##TITLE=C13_Ser 5176
 CDCl3, 1500 sc

 5.7.2023
##JCAMPDX= 6.0         $$ Bruker NMR JCAMP-DX V2.0
##DATA TYPE= NMR SPECTRUM
##DATA CLASS= NTUPLES
##ORIGIN= UXNMR, Bruker Analytische Messtechnik GmbH
##OWNER= root
$$ XWIN-NMR		Version 3.5
$$ Wed Jul  5 16:23:16 2023 Russian Standard Time (UT+4h)  she@DPX200
##.OBSERVE FREQUENCY= 50.327896
##.OBSERVE NUCLEUS= ^13C
##.ACQUISITION MODE= SIMULTANEOUS
##.ACQUISITION SCHEME= undefined
##.AVERAGES= 1501
##.DIGITISER RES= 17
##SPECTROMETER/DATA SYSTEM= spect
##.PULSE SEQUENCE= zgpg30
##.SOLVENT NAME= DMSO
##.SHIFT REFERENCE= (INTERNAL, DMSO, 0, 222.624)
##AUDIT TRAIL= $$ (NUMBER, WHEN, WHO, WHERE, WHAT)
$$ ##TITLE= Audit trail, XWIN-NMR		Version 3.5
$$ ##JCAMPDX= 5.01
$$ ##ORIGIN= Bruker BioSpin GmbH
$$ ##OWNER= she
$$ F:/spectra/data/she/nmr/c13/1/pdata/1/auditp.txt
$$ ##AUDIT TRAIL=  $$ (NUMBER, WHEN, WHO, WHERE, WHAT)
(   1,<2023-07-05 16:21:54.76 +0400>,<she>,<DPX200>,
      <created by zg, POWCHK disabled, PULCHK disabled
       terminated by command 'halt'
       configuration hash MD5:
       00 E9 B6 7A A2 85 ED C7 34 08 36 98 17 FE 4E 26
       data hash MD5: 32K
       62 E8 71 7F 3B 3C AD 7F 0A 0A 6B 2A 11 FB 42 78>)
(   2,<2023-07-05 16:22:01.06 +0400>,<she>,<DPX200>,
      <Start of raw data processing
       efp BC_mod = 2 LB = 2 FT_mod = 6 PKNL = 1 PHC0 = -389.5359 PHC1 = 30.96414 SI = 32K 
       data hash MD5: 32K
       0B 1D 07 B0 52 07 5B 50 9B D1 D9 5B 75 4A BF 67>)
(   3,<2023-07-05 16:22:03.84 +0400>,<she>,<DPX200>,
      <abs ABSG = 5 
       data hash MD5: 32K
       E0 3D F8 A6 A2 D2 9B 97 67 05 2E 0E FD 9C 8E BA>)
(   4,<2023-07-05 16:22:35.81 +0400>,<she>,<DPX200>,
      <pk PHC0 = 14.5813 PHC1 = -21.6 
       data hash MD5: 32K
       CB E6 22 8A F2 8C 2F B9 51 D3 61 3C 92 78 B4 7F>)
(   5,<2023-07-05 16:22:38.28 +0400>,<she>,<DPX200>,
      <abs ABSG = 5 
       data hash MD5: 32K
       32 B3 33 57 6A C1 7D 77 0A 61 F1 B6 92 D5 2A 0B>)
$$ ##END=
$$ 
$$ hash MD5
$$ DC EF 1E B2 D8 2A 0F 11 0E 0A 9D A4 FE 8D 52 E5
##$RELAX= 
##$RELAX= 
##$RELAX= 
##$RELAX= 
##$RELAX= 
##$RELAX= 
##$RELAX= 
##$RELAX= 
$$ Bruker specific parameters
$$ --------------------------
##$DU= <F:/spectra>
##$EXPNO= 1
##$NAME= <c13>
##$PROCNO= 1
##$TYPE= <nmr>
##$USER= <she>
##$AMP= (0..31)
100 100 100 100 100 100 100 100 100 100 100 100 100 100 100 100 100 100 
100 100 100 100 100 100 100 100 100 100 100 100 100 100 
##$AQSEQ= 0
##$AQ_mod= 1
##$AUNM= <au_zg>
##$AUTOPOS= <>
##$BF1= 50.322709
##$BF2= 200.13
##$BF3= 50.322709
##$BF4= 500.13
##$BF5= 500.13
##$BF6= 500.13
##$BF7= 500.13
##$BF8= 500.13
##$BYTORDA= 1
##$CFDGTYP= 0
##$CFRGTYP= 5
##$CHEMSTR= <none>
##$CNST= (0..31)
1 1 145 1 1 1 1 1 1 1 1 1 1 1 1 1 1 1 1 1 1 1 1 1 1 1 1 1 1 1 1 1 
##$CPDPRG= <waltz16>
##$CPDPRG1= <>
##$CPDPRG2= <waltz16>
##$CPDPRG3= <>
##$CPDPRG4= <mlev>
##$CPDPRG5= <mlev>
##$CPDPRG6= <mlev>
##$CPDPRG7= <mlev>
##$CPDPRG8= <mlev>
##$CPDPRGB= <>
##$CPDPRGT= <>
##$D= (0..31)
$$ [...]
##$SUBNAM4= <"">
##$SUBNAM5= <"">
##$SUBNAM6= <"">
##$SUBNAM7= <"">
##$SUBNAM8= <"">
##$SUBNAM9= <"">
##$SW= 239.972175391363
##$SWIBOX= (0..15)
0 1 3 0 0 0 0 0 0 0 0 0 0 0 0 0 
##$SW_h= 12077.2946859903
##$TD= 32768
##$TD0= 1
##$TE= 0
##$TE2= 300
##$TE3= 300
##$TEG= 300
##$TL= (0..7)
120 120 120 120 120 120 120 120 
##$TP= (0..7)
150 150 150 150 150 150 150 150 
##$TP07= 0
##$TPNAME0= <>
##$TPNAME1= <>
##$TPNAME2= <>
##$TPNAME3= <>
##$TPNAME4= <>
##$TPNAME5= <>
##$TPNAME6= <>
##$TPNAME7= <>
##$TPOAL= (0..7)
0.5 0.5 0.5 0.5 0.5 0.5 0.5 0.5 
##$TPOFFS= (0..7)
0 0 0 0 0 0 0 0 
##$TUNHIN= 0
##$TUNHOUT= 0
##$TUNXOUT= 0
##$USERA1= <user>
##$USERA2= <user>
##$USERA3= <user>
##$USERA4= <user>
##$USERA5= <user>
##$V9= 5
##$VALIST= <valist>
##$VCLIST= <CCCCCCCCCCCCCCC>
##$VD= 0
##$VDLIST= <DDDDDDDDDDDDDDD>
##$VPLIST= <PPPPPPPPPPPPPPP>
##$VTLIST= <TTTTTTTTTTTTTTT>
##$WBST= 1024
##$WBSW= 4
##$XGAIN= (0..3)
0 0 0 0 
##$XL= 0
##$YL= 0
##$YMAX_a= 10825039
##$YMIN_a= -3096856
##$ZGOPTNS= <>
##$ZL1= 120
##$ZL2= 120
##$ZL3= 120
##$ZL4= 120
##$ABSF1= 222.624
##$ABSF2= -17.3728
##$ABSG= 5
##$ABSL= 3
##$ALPHA= 0
##$AQORDER= 0
##$ASSFAC= 0
##$ASSFACI= 0
##$ASSFACX= 0
##$ASSWID= 0
##$AUNMP= <proc_1d>
##$AZFE= 0.1
##$AZFW= 0.5
##$BCFW= 0
##$BC_mod= 2
##$BYTORDP= 0
##$COROFFS= 0
##$CY= -3
##$DATMOD= 1
##$DC= 0
##$DFILT= <>
##$DTYPP= 0
##$F1P= 0
##$F2P= 0
##$FCOR= 0.5
##$FTSIZE= 32768
##$FT_mod= 6
##$GAMMA= 0
##$GB= 0
##$INTBC= 1
##$INTSCL= 4.134877e-10
##$ISEN= 128
##$LB= 2
##$LEV0= 0
##$LPBIN= 0
##$MAXI= 10000
##$MC2= 0
##$MEAN= 0
##$ME_mod= 0
##$MI= 0.1934396
##$NCOEF= 0
##$NC_proc= -3
##$NLEV= 6
##$NOISF1= 120.0001
##$NOISF2= 80.00006
##$NSP= 0
##$NTH_PI= 0
##$NZP= 0
##$OFFSET= 222.624
##$PC= 1.4
##$PHC0= -374.9546
##$PHC1= 9.36414
##$PH_mod= 1
##$PKNL= yes
##$PPARMOD= 0
##$PSCAL= 0
##$PSIGN= 0
##$REVERSE= no
##$SF= 50.3227315983092
##$SI= 32768
##$SIGF1= 140
##$SIGF2= 120
##$SINO= 11.81781
##$SIOLD= 32768
##$SREGLST= <13C.CDCl3>
##$SSB= 0
##$STSI= 32768
##$STSR= 0
##$SW_p= 12077.2946859903
##$SYMM= 0
##$S_DEV= 0
##$TDeff= 32768
##$TDoff= 0
##$TI= <>
##$TILT= no
##$TM1= 0
##$TM2= 0
##$TOPLEV= 0
##$USERP1= <user>
##$USERP2= <user>
##$USERP3= <user>
##$USERP4= <user>
##$USERP5= <user>
##$WDW= 1
##$XDIM= 32768
##$YMAX_p= 499703640
##$YMIN_p= -14676189
$$ End of Bruker specific parameters
$$ ---------------------------------
##NTUPLES= NMR SPECTRUM
##VAR_NAME=  FREQUENCY,     SPECTRUM/REAL,   SPECTRUM/IMAG
##SYMBOL=    X,             R,               I
##VAR_TYPE=  INDEPENDENT,   DEPENDENT,       DEPENDENT
##VAR_FORM=  AFFN,          ASDF,            ASDF
##VAR_DIM=   32768,         32768,           32768
##UNITS=     HZ,            ARBITRARY UNITS, ARBITRARY UNITS
##FACTOR=    0.368581032318806, 1,           1
##FIRST=     11203.0474430531, 0,            0
##LAST=      -874.247242937185, 0,           0
##MIN=       -874.247242937185, -14676189,   0
##MAX=       11203.0474430531, 499703640,    0
$$ Real data points
##PAGE= N=1
##DATA TABLE= (X++(R..R)), XYDATA
$$ [...]
15663a436560k6159n28263n39943j39490J21186J95187O5720n33293j076689p81349
15653d679653N60685J909865K145591J426624O98174M7265q86948j415230j017635
15644a211262k78110K52785O01172J145814J208477L56037n22080q58727j235808
15635e41702k137039k611764k045123j147947n30950J75137J169492K234782K488873
15626b946241J446359K50953j74310J0208N43337R36224J014568Q68251K27841
15617B177190p02431j085891j019148j389492j907555j916852j233273L905J079345
15608e994202J344999R60206N35444J17054n9558J14317K29724J74239j34171
15599b711948n2865N08713N66357N20739R93248J704162J937608J070517l90377
$$ y = [-1436560, -1462719, -1990982, -2530925, -2670415, -2549229, -2354042, -2288322, -2821615, -3898304, -4679653, -4118968, -2209103, -63512, 1363112, 2061286, 2108551, 1221603, -193627, -1211262, -1489372, -1236587, -635415, 510399, 1718876, 2074913, 1552833, 694106, -541702, -2678741, -5290505, -7335628, -8483575, -9014525, -8839388, -7669896, -5435114, -2946241, -1499882, -1248929, -1423239, -1413031, -869694, 66530, 1081098, 1949349, 2177190, 1474759, 388868, -630280, -2019772, -3927327, -5844179, -7077452, -7073547, -5994202, -4649203, -3688997, -3153553, -3036499, -3096057, -2981740, -2752016, -2577777, -2711948, -2764813, -2256100, -1689743, -1169004, -175756, 1528406, 3466014, 4536531, 4146154]
15590D146154j067578r13082p85625q00601n80674k5200M61834M03732R7329k89443
15580F46846p59840q98843n74626k96634r1673O42873J326140J307074P87690
15571B089007k43327j311066j573484j022423k87505L41995O76950M84086K3265
15562h22502l7265J18252J72583J44315k41376n56629j63967O74662J076082R51911
15552A316066Q66274R58906R54555L82584n07478p78909m09914K13711L81138
15543C376933j15635l76826K67377J210982J071369k23493j104752q26386k95311
15534B984258k62305r88897j982299k482650k268960j248084k1214O26185Q47057
15525d796909P42588M74105M99280R05453R94588N77131J96574J84050N44968
$$ y = [4146154, 3078576, 2165494, 1379869, 579268, -1406, -26606, 435228, 838960, 936289, 646846, -112994, -1011837, -1586463, -1883097, -1974770, -1331897, -5757, 1301317, 2089007, 1845680, 534614, -1038870, -2061293, -2348798, -2006803, -1329853, -845767, -822502, -859767, -741515, -568932, -424617, -665993, -1222622, -1386589, -711927, 364155, 1316066, 2182340, 3141246, 4095801, 4478385, 3970907, 3191998, 2782084, 2995795, 3376933, 3261298, 2884472, 3151849, 4362831, 5434200, 5210707, 4105955, 3279569, 2984258, 2721953, 1733056, -249243, -2731893, -5000853, -6248937, -6270151, -5643966, -4796909, -4054321, -3580216, -3080936, -2175483, -1180895, -603764, -407190, -223140, 321828]
15516C21828R75333Q06524o5239o65286o36835l80150K72285J181599J475109
15507C285168Q48537m26505j521589j643038j314369j230793j252389j346947
15499d601925j288533o85755J56567P45603P94480L85689j49222j25225L16857
15490d451464P33674J025165J136833P34758j8226p63533j555569k008445j708329
15481f875136p36511M28174R73432O82430K99565L72807K72106k23372j04777
15472d911282J133330K713648L276711K186181L65962j276994k736970l110426
15464b359840j698487L40543J482028J676917J570974J270237Q16003K3078j255835
15455A865618k133881k116473j916528j820476j435119n29519M57816J311828
$$ y = [321828, 1297161, 2103685, 2038446, 1373160, 736325, 356175, 628460, 1810059, 3285168, 4133705, 3707200, 2185611, 542573, -771796, -2002589, -3254978, -4601925, -5890458, -6576213, -6419646, -5674043, -4879563, -4493874, -4643096, -4768321, -4451464, -3717790, -2692625, -1555792, -821034, -839260, -1602793, -3158362, -5166807, -6875136, -7611647, -7183473, -6210041, -5527611, -5228046, -4855239, -4583133, -4806505, -4911282, -3777952, -1064304, 2212407, 4398588, 4764550, 3487556, 750586, -2359840, -4058327, -3717784, -2235756, -558839, 1012135, 2282372, 3098375, 3121453, 1865618, -268263, -2384736, -4301264, -6121740, -7556859, -8086378, -7628562, -6316734]
15447f316734J941142K043655J796480J310306L17741n67681n87078j29060K7143
15438a64086k50818o84326j175005j328668j239473q02508Q696M43080L58243
15429d834865q7682p13828j357157j608656j214487m08439M67520R30858J328834
15420g497902K044429K283739J839079J072173N3013p22675j054466j042411o96229
15411c721250m70300o88218o77275l01807j11231K32070R52591J463408J535580
15402a786432J386187J105767O09014n5999n59976j118163j987394k298117j515655
15393f220768K0602J200132J449368J122924M35484n33004r04952n13543m7790
15384c991547M54681J069201J216132L87060m99362l01814j1659n62851r46370
$$ y = [-6316734, -4375592, -2331937, -535457, 774849, 1092590, 524909, -62169, -191229, -164086, -414904, -1099230, -2274235, -3602903, -4842376, -5644884, -5636188, -5193108, -4834865, -4922547, -5636375, -6993532, -8602188, -9816675, -10225114, -9757594, -8826736, -7497902, -5453473, -3169734, -1330655, -258482, -205469, -928144, -1982610, -3025021, -3721250, -4191550, -4879768, -5557043, -5858850, -5970081, -5738011, -4785420, -3322012, -1786432, -400245, 705522, 1314536, 1258537, 698561, -419602, -2406996, -4705113, -6220768, -6200166, -5000034, -3550666, -2427742, -1992258, -2525262, -3430214, -3943757, -3991547, -3536866, -2467665, -1251533, -864473, -1363835, -1665649, -1677308, -2240159, -3186529]
15375c186529l83894L34280O29822O50735K57434q88972j878696j435289o2516
15366e963625O78628O75613K76166j79187j90897j71934k39527P1461M67919M55435
15356d119948K67207M48714O64748N76558O34171P70394L42559j6370J18829M76536
15346A63398P12270N34584K44669L18150N25590o7627j206260j624314j088672
15337a488212m37006l09603p53947r71447m87400J04998L91406M05263N65960
15328b979988J047683J102076K62412n15633m85202j08O10799J105500J274056
15319A421595R37439M72527j25787j065743j671114j557532j015748p10121p82579
15310d097063j012366o37145P25362J934034J813223N00790p48077j099096q72667
$$ y = [-3186529, -3570423, -3236143, -2606321, -1955586, -1698152, -2587124, -4465820, -5901109, -5963625, -5284997, -4609384, -4333218, -4512405, -4703302, -4875236, -5114763, -5043302, -4575383, -4119948, -3852741, -3404027, -2739279, -2162721, -1528550, -758156, -415597, -431967, -313138, 163398, 875668, 1410252, 1654921, 1973071, 2498661, 2431034, 1224774, -399540, -1488212, -1925218, -2234821, -2988768, -3960215, -4447615, -4342617, -3951211, -3545948, -2979988, -1932305, -830229, -567817, -1083450, -1568652, -1568760, -957961, 147539, 1421595, 2359034, 2831561, 2705774, 1640031, -31083, -1588615, -2604363, -3314484, -4097063, -5109429, -5746574, -5021212, -3087178, -1273955, -773165, -1521242, -2620338, -3493005]
15301c493005n19878k04710J91052L24241j25948m64482l83709L3795O11905L09331
15291c721408q72720j089705j30092Q15112J042527P74736O15094K80532j03803
15282b389727k46638l24535n03801q74991r76905o07254Q1106N55207P93575R06424
15272c587539O22414Q9644k69290o17730r08599p13489k59272L17392R73382J382263
15262b970824J514116J176110L92199k70376n44192j027508j474903j469072j390529
15253f064979j175734p12641j32187J71951K37319K06272M17800P36144R03381
15244e412674J142395J337658J084711J95017n64814n37892l45387q76536j601914
15235e579436j991627j568264J36684K137643L064584K745427J422411r5939j113958
$$ y = [-3493005, -4012883, -4217593, -4026541, -3702300, -3828248, -4292730, -4676439, -4642644, -4030739, -3721408, -4594128, -5683833, -5813925, -4998813, -3956286, -3181550, -2566456, -2285924, -2389727, -2636365, -2960900, -3464701, -4339692, -5316597, -5923851, -5842745, -5287538, -4493963, -3587539, -2965125, -2875481, -3144771, -3762501, -4671100, -5384589, -5643861, -5326469, -4353087, -2970824, -1456708, -280598, 111601, -158775, -702967, -1730475, -3205378, -4674450, -6064979, -7240713, -7953354, -8085541, -7913590, -7676271, -7469999, -7052199, -6316055, -5412674, -4270279, -2932621, -1847910, -1652893, -2217707, -2755599, -3100986, -3977522, -5579436, -7571063, -9139327, -9002643, -6865000, -3800416, -1054989, 367422, 271483, -842475]
15226h42475j530147j455324r54477m90011r48399j683099j209480j03015N44292
15217h672135N98329N84886P61598Q30921N74232N78545P43037M77222J83164
15208c340201K86126M16878O4706n733P04199J157433O61949k04751n17634J09825
15198f67203O59855J26648j92358R6634k4131n84101q51413o94772m68316k12229
15188b811386J63103N30528P97252J014894P19461L9983l02410j87130k60988
15179b96693r99772j425512q74091k26262k84746q79659j177991q93750j61697
15170g220173Q43938J692558K237188K167591J434128N84060j07370o56105q87268
15161H8547j014973j423162j446788r91790l65221L36963N65516J35475m78401
$$ y = [-842475, -2372622, -3827946, -4782423, -5272434, -6220833, -7903932, -9113412, -9216427, -8672135, -8073806, -7488920, -6727322, -5896401, -5322169, -4743624, -4000587, -3523365, -3340201, -3054075, -2637197, -2572491, -2578224, -1874025, -716592, -54643, -259394, -777028, -667203, -7348, 119300, -73058, 23576, -555, -584656, -1436069, -2130841, -2599157, -2811386, -2648283, -2117755, -1320503, -305609, 413852, 453835, 151425, -35705, -296693, -1296465, -2721977, -3596068, -3822330, -4107076, -4986735, -6164726, -7058476, -7220173, -6376235, -4683677, -2446489, -278898, 1155230, 1739290, 1631920, 975815, 88547, -926426, -2349588, -3796376, -4788166, -5153387, -4816424, -4250908, -4115433, -4593834]
15152d593834o70914m59396k16166K95014Q71682J120683P16484j37601q90881
15143c964929j166367n32204M76974J271022J481996J066288J51442p07231n31846
15134b454855K52238R80965J370412J221859N50002j84464o97451r96798j024426
15125i82518o65115R2773P12384Q94632Q37259M79794l46249j362730j657383
15116a997153r74788j17680M71700P70665J024970J242821J163551Q22893M152
15107B411131j091253j465302n77590N58383J100520J241261P59066k34096j080204
15098A621916j784137k056341j446339n16474L12032P58900Q37060R30048J040491
15089c02844R90510Q25629O72995M90348K67921j61343n80503q66826j255504
$$ y = [-4593834, -5264748, -5724144, -5940310, -5645296, -4773614, -3652931, -2936447, -3074048, -3964929, -5131296, -5663500, -5186526, -3915504, -2433508, -1367220, -1215778, -1923009, -2454855, -2202617, -1221652, 148760, 1370619, 1920621, 1736157, 1038706, 41908, -982518, -1647633, -1554860, -842476, 52156, 889415, 1369209, 1022960, -339770, -1997153, -2971941, -3089621, -2617921, -1847256, -822286, 420535, 1584086, 2406979, 2411131, 1319878, -145424, -723014, -164631, 935889, 2177150, 2936216, 2702120, 1621916, -162221, -2218562, -3664901, -4181375, -3869343, -3110443, -2273383, -1343335, -302844, 687666, 1513295, 2186290, 2676638, 2944559, 2783216, 2202713, 1335887, 80383]
15080H0383j229930o71261m26601l63534j64773J06566O79167J052650M40891
15071d96442o20789j238521j507872j604640j348927j248179j285879q09325K18542
15062i942032Q05824N82777M45984N76411R11974J334455J351579R71864M31352
15053b529812J86721P53436J582119J771711J018880j07522p12111p14979m52339
15044G96104n78154p29949n68993o18210p68954p56563j83772L94891K68585o4992
15034b810007K4730J61591l28793j246075j394442N2326J598047J916158J583458
15025d43007J143635L02407m75814n24057m78446r28411j141138m94393L54899
15016b684325O22588K94414j7882j4631J05093N59307R11399O31157n07835j986061
$$ y = [80383, -1149547, -1820808, -2247409, -2610943, -2775716, -2669150, -1989983, -937333, -496442, -1117231, -2355752, -3863624, -5468264, -6817191, -8065370, -9351249, -10160574, -9942032, -9136208, -8553431, -8107447, -7531036, -6619062, -5284607, -3933028, -2961164, -2529812, -2343091, -1589655, -7536, 1764175, 2783055, 2675533, 1963422, 1248443, 796104, 217950, -511999, -1080992, -1699202, -2468156, -3224719, -3408491, -3013600, -2745015, -2810007, -2785277, -2623686, -2952479, -4198554, -5592996, -5540670, -3942623, -2026465, -443007, 700628, 1003035, 527221, 3164, -475282, -1403693, -2544831, -3039224, -2684325, -2061737, -1767323, -1785205, -1799836, -1694743, -1135436, -224037, 407120, -100715, -2086776]
15006b086776k514141j537843J11915J128818J602441J531565R01402M68692M35973
14997D2046k2018q43213q60778o2238M37163J94539l2962N25430J708657K036013
14987C122639Q75076k12794n31719l30445J33651M19512M92872N85077K82591
14978D836460l75940n58169l39686j55112n35757j469668j845711j201587l15352
14969a960522K89356N07958J59696n94687j195460q40675L96291J189134Q75843
14960a173066L30671M36022M89373J80788j61555m47512m01849K44493R89610
14951D86975J002936L02346k75467l29363m32791o99633q96455r07949m75510
14942b224911l08444q42167j096529k78144R82835J404908R13400M20357L0992
$$ y = [-2086776, -4600917, -6138760, -6026845, -4898027, -3295586, -1764021, -862619, -393927, 42046, 20028, -823185, -1683963, -1746201, -1309038, -1114499, -1147461, -622031, 1086626, 3122639, 3997715, 3784921, 3253202, 2922757, 3056408, 3475920, 3968792, 4553869, 4836460, 4460520, 3902351, 3562665, 3407553, 2871796, 1402128, -443583, -1645170, -1960522, -1671166, -1163208, -1003512, -1598199, -2793659, -3634334, -3238043, -2048909, -1173066, -842395, -406373, 83000, 263788, 102233, -345279, -747128, -502635, 486975, 1489911, 1792257, 1516790, 1187427, 754636, 55003, -841452, -1749401, -2224911, -2533355, -3375522, -4472051, -4750195, -3767360, -2362452, -1449052, -1028695, -997703]
14933i97703p09748q73969o487O77984J021554J322578J070831L51872k48691
14924A608221q24907j225087j087416l58196M10677o6990j103790j483567j033152
14915e164207k59556K24851K63396K11528L30224P16197J084547Q47582L00448
14906a444990j0733n13438j342122j724986j185511m76526n1974M29116Q37818
14897e483346M43374q95511j595263p42109N29595J316308J988973K495125K023443
14888H0589R69245L03151J52975n3433m67095q55722p32362l99935p89683j356804
14878c149074j487038j022801m2683R31267R63993J6667p37644n38171r7557p092
14868e170133p5467L90402J501269J881832R12603m08983r60590q85059n75448
$$ y = [-997703, -1707451, -2581420, -2587907, -1909923, -888369, 434209, 1505040, 1856912, 1608221, 783314, -441773, -1529189, -1887385, -1476708, -1543698, -2647488, -4131055, -5164207, -5423763, -5198912, -4935516, -4723988, -4393764, -3677567, -2593020, -1745438, -1444990, -1455723, -1969161, -3311283, -5036269, -6221780, -6698306, -6750280, -6321164, -5483346, -5039972, -5935483, -7530746, -8272855, -7743260, -6426952, -4437979, -1942854, 80589, 1049834, 1352985, 1505960, 1452527, 985432, 129710, -602652, -1002587, -1792270, -3149074, -4636112, -5658913, -5701596, -4770329, -3806336, -3789669, -4527313, -5065484, -5163041, -5170133, -5245600, -4855198, -3353929, -1472097, -559494, -968477, -1929067, -2814126, -3389574]
14859c389574q8433N48621J269876J751539J489961M96093o63773j317917j240233
14850a143840q78632k75676K91567N59252O76084N05580L64070N13767P55858
14841A368030N53587j28519n38360p04465j112860j330512q70565n5642J08248
14832b711058r533L21247J055743J519891J289891Q68769L02462n66310j200976
14823H70126j334447j568761j737589r70607K12639Q79323N93943l58792n20331
14814c934496K25403P92159L55511o16154o93056J80681R73697J102757P83353
14805h30145K35891m15258j008033j202445o34804L44309J349125K180785K112572
14796B131997O85905j010462j698910j316230n33487L60017P15126j9050o99478
$$ y = [-3389574, -3478007, -2929386, -1659510, 92029, 1581990, 2078083, 1414310, 96393, -1143840, -2022472, -2298148, -2006581, -1447329, -771245, -265665, 98405, 612172, 1368030, 1921617, 1793098, 1254738, 550273, -562587, -1893099, -2763664, -2819306, -2711058, -2720591, -2399344, -1343601, 176290, 1466181, 2334950, 2637412, 2071102, 870126, -464321, -2033082, -3770671, -4741278, -4528639, -3649316, -3055373, -3414165, -3934496, -3709093, -2916934, -2561423, -3177577, -3870633, -3689952, -2716255, -1613498, -830145, -594254, -1009512, -2017545, -3219990, -3854794, -3510485, -2161360, 19425, 2131997, 2817902, 1807440, 108530, -1207700, -1741187, -1381170, -666044, -685094, -1384572]
14787a384572m61396J48691Q9424l75274n47171j41652O43322Q95364P70429N04375
14777A41540p6732m39666n40274n19184j57172j03415l44499k62503j20296J63124
14767b259077P07798J034594R32664R24697M98252m97155j142026j353943j165870
14758b320066o33470J9145K26711R7928K01491M78235M60432O0931k10548l36689
14748a955900o83757p62302k87157M52795R27739Q90501M01879n98451j363305
14739b977958j182395o09958m78404n40397k24107J27531L84333N52700N22562
14730d426093L35532K73332K70618K77883K09763k65322p60585o10760M13865
14721d281767J604846J896087J329602Q00182O47567K19624o72390j932651k598100
$$ y = [-1384572, -1845968, -1697277, -1607853, -1983127, -2530298, -2671950, -2028628, -1133264, -362835, 141540, 64808, -374858, -915132, -1434316, -1591488, -1694903, -2039402, -2301905, -2422201, -2259077, -1551279, -516685, 415979, 1340676, 1838928, 1341773, 199747, -1154196, -2320066, -2953536, -2934391, -2707680, -2609752, -2408261, -1930026, -1469594, -1408663, -1619211, -1955900, -2639657, -3401959, -3689116, -3236321, -2308582, -1418081, -1016202, -1614653, -2977958, -4160353, -4770311, -5248715, -5789112, -6013219, -5885688, -5501355, -4948655, -4426093, -4090561, -3817229, -3546611, -3268728, -3058965, -3324287, -4084872, -4695632, -4281767, -2676921, -780834, 548768, 1348950, 1996517, 2216141, 1543751, -388900, -2987000]
14712b987000j855962m83312M85798M80819j46872n3262P17284Q88650L78915
14703b574942O840J59641P15787J591888J917767J054383k78618j045027r36490
14694F11229k21490L08282M09293O54369Q65119Q58855N24268j15710j02690M65065
14684D256590K69372l75393m93302k50415j95152q0357O38141J357420J188335
14675F315239M89308L48331Q34718R14436K68283n01495j107859j333814j102975
14666E124172j055632j447225j377964q75867q03116p08621n5755N10267Q39351
14657A49610Q85243N14195J22107j35229m89512p49282n02045j50807O8148K05898
14647h1674L00794J60732l53369r13324j194305r75438n15774k37364m26875p65714
$$ y = [-2987000, -4842962, -5326274, -4840476, -4359657, -4506529, -4559791, -3842507, -2953857, -2574942, -2568102, -2408461, -1692674, -100786, 1816981, 2871364, 2592746, 1547719, 611229, 389739, 698021, 1107314, 1761683, 2626802, 3485657, 4009925, 3894215, 3791525, 4256590, 4525962, 4150569, 3657267, 3406852, 3211700, 3131343, 3769484, 5126904, 6315239, 6804547, 7152878, 7987596, 8902032, 9170315, 8668820, 7560961, 6227147, 5124172, 4068540, 2621315, 1243351, 367484, -435632, -1144253, -1200008, -689741, 149610, 1034853, 1549048, 1671155, 1535926, 1046414, 297132, -204913, -355720, -287572, -81674, 219120, 379852, 26483, -886841, -2081146, -3056584, -3572358, -3809722, -4236597, -5002311]
14637e002311q21835k93172N43539Q85064Q10651Q12444N99086r2817n94288l26693
14627c480332K51395P49341J000898N55746j01087m45986r72652j294243r26764
14618d663684J22199P73347M98215N22098J486725K564210K538359J360582O5086
14609E267137k76941Q5997K61034L41971K85389k68544j075469j507708j371093
14600A741773r13237r44721j551218j514769q34250l68924k53522l03270k81722
14591e223860p4179K50921O23293P61749N55168J91417j90253k51831K59127N64426
14581b534022O9021n59035m96228k31078k88082k31308J19046N83494N31638K66265
14571b770289L45757J20293l95345n37789l91467m33648o03692m93476j42390
$$ y = [-5002311, -5824146, -6117318, -5573779, -4688715, -3878064, -3065620, -2466534, -2559351, -3153639, -3480332, -3228937, -2479596, -1478698, -922952, -1024039, -1470025, -2442677, -3736920, -4663684, -4541485, -3768138, -3269923, -2747825, -1261100, 1303110, 3841469, 5202051, 5267137, 4990196, 5076193, 5337227, 5679198, 5964587, 5696043, 4620574, 3112866, 1741773, 828536, -116185, -1667403, -3182172, -4016422, -4385346, -4638868, -4942138, -5223860, -5298039, -5047118, -4423825, -3662076, -3106908, -2915491, -3105744, -3357575, -3098448, -2534022, -2465001, -3024036, -3520264, -3751342, -4039424, -4270732, -4151686, -3568192, -3036554, -2770289, -2424532, -2304239, -2699584, -3237373, -3628840, -4062488, -4666180, -5159656, -5302046]
14562e302046L25777R95063J436961J295772R31959P37795L65284L5010M71521
14553A293096R79601N70944j66306q56279j768538k514073k206300p08747P82369
14544d594233J458044J282497K69698j037401j987996k318913j784607r96715
14536i709626o57114l85820K37000J029583Q85587j22930n85796J10074J438705
14527g760337K147893J763770Q69578k70054j157779j353187q27761J25779J049610
14518e412488J168142Q80315J263534J857497J194775k23678q57099q91717p58735
14509a779454n25098j23196n6839l95419m88111l45654k46205Q9491M49578N63235
14499b857672P33612N95619J29681L75268P79037J9343j037099j172216j47576
$$ y = [-5302046, -4976269, -3981206, -2544245, -1248473, -316514, 421281, 786565, 821575, 1293096, 2272697, 2843641, 2677335, 1821056, 52518, -2461555, -4667855, -5376602, -4594233, -3136189, -1853692, -1583994, -2621395, -4609391, -6928304, -8712911, -9709626, -10366740, -10752560, -10515560, -9485977, -8600390, -8723320, -9309116, -9199042, -7760337, -5612444, -3848674, -2979096, -3249150, -4406929, -5760116, -6587877, -6462098, -5412488, -4244346, -3364031, -2100497, -243000, 951775, 728097, -129002, -1020719, -1779454, -2304552, -2427748, -2484587, -2880006, -3368117, -3713771, -3959976, -3870485, -3420907, -2857672, -2124060, -1528441, -1398760, -1023492, -244455, -225112, -1262211, -2434427, -2582003]
14490b582003J367798K495534K522141J519249M44259l07837o47678p72121j088558
14481B950784j221818q93536m54317l2119M32379R35567R06310L21574j60499
14472B784325o6502n7119m17956n57313n93844r62135j276911q81719l52854n35959
14462b917987j131881j164002k62293M50743L37287j45149l03503L44686J312662
14453c479437J779011J255582L63802J86884P88592J331628J143263P41263J96282
14444D306870n77338j219244j559960j444041j400883j278940q91495n86877k51278
14435d903186K67627Q77750J200272R12572O25305N13829M45039K76508j69607
14426D6109l56139O9244M02250J71709j55816o0309K81451P30131R96929L07137
$$ y = [-2582003, -1214205, 1281329, 3803470, 5322719, 5766978, 5459141, 4811463, 4039342, 2950784, 1728966, 835430, 381113, 348994, 781373, 1716940, 2623250, 2944824, 2784325, 2717823, 2660704, 2242748, 1685435, 1091591, 129456, -1147455, -2029174, -2382028, -2917987, -4049868, -5213870, -5476163, -5025420, -4688133, -4833282, -5136785, -4792099, -3479437, -1700426, -444844, -81042, 105842, 894434, 2226062, 3369325, 4110588, 4306870, 3729532, 2510288, 950328, -493713, -1894596, -3173536, -4065031, -4651908, -4903186, -4635559, -3757809, -2557537, -1644965, -1019660, -505831, -60792, 215716, 46109, -310030, -240786, 161464, 333173, 177357, 117048, 398499, 1128630, 2125559, 2432696]
14416B432696n07366n29428k90869j96554Q9474M61369L17502J02282J47833Q715
14406B035654m49243n67955J49385M30106l98819j082447q08522K7674O88916
14397B4749P66696L55634K15448L69604M42905K98896j21242p69037j332859j384237
14387a133443n78628R68028J806118J284042N36162J25260l40513n87739l07621
14378A771666K1154j42489p52197j293110j268541p33218k95339l69240m57726
14369c519040j45041R0592J03177M90319J050805J095696M22106l91372q73481
14360a676239n67950O79594J675375J431545L21786n73262p72513m29611O02572
14351F91297J730433K094151J714455O62068p45493j592427j349378p62476l66897
$$ y = [2432696, 1925330, 1395902, 1105033, 908479, 997953, 1459322, 1776824, 1879106, 2026939, 2035654, 1586411, 1018456, 1167841, 1597947, 1199128, 116681, -691841, -664167, 24749, 791445, 1147079, 1362527, 1732131, 2175036, 2473932, 2352690, 1583653, 250794, -1133443, -1712071, -744043, 1062075, 2346117, 2882279, 3007539, 2667026, 2079287, 1771666, 1792820, 1650331, 898134, -394976, -1663517, -2396735, -2692074, -3061314, -3519040, -3664081, -3573489, -3470312, -2979993, -1929188, -833492, -411386, -802758, -1676239, -2244189, -1564595, 110780, 1542325, 1864111, 1290849, 518336, 88725, 691297, 2421730, 4515881, 6230336, 6892404, 6146911, 4554484, 3205106, 2442630, 2075733]
14342B075733J05391P36701J626908K314456J652594K2112j127178j525018j578201
14333D303498j329586j000660p71554O2297J370405J862663J255429J99942q82395
14324E070039j741879j856836j269959n65124l18797l75564k09272J15472M34352
14315g17568M76689P1836m00286p69812j006567m21822O29311J119485P35674
14306b83060K44492j9160j05011l74501j017584j341315j030752m97711k10927
14297d635529o2977J00721J32944L26737Q82745J349819J376659J159765P42998
14288A373882K42570l77599r58959j055250p66861n56542n32600l28168n4751
14279c014278k95884j173803j680765j345901n76800K86591R55571J093435J037694
$$ y = [2075733, 2181124, 2917825, 4544733, 6859189, 8511783, 8533895, 7406717, 5881699, 4303498, 2973912, 1973252, 1201698, 1263995, 2634400, 4497063, 5752492, 5952434, 5070039, 3328160, 1471324, 201365, -363759, -682556, -1058120, -1267392, -1151920, -717568, -240879, -169043, -569329, -1339141, -2345708, -2767530, -2138219, -1018734, -283060, -38568, -57728, -162739, -537240, -1554824, -2896139, -3926891, -4424602, -4635529, -4698506, -4597785, -4464841, -4138104, -3255359, -1905540, -528881, 630884, 1373882, 1616452, 1238853, 279894, -775356, -1542217, -2098759, -2631359, -2959527, -3014278, -3310162, -4483965, -6164730, -7510631, -8087431, -7800840, -6845269, -5751834, -4714140]
14270d714140J266882J733803K225676K024698J062367n85p05267q06430n41907
14261A545097l34316k63622J9095O02022J050255J130499M73638l00496o33164
14252C289008j035100j446716j532107j192945p48727l43760m0894K47913L31771
14243b471557M87784R36688J044065N69168L10035N22977N89447J63790m70042
14234A682355p72284o49150l90234p7977K81617K12226j00596J01076M15199L25073
14224A027305K65646j00976o48230n38824l88112k35078J25020J46944p9758l7226
14214d63289K43757M89196O30421O61470N62604K01752m13243j010972j377843
14205d76147j699822k065201k554114k956816k756063j832936l35090R45590J276426
$$ y = [-4714140, -3447258, -1713455, 512221, 2536919, 3599286, 3598701, 2893434, 2087004, 1545097, 1210781, 947159, 966254, 1568276, 2618531, 3749030, 4222668, 3922172, 3289008, 2253908, 807192, -724915, -1917860, -2666587, -3010347, -3051241, -2803328, -2471557, -1983773, -1047085, -3020, 566148, 876183, 1399160, 1988607, 2152397, 1682355, 910071, 260921, -129313, -207290, 74327, 286553, 185957, 287033, 702232, 1027305, 1292951, 1191975, 543745, 4921, -383191, -618269, -493249, -346305, -426063, -463289, -219532, 269664, 900085, 1561555, 2124159, 2325911, 1912668, 901696, -476147, -2175969, -4241170, -6795284, -9752100, -12508163, -14341099, -14676189, -13730599, -12454173]
14196a2454173O39856j96227r9407Q99932J844918J980394J511345J032153O81886
14187d159323N66862R99219R94247K64764J75988N16449J75608m83927o93166
14178a643279k72807L57083O21433L90280R5135o3211J96039N70997M95220R414
14168G56304m0626N09144P85756M83289k44864n03850J91849J240222J575640
14159D752864Q34681k11960r05270j174881j110779q03480n31675q41850q98575
14150h90925k28676L15222O43898R06345Q49292M96152N2761J15867P77785J045163
14140D082884N22279m07268r00679p39636k77914q1697o58256j523560j843001
14131a826848j475107j013784o61340j43923P24070J570847J703118J548214J380309
$$ y = [-12454173, -11814317, -12010544, -12109951, -11210019, -9365101, -7384707, -5873362, -4841209, -4159323, -3592461, -2593242, -1598995, -1334231, -1158243, -641794, -466186, -950113, -1643279, -1916086, -1559003, -937570, -547290, -452155, -515366, -319327, 251670, 746890, 756304, 715678, 1224822, 2010578, 2493867, 2249003, 1745153, 1937002, 3177224, 4752864, 5587545, 5375585, 4470315, 3295434, 2184655, 1381175, 849500, 7650, -890925, -1119601, -804379, -160481, 745864, 1595156, 2091308, 2144069, 2259936, 3037721, 4082884, 4605163, 4197895, 3297216, 2557580, 2279666, 2197969, 1539713, 16153, -1826848, -3301955, -4315739, -4977079, -5121002, -4396932, -2826085, -1122967, 425247, 1805556]
14122A805556R80312N01052n2143j84077N40075J344902J003670j45084j020413
14113D773850j248499r50690n51311n23423m52645o051L67624M68883P40558R37254
14103C555550P32244O54743P68169Q23846P89314K69234m95835o86424k00761
14094F210080L59605N12866K89969j32896p64730j378422k072036k622272k259795
14085a857631j038227J46941J007220J377925R71827K17561k35521k68312K34931
14076E56714P39713Q50294P13970N57846M27877K28287l6348p30997j451371j587163
14066B68822j265301o89643j39879O35533J540312J906350J248980j32179j326134
14057B046861j922543k014242j629263o92390K62023Q02369J126480J214588Q64273
$$ y = [1805556, 2785868, 3286920, 3234777, 3050700, 3590775, 4935677, 5939347, 5794263, 4773850, 3525351, 2574661, 2023350, 1499927, 1047282, 1041231, 1408855, 1877738, 2618296, 3555550, 4287794, 4942537, 5710706, 6534552, 7323866, 7593100, 7097265, 6410841, 6210080, 6569685, 7082551, 7372520, 7239624, 6474894, 5096472, 3024436, 402164, -1857631, -2895858, -2748917, -1741697, -363772, 608055, 825616, 590095, 321783, 556714, 1296427, 2146721, 2860691, 3418537, 3846414, 4074701, 4038353, 3307356, 1855985, 268822, -996479, -1686122, -1826001, -1190468, 349844, 2256194, 3505174, 3372995, 2046861, 124318, -1889924, -3519187, -4211577, -3949554, -3147185, -2020705, -806117, 58156]
14048E8156J79989n17931p50952m24139k32039o65662j150234j245875j169891
14039e918578j233107j293007p02861m4431L09696L46641j59126q97111j338680
14030a0930564r86086l8513O16160O70427J012713J846361K291467K058854J806772
14021a652409J521100J250426P09678n67390j696983j551878n13344P06096J200356
14012e94348P28312N36436O93666M11337k45703q62470r79761m86054K57623K97821
14002b43141n85423j604729j740076p00892N75599Q78026J46683r17418j425862
13993e617233r86765L69790J612441J352045L09084p6618L92761J295277K123131
13984G73913J885481P46607k97935o52498l15593j90447n85662p66789m81496
$$ y = [58156, 238145, -279786, -1030738, -1454877, -1686916, -2352578, -3502812, -4748687, -5918578, -7151685, -8444692, -9147553, -9191984, -8882288, -8535647, -8694773, -9591884, -10930564, -11916650, -11955163, -11339003, -10668576, -9655863, -7809502, -5518035, -3459181, -1652409, -131309, 1119117, 1828795, 1261405, -435578, -1987456, -2500800, -1794704, -594348, 133964, 670400, 1364066, 1775403, 1529700, 667230, -312531, -798585, -540962, -243141, -828564, -2433293, -4173369, -4874261, -4298662, -3420636, -3273953, -4191371, -5617233, -6603998, -6234208, -4621767, -3269722, -2960638, -3037256, -2644495, -1349218, 773913, 2659394, 3406001, 3108066, 2455568, 2139975, 1949528, 1363866, 597077, 115581]
13975A15581k6956K27492j63795o11380n34685j12855J41707l61417j230113j481562
13965d037983j120392n90492K94204J336199J815359J516673L20971m69351L01050
13956f33762J068383Q17257K96177l0430q6608J11156K03964L11263M85947K29567
13946B772914j13961J91851O91008N01434n00671j484148j692637j577957j146200
13937b358367k28052P52256R87796P97940Q97661J050603J181704J009946L38960
13928D430447m78129j207375j375438j005235r10489j394299j980169j637061
13920e557748m25447J91245L31116R35728J761787J917774J155936L31937k7848
13911F14480k16502m76834o70814p76302n44547J20472P73838P24242J93790j17275
$$ y = [115581, 88625, 316117, 152322, -459058, -993743, -1106598, -964891, -1326308, -2556421, -4037983, -5158375, -5748867, -5454663, -4118464, -2303105, -786432, -465461, -934812, -633762, 434621, 1251878, 1548055, 1517625, 1431017, 1542173, 1746137, 2057400, 2543347, 2772914, 2658953, 2850804, 3541812, 4043246, 3542575, 2058427, 365790, -1212167, -2358367, -2586419, -1834163, -846367, -48427, 849234, 1899837, 3081541, 4091487, 4430447, 3952318, 2744943, 1369505, 364270, -546219, -1940518, -3920687, -5557748, -5983195, -5791950, -5460834, -4525106, -2763319, -845545, 310391, 642328, 614480, 397978, -78856, -749670, -1525972, -2070519, -1950047, -1176209, -451967, -258177, -375452]
13901c75452k205j28787o63988j223318j566053j532251j323917n80438O15586
13892f780823J097805R92364R37357P65183O15955M98734N20368P93078P42303
13883A82324Q7279p22841q15234K27658J280529J374337O98965j43496o09225
13874A560296j214154j823099j651349j014977m21433J86367O34903O21206K7506
13865c094734p99403j064887m05592N02834J073182O01907o07754j301002j250933
13856f346382o26973K53663M77958N6485j30524J37673O81758R20711N54361k38396
13846d259666n97665n40935l92351J25792Q31938R54980O74249M81096K95768
13837b426794l8849o29068j364454j347331j6525J487019J839215J572975J120520
$$ y = [-375452, -377657, -506444, -1170432, -2393750, -3959803, -5492054, -6815971, -7396409, -6780823, -5683018, -4690654, -3753297, -2988114, -2372159, -1873425, -1353057, -559979, 182324, 269603, -453238, -1268472, -1040814, 239715, 1614052, 2313017, 2169521, 1560296, 346142, -1476957, -3128306, -4143283, -4564716, -4378349, -3743446, -3122240, -3094734, -3894137, -4959024, -5364616, -4861782, -3788600, -3186693, -3794447, -5095449, -6346382, -6973355, -6719692, -6241734, -6185249, -6315773, -6178100, -5496342, -4575631, -4021270, -4259666, -4857331, -5398266, -5790617, -5664825, -4832887, -3877907, -3203658, -2722562, -2426794, -2465643, -3094711, -4459165, -5806496, -5823021, -4336002, -2496787, -923812, 196708]
13828A96708O60750M77685k74543j522423k196387j382818L64318J482560J892757
13819c01393J724781M76976j270062j778746r02925p7570q5k5800J26650l0586
13809b058760l61856l50774j8934K79760J09438k63559j06356L55151K85831m09617
13799b539676o83846k47497J71204k5647q43861j473953j108520m53561J74757
13790g030600Q87381J128736Q81716M15079K24042K95976K71923K33598J52213
13781b539936J44954L72109k1400j215743j632559j033347k13391L59579N53886
13772e225848M93690M16243L81816M95384Q15074P70281M07412P7269j90615J81342
13762a377952R00703Q31282R4886j95803K38871O33338K91878n66628j099390
$$ y = [196708, 857458, 1335143, 1060600, -461823, -2658210, -4041028, -3676710, -2194150, -301393, 1423388, 1900364, 630302, -1148444, -2051369, -2128939, -2129024, -2154824, -2028174, -2058760, -2420616, -2771390, -2790324, -2510564, -2401126, -2664685, -2771041, -2415890, -2130059, -2539676, -3223522, -3471019, -3299815, -3325462, -4169323, -5643276, -6751796, -7205357, -7030600, -6143219, -5014483, -4132767, -3717688, -3493646, -3197670, -2925747, -2692149, -2539936, -2394982, -2022873, -2044273, -3260016, -4892575, -5925922, -6139313, -5779734, -5225848, -4732158, -4315915, -3934099, -3438715, -2623641, -1853360, -1445948, -1368679, -1559294, -1377952, -477249, 354033, 448919, 253116, 491987, 1125325, 1417203, 850575, -248815]
13753b48815j084392q42284m59057k28676l90882l21761L0440M25385J378479
13744a741563J947624J092960m33842j015223p38456n39202k93905m182L29544
13735a396245N71852J112511J586426J271808N81499Q8190l42631q83990r33302
13726A656118o55596p52967j341467k059614k282404k119851j945044j293674
13718a0794499k47509N99664J193353J836046K065139J324679N11722O76036J123826
13709a711543J041549N16149k86886o97995o33684p99277j302953j177238n38241
13700e590119j37345k72273n02845m84948j70916L25539L20275j96474m92515
13691g201621o69758r35893m03576Q54502J491930J661926J955591J943350J499755
$$ y = [-248815, -1333207, -2175491, -2634548, -2863224, -3254106, -3575867, -3545427, -3120042, -1741563, 206061, 1299021, 865179, -150044, -888500, -1427702, -1721607, -1725789, -1396245, -824393, 288118, 1874544, 3146352, 3727851, 3816041, 3473410, 2589420, 1656118, 1000522, 247555, -1093912, -3153526, -5435930, -7555781, -9500825, -10794499, -11042008, -10442344, -9248991, -7412945, -5347806, -4023127, -3511405, -2835369, -1711543, -669994, -153845, -440731, -1138726, -1772410, -2571687, -3874640, -5051878, -5590119, -5727464, -5999737, -6502582, -6987530, -7158446, -6832907, -6512632, -6709106, -7201621, -7871379, -8807272, -9210848, -8356346, -6864416, -5202490, -3246899, -1303549, 196206]
13682A96206O93465J29422k13379o98381j393919j883592j569159q87239k01899
13673e828475N65950O37812o1330o81575l93886M22769Q98135O97872r1407n09119
13663d343254l32950O0309P23210J420506J487726R91968N05010M44666P14738
13654A671929R07036J025804O61884j9539q81254j258312n46133M43347O61035
13645B665797K20029j05390j91098j91366l01331o46522j206334j494403j091189
13636b341807k37987O05321J113426J374309J553113J410527J022452K02936r30958
13627C771332j511058j444538j201953r67120q85240q10320j00842R03606J488551
13618g57582J481484P60866l90m3904R4487L7261J36159J56321J25033L33709
$$ y = [196206, 889671, 1019093, 805714, 107333, -1286586, -3170178, -4739337, -5626576, -5828475, -5262525, -4624713, -4686043, -5367618, -5761504, -5338735, -4440600, -3742728, -3834135, -4343254, -4676204, -4615895, -3892685, -2472179, -984453, 7515, 512525, 957191, 1671929, 2578965, 3604769, 4266653, 4247114, 3365860, 2107548, 1561415, 2004762, 2665797, 2885826, 2780436, 2589338, 2397972, 2096641, 1450119, 243785, -1250618, -2341807, -2579794, -1974473, -861047, 513262, 2066375, 3476902, 4499354, 4702290, 3771332, 2260274, 815736, -386217, -1353337, -2238577, -3048897, -3149739, -2246133, -757582, 723902, 1484768, 1484378, 1440474, 1534961, 1572222, 1708381, 1864702, 1989735, 2323444]
13608B323444K66949k35857q73054j392862j558859j326808n79065L47776J119626
13599a908710J736262J818313J286107O79951L60041K89718k210m87113o67559
13590C104800q39288j281579j424750p52185O5139L7452n52302o46552l47799
13581b637064j91535l3070N01942R47396N91869j37995o37915q32070o39086l86102
13571c453630l18472l04888k79229l45537l82791n89734p69351m22180L83907
13562f481905R93907J237245J386823J466652J768042J916660J165335k72199
13554C180560j440707j477602k26625J236479J318003M30511J781k232k07602
13545B812566q68994j269364r40807l85223J34027L96430P49360J268970J199727
$$ y = [2323444, 2590393, 2354536, 1481482, 88620, -1470239, -2797047, -3376112, -3028336, -1908710, -172448, 1645865, 2931972, 3611923, 3971964, 4261682, 4259472, 3772359, 3104800, 2265512, 983933, -440817, -1193002, -1127863, -1090411, -1642713, -2289265, -2637064, -2828599, -2861669, -2359727, -1412331, -820462, -958457, -1596372, -2428442, -3067528, -3453630, -3772102, -4076990, -4356219, -4701756, -5084547, -5674281, -6443632, -6865812, -6481905, -5487998, -4250753, -2863930, -1397278, 370764, 2287424, 3452759, 3180560, 1739853, 262251, 35626, 1272105, 2590108, 3020619, 3022400, 3020168, 2812566, 1943572, 674208, -266599, -651822, -517795, -121365, 627995, 1896965, 3096692]
13536C096692Q09801N53404O37020P27164L31856l71514j227945k082255k450982
13527B3241k233097j622277r03520j07147O79015J080026J291950J564594J382372
13518A155157R47651L50086m41430p04796j60593O89918J152273J000379Q05381
13509D794026L87363j5876j16779k06383l64220o14184j159286j790903j837505
13500i23747j238113q08592o70158l04663r3534j52708O9435O00512R36490R81741
13490a603337O51264q6975m74984l13113j90234j01840L22095J007713J244249
13481D54838J132425J060350P18917J29357k65374m84835n70472o05924q77905
13472F91377j178559r07909j54940L73937M24843Q3870j10820k67636p12721j174847
$$ y = [3096692, 3906493, 4459897, 5096917, 5824081, 6155937, 5784423, 4556478, 2474223, 23241, -2209856, -3832133, -4735653, -4842800, -4163785, -3083759, -1791809, -227215, 1155157, 2102808, 2452894, 2011464, 1306668, 1146075, 1835993, 2988266, 3988645, 4794026, 5181389, 5165513, 5048734, 4842351, 4478131, 3863947, 2704661, 913758, -923747, -2161860, -2970452, -3640610, -3945273, -4038807, -4191515, -4122080, -3521568, -2585078, -1603337, -952073, -1039048, -1514032, -1827145, -2017379, -2119219, -1797124, -789411, 454838, 1587263, 2647613, 3366530, 3495887, 3230513, 2745678, 2175206, 1569282, 691377, -487182, -1395091, -1550031, -1176094, -751251, -667381, -778201, -1045837, -1758558, -2933405]
13462b933405j250371j045100p52651j50738P36872J439249R44637n0968J45598
13453b916877Q53545N48191j18287M1377N92792Q17492K92250n03591q30429o51756
13443a875293k34644M16418Q69291P29667J97388l41838k79783Q0568K00874J48778
13433h8574O7606J95123O62047J116102P12168l55444n72160J00724M29839L61120
13423B628551j46054p25322o20151l00060l33051n82275r10790j286741j651187
13414c927080j561589n86782K85926O24861J163162J286307P39862P17515J319913
13405F2095J621970J138982r3562j014296j006000n28816j66073l90410q68109
13396a244219j035067j009192r75303q44217k30385Q93391J401631P17371J3719
$$ y = [-2933405, -4183776, -5228876, -5981527, -6132265, -5395393, -3956144, -3011507, -3062475, -2916877, -2063332, -1515141, -1633428, -1592051, -999259, -181767, 110483, -393108, -1223537, -1875293, -2109937, -1693519, -824228, -94561, 102827, -239011, -518794, -438226, -237352, -88574, -20968, 174155, 836202, 1952304, 2664472, 2309028, 1736868, 1837592, 2267431, 2628551, 2482497, 1757175, 1137024, 836964, 503913, -78362, -989152, -2275893, -3927080, -5488669, -6075451, -5789525, -5164664, -4001502, -2715195, -1975333, -1257818, 62095, 1684065, 2823047, 2729485, 1715189, 709189, 180373, 14300, -376110, -1244219, -2279286, -3288478, -4263781, -5107998, -5338383, -4444992, -3043361, -2325990, -2312271]
13387b312271j10269m32519j159302j743313j861693q04318J328860K692680K409186
13378a992959J305387M54477m2754n89200r78568q97945n41359k10252J60787
13369c332386K89842J50941l33504j129904j553773j143792j94166L00446N91065
13360f355231J126748J490596J623168J653144J364011O83320j5120l74714l43414
13351H52508j37898k26594p67198j342494j217917k64964M88654O06405Q17419
13342a192079Q39278M32544L15708M95011P06884Q98256Q48047O61357N85301
13333D590307N72087M92096O34114O95476N47729N16374R6913q73173j723612
13324E548311k099395j928090j530649j076477n40424K01469Q02729P74762N53287
$$ y = [-2312271, -2422540, -2855059, -4014361, -5757674, -7619367, -8423685, -7094825, -4402145, -1992959, -687572, -233095, -275849, -865049, -1843617, -2741562, -3282921, -3493173, -3332386, -3042544, -2891603, -3225107, -4355011, -5908784, -7052576, -7246742, -6946296, -6355231, -5228483, -3737887, -2114719, -461575, 902436, 1585756, 1570636, 1195922, 852508, 714610, 488016, -279182, -1621676, -2839593, -3104557, -2615903, -2009498, -1192079, -352801, 79743, 395451, 890462, 1597346, 2495602, 3343649, 4005006, 4590307, 5162394, 5654490, 6288604, 6984080, 7531809, 8048183, 8145096, 7271923, 5548311, 3448916, 1520826, -9823, -1086300, -1626724, -1425255, -622526, 152236, 705523]
13315G05523L62511J15620r3869N0195L54899L21702J20789j50342j23361N22214
13305B185881J039917P91021m7212p40017q41583l62672J03077J14835R3016j11741
13295B224522l01106J0218O38566R23144Q41357O97630M79086P52307J157988
13286G423712J044041P88421K97302n20908q52343m23450j88997o38315j084178
13277E845285j180607r70186k61351P19731J455518J111165k13406j139850j076929
13268D289370l12310P65388J520857J467609J055758K32992q16277j361713j513162
13259E328512j204037m36502J17742n7586p11810p43819k7905N03539Q38944J097040
13249D704118J467581J463508N60544m81322j046408j160482j564612k253549
$$ y = [705523, 1068034, 1183654, 1089785, 1139980, 1494879, 1816581, 1937370, 1787028, 1663667, 2185881, 3225798, 4016819, 3969607, 3229590, 2388007, 2025335, 2128412, 2243247, 2336263, 2224522, 1923416, 1933634, 2572200, 3495344, 4336701, 5034331, 5513417, 6265724, 7423712, 8467753, 9256174, 9553476, 9032568, 8180225, 7756775, 7567778, 6929463, 5845285, 4664678, 3694492, 3433141, 4152872, 5608390, 6719555, 6506149, 5366299, 4289370, 3977060, 4742448, 6263305, 7730914, 8786672, 9019664, 8203387, 6841674, 5328512, 4124475, 3687973, 3805715, 3748129, 3036319, 2292500, 2264595, 2768134, 3607078, 4704118, 6171699, 7635207, 8195751, 7714429, 6668021, 5507539, 3942927, 1689378]
13241A689378k486200k305642j875320q16386P44403J582737J703380J515695
13233b47955R97219P23311R41376J090572J010734J034871J389074J890815J905263
13224A0735280J092639L65180j00546o16364p67642p31932p85786p00003m79932
13215H010894l09419l83178o68339r00787j068764q65951k88144K81168M78781
13206D286261j34542r57245j114081o14399o31719j255750j460160j028466n51790
13197c461891l29097N2567O24346J044434J126054P56439J208m24355o3033L99113
13187b74215L40186o9997n76352m13437L44378Q87470R39857M64692k41705m55508
13177I45369l70970l94255k5878Q85903J597193J744476J400825M77165n75845
$$ y = [1689378, -796822, -3102464, -4977784, -5794170, -5049767, -3467030, -1763650, -247955, 749264, 1472575, 2413951, 3504523, 4515257, 5550128, 6939202, 8830017, 10735280, 11827919, 12193099, 12092553, 11476189, 10708547, 9976615, 9190829, 8490826, 8010894, 7701475, 7318297, 6649958, 5749171, 4680407, 3814456, 3526312, 3807480, 4286261, 4151719, 3194474, 2080393, 1465994, 834275, -421475, -1881635, -2910101, -3461891, -3790988, -3738421, -3114075, -2069641, -943587, -187148, -185940, -610295, -673328, -274215, 65971, -4026, -580378, -993815, -649437, 238033, 1177890, 1642582, 1400877, 945369, 574399, 180144, 154266, 1040169, 2637362, 4381838, 5782663, 6259828, 5683983]
13168E683983n69740J74647J54334o67399j370029j652994j477710j387948j895014
13159c007870k037681j165134J49006J204865J373742Q75073L05358l09864p25778
13150c338283m02326M21824J013632P53481J15499J64514K19547j57798k69876
13141a479786J89183Q85754J170284P37205M31439Q27041P89589J09858m26182
13132C234385p58933r15908n54738N0371M21720N89768M99422K48786K69214L91534
13122C475621M15929O16526P75792M24651J29253L74901L53301l01099j168620
13113E096255j745238j569683j118787q13094J70420J512628K264825J976896
13105E774222J013093j25693p93749m37381L26565K98455o04838j466210j724075
$$ y = [5683983, 5114243, 5288890, 5443224, 4775825, 3405796, 1752802, 275092, -1112856, -3007870, -5045551, -6210685, -6061679, -4856814, -3483072, -2607999, -2302641, -2612505, -3338283, -3740609, -3318785, -2305153, -1551672, -1436173, -1271659, -1052112, -1209910, -1479786, -1290603, -404849, 765435, 1502640, 1934079, 2761120, 3550709, 3660567, 3234385, 2475452, 1559544, 1004806, 1055177, 1476897, 2066665, 2566087, 2814873, 3084087, 3475621, 3891550, 4508076, 5283868, 5708519, 5837772, 6212673, 6565974, 6264875, 5096255, 3351017, 1781334, 662547, -150547, 19873, 1532501, 3797326, 5774222, 6787315, 6661622, 5867873, 5430492, 5757057, 6055512, 5450674, 3984464, 2260389]
13096B260389j112726k15586N00020J089969J286692R79655M03024l2789j87978
13087D970670k82541o25038j020152j141060j436620j824101j444197m91624j41489
13078c436152k36208P8795P51856J524968K149550K555633K706699K456518J727892
13069A0279551P44777J08815n10598j213754j576581j333190o40390o4022N64857
13060F359465J392901J562047Q89221Q7590j28047J13742K55999K26366J28946
13051A0888230o01253j430750j253174m33069k76299p74346j054869r65488o89950
13042C409032n63452m48981K9116M78440O87216J105534J632115J649847Q29147
13033H808014J27376K47350J066962J721602J490152P85681M98475J82724l50572
$$ y = [2260389, 1147663, 932077, 1432097, 2522066, 3808758, 4788413, 5191437, 5158648, 4970670, 4688129, 4063091, 3042939, 1901879, 465259, -1358842, -2803039, -3294663, -3436152, -3672360, -3593565, -2841709, -1316741, 832809, 3388442, 6095141, 8551659, 10279551, 11024328, 11133143, 10622545, 9408791, 7832210, 6499020, 5858630, 5794608, 6359465, 7752366, 9314413, 10203634, 10291224, 10163177, 10276919, 10532918, 10759284, 10888230, 10286977, 8856227, 7603053, 7169984, 6893685, 6119339, 5064470, 4098982, 3409032, 2845580, 2396599, 2425715, 2904155, 3591371, 4696905, 6329020, 7978867, 8808014, 8935390, 9182740, 10249702, 11971304, 13461456, 14247137, 14745612, 14928336, 14577764]
13024A4577764n48832q40159r55147m31353M30431J307107J898430J823342J630595
13015A8892178K196024K919969L211185L379519L260785K754167K571928K718667
13007D1904422K864021L149747L562685M097298M834198O321453Q421466J0286269
12999H5441559J1750521J3116632J4409212J5854597J8627422K2985144K8318187
12992B10503274L4244672M0794469M7656664N2665901N1781782M0140027J5560022
12985D93346811j5983908m2246393n5164011n5934072n0005392m1864167l4288776
12978A97860092k8064458k2452977j7647853j4835395j3420646j1669642r563798
12971H0205323p998006p208981o747086n930613m852621l688007k127257q43546
$$ y = [14577764, 14028932, 13188773, 12233626, 11802273, 12232704, 13539811, 15438241, 17261583, 18892178, 21088202, 24008171, 27219356, 30598875, 33859660, 36613827, 39185755, 41904422, 44768443, 47918190, 51480875, 55578173, 60412371, 66733824, 75155290, 85441559, 97192080, 110308712, 124717924, 140572521, 159199943, 182185087, 210503274, 244747946, 285542415, 333199079, 385864980, 437646762, 477786789, 493346811, 477362903, 435116510, 379952499, 324018427, 274013035, 232148868, 197860092, 169795634, 147342657, 129694804, 114859409, 101438763, 89769121, 80205323, 72207317, 64998336, 58251250, 52320637, 47468016, 43780009, 41652752, 40809206]
12963D0809206q59491j687144k355725k587682k159227j626208j417387j176284
12955B6940058q17416k16484L13296N04038L37047j51054n71289o83307q95767
12946B4759122j151749r76938o52949l20634M44135J043924P32022K38489M92937
12937B4608359J358699K252156K642205K866248L604851M895771N965630O293548
12929E4487467N924595M775467K822445K58556j956695k578325j795920p28333
12921F1209257M40566J819724L088816M001043M709971N219879N740985O581900
12913I2812141P713156R038139J0523979J2541083J5527661J9800143K4857976
12906A92814278L0039315L5682203M2041656M8705039N3574508N1476712L6697595
$$ y = [40809206, 39949715, 38262571, 35906846, 33319164, 31159937, 29533729, 28116342, 26940058, 26122642, 25906158, 26219454, 26723492, 27060539, 26909485, 26338196, 25654889, 24759122, 23607373, 22630435, 21977486, 21656852, 22100987, 23144911, 23876933, 24115422, 24608359, 25967058, 28219214, 30861419, 33727667, 37332518, 42228289, 48193919, 54487467, 60412062, 65187529, 68009974, 68268530, 66311835, 63733510, 61937590, 61209257, 61649823, 63469547, 66558363, 70559406, 75269377, 80489256, 86230241, 92812141, 100525297, 109563436, 120087415, 132628498, 148156159, 167956302, 192814278, 222853593, 258535796, 300577452, 349282491, 402856999, 454333711, 491031306]
12899D91031306Q672334k3614746m7411269n6886214n5330377m8853335m0955028
12892B26652671l3355788k6912044k1715108j7960540j5519799j3474329j1401278
12885H6313785r397280p775998o804809o388999o112016n326873l928946k557467
12877C8021397j690944j508023j612335j174155p39044p13030r12674j467516
12869B8203676j885800j528924q05876r8652M15000M06568j43318r20852j513118
12860B2128704j662680j294009q08381p14621r61564r06566n36250q1333L52815
12851A5516115Q50247J497604K249310K657870K170521J090844M63908O92265
12843B7188684Q97835O66997N74758J179785J855114J569887O91982M05754J145353
$$ y = [491031306, 499703640, 476088894, 428677625, 371791411, 316461034, 267607699, 226652671, 193296883, 166384839, 144669731, 126709191, 111189392, 97715063, 86313785, 76916505, 69140507, 62335698, 55946699, 49834683, 44507810, 40578864, 38021397, 36330453, 34822430, 33210095, 32035940, 31296896, 30583866, 29671192, 28203676, 26317876, 24788952, 23983076, 23884424, 24299424, 24705992, 24562674, 23641822, 22128704, 20466024, 19172015, 18363634, 17649013, 16687449, 15780883, 15244633, 15163300, 15516115, 16366362, 17863966, 20113276, 22771146, 24941667, 26032511, 26496419, 27188684, 28086519, 28753516, 29328274, 30508059, 32363173, 33933060, 34625042, 35030796, 36176149]
12834C6176149K781163M417530N125374N008076N081149O072548P725305R583108
12826H1970402J1271548J2580271J3707931J4941166J6811476J9662039K3293144
12819A94237977K8056130L4248166M1508971M8207164N1659377M8144043L2437385
12812D78499213M407875k5960125m7054834n4978785n2896329m6091270l8554836
12805B17370909l2034195k6597898k2119343j8558382j5442593j2324614r682744
12798H0611140q099074p220064o385756n542981m814713l992425l616704l669994
12790C7269429l587195l518061k878631j658382j426994k204145k734374k322179
12782A6939468j032728Q7307M6323p78598j330833j270569q78894l71280k34818
$$ y = [36176149, 38957312, 43374842, 48500216, 53508292, 58589441, 64661989, 72387294, 81970402, 93241950, 105822221, 119530152, 134471318, 151282794, 170944833, 194237977, 222294107, 256542273, 298051244, 346258408, 397917785, 446061828, 478499213, 482907088, 456946963, 409892129, 354913344, 302017015, 255925745, 217370909, 185336714, 158738816, 136619473, 118061091, 102618498, 90293884, 80611140, 72512066, 65292002, 58906246, 53363265, 48548552, 44556127, 40939423, 37269429, 33682234, 30164173, 27285542, 25627160, 24200166, 21996021, 19261647, 16939468, 15906740, 15994047, 16040370, 15261772, 13930939, 12660370, 11781476, 11410196, 11175378]
12773A1175378o44366q14334l92649O20009J321997R95461M12677p3277o39069
12764A1961827r10921q03284p86763j085401j784754k360457k251928j611987
12756C66332n43223K39832J41269k6639L50889M60630j57001p39838j125898r67824
12746b001471J9343J069728J417687J002438K59670k6247K43993Q29460R26985
12737C741586J90265l23148l27625p15657j494006k071659j789539m30456J492614
12728a727625K570531K386399J680477P48648L39690M51793k1190j016883j427920
12719C983920j008364n15610k82267j64932k6797Q4664L90347R01010J624619
12710D986590J905451J285558K46120p27350j272242j058270j73312O89232P73576
$$ y = [11175378, 10531012, 9716678, 9324029, 9944038, 11266035, 12261496, 12674173, 12600896, 11961827, 11050906, 10247622, 9460859, 8375458, 6590704, 4230247, 1978319, 366332, -176891, 62941, 204210, 177571, 528460, 989090, 832089, 92251, -1033647, -2001471, -1982128, -912400, 505287, 1507725, 1767395, 1741148, 1985141, 2814601, 3741586, 3931851, 3608703, 3281078, 2565421, 1071415, -1000244, -2789783, -3220239, -1727625, 842906, 3229305, 4909782, 5658430, 5998120, 6449913, 6428723, 5411840, 3983920, 2975556, 2459946, 2177679, 2012747, 1985950, 2070614, 2460961, 3361971, 4986590, 6892041, 8177599, 8423719, 7696369, 6424127, 5365857, 5192545, 5881777, 6655353]
12701F655353K3822q49950j411781j532289r96866J66142R48286Q83247O50985
12692D536949O8419q85943j131604o09266j57631N9327L04598R2209l54259k73164
12682A649635N28163R73637M93432l26060p26563n99256q00277j441286j731708
12673a980283j384284q72012l42848K16374R38531J125241N16490J08832K9773
12664a644186M11708P40559L05356l98736n93385l46077j73082P0725K54088r3773
12654a466803m77880k35921o757l02411l07105L10959Q49417P66452P14206J197270
12644A041427J276700R25886Q32546Q04934P37557J99339q01317j266667j019458
12635B730947l76992L51708N94013M05802K73519M62945Q17123O14608m45449
$$ y = [6655353, 6679175, 5829225, 4417444, 2885155, 1888289, 2054431, 3002717, 3885964, 4536949, 4605368, 3719425, 2587821, 1978555, 1820924, 1880251, 2184849, 2277058, 1922799, 1649635, 2177798, 3151435, 3644867, 3318807, 2592244, 1992988, 1192711, -248575, -1980283, -3364567, -4236579, -4579427, -4363053, -3424522, -2299281, -1782791, -1673959, -1644186, -1232478, -491919, -186563, -585299, -1178684, -1524761, -1697843, -1627118, -1373030, -1466803, -1944683, -2180604, -2187361, -2489772, -2796877, -2485918, -1636501, -870049, -155843, 1041427, 2318127, 3244013, 4076559, 4881493, 5619050, 5818389, 5017072, 3750405, 2730947, 2353955, 2705663, 3299676, 3705478, 3978997, 4441942, 5259065, 5873673, 5428224]
12626E428224j433479j617186j338075j151293p75363l23435k95011n99605m86731
12617b591954J84995N01723L6380m97347p47260p85348L0824J085769J119034
12608a663184P06711M63730q8212p71278o97046J48058P99507J000898R65962
12599H65146R03931O41670k91828j172031j614064j370000j10315J254001J586733
12590F93243J381765J380573J394778J150012N97409q5758n63906j055074j526767
12581C366275j584476j456624p43095O47868J432375J358902J216048R78802N03620
12572E719695j72124o82290o99604l76671l53889n85586q17191j304269j925995
12563a197924j904539j087470j1088J145830K122221K206376J779488J482880
$$ y = [5428224, 3994745, 2377559, 1039484, -111809, -887172, -1210607, -1505618, -2105223, -2591954, -2406959, -1905236, -1868856, -2366203, -3113463, -3898811, -3867987, -2782218, -1663184, -956473, -492743, -580955, -1352233, -2049279, -1901221, -1101714, -100816, 865146, 1769077, 2410747, 2118919, 946888, -667176, -2037176, -2147491, -893490, 693243, 2075008, 3455581, 4850359, 6000371, 6597780, 6512022, 5948116, 4893042, 3366275, 1781799, 325175, -417920, 229948, 1662323, 3021225, 4237273, 5216075, 5719695, 5547571, 4865281, 4165677, 3789006, 3435117, 2849531, 2032340, 728071, -1197924, -3102463, -4189933, -4201021, -3055191, -932970, 1273406, 3052894, 4535774]
12555D535774J103128P74032L00579r69219k229076k373775j851833j378578j329634
12546c418602j273530r28438n82896l92455l36778l80791o45755q53947p78914
12537i592106m42006n769K94333P22848J260156J774960K428532K828239K341841
12528A611028Q86094o35600j222373j116765q70931m57762J8268L94840O33880
12519g59321Q65705Q42814N24674J08378k35698k84530m11549q09053j454843
12510a613423j995433j925808j194103P6817J241260J650247J352616Q75996L52080
12501a179751j13459o37361j211320j131152p84363m67504M35750J310952J340939
12492b437269Q94551L08756k47639l37057J44184O76296R10234P33167n3876o45797
$$ y = [4535774, 5638902, 6412934, 6713513, 5744294, 3515218, 1141443, -710390, -2088968, -3418602, -4692132, -5620570, -6203466, -6595921, -6932699, -7313490, -7959245, -8813192, -9592106, -10034112, -10039881, -9745548, -9022700, -7762544, -5987584, -3559052, -730813, 1611028, 2497122, 1861522, 639149, -477616, -1348547, -1806309, -1788041, -1393201, -759321, 106384, 949198, 1473872, 1582250, 1346552, 1062022, 650473, -158580, -1613423, -3608856, -5534664, -6728767, -6651950, -5410690, -3760443, -2407827, -1531831, -1179751, -1293210, -1930571, -3141891, -4273043, -5057406, -5524910, -5089160, -3778208, -2437269, -1542718, -1233962, -1481601, -1818658, -1674474, -998178, -87944, 645223, 591347, -54450]
12482e4450j86619P17379J085675R76721O81295M52367J32840p56405j435452
12473A613351j170724o63034l99528m23118q89930j281771r99690N6597J401534
12464b756313K156952J894522P48739m94175j150148j173038q70794k79678O05421
12455a318512J150870Q68079M85173N56853K94424M5301o5700m52034r51393j289417
12445f76356j394050j249158j125481j141581n83234J54561J79316K29021J070090
12436d536872J931818J793636Q56878J39031K68938N03242L91592K90380K06575
12427A845218l83875j364850j793444j245246k74588K76728j20017j192422j884847
12418f137343j504145o51003K55671J141039J648442J262761O76732J163156J956894
$$ y = [-54450, -241069, 476310, 1561985, 2538706, 3220001, 3672368, 3805208, 3048803, 1613351, 442627, -220407, -619935, -1043053, -1932983, -3214754, -4214444, -4157847, -2756313, -599361, 1295161, 2043900, 1549725, 399577, -773461, -1644255, -1923933, -1318512, -167642, 700437, 1185610, 1742463, 2036887, 2082188, 2016488, 1564454, 613061, -676356, -2070406, -3319564, -4445045, -5586626, -6169860, -6015299, -5835983, -5606962, -4536872, -2605054, -811418, 45460, 184491, 453429, 956671, 1348263, 1638643, 1845218, 1461343, 96493, -1696951, -2942197, -3216785, -2940057, -3060074, -4252496, -6137343, -7641488, -8292491, -8036820, -6895781, -5247339, -3984578, -3307846, -2144690, -187796]
12409a87796J823908J149474K77146l57259l66439J31975P12106Q03826L59506
12400D346447k81784q77581j512466j792553j236899m22718K74487R15706J538063
12391I50702J861634J606773J255449J051328N86772l11375j195215j350681o67325
12382C788062j47134o1187j11700k98938n34004m67069P7663P96838J497557J768267
12372F308355J117866J60069o14082r08724n98807k59241l52497o75516r64381
12363C213042j191183j384076r99433J12505J090231J123510N75276K01523M23070
12354C164465R76188J076574M78608k32864r50576j562882j684568j314955n99978
12345f49988m17911o36874m24589M27460J509754K136051K282404J601274j342
$$ y = [-187796, 1636112, 2785586, 3062732, 2705473, 2339034, 2471009, 3183115, 3986941, 4346447, 4064663, 3187082, 1674616, -117937, -1354836, -1777554, -1503067, -587361, 950702, 2812336, 4419109, 5674558, 6725886, 7312658, 7001283, 5806068, 4455387, 3788062, 3640928, 3579741, 3468041, 3169103, 2635099, 2168030, 2245693, 3042531, 4540088, 6308355, 7426221, 7586290, 6972208, 6063484, 5464677, 5205436, 4852939, 4177423, 3213042, 2021859, 637783, -361650, -249145, 841086, 1964596, 2539872, 2741395, 3164465, 4140653, 5217227, 5695835, 5462971, 4512395, 2949513, 1264945, -50010, -649988, -1067899, -1704773, -2129362, -1701902, -192148, 1943903, 4226307, 5827581, 5826239]
12336E826239j279525j332525o87378k21710l0323l54760j229977j981664j813441
12327c105064j085066o64180j43096K24178P1395J4689L51095N44771K40996n89082
12317d139364j201703j052777o22948K49504J784317K677314K430545J941162
12309B066050J451581P29490r7280m71140m81292r19828j562708j599399j212740
12300b097266r07108o66570l53752L63564J064007J090743J392934K563754L299440
12291E749746K593195Q53941q53614j530769j301948n93051K59766M14148j79508
12282E411906r67515j367092j118367q85705j095586j330162q01104M20414J323762
12273d09449J759368J759010J054322n48757k021680j983217p78118K66841L80162
$$ y = [5826239, 4546714, 3214189, 2526811, 2305101, 2274778, 1920018, 690041, -1291623, -3105064, -4190130, -4854310, -4997406, -4773228, -4701833, -4687144, -4336049, -3791278, -3550282, -4139364, -5341067, -6393844, -7016792, -6767288, -4982971, -2305657, 124888, 2066050, 3517631, 4247121, 4149841, 3678701, 3197409, 2277581, 714873, -884526, -2097266, -3004374, -3670944, -4024696, -3661132, -2597125, -1506382, -113448, 2450306, 5749746, 8342941, 9196882, 8343268, 6812499, 5510551, 4917500, 5177266, 5591414, 5411906, 4444391, 3077299, 1958932, 1073227, -22359, -1352521, -2153625, -1733211, -409449, 1349919, 3108929, 4163251, 3614494, 1592814, -390403, -1168521, -901680, -521518]
12264e21518j23063o64091p43319l19632J3034n5770M1816K28690K60099J66219
12254a717535J04860K41962L60156M15834N54721N55803L67086L66132N06978
12245A755997N14238K35969j31133l56025m11103m42340k50065J49227K39124
12236A303889k813k64223p0231P49723J550061J665778J303212O08368j94682
12227F649082r75934j569759j502535j079328p39248q02328j184915j197326p08789
12218c111080p14746j113334q39972J15607J026332J845840K359619J978204P40832
12209B287302l57931j128686j545628j301307r81547q71781p79270n86318n77814
12200e842980r07495j100198p29721L14944J320807J676276J702034J561833J099906
$$ y = [-521518, -644581, -1308672, -2051991, -2371623, -2358589, -2414359, -2372543, -2143853, -1883754, -1717535, -1612675, -1370713, -1010557, -594723, -40002, 515801, 882887, 1249019, 1755997, 2270235, 2506204, 2375071, 2019046, 1607943, 1165603, 915538, 1064765, 1303889, 1301076, 1036853, 966622, 1716345, 3266406, 4932184, 6235396, 6843764, 6649082, 5673148, 4103389, 2600854, 1521526, 782278, -20050, -1204965, -2402291, -3111080, -3825826, -4939160, -5779132, -5663525, -4637193, -2791353, -431734, 1546470, 2287302, 1929371, 800685, -744943, -2046250, -3027797, -3899578, -4678848, -5265166, -5842980, -6750475, -7850673, -8580394, -8265450, -6944643, -5268367, -3566333, -2004500, -904594]
12191i04594M46978k41285n31487k14927j80789n66717q53017p70240p90223r52931
12181e559232j023922j051672j034697o95450L36767J239400J740062J889531
12173d159213J444111J100828R67631M95261j35006j12030N63033J273182J280407
12164B718204Q20187P22926O06732p7107p21902n42637M87697J255853R91128
12155F261081J92341o33021j134620j200872j129192j088101q23484o6486R21219
12146A298865J381881J090063M76985J04314K52500M00788K89712J06222j68321
12137E233009l59605m46795o17972q22005o23701m3983K54030L30934L37682j0781
12127C230813o89476q44502j632P50686Q23480L22852k07589m03061l56530L10242
$$ y = [-904594, -457616, -698901, -1230388, -1445315, -1626104, -2192821, -3045838, -3816078, -4606301, -5559232, -6583154, -7634826, -8669523, -9364973, -9028206, -7788806, -6048744, -4159213, -2715102, -1614274, -646643, -151382, -286388, -398418, 164615, 1437797, 2718204, 3538391, 4261317, 4868049, 4790942, 4069040, 3526403, 4014100, 5269953, 6261081, 6453422, 5820401, 4685781, 3484909, 2355717, 1267616, 444132, 377646, 1298865, 2680746, 3770809, 4247794, 4352108, 4604608, 5005396, 5295108, 5401330, 5233009, 4873404, 4426609, 3808637, 2986632, 2362931, 2318948, 2572978, 2903912, 3241594, 3230813, 2541337, 1696835, 1695203, 2445889, 3269369, 3592221, 3384632, 2981571, 2625041, 2935283]
12117B935283M80666o44646j344303r79250l83853n8414j28205j47956l74169
12108f44847n39341K49860R56889N02088q3132n2209N17093Q22663L15062k03871
12098A840255l28359k90800n23549n84077j0449N85935R02280M32287l02276m06098
12088A315149J86272R87303J444536J345296P44098J22831j68150n26720j079817
12079D370798j227283p97533j30497M50162R11953N25196l72240n37792q5363
12070C107401L37288L95050J409q33419j020109k45043J49200o1817k47604j83790
12060A398566j77050q01762j669008k003088j591464j081265r19417r91685j120354
12051h956527j009984o11716J7843M53343K33309k26189j53032K87469J040599
$$ y = [2935283, 3415949, 2771303, 1427000, 447750, 63897, 5483, -122722, -270678, -644847, -1184188, -934328, 22561, 524649, 441517, 389308, 906401, 1729064, 2044126, 1840255, 1511896, 1221096, 697547, 113470, 103021, 688956, 1591236, 2023523, 1721247, 1315149, 1501421, 2488724, 3933260, 5278556, 6022654, 6145485, 5977335, 5450615, 4370798, 3143515, 2345982, 2215485, 2665647, 3577600, 4102796, 3730556, 3192764, 3107401, 3444689, 3839739, 3841148, 3007729, 1987620, 1742577, 1891777, 1829960, 1582356, 1398566, 1221516, 419754, -1249254, -3252342, -4843806, -5925071, -6844488, -7836173, -8956527, -9966511, -10578227, -10560384, -10107041, -9873732, -10099921, -10252953, -9965484, -8924885]
12042h924885J593947J364557N29558L7875K37646O96472J061701J190187J146668
12033a066274Q27187Q18245J250514J017655L01613l14824p33573o86340n73275
12024H40928o45311l90379o9425k63137o48152r21980j157292j519753j753162
12015f527663j769005j425836l66745R18847J328771P78597K52271L88093O56684
12006e765986P58668N17412J75936j62962r38205j428692j131397p19066m33366
11997i127658K29258J457544K373086J959979Q70931L09887K71875l74101j228731
11988c257930o68094L94416L70535n10360j348139j675655j469855r46563L0514
11979i081131J282241K042654K123438J780159J379894Q92276J21553n57909o94889
$$ y = [-8924885, -7330938, -5966381, -5436823, -5398948, -5161302, -4464830, -3403129, -2212942, -1066274, -239087, 579158, 1829672, 2847327, 3148940, 2834116, 2100543, 1414203, 840928, 195617, -194762, -264187, -527324, -1175476, -2097456, -3254748, -4774501, -6527663, -8296668, -9722504, -10089249, -9170402, -7841631, -7063034, -6810763, -6422670, -5765986, -5007318, -4489906, -4313970, -4476932, -5415137, -6843829, -7975226, -8694292, -9127658, -8898400, -7440856, -5067770, -3107791, -2236860, -1926973, -1655098, -2029199, -3257930, -3926024, -3531608, -3161073, -3671433, -5019572, -6695227, -8165082, -9111645, -9081131, -7798890, -5756236, -3632798, -1852639, -472745, 419531, 541084, -16825, -711714]
11970g11714m06647r8478K98765P80509R06276P72217M54770k54345q86494q50869
11960C990n86662q68482j001470o82839l83520J70058Q67580J325191J047225
11951a08929J83658j39020K8582J78488p5524r67569j392669r43105m14272j36784
11941c787144K45653N44882P65548J033243P71091L40844l65685j248257j104458
11932b804283k70972J22407J22656K95039M22196k64187j417948j687306j255015
11923f737413m97411l6552j05685m07697q05659r62440p32865q76580r78846j21445
11913a2262593J296274K292106K218706J436151M30659j45630k690O84873J204133
11904b848011J075214O84919L68029L74473N71081P93982J392291K041648J921980
$$ y = [-711714, -1118361, -1216839, -918074, -137565, 768711, 1540928, 1995698, 1741353, 854859, 3990, -582672, -1451154, -2452624, -3135463, -3518983, -3348925, -2481345, -1156154, -108929, 74729, -64291, -35709, 142779, 67255, -900314, -2292983, -3236088, -3650360, -3787144, -3541491, -2996609, -2231061, -1197818, -426727, -85883, -451568, -1699825, -2804283, -3075255, -2952848, -2830192, -2535153, -2112957, -2377144, -3795092, -5482398, -6737413, -7234824, -7271376, -7377061, -7784758, -8590417, -9552857, -10285722, -11162302, -12141148, -12262593, -10966319, -8674213, -6455507, -5019356, -4588697, -4734327, -4737017, -4052144, -2848011, -1772797, -1087878, -719849, -345376, 225705, 1019687, 2411978, 4453626, 6375606]
11895F375606R00438k7652k03318n8662m07283j249533j696591j158719j49372
11886B324914L96674K5058p85301q12524l28886k44094k82960j36701j65927j14268
11876a24015K99652N74978J92721n54910p65127m05163J05686N22097M88741J10794
11866D45454J23752O15189R86510P39331k05819j037873j379799j115187l81754
11857a210196q824p3693k17285l88400o24681o32471l68753J27397O37046J025474
11847a734386J066581N99719j42583r47559j303512j007919o05767k0874R13115
11838c183185J492046J237918P33299L85337p8758o09217q52570o26224Q1549
11829a419805Q99093J186032P97877k30673j436765k146608k178429j459861K091
$$ y = [6375606, 7276044, 7248392, 7045074, 6986412, 6579129, 5329596, 3633005, 2474286, 2324914, 2721588, 2746646, 1961345, 1148821, 819935, 575841, 292881, 156180, -9747, -124015, 175637, 750615, 943336, 388426, -376701, -781864, -676178, -154081, 334660, 445454, 569206, 1184395, 2170905, 2910236, 2704417, 1666544, 286745, -828442, -1210196, -1219020, -1292713, -1509998, -1898398, -2523079, -3155550, -3524303, -3396906, -2759860, -1734386, -667805, -68086, -210669, -1158228, -2461740, -3469659, -4075426, -4096300, -3183185, -1691139, -453221, 280078, 665415, 586657, -22560, -875130, -1501354, -1419805, -520712, 665320, 1463197, 1232524, -204241, -2350849, -4529278, -5989139, -5987048]
11820e987048J357267J660008Q39958l67012m86442M27059R65302O24132K6680
11811i40096l05035l94695k71138j82875L865K07436j92512n45018l8147P15950
11801a942265P26113K27858K09588O36841N95239J53114j58839j8300L41133L96283
11791A166765K61231m49940j546946j754722p99229L30446J033615J338941J068441
11782F48602P43432K27652o00212o39187m8012L77290J86308l93270m87059R3871
11772A09415J020743K098331L133870L816423L948403K468407k03520j610250
11764A4781822j663808j630024j645676j649016j935283k217379j846830j187746
11756A006060o53023k03344l25558o27501m42753j45495k11168o70903j203790
$$ y = [-5987048, -4629781, -2969773, -2129815, -2496827, -2983269, -2556210, -1590908, -966776, -940096, -1245131, -1639826, -1910964, -2093839, -2089974, -1882538, -2075050, -2620068, -2658215, -1942265, -1216152, -988294, -778706, -141865, 453374, 606488, 447649, 429349, 770482, 1166765, 1427996, 978056, -568890, -2323612, -3122841, -2792395, -1758780, -419839, 648602, 1392034, 1619686, 1019474, 380287, 332275, 709565, 895873, 502603, 15544, 109415, 1130158, 3228489, 6362359, 10178782, 14127185, 16595592, 16392072, 14781822, 13118014, 11487990, 9842314, 8193298, 6258015, 4040636, 2193806, 1006060, 353037, 149693, -175865, -803366, -1246119, -1391614, -1602782, -2273685, -3477475]
11747c477475j056444l64893N74237J484870J668037J117124N18094L52370M76072
11738A291992L90552L23734J45275k07272k73042n0839J20147M4277k60033r90215
11728E34576j745054j976120j658915j070213k91442P33774J215336Q56776N41163
11719b860119O59170J169081J950237J993543R82208J10898k34289o61395q16602
11710B292732n56103l07999K00710Q79888J135683R15007N78675L42186K14821
11701E695600k92271p83486m84670K7020q6486m76284k59853K91976Q05483J069593
11691E506622M23214n10236q22960o74424l57587j83462j57652J33566O85843
11682D042924J096744P40985J43858J779o1237m23949q36036q43733p13110k76684
$$ y = [-3477475, -4533919, -4898812, -4324575, -2839705, -1171668, -54544, 463550, 815920, 1291992, 1682544, 2006278, 2151553, 1944281, 1671239, 1620400, 1740547, 1784824, 1524791, 534576, -1210478, -3186598, -4845513, -5915726, -6207168, -5473394, -4258058, -3401282, -2860119, -2200949, -1031868, 918369, 2911912, 3894120, 4005018, 3770729, 3109334, 2292732, 1736629, 1428630, 1629340, 2509228, 3644911, 4559918, 5138593, 5480779, 5695600, 5403329, 4619843, 4135173, 4162193, 4075707, 3599423, 3339570, 3631546, 4437029, 5506622, 5929836, 5419600, 4596640, 3922216, 3564629, 3381167, 3223515, 3357081, 4042924, 5139668, 5880653, 6024511, 6026290, 5965053, 5541104, 4705068, 3861335, 3148225, 2871541]
11672B871541M60329Q91673R05943M96617j31053o61305j381450k199925k358567
11663a106197j668240q83951n01573j155K20189k32936k73961L35185P23785M74765
11653b914089j11585k84274j24995j05144j52359q3066K26594P73359J071837
11644a703722O86217J10057L70747R09593P99328L47227J87294M24093Q11527
11635B942361J080083Q60406J53262n06342n53028r0298O6296j95354k91262k35992
11625C230132j95419j0932R634m21522q73825q50503k42902O34676R09724L81268
11615B570331k46074q03821j386128j788157j365424m58853n3985m71914o73964
11606d677989q8961K52070K53861O85295J057072P21366J60789k44798m85230
$$ y = [2871541, 3331870, 4223543, 5129486, 5626103, 5495050, 4833745, 3452295, 1252370, -1106197, -2774437, -3658388, -4159961, -4161116, -3940927, -4173863, -4447824, -4112639, -3388854, -2914089, -3025674, -3309948, -3434943, -3540087, -3692446, -3775512, -3548918, -2775559, -1703722, -1017505, -907448, -536701, 372892, 1172220, 1519447, 1706741, 2130834, 2942361, 4022444, 4882850, 5036112, 4529770, 3976742, 3886444, 3952740, 3757386, 3466124, 3230132, 3034713, 3023781, 3033415, 2611893, 1738068, 887565, 644663, 1279339, 2189063, 2570331, 2324257, 1520436, 134308, -1653849, -3019273, -3478126, -3532111, -4004025, -4677989, -4766950, -4514880, -4261019, -3575724, -2518652, -1797286, -1636497, -1881295, -2366525]
11597b366525p20381j280127j557216q61469m563J56279Q0091L55103Q60059J403188
11587c935561K037807K207148J791918J239075R82440R65293J127540R81249J48966
11578G545875l39787l07903n81080j188119j331031q97410q67438j368244j388340
11569g23477p05134L36899J290341J422841P79210K85448Q6578j6776R1592k16036
11559B631486q11502n70827n0811j05517l31755k90909K42555R18546J330548
11550B961814J299393M59281o55834r85658m09703j09805n79893j016264q72671
11541I0660l39959J40369J69375l09204p75824o68281k36380L15258P14486P20173
11531a79327K85744k51780l89618P1720N46951N14823J88369q4242r4162j50567
$$ y = [-2366525, -3086906, -4367033, -5924249, -6785718, -6790281, -6634002, -6553911, -6198808, -5338749, -3935561, -1897754, 309394, 2101312, 3340387, 4322827, 5288120, 6415660, 7396909, 7545875, 7206088, 6898185, 6317105, 5128986, 3797955, 2900545, 2033107, 664863, -723477, -1428611, -1091712, 198629, 1621470, 2400680, 2686128, 2772706, 2755930, 2847522, 2631486, 1819984, 1249157, 1198346, 1092829, 761074, 470165, 712720, 1631266, 2961814, 4261207, 4720488, 4064654, 3078996, 2669293, 2559488, 1979595, 963331, 90660, -249299, -108930, 60445, -248759, -1024583, -1692864, -1929244, -1613986, -899500, -179327, 106417, -145363, -534981, -463261, 83690, 598513, 786882, 702640, 608478, 457911]
11521D57911m26317r19556j041783j9482J459723J881991J477381J160137P98064
11512D828069K69282L2242k32274r07219j486791j668926j557534j618757j919593
11503d261501j762956q30597j69598j89945l55741n20200l63014J33773Q26907
11494g492872J467359J594579J179880O15636L39435K19614L4333J75870P98161
11485a068005J462213J532296P02628l55450o96656r7929J090259J950148J467061
11476E986565L34235L2654N23514R79786M21918j200189k398823k046140j122328
11467A511192r57145j096406q22266l45366K1425M32096Q33553Q69623L83843
11458H30549r9929l57698o82387q92109q24839p80785o63064l31797m994k77835
$$ y = [457911, 31594, -887962, -1929745, -1949227, -489504, 1392487, 2869868, 4030005, 4828069, 5097351, 5129593, 4897319, 3990100, 2503309, 834383, -723151, -2341908, -4261501, -6024457, -6855054, -7024652, -7214597, -7570338, -8090538, -8453552, -8319779, -7492872, -6025513, -4430934, -3251054, -2635418, -2295983, -2076369, -2042036, -1866166, -1068005, 394208, 1926504, 2629132, 2273682, 1577026, 1479097, 2569356, 4519504, 5986565, 6320800, 6353454, 6876968, 7856754, 8278672, 7078483, 4679660, 2633520, 1511192, 554047, -542359, -1364625, -1709991, -1688566, -1256470, -422917, 446706, 830549, 730620, 372922, -309465, -1201574, -2026413, -2807198, -3470262, -3802059, -3807053, -4084888]
11448d084888r81282j240256o57196M73895J672414K400689K356180J665093J127342
11439B731991J034346M46330m28672q17271o75798o65983j101213j278706p62080
11430a517056l09120o20625r62880r01059q68302l44168P65440J611275J557560
11421a588935Q85510L39245Q158l19478p63208j163017q30517k47084k93069o42511
11411d614906q05308p03127j15699P47356J315145J516435J567430J130822K41093
11402B79241l86709o50991o29900l78480j63278l06816p65379q92696k12346R48218
11392c159136J478610J182884J005322J125611P23422m41421j254993j298906
11384f38607r57329l53198j10619l67890q76056j270992r40113j41150K87536
$$ y = [-4084888, -5066170, -6306426, -6963622, -6489727, -4817313, -2416624, -60444, 1604649, 2731991, 3766337, 4212667, 3783995, 2966724, 2290926, 1624943, 523730, -754976, -1517056, -1826176, -2446801, -3409681, -4310740, -5179042, -5523210, -4757770, -3146495, -1588935, -703425, -364180, -356022, -675500, -1438708, -2601725, -3432242, -3679326, -3972395, -4614906, -5420214, -6123341, -6239040, -5491684, -4176539, -2660104, -1092674, 38148, 279241, -107468, -758459, -1388359, -1766839, -1930117, -2236933, -3002312, -3895008, -4107354, -3159136, -1680526, -497642, 507680, 1633291, 2356713, 1915292, 660299, -638607, -1595936, -1949134, -2059753, -2427643, -3303699, -4574691, -5514804, -5655954, -5368418]
11375e368418J78400L42980J023294J659758J859985J467588Q76963M62460L1590
11366B534600m89787n26542r4148J19483j84938n50135m53735k31192j66085N4870
11356A2391O28757P32773J89190k79519p26543j045208q05683m94611p26643j281752
11346c796848j842385j536422J54190K154555K571715J435319M52768j10056k05281
11337g22445M1950J03216q1211n03874p65777o55263o59628j090997r94969l24795
11327e653793N8280K62766M64601L33608J25194L70639J055523J772021J790871
11318E79710J056102P8871j106845j976550j334761k74354M7986J75119K23278
11309b531444k3370k70957k2977P74542J380850J498026J191085O19920L7855
$$ y = [-5368418, -5190018, -4847038, -3823744, -2163986, -304001, 1163587, 2040550, 2503010, 2534600, 2044813, 1518271, 1424123, 1543606, 1358668, 808533, 354798, 123606, -42479, 12391, 641148, 1373921, 1563111, 1283592, 557049, -488159, -1293842, -1788453, -2515096, -3796848, -5639233, -7175655, -7021465, -4866910, -2295195, -859876, -407108, -517164, -722445, -680495, -577279, -658490, -1162364, -1928141, -2583404, -3243032, -4334029, -5328998, -5653793, -5595513, -5332747, -4868146, -4534538, -4409344, -4038705, -2983182, -1211161, 579710, 1635812, 1714683, 607838, -1368712, -2703473, -2977827, -2929841, -2754722, -2531444, -2554814, -2825771, -2848748, -2074206, -693356, 804670, 1995755, 2615675, 2653530]
11300B653530l40789l08771m6485L3371O3768J27284J64018n8409o92449j083068
11290E12000p05086j87500n13412j515076k058558j565300n44107J13174K29435
11281f234430N21574J391957K098347J957487J183547M10296P6021j76870n07709
11272G20220n88708m24706K05902N75229J68595l97527j102421j630198r15105
11263c388719Q94411K340304K824192K379716J306405j11340j000655p45764j39343
11254D359207M3984o21j40856o23559j293302j884858k148810k072190k014304
11245e775309j601513l93176Q88507J293945R89988Q25044Q32198P37685M26239
11236a776392K31958L12144M93199N65124R96569J784311J718908L02859j447833
$$ y = [2653530, 2312741, 2003970, 1957485, 1990856, 2054624, 2181908, 2345926, 2287517, 1595068, 512000, -193086, -380586, -893998, -2409074, -4467632, -6032932, -6577039, -6463865, -6234430, -5712856, -4320899, -2222552, -265065, 918482, 1328778, 1404799, 1227929, 720220, 131512, -293194, -87292, 487937, 656532, 259005, -843416, -2473614, -3388719, -2494308, -154004, 2670188, 5049904, 6356309, 6244969, 5244314, 4498550, 4359207, 4403191, 4402570, 4261714, 3638155, 2344853, 459995, -1688815, -3761005, -5775309, -7376822, -7769998, -6881491, -5587546, -4597558, -3772514, -2940316, -2202631, -1776392, -1544434, -1232290, -739091, -173967, 822602, 2606913, 4325821, 4628680, 3180847]
11227C180847j998357j630281j293580l04337J180354J604824Q24651j32397n08314
11218I23410O7820Q45706J160717J015460L25547m99134p13378p33751j051354
11209A341043j093816k60756J048873J576106J283181R46699R69363Q18451N19758
11200G148902M73791M02920r3749p19234j358860j886852j660339k41066J332051
11191C397564K192309K440527J670218J54107r53611j052564n67551n41628j162310
11182E577061j354945q43620j17411L69528K5808q03779j011406l27269J71270
11173A685237k26101r49918j101712l15532R60810J760484J831619J480440R67253
11164F092580L79109l09665j228653k106411k365321j740319m49632P84956J055174
$$ y = [3180847, 1182490, -447791, -1741371, -2045708, -865354, 739470, 1564121, 1431724, 923410, 991230, 1836936, 2997653, 4013113, 4338660, 3839526, 3126148, 2392397, 1341043, 247227, -13529, 1035344, 2611450, 3894631, 4841330, 5810693, 6629144, 7148902, 7622693, 8025613, 7931864, 7212630, 5853770, 3966918, 2306579, 2065513, 3397564, 5589873, 8030400, 9700618, 9854725, 8901114, 7848550, 7280999, 6739371, 5577061, 4222116, 3378496, 3261085, 3630613, 3656421, 2852642, 1841236, 1513967, 1685237, 1459136, 509218, -592494, -908026, 52784, 1813268, 3644887, 5125327, 6092580, 6471689, 6162024, 4933371, 2826960, 461639, -1278680, -1728312, -943356, 111818]
11155A11818L72695m80443j494915k157023j753250o63089M21518J037621Q80843
11146c724225L01313k31196q42499j059891n14899J42400N73949R27356Q37474
11137c590218J31922o12075j059029r93172m52035j91311j29954J22208L10488
11128f463176L55327M68307P35074P88498O60896P80541Q39353J193543J936635
11119A294998J933273J079878m2176j034363j333261j239854j180781r50483m63077
11110a935846K85901J090131J749685K071405J595492K99956n04432n35973m71619
11101C644700m1251P72128J084985Q44435m1618j038164j259373j115426q40351
11092B010065m37640k21452l22967o57289j012374q49055j38615P37911J409567
$$ y = [111818, 484513, 4070, -1490845, -3647868, -5401118, -6064207, -5642689, -4605068, -3724225, -3422912, -3654108, -4496607, -5556498, -6071397, -5928997, -5355048, -4427692, -3590218, -3458296, -4070371, -5129400, -6122572, -6574607, -6765918, -6895872, -6773664, -6463176, -6107849, -5639542, -4904468, -4115970, -3455074, -2674533, -1835180, -641637, 1294998, 3228271, 4308149, 4265973, 3231610, 1898349, 658495, -522286, -1472769, -1935846, -1649945, -559814, 1189871, 3261276, 4856768, 5156724, 4652292, 4116319, 3644700, 3603449, 4375577, 5460562, 6304997, 6263379, 5225215, 3965842, 2850416, 2010065, 1572425, 1350973, 1028006, 370717, -641657, -1490712, -1629327, -891416, 518151]
11083E18151J062875J69439l42794n45648q30396j273954j389406q30693m9905
11074c512331L07844j43319p27960p27882m96752O2766N69942L92818L77864P92236
11064c104774Q37977N49643P86019R91670K18431o61142o04737p1675J01628J43974
11054h12986L67680M22136o6755n37290r0641J155918K090884J843772Q63302
11045E236020K42447k5538k24056m13339n64080k56018j6343m85535p32379o25262
11035B135917o32633o27208p70207q85505m36007J59478P49023J496380J507090
11026B696328K23211j196720j474540r52720m11661m24500n84598j99446P62707
11017a561939J556174J345290M33197l48954m78737J3084M01538K89087l25855
$$ y = [518151, 1581026, 1750465, 1407671, 862023, 31627, -1242327, -2631733, -3462426, -3512331, -3204487, -3347806, -4075766, -4803648, -5300400, -5237634, -4667692, -4274874, -3897010, -3104774, -2266797, -1717154, -931135, 60535, 278966, -382176, -986913, -1058588, -956960, -812986, -445306, -23170, -89925, -627215, -717856, 438062, 2528946, 4372718, 5236020, 5478467, 5452929, 5228873, 4815534, 4251454, 3995436, 3979093, 3493558, 2761179, 2135917, 1503284, 876076, 105869, -779636, -1215643, -1056165, -307142, 1189238, 2696328, 2919539, 1722819, 248279, -704441, -1116102, -1540602, -2125200, -2324646, -1561939, -5765, 1339525, 1772722, 1423768, 945031, 958115, 1359653, 1648740, 1322885]
11008A322885q71191o10638J69512P32809Q31417O67214J039916J826606K069052
10999G177582J411481j83828j863482k205263j403654r40048j082505j429974
10991e19691j374328m19875J059295J786545J053069l5473l84435m94901p30126
10982e9920q90094p45212m34206K05895J178132K168343K543206J653136j16891
10973E502389j297051j274960q32097m68515l75227n25241n27561l79194n6749
10964b34206J81928r7495l22960R494N06500P00064N77628L75133n4702p39994
10954I01390j595985k067495j686126j025616n80916m42909m60615j54063O13937
10945f498398J315565J392734J034196Q32479R15618J327273J551643R85842J51146
$$ y = [1322885, 451694, -158944, 10568, 743377, 1574794, 2242008, 3281924, 5108530, 7177582, 8589063, 8405235, 6541753, 4336490, 2932836, 1992788, 910283, -519691, -1894019, -2313894, -1254599, 531946, 1585015, 1549542, 1165107, 670206, -59920, -950014, -1695226, -2129432, -1923537, -745405, 1422938, 3966144, 5619280, 5502389, 4205338, 2930378, 2098281, 1629766, 1254539, 729298, 201737, -177457, -234206, -52278, -149773, -472733, -463239, 43261, 743325, 1320953, 1696086, 1641384, 901390, -694595, -2762090, -4448216, -5473832, -6054748, -6497657, -6958272, -7112335, -6498398, -5182833, -3790099, -2755903, -1923424, -1007806, 319467, 1871110, 2856952, 3008098]
10936C008098m06892o07859j27995N91016O14740K32165M40131P48512L43910
10927D835826j77675l27153l82339q88520j343510p84382L32765J190986J309813
10918C765811O84353j58997q63635j390784j563615j148367o46987l56015n13452
10909b191688j019128j365728j466766j216198p08297n6383M37146O32408M36802
10900f517832M45074O16035M33880M32011P81427P00578K31916M80N39338J473458
10890h63635J694586P59498l46828q75636j216272j462873j200664l08331N47870
10881c272285Q03051O96366O69311L68835j27558k61190n1325M60214J023830
10872C09249J335558J155358O33371K23520L93862O90804r0119j351413j553114
$$ y = [3008098, 2601206, 1993347, 1865352, 2456368, 3071108, 3303273, 3743404, 4491916, 4835826, 4658151, 4330998, 3948659, 3060139, 1716629, 932247, 1265012, 2455998, 3765811, 4450164, 4291167, 3427532, 2036748, 473133, -675234, -1322221, -1678236, -2191688, -3210816, -4576544, -6043310, -7259508, -7967805, -8024188, -7587042, -6954634, -6517832, -6072758, -5456723, -5022843, -4590832, -3809405, -3108827, -2876911, -2876431, -2337093, -863635, 830951, 1590449, 1243621, 367985, -848287, -2311160, -3511824, -3820155, -3272285, -2469234, -1772868, -1103557, -734722, -862280, -1123470, -1174795, -714581, 309249, 1644807, 2800165, 3433536, 3657056, 4050918, 4741722, 4651603, 3300190, 1747076]
10863A747076m54320R92032J904569J818378R94596L46065J61067m6597o77318
10854F785548j477848k025649j691387p51665j97115J43629N88351Q97278Q63371
10845C134513M79550r4588q03467j309488j347430r21229m35536r1622Q7529O7937
10835a233831M4581m1082l50580l71829N032K10378P1985k3187J63339O07689
10825i17505Q12946L52836l05399l43889J58841P12942J127892O58988m45423
10816A812229j065816r14636o21197n48291p72807p68794j20995N36052P74903
10807a689352J099458J391962J136137P55183N41440K21258q518K35718N48782
10798D232068M43389j20697r30924j490754j146752l31276j10445n45735r40404
$$ y = [1747076, 1292756, 2284788, 4189357, 6007735, 7002331, 7348396, 7509463, 7462866, 6785548, 5307700, 3282051, 1590664, 838999, 641884, 785513, 1373864, 2271142, 3134513, 3614063, 3519475, 2716008, 1406520, 59090, -862139, -1297675, -1389297, -1301768, -1233831, -1189250, -1230332, -1580912, -1952741, -1947709, -1737331, -1665346, -1688533, -1525194, -917505, -104559, 248277, -57122, -401011, -242170, 470772, 1598664, 2257652, 1812229, 746413, -168223, -789420, -1337711, -2110518, -2879312, -3000307, -2464255, -1689352, -589894, 802068, 1938205, 2693388, 3234828, 3456086, 3447568, 3683286, 4232068, 4675457, 4554760, 3623836, 2133082, 986330, 655054, 544609, -1126, -941530]
10789i41530q17093l12093L63223Q54287P92025L94726r486o6554M04451Q59991
10779A521947M62504o48556j224612p07710J26241Q71653J352236R48764l2846
10770B669621r37714j117283m83134p243k48116L90J129608J811015J661294J221770
10760E700208P95168M53582L353l42519j44402O0124k90463l53418j50974l65926
10750E364733n01858k33804Q3546M88217Q33021Q04902O04593K47632q5862n3544
10740G551576Q6671J34687J18689l08901j323169j773325j574948j777411k107333
10731i73464j784218r07673m05087l62048l36277o0418K72492k8078m84602l40297
10721e409670J4662M06016P32818O24069L65937K70960L00689L00488K21701Q1252
$$ y = [-941530, -1758623, -2070716, -1707493, -853206, -61181, 333545, 324059, 257505, 661956, 1521947, 1984451, 1335895, 111283, -596427, -470186, 401467, 1753703, 2702467, 2669621, 1731907, 614624, 131490, 124247, -123869, -123479, 1006129, 2817144, 4478438, 5700208, 6495376, 6948958, 6952311, 6609792, 6465390, 6525514, 6235051, 5881633, 5730659, 5364733, 4862875, 4629071, 4712617, 5200834, 6033855, 6838757, 7443350, 7690982, 7605120, 7551576, 7638247, 7772934, 7891623, 7582722, 6259553, 4486228, 2911280, 1133869, -973464, -2757682, -3665355, -4070442, -4432490, -4768767, -4829185, -4556693, -4584771, -5069373, -5409670, -5395008, -4988992, -4256174, -3632105, -3266168, -2995208, -2694519, -2394031, -2172330, -2091078]
10711b091078k25591q06626j218472o42349R86740K173476J744124N66211k9214
10702D57221j37710m86055p03981n26872o89327j239545j109430N609J398024
10693c032066K181893J842772O08306n18527o89211l51961J1577L31171Q02797
10684A186751J011116M81306l42580q16397q13512p59212q23542p30988k90924
10675a897982K00073K34481k47773q27517j045393q24383k03124O43902Q36807
10666c130909K52182l30356m34896l54179j65942L26613O34393N03393J03792
10657b595909j71708J41330N13894N42873P80016J022049P49596L30340J1569
10648A324050l6172M72246O67255K73441k03991l25346J45037P65548M38100o68438
$$ y = [-2091078, -2316669, -3123295, -4341767, -4984116, -3997376, -1823900, -79776, 486435, 457221, 319511, -166544, -870525, -1397397, -2086724, -3326269, -4435699, -4430090, -3032066, -850173, 992599, 1600905, 1082378, 393167, 41206, 52783, 383954, 1186751, 2197867, 2679173, 2336593, 1520196, 706684, -52528, -876070, -1607058, -1897982, -1697909, -1463428, -1711201, -2538718, -3584111, -4408494, -4611618, -3967716, -3130909, -2878727, -3209083, -3643979, -3998158, -4164100, -3837487, -3203094, -2699701, -2595909, -2767617, -2626287, -2112393, -1569520, -789504, 232545, 982141, 1312481, 1324050, 1287878, 1760124, 2427379, 2700820, 2496829, 2171483, 2316520, 3082068, 3520168, 2851730]
10638B851730j320986j154363o90241n42021r59719j323111j064885n59048j76508
10629d939152L42282P12893K78741r3647l6513n937m7461l35674n57633J1743
10619d670358Q55162J306735J441800J692752J802300J188491M86469K38433q3437
10610D258347q33813j499868j483853j025605o62636p22839o65143k36769J28373
10601b743806K83288L19586K27647p6555j37466M85701J378493J645925P00982
10592B083795m81822j208879j202178n08532R7474N87805J393097J498980O19288
10583B879028j69165m95878q5645J268087K416553J958783L5297j790264k460806
10574C555990k253659j717150j284387r51013j54957J188483J891940J623641
$$ y = [2851730, 1530744, 376381, -313860, -855881, -1815600, -3138711, -4203596, -4762644, -4939152, -4596870, -3883977, -3605236, -3698883, -3735396, -3741333, -3788794, -4124468, -4682101, -4670358, -3815196, -2508461, -1066661, 626091, 2428391, 3616882, 4103351, 4341784, 4258347, 3424534, 1924666, 440813, -584792, -1247428, -1970267, -2635410, -2872179, -2743806, -2460518, -2140932, -1913285, -1989840, -2127306, -1641605, -263112, 1382813, 2083795, 1601973, 393094, -809084, -1317616, -1220142, -632337, 760760, 2259740, 2879028, 2709863, 2213985, 2128340, 3396427, 5812980, 7771763, 7807060, 6016796, 3555990, 1302331, -414819, -1699206, -2650219, -2805176, -1616693, 275247, 1898888]
10566A898888J124954M14131l18094o37951m76985L1949m6549q05091n82947O32166
10556A234471J450474J607888J463376J261174P03893o79929k266741l008500
10548A766106k303561j066741q46249j058650p60169m69766m44751n9064O43055
10539d599790J072683J033256N30382l6247m99637r69981j061936p27964k68766
10530e528000J66228L36591K79930O22930J475391J618969Q29198L16902M16016
10521E34155O63254O52053p0006q84055q99457p84625n79491j91622j86637k57932
10511b004363p192j27599p27747q59893K2631J052967J422288J203154K72393
10502B46639j233239k141139j565786j99585J020897J497325P97074o18122j917490
$$ y = [1898888, 3023842, 3437973, 3119879, 2481928, 2004943, 2036892, 1990343, 1185252, 602305, 1234471, 2684945, 4292833, 5756209, 7017383, 7721276, 7041347, 4774606, 1766106, -537455, -1604196, -2450445, -3509095, -4269264, -4739030, -5183781, -5242845, -4599790, -3527107, -2493851, -1963469, -1999716, -2499353, -3469334, -4531270, -5259234, -5528000, -5361772, -5025181, -4745251, -4122321, -2646930, -1027961, -198763, 118139, 534155, 1197409, 1849462, 1779456, 895401, -4056, -788681, -1368172, -1559794, -1746431, -2004363, -2011555, -2139154, -2866901, -3726794, -3704163, -2651196, -1228908, -25754, 246639, -986600, -3127739, -4693525, -4893110, -3872213, -2374888, -1577814, -2195936, -4113426]
10493d113426k051901j223859J47972J710943K073757J115742L8810n36353m78727
10484c317042K82012R92459J230972J155692R08565K98069n79547j046635p38225
10475h13680r6703K8906n27337j102762j297182j285997p53014K84704R32903
10466d630162J192161J285468R90446M22174l34972m96264K29636O58352p9429
10457g62590j389983j903232r65342L62641J013055N91585j47775k60125K48j31631
10447c593149l99313O9184R45707J442325J089674L61934k36735p16196j012153
10438b048722n92030q8804l01655m70353J95535O66499M11419N1032m43999o85320
10428c306398n46374j89332K09534K44508J58020K37036L78528O46698J150296
$$ y = [-4113426, -6165327, -7389186, -7241214, -5530271, -3456514, -2340772, -2301962, -2838315, -3317042, -3035030, -2042571, -811599, 344093, 1252658, 1550727, 971180, -75455, -813680, -910383, -881477, -1408814, -2511576, -3808758, -5094755, -5847769, -5563065, -4630162, -3438001, -2152533, -1162087, -739913, -1074885, -1571149, -1341513, -683161, -762590, -2152573, -4055805, -5021147, -4658506, -3645451, -3053866, -3201641, -3461766, -3461518, -3593149, -3992462, -3923278, -2977571, -1535246, -445572, -83638, -320373, -1036569, -2048722, -2640752, -2729556, -3031211, -3501564, -3306029, -2639530, -2228111, -2177079, -2621078, -3306398, -3852772, -4042104, -3832570, -3588062, -3430042, -3193006, -2814478, -2167780, -1017484]
10419a017484J336994Q19477l873p42621r54774q96116r86434q67542n85587k89894
10409d187854J73306K60326k97878j229338j828076j443320n54593R9470L38245
10400h669712O43095R81895R07995L11054q2643O36730J831791K191546J495752
10391B47503M70889l81607q27515q78577o62032l60912m11297o56165n54122J76605
10381c837230R62794J195589J045956N47569m1146m07636n2918N93475L03498
10372C09951q09375k003172k427756j669391n83281J94465O59637P19300Q05994
10363d803628P56141J12797o37832o96542k9865K90723k18998n59757k29193Q8962
10353e927192J03720O1535L23509Q25321J369174J620851J193121M24495k7326
$$ y = [-1017484, 319510, 1138987, 1135114, 392493, -562281, -1458397, -2444831, -3312373, -3897960, -4187854, -4014548, -3754222, -4052100, -5281438, -7109514, -8552834, -9107427, -9007957, -8669712, -8026617, -7044722, -6136727, -5825673, -5908316, -5271586, -3439795, -1248249, 247503, 718392, 336785, -490730, -1369307, -2031339, -2392251, -2803548, -3459713, -4013835, -3837230, -2874436, -1678847, -632891, -85322, -126468, -534104, -587022, 6453, 309951, -499424, -2502596, -4930352, -6599743, -7183024, -6988559, -6328922, -5609622, -4803628, -4047487, -3934690, -4572522, -5269064, -5298929, -5008206, -5227204, -5786961, -6016154, -5927192, -5823472, -5761937, -5438428, -4613107, -3243933, -1623082, -429961, -5466, -32792]
10344c2792l85959o16034k84722K69179P87450P09219j01912r32438j255006j106740
10334b949755m63573L44740P29069J054367J760005K326204K333873J481123J54612
10325F770665j039226j745082j771667j414943j038808q57525q84029r13260p23278
$$ y = [-32792, -418751, -1034785, -1319507, -1050328, -262878, 446341, 344429, -588009, -1843015, -2949755, -3413328, -3068588, -2339519, -1285152, 474853, 2801057, 5134930, 6616053, 6770665, 5731439, 3986357, 2214690, 799747, -239061, -1096586, -1980615, -2893875, -3617153]
$$ [...]
##END NTUPLES=NMR SPECTRUM
##END=
