##TITLE=C13_Ser 5175
 CDCl3, 1600 sc

 4.7.2023
##JCAMPDX= 6.0         $$ Bruker NMR JCAMP-DX V2.0
##DATA TYPE= NMR SPECTRUM
##DATA CLASS= NTUPLES
##ORIGIN= UXNMR, Bruker Analytische Messtechnik GmbH
##OWNER= root
$$ XWIN-NMR		Version 3.5
$$ Tue Jul  4 16:16:20 2023 Russian Standard Time (UT+4h)  she@DPX200
##.OBSERVE FREQUENCY= 50.327896
##.OBSERVE NUCLEUS= ^13C
##.ACQUISITION MODE= SIMULTANEOUS
##.ACQUISITION SCHEME= undefined
##.AVERAGES= 1601
##.DIGITISER RES= 17
##SPECTROMETER/DATA SYSTEM= spect
##.PULSE SEQUENCE= zgpg30
##.SOLVENT NAME= DMSO
##.SHIFT REFERENCE= (INTERNAL, DMSO, 0, 222.624)
##AUDIT TRAIL= $$ (NUMBER, WHEN, WHO, WHERE, WHAT)
$$ ##TITLE= Audit trail, XWIN-NMR		Version 3.5
$$ ##JCAMPDX= 5.01
$$ ##ORIGIN= Bruker BioSpin GmbH
$$ ##OWNER= she
$$ F:/spectra/data/she/nmr/c13/1/pdata/1/auditp.txt
$$ ##AUDIT TRAIL=  $$ (NUMBER, WHEN, WHO, WHERE, WHAT)
(   1,<2023-07-04 16:15:28.35 +0400>,<she>,<DPX200>,
      <created by zg, POWCHK disabled, PULCHK disabled
       terminated by command 'halt'
       configuration hash MD5:
       00 E9 B6 7A A2 85 ED C7 34 08 36 98 17 FE 4E 26
       data hash MD5: 32K
       CF 33 21 08 5A CA EA 80 03 AD BD 1E C1 3B 74 BA>)
(   2,<2023-07-04 16:15:30.76 +0400>,<she>,<DPX200>,
      <Start of raw data processing
       efp BC_mod = 2 LB = 2 FT_mod = 6 PKNL = 1 PHC0 = -379.1749 PHC1 = 34.76414 SI = 32K 
       data hash MD5: 32K
       F7 62 7D 7A C7 45 D9 EC 7D BF E3 BB 14 40 3A F6>)
(   3,<2023-07-04 16:15:33.51 +0400>,<she>,<DPX200>,
      <abs ABSG = 5 
       data hash MD5: 32K
       45 DF C5 8D FB 40 40 7E 83 9F 99 6A D7 9C 43 4C>)
$$ ##END=
$$ 
$$ hash MD5
$$ BE 17 15 19 6C 2C 5A DB 73 51 DF 96 7E 2A 55 CB
##$RELAX= 
##$RELAX= 
##$RELAX= 
##$RELAX= 
##$RELAX= 
##$RELAX= 
##$RELAX= 
##$RELAX= 
$$ Bruker specific parameters
$$ --------------------------
##$DU= <F:/spectra>
##$EXPNO= 1
##$NAME= <c13>
##$PROCNO= 1
##$TYPE= <nmr>
##$USER= <she>
##$AMP= (0..31)
100 100 100 100 100 100 100 100 100 100 100 100 100 100 100 100 100 100 
100 100 100 100 100 100 100 100 100 100 100 100 100 100 
##$AQSEQ= 0
##$AQ_mod= 1
##$AUNM= <au_zg>
##$AUTOPOS= <>
##$BF1= 50.322709
##$BF2= 200.13
##$BF3= 50.322709
##$BF4= 500.13
##$BF5= 500.13
##$BF6= 500.13
##$BF7= 500.13
##$BF8= 500.13
##$BYTORDA= 1
##$CFDGTYP= 0
##$CFRGTYP= 5
##$CHEMSTR= <none>
##$CNST= (0..31)
1 1 145 1 1 1 1 1 1 1 1 1 1 1 1 1 1 1 1 1 1 1 1 1 1 1 1 1 1 1 1 1 
##$CPDPRG= <waltz16>
##$CPDPRG1= <>
##$CPDPRG2= <waltz16>
##$CPDPRG3= <>
##$CPDPRG4= <mlev>
##$CPDPRG5= <mlev>
##$CPDPRG6= <mlev>
##$CPDPRG7= <mlev>
##$CPDPRG8= <mlev>
##$CPDPRGB= <>
##$CPDPRGT= <>
##$D= (0..31)
0 2 0.00345 0 0 0 0 0 0 0 0 0.03 2e-05 3e-06 0 0 0 0 0 0 0 0 0 0 0 0 0 
0 0 0 0 0 
##$DATE= 1688467525
##$DBL= (0..7)
120 120 120 120 120 120 120 120 
##$DBP= (0..7)
150 150 150 150 150 150 150 150 
##$DBP07= 0
##$DBPNAM0= <>
##$DBPNAM1= <>
##$DBPNAM2= <>
##$DBPNAM3= <>
##$DBPNAM4= <>
##$DBPNAM5= <>
##$DBPNAM6= <>
##$DBPNAM7= <>
##$DBPOAL= (0..7)
0.5 0.5 0.5 0.5 0.5 0.5 0.5 0.5 
$$ [...]
##$SUBNAM4= <"">
##$SUBNAM5= <"">
##$SUBNAM6= <"">
##$SUBNAM7= <"">
##$SUBNAM8= <"">
##$SUBNAM9= <"">
##$SW= 239.972175391363
##$SWIBOX= (0..15)
0 1 3 0 0 0 0 0 0 0 0 0 0 0 0 0 
##$SW_h= 12077.2946859903
##$TD= 32768
##$TD0= 1
##$TE= 0
##$TE2= 300
##$TE3= 300
##$TEG= 300
##$TL= (0..7)
120 120 120 120 120 120 120 120 
##$TP= (0..7)
150 150 150 150 150 150 150 150 
##$TP07= 0
##$TPNAME0= <>
##$TPNAME1= <>
##$TPNAME2= <>
##$TPNAME3= <>
##$TPNAME4= <>
##$TPNAME5= <>
##$TPNAME6= <>
##$TPNAME7= <>
##$TPOAL= (0..7)
0.5 0.5 0.5 0.5 0.5 0.5 0.5 0.5 
##$TPOFFS= (0..7)
0 0 0 0 0 0 0 0 
##$TUNHIN= 0
##$TUNHOUT= 0
##$TUNXOUT= 0
##$USERA1= <user>
##$USERA2= <user>
##$USERA3= <user>
##$USERA4= <user>
##$USERA5= <user>
##$V9= 5
##$VALIST= <valist>
##$VCLIST= <CCCCCCCCCCCCCCC>
##$VD= 0
##$VDLIST= <DDDDDDDDDDDDDDD>
##$VPLIST= <PPPPPPPPPPPPPPP>
##$VTLIST= <TTTTTTTTTTTTTTT>
##$WBST= 1024
##$WBSW= 4
##$XGAIN= (0..3)
0 0 0 0 
##$XL= 0
##$YL= 0
##$YMAX_a= 10681095
##$YMIN_a= -5820230
##$ZGOPTNS= <>
##$ZL1= 120
##$ZL2= 120
##$ZL3= 120
##$ZL4= 120
##$ABSF1= 222.624
##$ABSF2= -17.3728
##$ABSG= 5
##$ABSL= 3
##$ALPHA= 0
##$AQORDER= 0
##$ASSFAC= 0
##$ASSFACI= 0
##$ASSFACX= 0
##$ASSWID= 0
##$AUNMP= <proc_1d>
##$AZFE= 0.1
##$AZFW= 0.5
##$BCFW= 0
##$BC_mod= 2
##$BYTORDP= 0
##$COROFFS= 0
##$CY= -3
##$DATMOD= 1
##$DC= 0
##$DFILT= <>
##$DTYPP= 0
##$F1P= 0
##$F2P= 0
##$FCOR= 0.5
##$FTSIZE= 32768
##$FT_mod= 6
##$GAMMA= 0
##$GB= 0
##$INTBC= 1
##$INTSCL= 4.134877e-10
##$ISEN= 128
##$LB= 2
##$LEV0= 0
##$LPBIN= 0
##$MAXI= 10000
##$MC2= 0
##$MEAN= 0
##$ME_mod= 0
##$MI= 0.1934396
##$NCOEF= 0
##$NC_proc= -3
##$NLEV= 6
##$NOISF1= 120.0001
##$NOISF2= 80.00006
##$NSP= 0
##$NTH_PI= 0
##$NZP= 0
##$OFFSET= 222.624
##$PC= 1.4
##$PHC0= -379.1749
##$PHC1= 34.76414
##$PH_mod= 1
##$PKNL= yes
##$PPARMOD= 0
##$PSCAL= 0
##$PSIGN= 0
##$REVERSE= no
##$SF= 50.3227315983092
##$SI= 32768
##$SIGF1= 140
##$SIGF2= 120
##$SINO= 11.81781
##$SIOLD= 32768
##$SREGLST= <13C.CDCl3>
##$SSB= 0
##$STSI= 32768
##$STSR= 0
##$SW_p= 12077.2946859903
##$SYMM= 0
##$S_DEV= 0
##$TDeff= 32768
##$TDoff= 0
##$TI= <>
##$TILT= no
##$TM1= 0
##$TM2= 0
##$TOPLEV= 0
##$USERP1= <user>
##$USERP2= <user>
##$USERP3= <user>
##$USERP4= <user>
##$USERP5= <user>
##$WDW= 1
##$XDIM= 32768
##$YMAX_p= 514309285
##$YMIN_p= -18079175
$$ End of Bruker specific parameters
$$ ---------------------------------
##NTUPLES= NMR SPECTRUM
##VAR_NAME=  FREQUENCY,     SPECTRUM/REAL,   SPECTRUM/IMAG
##SYMBOL=    X,             R,               I
##VAR_TYPE=  INDEPENDENT,   DEPENDENT,       DEPENDENT
##VAR_FORM=  AFFN,          ASDF,            ASDF
##VAR_DIM=   32768,         32768,           32768
##UNITS=     HZ,            ARBITRARY UNITS, ARBITRARY UNITS
##FACTOR=    0.368581032318806, 1,           1
##FIRST=     11203.0474430531, 0,            0
##LAST=      -874.247242937185, 0,           0
##MIN=       -874.247242937185, -18079175,   0
##MAX=       11203.0474430531, 514309285,    0
$$ Real data points
##PAGE= N=1
##DATA TABLE= (X++(R..R)), XYDATA
$$ [...]
15571b335447r73807r77512r98523o63823L12012J259669J288055N75151L8771
15562b475454l89337p88541o69124k54864L73599J213739J731156J845243J690811
15553B277228J437928J250856J250713J006992K19669j56620m0836l60237j237165
15544E648528j733856j307110r96118j230278j174421o40953n4496L36029L92975
15535g59700N13076P90741Q09356M74801R3220q2378l1633L0284J51581M80594
15525B469942Q51524R34472M60525J33653J34104o4169m38179n93392l65991J28767
15515C651256K78689m920l04744o03098m95469K20016O81493O20391J47326o76032
15505C514908j627441k019961j369538l52128K69168N02639N70896O06628J026963
$$ y = [-2335447, -3309254, -4286766, -5285289, -5949112, -5637100, -4377431, -3089376, -2514225, -2475454, -2864791, -3653332, -4322456, -4577320, -4203721, -2989982, -1258826, 586417, 2277228, 3715156, 4966012, 6216725, 7223717, 7443386, 7286766, 7245930, 6885693, 5648528, 3914672, 2607562, 1611444, 381166, -793255, -1434208, -1488704, -1152675, -759700, -246624, 544117, 1353473, 1828274, 1921494, 1839116, 1807483, 1837767, 1989348, 2469942, 3321466, 4255938, 4716463, 4850116, 4984220, 4920051, 4481872, 3888480, 3522489, 3651256, 3929945, 3925025, 3620281, 3017183, 2521714, 2741730, 3423223, 4043614, 4190940, 3514908, 1887467, -132494, -1502032, -1854160, -1584992, -1082353, -511457, 95171, 1122134]
15496A122134J370051J195000R80110N60415r1405k62956K56803O95339K51229
15487F076720p43460j648783j553543n21626L55641N24117M72292P37806R69985
15478D669149Q95428N41536k58341j048001j080708p19028k09386L8727l02264
15469B527112o84471p58131r5861J225300K179869J934555J001701N01285O10992
15460H442351N12975m29042j797480k531306k041621q71022J66279P38171P04068
15451B893373l727q81971q89078m38203j49907J39976N49328R82359O18623m90969
15441B329804j590549k128485j726486l76108J156850J560954L00225q77953n87001
15432a938749J72565J31123p94164j289739n29305Q84505J769647J557774R88118
$$ y = [1122134, 2492185, 3687185, 4667295, 5227710, 5136305, 4873349, 5130152, 5825491, 6076720, 5333260, 3684477, 2130934, 1609308, 1964949, 2489066, 2961358, 3699164, 4669149, 5564577, 6106113, 5847772, 4799771, 3719063, 3000035, 2790649, 2829376, 2527112, 1842641, 1084510, 988649, 2213949, 4393818, 6328373, 7330074, 7831359, 8442351, 8955326, 8526284, 6728804, 4197498, 2155877, 1284855, 1451134, 2189305, 2893373, 2889646, 2007675, 1118597, 680394, 530487, 670463, 1219791, 2202150, 2820773, 2329804, 739255, -1389230, -3115716, -3491824, -2334974, -774020, -473795, -1351748, -1938749, -1766184, -1635061, -2429225, -3718964, -4248269, -3363764, -1594117, -36343, 951775]
15423I51775N11552Q8374N0693N18560J112448J176684L72319o69387p66508J35448
15413C481958R74497J411196J214588O74742J5370m86439m13072l95586o95738
15404E781516n91254j76874K5683n0829n17568q07706o50339q18584j136165j230067
15394a72187j330296j261357o83667j53750L45597J276608J902286J589367P02223
15385B214824J29607k18348j142998j652400p39085M55537O60240J47114J7736
15376a27773N15237J098068J269202R64215K83894l54591k49296L37189O87371
15367D423516K86799k51749l88277k48071j36900o59837j666141k217533j736511
15358b594704m61684O51890J085888J385470J965052K119765J555475R57608L92926
$$ y = [951775, 1463327, 1551701, 1602394, 2120954, 3233402, 4410086, 4782405, 4113018, 3346510, 3481958, 4456455, 5867651, 7082239, 7756981, 7772351, 7285912, 6872840, 6477254, 5781516, 5190262, 5013388, 5039071, 4988242, 4470674, 3662968, 3012629, 2194045, 1057880, -172187, -1502483, -2763840, -3447507, -3601257, -3255660, -1979052, -76766, 1512601, 2214824, 2344431, 2126083, 983085, -669315, -1408400, -952863, -292623, -145509, -127773, 387464, 1485532, 2754734, 3718949, 4002843, 3648252, 3398956, 3736145, 4423516, 4710315, 4458566, 4070289, 3822218, 3685318, 3025481, 1359340, -858193, -2594704, -3056388, -2404498, -1318610, 66860, 2031912, 4151677, 5707152, 6664760, 7057686]
15349G057686r8092l37219l01278k59635o83000j265458j220711k33805P26888
15340C385376O58764l06323j197820j373223q73067n0713Q72125J231617O09266
15331B956002k32915m56193K42063J303458J968937K032733J210028m37427j334481
15322G252205j108547r70956j291124j310146q77800o96833o54747k46404L14506
15313D10154N75266J37951n30359o57801l65983l81548p26364o80808o10700p00171
15303c530363o62548n44903J8535Q75790J045270M26887L73121J122904J218426
15294C43119N13369j47283o37837r42428p72972k4146P87469J028052R76395R94154
15284B117892O06412o09020k076478k225076q98681M17799R62389J175465J008720
$$ y = [7057686, 6959594, 6622375, 6321097, 6061462, 5378462, 4113004, 2892293, 2658488, 3385376, 4044140, 3737817, 2539997, 1166774, 293707, 242994, 1115119, 2346736, 2956002, 2723087, 2266894, 2508957, 3812415, 5781352, 7814085, 9024113, 8586686, 7252205, 6143658, 5172702, 3881578, 2571432, 1693632, 996799, 342052, 95648, 410154, 985420, 1123371, 593012, -64789, -430772, -812320, -1538684, -2219492, -2830192, -3530363, -4192911, -4737814, -4719279, -3843489, -2798219, -2371332, -1998211, -875307, 343119, 856488, 709205, 71368, -871060, -1644032, -1668178, -880709, 147343, 1123738, 2117892, 2724304, 2115284, 38806, -2186270, -3084951, -2667152, -1704763, -529298, 479422]
15275D79422J93532m61170m85645k04042j79829m17419j18343M34896P40425J075994
15265A057821J362858J276441P68610L13223K17525m9343n99409j288855j822497
15256A236374j495705n78414N92689J453526J148508j9800j122134j609315j634322
15247b028593j385037j309649j365117o89203O09648J469161J797611K137320
15239g63859K318094K032240J021890k97225j265508j857737j706893j119937
15231a638935j084080j199572p16408j72761o5250j72373p53626j499236j624757
15222h926998j223956j64303J246352J874300J324169J66239o64194o41031L24835
15213f684587J448781J556568P60722M54413Q54556P46946j66713r86733p64815
$$ y = [479422, 672954, 211784, -273861, -477903, -657732, -1075151, -1193494, -758598, -18173, 1057821, 2420679, 3697120, 4465730, 4778953, 4996478, 4947135, 4347726, 3058871, 1236374, -259331, -837745, -245056, 1208470, 2356978, 2337178, 1215044, -394271, -2028593, -3413630, -4723279, -6088396, -6777599, -6167951, -4698790, -2901179, -763859, 1554235, 3586475, 4608365, 4311140, 3045632, 1187895, -518998, -1638935, -2723015, -3922587, -4638995, -4811756, -4877006, -5049379, -5803005, -7302241, -8926998, -10150954, -10315257, -9068905, -7194605, -5870436, -5704197, -6368391, -7009422, -6684587, -5235806, -3679238, -2918516, -2464103, -1609547, -862601, -1029314, -2016047, -2780862]
15204b780862J59255M50092L2105j5865M54717O83205J74559k33258j15389j47497
15194a338938k10333K9036J0981j70788N4299R0441k91280k9380O22802R16119
15184c17041J002511R23534P56824M27093j54543p82920j287691j330076j119993
15175a882302p52400l10922K33431M61375J02966K3113K41175J48063Q350J35325
15165a591826O60713J042805P49359M42725M73978N14372M99825P81668Q81911
15156D455530J38245p89810j164090j277340j392213j493599j483677j041384
15148d048338k63372J89825O35711J502267J746237J084391M96881K19467J08716
15139A671785O09259J038253J008421O77349j84074r93484j188249j138518r97835
$$ y = [-2780862, -2621607, -2171515, -2139410, -2155275, -1700558, -1017353, -842794, -1076052, -1191441, -1338938, -1549271, -1520235, -1509254, -1680042, -1625743, -1535302, -1826582, -1855962, -1233160, -317041, 685470, 1609004, 2365828, 2792921, 2638378, 1855458, 567767, -762309, -1882302, -2634702, -2945624, -2712193, -2250818, -2147852, -2124739, -1883564, -1735501, -1727151, -1591826, -931113, 111692, 861051, 1303776, 1777754, 2292126, 2791951, 3573619, 4455530, 4593775, 3803965, 2639875, 1362535, -29678, -1523277, -3006954, -4048338, -4311710, -4121885, -3486174, -1983907, -237670, 846721, 1343602, 1563069, 1671785, 2281044, 3319297, 4327718, 5005067, 4820993, 3827509, 2639260, 1500742, 502907]
15130E02907p53478o56111p17120k95605P08719J063234N20874l19370j161642
15121a107592j380505p88486k9219M90563N36509K19276R0411M62863J209538
15112b96642J633482J268285M37653j27377l18937n61681j002383j076353n27872
15103e71825J1104L3365j73200j48538J6402L83120R30460J267964Q51880J11390
15093B712122j85491k815N8877J26786P44216J572708J817091J525217P90642
15084I159353m36302j711713k323826k161665j612000r65214o46921m65598j39370
15075a303256k35489j61906N17313J330366J851171J437459M0753p82845n33901
15066B159665o6395K05141L24064L75683N80939Q93199O58252l10049j573241
$$ y = [502907, -250571, -906682, -1623802, -1919407, -1210688, -147454, 373420, 54050, -1107592, -2488097, -3276583, -3305802, -2815239, -2278730, -2059454, -1969043, -1506180, -296642, 1336840, 2605125, 3042778, 2915401, 2596464, 2034783, 1032400, -43953, -571825, -560721, -527356, -700556, -849094, -832692, -449572, 480888, 1748852, 2600732, 2712122, 2526631, 2523816, 2582693, 2709479, 3453695, 5026403, 6843494, 8368711, 9159353, 8723051, 7011338, 4687512, 2525847, 913847, -51367, -698288, -1163886, -1303256, -1538745, -1700651, -1183338, 147028, 1998199, 3435658, 3476411, 2693566, 2159665, 2093270, 2298411, 2622475, 2998158, 3579097, 4472296, 5130548, 4820499, 3247258]
15057C247258k135276j360648n09942k75844P5213L22025m73475j239971r61173
15048c311833j97734M64027R15004P99153N2181m53951l86663k41794n01397n08129
15038c371136r2266P8785P2920J32419K67594K77254K7108o0962r1965n593L24796
15027b441046R24050J432912J388484M00483p05100q43391n00726m93815n71816
15018a409965m05952k18035k1578L12089P44275R12234N56721K14836L21751M29871
15008A436247L60890P6757l74738n67596m36267l04053m4730J33571k98894o24755
14998f43568J71676J149491J436111J070662P2084q69979j313378j242404o13956
14989g83261L3776J36949M454K14818j3515r65520j393854p35456M35123J179990
$$ y = [3247258, 1111982, -248666, -758608, -1034452, -959239, -637214, -1110689, -2350660, -3311833, -3509567, -3045540, -2130536, -1331383, -1279202, -1733153, -2119816, -2361610, -2863007, -3371136, -3463402, -3384617, -3311697, -3179278, -2911684, -2634430, -2607322, -2668284, -2760249, -2765842, -2441046, -1516996, -84084, 1304400, 1704883, 999783, 156392, -344334, -838149, -1409965, -1815917, -2033952, -2055530, -1743441, -999166, -86932, 469789, 684625, 1006376, 1436247, 1797137, 1873894, 1499156, 931560, 495293, 191240, 146510, 280081, -18813, -643568, -471892, 677599, 2113710, 3184372, 3256456, 2386477, 1073099, -169305, -783261, -749485, -612536, -608082, -393264, -406779, -1372299, -2766153, -3501609, -3066486, -1886496]
14979a886496J370066J276034O15613p70271j688968j496868p77900K40367J091045
14970b027378J333799J330276J152334Q18055M26397L4425l38344r29856j051649
14961G48059m86765k07256l58917k02566K19523M97660L26613k06682l37651m31415
14951d39397p80917q69676p92888r07074n65776M41471J206611J275769J157714
14942b74163J510102K237883K150559J123028R6239o73643j507491j824644j290540
14933A547330q53103q04071n52981j97259J89814M20329m9280p91777o91628J83927
14923a598699O02337K85568Q2098j19196m26836n54141p09439r47466p83312j27707
14913d296793L63132N05976O35950P51428N31941L78797O96833J130147J038107
$$ y = [-1886496, -516430, 759604, 1375217, 604946, -1084022, -2580890, -3358790, -3118423, -2027378, -693579, 636697, 1789031, 2607086, 3033483, 3067908, 2729564, 1799708, 748059, 261294, 54038, -304879, -507445, -287922, 209738, 536351, 329669, -7982, -439397, -1220314, -2089990, -2882878, -3789952, -4355728, -3914257, -2707646, -1431877, -274163, 1235939, 3473822, 5624381, 6747409, 6843648, 6170005, 4662514, 2837870, 1547330, 694227, -109844, -662825, -860084, -670270, -249941, -299221, -1090998, -1782626, -1598699, -996362, -710794, -628696, -747892, -1174728, -1728869, -2438308, -3385774, -4169086, -4296793, -3933661, -3427685, -2791735, -2040307, -1508366, -1129569, -432736, 697411, 1735518]
14904A735518L51337m10261p24336n89191m10319j69066K28260K15801n45763
14895c18020j194758r79221l29404K22358L05565M3249J13471O05329J270075
14886b61356J686234J495198J214460J074407R28014L51949m52588o35706m38464
14877D962148n12130m89343k79837l50070n84348n05754m90833j110754j771679
14868a132600j760153r23495q4524k33266l88402M94690J793884J872392N76906
14859B15432p44471j109750m08639J78079L9873k5985K15463M56656L72110R3447
14849g17785M42329J013091Q79500M97307N29003O97212N36441k26539j236791
14840B413768j705181j473367j039278j176657j683673j291266J37725J338551
$$ y = [1735518, 2086855, 1676594, 952258, 363067, -47252, -216318, 11942, 227743, -318020, -1512778, -2491999, -2821403, -2599045, -2293480, -2250231, -2136760, -1531431, -261356, 1424878, 2920076, 4134536, 5208943, 6136957, 6488906, 6036318, 5400612, 4962148, 4450018, 3960675, 3680838, 3330768, 2746420, 2240666, 1749833, 639079, -1132600, -2892753, -3816248, -3900772, -4134038, -4522440, -4027750, -2233866, -361474, 215432, -529039, -1638789, -2047428, -1869349, -1829476, -1855461, -1639998, -1183342, -811232, -717785, -275456, 737635, 1617135, 2114442, 2643445, 3340657, 3877098, 3650559, 2413768, 708587, -764780, -1804058, -2980715, -4664388, -5955654, -5817929, -4479378]
14832d479378J785907J470438Q82998O91895R24675J177922Q92476K26883m60418
14823C113398j036168j175978q14405l28458J82583N73351L53533n40413j530515
14814a203072j990808j581138r66553n52781l53291l76029J84885O59322L26816
14805e852649r2664j04238N11918J254300J088336L36769L15823N84889j07731
14796b065247j448835j929452r88836M46017J130896P20898l92934j100506j209710
14787f837709j380279j166871j62798P66316J123344J155438O05748n11721j097476
14778g506008n42458J94028M50771O28270P20992P06185P66777N55797O5910j03430
14768d063166J18338P27673J189853Q91581M66006L787q99983j574833j040758
$$ y = [-4479378, -2693471, -1223033, -340035, 351860, 1276535, 2454457, 3346933, 3573816, 3113398, 2077230, 901252, 86847, -241611, -59028, 514323, 867856, 327443, -1203072, -3193880, -4775018, -5741571, -6294352, -6647643, -7023672, -6838787, -6179465, -5852649, -5945313, -6049551, -5537633, -4283333, -3194997, -2858228, -2542405, -1957516, -2065247, -3514082, -5443534, -6432370, -5986353, -4855457, -4134559, -4527493, -5627999, -6837709, -8217988, -9384859, -9547657, -8781341, -7657997, -6502559, -5896811, -6408532, -7506008, -8048466, -7854438, -7403667, -6775397, -6054405, -5348220, -4581443, -4025646, -3959736, -4063166, -3944828, -3217155, -2027302, -1135721, -669715, -665928, -1565911, -3140744, -4181502]
14759d181502j19379M41677M93335l760n61184m48194K74423R31707J312626J248508
14749f11743P64141K26069J99960O35913J128752J480861J692928J961025J688722
14740I166628J48161j381962j419746n99234m58642q40384r78691j197452j605625
14731H33053j594003q38426r573L82748Q912o31178j76548R63859J369677J110159
14721A418680Q09349L84910m62818j060508o62129k6511j21325n61426n50106
14712h31884l79595k74646j46075J11854N54624R19620Q69557J88561n65134q09029
14702c62147m21007J77347L58135K1560r5236J48558J82513K36323J17892l45045
14692A8893q96428j239438n95393O30897J361585J121968K22148n2215K96865
$$ y = [-4181502, -4300881, -3859204, -3365869, -3369629, -3930813, -4379007, -4104584, -3172877, -1860251, -611743, 152398, 378467, 578427, 1214340, 2343092, 3823953, 5516881, 7477906, 9166628, 9314789, 7932827, 6513081, 5913847, 5455205, 4614821, 3636130, 2438678, 833053, -760950, -1599376, -1608949, -1226201, -1217289, -1848467, -2025015, -1061156, 308521, 1418680, 2228029, 2612939, 2150121, 1089613, 427484, 400973, 279648, -281778, -831884, -1211479, -1486125, -1632200, -1520346, -965722, -46102, 823455, 1012016, 446882, -362147, -783154, -605807, -247672, -226112, -321348, -172790, 9723, 246046, 363938, 18893, -877535, -2116973, -2712366, -2081469, -719884, 402084, 624232, 572017, 868882]
14683H68882k86452j378424j808443j436726o94763k34856j5986J18245M31088
14674d437435O45771M19296J74336J84796L12045M73900P30068R17397R01979
14665C22153P77037P16588K69714n46460r46375o86255J48137P89646N93115J48295
14655A585595J681l7993j41611n2960J32068j83148m63904j17940J94811j60223
14645G56376q56735j207708j139371r93054m33420P60715J774809J585077Q27353
14636A074042O98904J058781J094948N66192J74697J03088l42432r25108k77167
14627C225945R71871J240117J0696j268717j075788k15591k9943n12115o25070
14618A721405p4226k4211p06800q88559l20419N04445J022771M37445q80926j907918
$$ y = [868882, 582430, -795994, -2604437, -4041163, -4735926, -4970782, -4986768, -4868523, -4437435, -3791664, -3372368, -3198032, -3013236, -2701191, -2227291, -1497223, -579826, 322153, 1099190, 1815778, 2085492, 1539032, 592657, -93598, 54539, 844185, 1437300, 1585595, 1587276, 1549283, 1407672, 1354712, 1486780, 1303632, 839728, 721788, 916599, 756376, -100359, -1308067, -2447438, -3440492, -3873912, -3113197, -1338388, 246689, 1074042, 1772946, 2831727, 3926675, 4492867, 4667564, 4770652, 4428220, 3503112, 3225945, 4197816, 5437933, 5448629, 4179912, 3104124, 2888533, 2858590, 2346475, 1721405, 1647179, 1622968, 916168, 27609, -292810, 211635, 1234406, 1671851, 790925, -1116993]
14608a116993k153651j379094P8878J235911J642173J324756P70174J90107k64022
14599C28239m07226p11050j284445j549316j193118m94475L70221Q60360O83863
14590c396947L70669N56577R20469P55598K84184K0445K34128O20110O49044L10380
14580A324657l34343q16110p86252n83686m25845j09458J81946J24457j73761
14571a598395n63064n09598J73731M76710J62502k58870j68771L65543N33399
14562a386813M83313O17794R50691M89062o67038q73349j69215L62652M10219
14553B17316q5410r33542j312431o92702K09482N30941K43812R5025o4477m59440
14543b251426p85194j081387r90661j41845P23353J046599R32306P59443L70763
$$ y = [-1116993, -3270644, -4649738, -4570860, -3334949, -1692776, -368020, 402154, 592261, 328239, -78987, -790037, -2074482, -3623798, -4816916, -5311391, -4941170, -4080810, -3396947, -3026278, -2469701, -1549232, -793634, -509450, -489005, -254877, 365233, 1014277, 1324657, 990314, 174204, -612048, -1195734, -1621579, -1731037, -1549091, -1424634, -1598395, -2161459, -2671057, -2497326, -2020616, -1858114, -2116984, -2285755, -1920212, -1386813, -903500, -285706, 664985, 1154047, 487009, -386340, -555555, -192903, 217316, 131906, -801636, -2114067, -2806769, -2597287, -2066346, -1822534, -1727509, -1791986, -2251426, -3036620, -4118007, -5108668, -5250513, -4527160, -3480561, -2548255, -1788812, -1418049]
14534a418049k65188o57669j20425R81932J369255Q87618k3886p69530j031100
14525a047042j039596j722453k567852j851576r4567R90153J363439J172398Q75242
14516c921854Q68275Q89856P10162L69694l08587r95935r73206k28092N93840
14507b995847J131540J199345P23856O3719l85570k03275N19436P91157N9650
14498I04011q05122j132978p28773M76175J298560J272169Q20227O6672m75683
14489A695258m37629j68558J00623J34584l27761j020377j267942n24458N00249
14480a316011J201257J394138Q37539K25015k80356p60562r78888p74802l85282
14471h37952k47505n99345j075253j089911k86708P66272J218904P87107o0531
$$ y = [-1418049, -1683237, -2340906, -2461331, -1479399, -110144, 777474, 753588, -15942, -1047042, -2086638, -3809091, -6376943, -8228519, -8323086, -7332933, -5969494, -4797096, -3921854, -3053579, -2163723, -1453561, -1083867, -1392454, -2388389, -3361595, -3589687, -2995847, -1864307, -664962, 58894, 122613, -262957, -466232, 53204, 844361, 904011, 98889, -1034089, -1762862, -1286687, 11873, 1284042, 2104269, 2170941, 1695258, 1257629, 1089071, 1189694, 1324278, 996517, -23860, -1291802, -1816260, -1316011, -114754, 1279384, 2116923, 2341938, 2061582, 1301020, 322132, -452670, -837952, -1085457, -1684802, -2760055, -3849966, -4136674, -3370402, -2151498, -1364391, -1424922]
14462a424922j49631L17186M12092K16642l52589j121910j237721n83043N00454
14453c423442J133596O41358J5646L95761J295522J890416J522148M08391m17921
14444C461475r60609j560683k127245k300745k034124j535326p50113k8238L03280
14435g532328K43741L83112J319395K340080K046207M24996j014147j349025n67749
14426c705718M26501J031934J070072N00496k98253r76627j279528r66638K07603
14417c990158J331900J324141R8759j158714j264984q0647J546105J837891J027912
14408F72205K16406m98127j319671k141027k153775j244678j44483O26142O38738
14399e348270j03958o74852r4816Q81583J285136J294998J156031J068337Q63400
$$ y = [-1424922, -1574553, -1257367, -845275, -628633, -981222, -2103132, -3340853, -3923896, -3423442, -2289846, -1648488, -1632842, -1237081, 58441, 1948857, 3471005, 3879396, 3461475, 2500866, 940183, -1187062, -3487807, -5521931, -7057257, -7807370, -7835608, -7532328, -7288587, -6905475, -5586080, -3246000, -1199793, -774797, -1788944, -3137969, -3705718, -3279217, -2247283, -1177211, -676715, -974968, -1951595, -3231123, -4197761, -3990158, -2658258, -1334117, -1235358, -2394072, -3659056, -3739703, -2193598, -355707, 672205, 888611, 390484, -929187, -3070214, -5223989, -6468667, -6613150, -5987008, -5348270, -5452228, -6127080, -6221896, -5340313, -4055177, -2760179, -1604148, -535811, 327589]
14390C27589K99954k13187l63021m44242l84254l20957n88134p12970k44467M77474
14380b166215J035601J470706J657464J479856J025526N09552N4069l41664q16884
14371C908011j638441k327054j643760n7636Q35835N44525n65356j652528j595979
14362d192383p43357j78491L03933J118408J759250J326105M12007J52885P4921
14353C3278o86370j657939k176634k135165j672418j103473p99432k81004N90133
14344i889024J087772Q30664L23358n2038m47636n80724j58887N92395J359096
14335f935024J319647L70284l12392o10506j028798m72105J093897J881791J476864
14326c216342Q75643Q79130J207754J116728R49378Q82180M81003j44329m70161
$$ y = [327589, 627543, 414356, 51335, -392907, -777161, -1098118, -1686252, -2399222, -2643689, -2166215, -1130614, 340092, 1997556, 3477412, 4502938, 5012490, 5066559, 4724895, 3908011, 2269570, -57484, -1701244, -1758880, -923045, -378520, -943876, -2596404, -4192383, -4935740, -5114231, -4810298, -3691890, -1932640, -606535, -194528, -41643, 33278, -653092, -2311031, -4487665, -6622830, -8295248, -9398721, -10198153, -10479157, -9889024, -8801252, -7970588, -7647230, -7699268, -8146904, -8727628, -8886515, -8294120, -6935024, -5615377, -5245093, -5557485, -6167991, -7196789, -7668894, -6574997, -4693206, -3216342, -2340699, -1461569, -253815, 862913, 1812291, 2694471, 3175474, 3031145, 2560984]
14317B560984m54869m43599o96924j406071k330067k866316k711294j911698q64891
14308a1124745K91030R99213O56369l56808r00245n67171j42297K8251K65718
14299a0850685N30587P26822J054680J488244J685281J207028J12700p60720p47676
14290e553739k65785j39956l51945m83089n49643m86692k73263l20186o97758
14281i122056j068635j024720p19329j88895Q27082J387135P15448K9504K18546
14272h945920O21639O11444r7348q93585r95239k06391P97310J137466J174740
14263f795884J796598K076648J168889K73149N06868J058107L32054j222624j831322
14254b637517j166182l68051q4455j16950k37387k57217j64610R1069L10240R4531
$$ y = [2560984, 2106115, 1662516, 965592, -440479, -2770546, -5636862, -8348156, -10259854, -11124745, -10833715, -9834502, -9178133, -9534941, -10435186, -11002357, -11144654, -11116403, -10850685, -10320098, -9593276, -8538596, -7050352, -5365071, -4158043, -4045343, -4806063, -5553739, -5819524, -5959480, -6311425, -6794514, -7344157, -7830849, -8104112, -8424298, -9122056, -10190691, -11215411, -11934740, -12123635, -11296553, -9909418, -9193970, -9164466, -8945920, -8324281, -7712837, -7810185, -8703770, -9699009, -9905400, -9108090, -7970624, -6795884, -4999286, -2922638, -1753749, -1480600, -973732, 84375, 416429, -806195, -2637517, -3803699, -4171750, -4256205, -4373155, -4610542, -4867759, -5032369, -4941300, -4631060, -4536529]
14244d536529n47760r45537q43174r71243j458296j109973L49928J291460J103185
14235g667939O45930J09697k61874J07428J322086K464335K221281J070879K75692
14226B87515L7390K7602Q0289N6515j1390j2603n8959k12934l04666j73579L59597
14215G4777R56553R53357M44459m6893n67852j181871j399795j148336q39078
14206b754679j73332N84565M94886j2634r0714J66426M5379n89227p99398n15848
14196c644576j76269M90089Q71047R21655J037359J044958Q10981J40679p64891
14187G31032j227079j072178j292278j909743j983143j513572r72372j72147Q95855
14178h515625J444744J252758Q76450P79382R71320J280618J174183K69467m42024
$$ y = [-4536529, -5084289, -6029826, -6873000, -7844243, -9302539, -10412512, -10062584, -8771124, -7667939, -7022009, -6912312, -7174186, -7066758, -5744672, -3280337, -1059056, 11823, 287515, 324905, 352507, 432796, 489311, 477921, 465318, 406359, 193425, -111241, -284820, 74777, 1031330, 1984687, 2429146, 2382253, 1814401, 632530, -767265, -1915601, -2754679, -2928011, -2343446, -1848560, -1861194, -1951908, -1785482, -1740103, -2329330, -3128728, -3644576, -3820845, -3330756, -2459709, -1538054, -500695, 544263, 1355244, 1495923, 731032, -496047, -1568225, -2860503, -4770246, -6753389, -8266961, -9239333, -9411480, -8515625, -7070881, -5818123, -4941673, -4162291, -3190971, -1910353, -736170, -466703, -908727]
14169i08727l43335M4865O4555j46654l42281m35601l77230l26216n09219j044284
14159d324127j398851j271060o00723L08915J283986K084205K180729J417340
14151c19586L26389k45476o0824K32560P7437l66918p18887k13742J043592J603115
14141A357660O43755o15451j143998j738299k397376j981728r02023j61607L96527
14132f542540J214999K257403L274993L710720K870139J102946k40812j006052
14124F641796j435332j291084q59067n79653k17669M71993M37375j017041k385775
14115b34457k121851r95851l30268j78335l1539l617k35905l58091j08196M68815
14105d129295J022552J089951Q01965N53007L15485J12929K13448L78420J37595
$$ y = [-908727, -1252062, -1207197, -1142642, -1289296, -1631577, -2067178, -2444408, -2770624, -3279843, -4324127, -5722978, -6994038, -7594761, -7285846, -6001860, -3917655, -1736926, -319586, 6803, -238673, -299497, -66937, 10500, -356418, -1075305, -1289047, -245455, 1357660, 2001415, 1385964, 241966, -1496333, -3893709, -5875437, -6777460, -6939067, -6542540, -5327541, -3070138, 204855, 3915575, 6785714, 7888660, 7647848, 6641796, 5206464, 3915380, 3056313, 2476660, 2258991, 2730984, 3168359, 2151318, -234457, -2356308, -3352159, -3682427, -3860762, -3892301, -3895918, -4131823, -4489914, -4598110, -4129295, -3106743, -2016792, -1214827, -661820, -346335, -233406, -19958, 358462, 496057]
14096D96057m37432r94862j280243r95053p26193q13960m27764O17994J324345
14087c237111J236113J241143J562366J556231J232268R06858M63537k27294r23770
14078C810341j363404j513801j508119j389719q71396p04127j468008k027651
14070g035884j529616l24160J097424K116872J985317J079871J31594j0560N74109
14061a915033J058740J008974R8186j170057j752609j374314p02214o7665N51279
14052d264713Q93697O56090L97619K69462p0969n0747M50460P23432R43980J400921
14042A349232J732341J730266J105549l24359j603250j906072j416123r14110
14034b46526p37622k47463P15139J488856J440384N22034p56496j110653n95987
$$ y = [496057, 58625, -936237, -2216480, -3211533, -3937726, -4751686, -5179450, -4561456, -3237111, -2000998, -759855, 802511, 2358742, 3591010, 4497868, 4961405, 4734111, 3810341, 2446937, 933136, -574983, -1964702, -2836098, -3540225, -5008233, -7035884, -8565500, -8889660, -7792236, -5675364, -3690047, -2610176, -2478582, -2489142, -1915033, -856293, 152681, 250867, -919190, -2671799, -4046113, -4748327, -4815992, -4264713, -3371016, -2714926, -2317307, -2047845, -2118814, -2169561, -1719101, -995669, -51689, 1349232, 3081573, 4811839, 5917388, 5593029, 3989779, 2083707, 667584, -246526, -984148, -1231611, -516472, 972384, 2412768, 2934802, 2178306, 1067653, 471666]
14025D71666j22999O9248L9400r5853j22662r0011m1145M02672J112014J529916
14015C152246J151056M68230J19182m3919m4376O6477r3909m50859m73143k65617
14005C585368k73197o44195r95422r89018l91897N61060J037522P86241L29305
13996C005767L80258R37701J382821R78388k34375j264390j071626m80751o46766
13987B987027j163370j577082j994821j971448m30085J705125K814055K884043
13979C253444K676695K057211J218107P74000M91488m31536j513090j957242k034174
13970D534903j689092j028777m00294K56555P87250P70079J77456o99653j068843
13961A639584p01415k66982l0826k46872k36242M61401R42668R11288N64243j50436
$$ y = [471666, 348667, 417915, 457315, 361462, 238800, 148789, 107644, 510316, 1622330, 3152246, 4303302, 4771532, 4890714, 4846795, 4802419, 4868896, 4774987, 4324128, 3850985, 3585368, 3312171, 2667976, 1672554, 683536, 291639, 852699, 1890221, 2676462, 3005767, 3386025, 4323726, 5706547, 6684935, 6450560, 5186170, 4114544, 3633793, 2987027, 1823657, 246575, -1748246, -3719694, -4149779, -2444654, 369401, 3253444, 5930139, 7987350, 9205457, 9979457, 10470945, 10039409, 8526319, 6569077, 4534903, 2845811, 1817034, 1416740, 1673295, 2460545, 3230624, 3408080, 2708427, 1639584, 938169, 671187, 640361, 393489, 157247, 618648, 1561316, 2472604, 3036847, 2886411]
13951B886411p72890q76205o18826r387M67762l9403j083573j386799j098800
13942b531710j022111j024515p06151l07907l69667j145013j689089j187765m56465
13933a0440393l13484l35039N5273N55707N91589N13692J272010K009556J930102
13924d160987J690398J465614J190272P57350J14701j82688J73441L09455k49745
13915A107811l42054J07692K05576J39341M67368Q73976J219148J727891J877535
13906G384284J075533j0840n98035j100199j755492j834770j338766j226608j103998
13897e08891k13545J009430J659008J279461K55479o91943j164362r50475k77436
13888C96726J90770K51289L28772N15847K44964m32115p91313o88156l54170o9135
$$ y = [2886411, 2113521, 1237316, 618490, 609103, 1076865, 1037462, -46111, -1432910, -2531710, -3553821, -4578336, -5284487, -5592394, -5962061, -7107074, -8796163, -9983928, -10440393, -10753877, -11088916, -11033643, -10477936, -9886347, -9372655, -8100645, -6091089, -4160987, -2470589, -1004975, 185297, 942647, 1057348, 874660, 1048101, 1357556, 1107811, 765757, 873449, 1079025, 1218366, 1685734, 2559710, 3778858, 5506749, 7384284, 8459817, 8448977, 7850942, 6750743, 4995251, 3160481, 1821715, 595107, -508891, -722436, 286994, 1946002, 3225463, 3480942, 2788999, 1624637, 674162, 396726, 587496, 838785, 1167557, 1683404, 1928368, 1496253, 704940, 16784, -337386, -406521]
13878d06521j69759m80415n35393n20714n85841m42284m57770m75219M625O73307
13868c395984J225401J392179R78567K13586l38751m45753l76506m82826m84619
13859a714706k29429L6857m2916m07165n48247m61067j25292M8276P0948O83379
13849b689362J251540J296013P93428k72011j247000k098378k811334k658312
13841h435416j541907k33141O03691Q60048R36639J018001J065955J032696P03167
13832c990267L70649L62572M39523L15579j70507q16786j102255o51376J43298
13823e099570R13489J358221J051306P44554R28497J094252J233405J467392J091670
13814D783216j11113j278922j584447j514475j530779j252330n20453J51953M10536
$$ y = [-406521, -576280, -1056695, -1592088, -2112802, -2698643, -3140927, -3598697, -4073916, -4069291, -3395984, -2170583, -778404, 200163, 413749, 74998, -370755, -747261, -1230087, -1714706, -1944135, -1907278, -1950194, -2357359, -2905606, -3366673, -3491965, -3443689, -3372741, -2689362, -1437822, -141809, 651619, 379608, -867392, -2965770, -5777104, -8435416, -9977323, -10210464, -9606773, -8746725, -7810086, -6792085, -5726130, -4693434, -3990267, -3619618, -3257046, -2817523, -2501944, -2672451, -3489237, -4591492, -5242868, -5099570, -4186081, -2827860, -1776554, -1032000, -103503, 990749, 2224154, 3691546, 4783216, 4672103, 3393181, 1808734, 294259, -1236520, -2488850, -3009303, -2857350, -2446814]
13805b446814P05793Q73017N95309j87168o98071m5151P95228O62184o4503m24640
13795b34816J77126J442753K194074J894268Q35429j17319m30718R6261J014944
13786F872002J057542J51826p41849j255736j324151j382027j575072j301288
13778E01247q25750m12928K4686N2991k92108m37470l57232l13840l94757m71947
13768b927108k43951M77982J104998J245456R83080O76807L39918J537J27163
13759A785882K81687M50314M30562l84n92416j082410q81825J50687Q04856O57233
13749B004186N62039M31932Q8579Q0846P00158J227332R60783L08564m73522j201662
13739D689235j249533m68313O72953J145032L81406m69385n61482l23688l22325
$$ y = [-2446814, -1741021, -868004, -272695, -459863, -1157934, -1203085, -407857, 254327, 189824, -234816, -57690, 1385063, 3579137, 5473405, 6308834, 6191515, 5760797, 5857058, 6872002, 7929544, 8081370, 7339521, 6083785, 4759634, 3377607, 1802535, 501247, -324503, -737431, -712745, -659754, -951862, -1389332, -1746564, -2060404, -2455161, -2927108, -3171059, -2693077, -1588079, -342623, 640457, 1317264, 1657182, 1658719, 1785882, 2067569, 2517883, 2948445, 2948061, 2355645, 1273235, 391410, 542097, 1346953, 2004186, 2566225, 2998157, 3086736, 3167582, 3867740, 5095072, 6055855, 6364419, 5890897, 4689235, 3439702, 2971389, 3644342, 4789374, 5170780, 4701395, 4139913, 3816225, 3493900]
13730C493900n09199n96100o64030o91822n04416k53168j91935l29159n63229
13721h09158p19475r99190j219039p01047K31366O21907M46080L97912L59103
13712b391541Q3568Q6029K81484Q5118m28726l61458L81477J007913J138075Q52376
13702G34315R35363J382284J251143N21766j56018m52150n50103o01012q32414
13693B233174j106151q29727l68884k64388k23224k8184K67123N36988K85324
13684E02051j63320m19646p36372j088295j016154o42376n31466m60392p1430
13675d627400R5352l58503j129114j615570j045179j41613L90508R05030J327024
13666f199465J435974J565303J778138J430556N99179K41788L44013L27058L31360
$$ y = [3493900, 2984701, 2388601, 1724571, 1032749, 528333, 275165, 83230, -245929, -809158, -1528633, -2527823, -3746862, -4447909, -4216543, -3594636, -3148556, -2750644, -2391541, -2307973, -2221944, -1940460, -1855342, -2284068, -2645526, -2264049, -1256136, -118061, 734315, 1669678, 3051962, 4303105, 4824871, 4668853, 4216703, 3666600, 3065588, 2233174, 1127023, 297296, -71588, -335976, -559200, -587384, -320261, 216727, 502051, 338731, -80915, -817287, -1905582, -2921736, -3564112, -4095578, -4555970, -4627400, -4532048, -4890551, -6019665, -7635235, -8680414, -8822027, -8431519, -7526489, -6199465, -4763491, -3198188, -1420050, 10506, 609685, 851473, 1195486, 1522544, 1853904]
13657A853904P02053J084418J170660P31115j11285j266695k378038k933096l123020
13648d269984k769187k159883j602529q29622M33302J603258K003450J631850
13640e959345Q64729L04148M65733P25596N43596L76810M64633M22624J52437
13631a639039m46921j118714j247303r73489n46219R6463P18275R86648R60055
13622c210244M75329j12308p9727K25125j23280o68976q78955n63332L09719R52843
13612c673806Q06070L82648j00415m87511o98167r11066q25150l35606J22712
13603e720291K40835Q8161O3960M62245Q19981Q75614R73963J540875J980274
13594A325617J576074J009906R23151P23751L08751K73664L21790K20114k2083
$$ y = [1853904, 2555957, 3640375, 4811035, 5542150, 5430865, 4164170, 1786132, -1146964, -4269984, -7039171, -9199054, -10801583, -11631205, -11197903, -9594645, -7591195, -5959345, -5094616, -4790468, -4324735, -3599139, -3055543, -2678733, -2214100, -1791476, -1639039, -2085960, -3204674, -4451977, -5425466, -5971685, -5875222, -5156947, -4170299, -3210244, -2734915, -2847223, -2926950, -2701825, -2825105, -3494081, -4373036, -4936368, -4626649, -3673806, -2867736, -2485088, -2585503, -3073014, -3771181, -4682247, -5507397, -5843003, -5720291, -5479456, -5391295, -5327335, -4865090, -4045109, -3169495, -2195532, -654657, 1325617, 2901691, 3911597, 4834748, 5558499, 5867250, 6140914, 6462704, 6682818, 6660735]
13585F660735k06378k34274n39812j060323j522348j687460j499185r97405m08954
13576a495404j57822K5023K28215J80344K93443O76502J149206J661732J937276
13567D498515J933767J319871L05931o01821p36713l28728m56284q58236r09086
13558D167216q31546n65085j06710o7326l43740m51134R3683O78750M28631l14268
13548B688471r94859j325871q53816K71394J171307J263830Q03452K95180j08798
13539C210290n2334K22970J43346Q0166K98903Q3097k31833k10076k19456k70722
13529C054351n1911L06669M81216M76150L95238L52404K03482J3436K1052m50834
13519D801253j599089k396806k292402j219490J15793P08414K33006o65671q15089
$$ y = [6660735, 6454357, 6220083, 5680271, 4619948, 3097600, 1410140, -89045, -1086450, -1495404, -1653226, -1628203, -1399988, -1219644, -926201, -249699, 899507, 2561239, 4498515, 6432282, 7752153, 8058084, 7456263, 6719550, 6390822, 5934538, 5076302, 4167216, 3335670, 2770585, 2663875, 2596549, 2252809, 1801675, 1895358, 2574108, 3002739, 2688471, 1693612, 367741, -486075, -214681, 956626, 2220456, 3023908, 3319088, 3210290, 3157956, 3380926, 3524272, 3604438, 3903341, 3986438, 3754605, 3544529, 3325073, 3054351, 3002440, 3309109, 3790325, 4266475, 4661713, 5014117, 5217599, 5231035, 5252087, 4801253, 3202164, 805358, -1487044, -2706534, -2590741, -1882327, -1649321, -2314992, -3130081]
13510c130081j78847P3040j14554R5716P18298J175857R37623J57115k93734l49721
13500i09288k98768j23638j10400o40351j162009o39860M21741O89354P7955l59315
13490c054579K63214J112504J241488J073466P68287Q5693p49845j250293j164394
13481a674459l84622K65659P7557p0833M72035J121460J035932M69725J62039
13472A474493k10257r53577j519714j644015j639393j941252j843806n14546J222330
13463g569737K138104J844731J157932R71785J115306J113433Q65221N00671N2479
13454B189925l10448k52617q4643m18632o39095m09194n57377j114542r90087
13445b586710L5712L33023k68156m12165K07887J161947J593631J124667O26562
$$ y = [-3130081, -3308928, -3235888, -3350442, -3254726, -2536428, -1360571, -422948, -265833, -559567, -909288, -1208056, -1331694, -1442094, -2082445, -3244454, -3884314, -3462573, -2773219, -2695264, -3054579, -2791365, -1678861, -437373, 636093, 1404380, 1490073, 740228, -510065, -1674459, -2059081, -1793422, -1715865, -1786698, -1314663, -193203, 842729, 1312454, 1474493, 1264236, 310659, -1209055, -2853070, -4492463, -6433715, -8277521, -8792067, -7569737, -5431633, -3586902, -2428970, -1457185, -341879, 771554, 1636775, 2137446, 2189925, 1879477, 1626860, 1542217, 1123585, 484490, 75296, -482081, -1596623, -2586710, -2550998, -2217975, -2486131, -2898296, -2690409, -1528462, 65169, 1189836, 1816398]
13436A816398K48689m88922j261544j444417j221844m16295Q09787J321128O14698
13427b2322j99945m83153r77801j486441j229758p67065q23546p59584p3264M48907
13417f373972L80645L29958R15623J612031J334161M30575J18552N24020J052737
13408C24330J140229P17608M40107L81611j59148q65569j070794p29800j68113
13399A0461k05595r86668j790824k015514j905251j477247m18448P16681J104697
13390f967708O68382m9158l60382L01581R96781P80050K93508j72634o66438j085343
13380f261361j199528n27055L46289L86510m62947j201500r01354J17752J119589
13371h583605J763203J555540O93749K81995M29928M88503P08137J172715J353583
$$ y = [1816398, 2065087, 1576165, 314621, -1129796, -2351640, -2767935, -1958148, -637020, -22322, -222267, -705420, -1683221, -3169662, -4399420, -5166485, -5990031, -6749615, -6822879, -6373972, -5993327, -5663369, -4747746, -3135715, -1801554, -1370979, -1252427, -728407, 324330, 1464559, 2182167, 2622274, 3003885, 2844737, 1979168, 908374, 178574, 10461, -195134, -1181802, -2972626, -4988140, -6893391, -8370638, -8789086, -8072405, -6967708, -6299326, -6348484, -6708866, -6407285, -5410504, -4630454, -4336946, -4509580, -5176018, -6261361, -7460889, -7987944, -7641655, -7255145, -7718092, -8919592, -9820946, -9703194, -8583605, -6820402, -5264862, -4571113, -4289118, -3859190, -3370687, -2662550, -1489835, -136252]
13362a36252J202341R24683N57508K48064N13221J089850J322658P94672n7822
13353F458923m74927m01642J00493Q44661P91134l4854l89238j99076j29154k26317
13343F340003k11693l76770p27158r66176j077721j117403j315481j225186n17386
13334a194971M47821J048508R42223R95390J221768J023745L66672m24967j017625
13325C408564j348504j079518o56254p68462r79231r46877o48714L5620Q21725
13316b161651J238557J294506J016856K43790k21089J65683O73537J94571q60124
13307A584636j407104j278248j278395j153041m67373P305N72441J321673J426254
13298f71852N62800o01693r76678p29609l31627L85444J033050J255226J269025
$$ y = [-136252, 1066089, 1990772, 2548280, 2796344, 3309565, 4399415, 5722073, 6516745, 6458923, 5983996, 5582354, 5682847, 6527508, 7318642, 7283788, 6894550, 6695474, 6566320, 6340003, 6128310, 5751540, 5024382, 4058206, 2980485, 1863082, 547601, -677585, -1194971, -747150, 301358, 1243581, 2238971, 3460739, 4484484, 4851156, 4426189, 3408564, 2060060, 980542, 324288, -444174, -1423405, -2370282, -3018996, -2983376, -2161651, -923094, 371412, 1388268, 1632058, 1410969, 1576652, 2250189, 2444760, 1584636, 177532, -1100716, -2379111, -3532152, -3999525, -3992220, -3419779, -2098106, -671852, -109052, -710745, -1687423, -2417032, -2748659, -2363215, -1330165, -74939, 1194086]
13289A194086Q23143j96393j287810j614752j061115j31637R81686J735536J424417
13280A867161M98857l12334m69919K97116R94972L18293q02550j010977o72430
13271G08189l15047j9529K24994K14062J16729j17664k86828O5128M33963L70191
13261A394188J62461k02220n42238l56396K45378Q13309R47239O50114L25525
13252C437360J39472j75286k48568j05775l02296q42932j175124j180678j002747
13243a456574m55234o0116n8313K19024J313885K517852K579881J467041j2558
13234F054888q36103j009437j222456j315912p48269p8271j56525o34097n72601
13225e18783K09794O96763n4230j330284j785404j290207m04356L18759K88099
$$ y = [1194086, 2017229, 1820836, 533026, -1081726, -2142841, -2274478, -1292792, 442744, 1867161, 2366018, 2053684, 1583765, 1880881, 2875853, 3194146, 2391596, 1380619, 708189, 393142, 373613, 598607, 812669, 929398, 811734, 524906, 590034, 1023997, 1394188, 1556649, 1354429, 812191, 455795, 701173, 1514482, 2461721, 3111835, 3437360, 3576832, 3401546, 3152978, 3047203, 2744907, 1901975, 726851, -453827, -1456574, -1911808, -1971924, -2030237, -1811213, -497328, 2020524, 4600405, 6067446, 6054888, 5218785, 4209348, 2986892, 1670980, 922711, 844440, 687915, 53818, -518783, -308989, 387774, 333544, -996740, -2782144, -4072351, -4476707, -4157948, -3869849]
13216c869849k39165j90594M87371O26352k6585m58612l57384j25465j26555k54609
13206d535095k45641o48367r86159k54838J135246K037341J716761P93925j16373
13197a103200o80789q70488r02649o89210r4985N93895R90025O85536j61355r56792
13187c190012j248600q76205J62942J496023K408564K080899O17254n85533p36393
13178A28939n82591o61633q19254p99021n69722j52677K92536m4284q05077q51960
13168d864744j55441P33010R15954M85171L93823P79621R95178P73466j56526
13159a00488j260688j138339j23383O26798Q22781R89775Q74801K40726l79746
13150E52237o37692j55663P73757J358232J297795Q38127M2365p94807j376497
$$ y = [-3869849, -4109014, -4299608, -3812237, -3185885, -3212470, -3671082, -4028466, -4153931, -4280486, -4535095, -4780736, -5429103, -6415262, -6670100, -5534854, -3497513, -1780752, -986827, -1103200, -1783989, -2654477, -3557126, -4246336, -4341321, -3747426, -2757401, -2071865, -2233220, -3190012, -4438612, -5314817, -5151875, -3655852, -1247288, 833611, 1450865, 865332, 128939, -453652, -1115285, -1934539, -2733560, -3303282, -3455959, -3163423, -3207707, -4012784, -4864744, -5020185, -4287175, -3371221, -2886050, -2492227, -1712606, -717428, 56038, -100488, -1361176, -2499515, -2622898, -1996100, -1173319, -183544, 691257, 931983, 552237, -85455, -241118, 532639, 1890871, 3188666, 4026793, 4069158, 3274351, 1897854]
13141A897854j428904n76143L23099M28511j26268n03550j93363M92275J223852
13132A537363J574841J507368J106480L02640Q0337O13660P04412l8728r24144
13123F464229j165273r72226q55186o36087n64288o44371o71943o37294m42681
13114a25120l96045n05824o36098k48865P32450R78524M06290j95953o33219o19834
13104a243694M3371P81424J149084P70730k67119j067256j000656n78647m03442
13095a816205m0486J119367K385277K714178K149833J132321l2382p31136p84003
13086F096764j006534j367110j154114p18023o04795n95937p40851o29147k48132
13077i67879R8328N26015Q50992Q88003J032890J238945J046074N67020m1967
$$ y = [1897854, 468950, -107193, 215906, 644417, 518149, 14599, -178764, 313511, 1537363, 3112204, 4619572, 5726052, 6028692, 6109029, 6722689, 7427101, 7388373, 6464229, 5298956, 4326730, 3471544, 2835457, 2271169, 1626798, 954855, 317561, -125120, -521165, -1026989, -1663087, -1911952, -1179502, -200978, 205312, 9359, -623860, -1243694, -1200323, -418899, 730185, 1500915, 1233796, 166540, -834116, -1412763, -1816205, -1856691, -737324, 1647953, 4362131, 6511964, 7644285, 7611903, 6880767, 6096764, 5090230, 3723120, 2569006, 1850983, 1246188, 650251, -90600, -719747, -967879, -869551, -343536, 507456, 1395459, 2428349, 3667294, 4713368, 5280388, 5238421]
13068E238421m84982k37679P41482J346490J429540J679272J980346J580908M03651
13059A3677449l32112l38071l80285o10503j162116j597494j024483p312J71257
13050H396330j26841O6325M57251Q64760R29287M21333j87313o12689p77832n87059
13040H843552j72894r6838k33074n05586j031249j321509j185855p46724k99740
13031C250083M28133J269104J698058J695882J136297O25129P22079Q77966O89375
13022A2392106N56174O69115N21828K79820M43588M90491o0120q53744j038430
13013A3400828J03077J769797K608075K478479J814381J267793J660439L063059
13005B8165928M355819M729066N242612O361498O900499P035097P864361R834784
$$ y = [5238421, 4753439, 4515760, 5257242, 6603732, 8033272, 9712544, 11692890, 13273798, 13677449, 13345337, 13007266, 12626981, 12016478, 10854362, 9256868, 8232385, 8225073, 8396330, 8269489, 8335814, 8793065, 9657825, 10587112, 11008445, 10821132, 10208443, 9430611, 8843552, 8670658, 8573820, 8340746, 7835160, 6803911, 5482402, 4296547, 3549823, 3250083, 3678216, 4947320, 6645378, 8341260, 9477557, 10102686, 10824765, 11702731, 12392106, 12948280, 13617395, 14139223, 14419043, 14862631, 15353122, 15293002, 14439258, 13400828, 13503905, 15273702, 17881777, 20360256, 22174637, 23442430, 25102869, 28165928, 32521747, 37250813, 42493425, 48854923, 55755422, 62790519, 70654880, 80489664]
12997H0489664J2120505J3679273J5230688J7840140K0735505K3427809K6638275
12990B10161859L1071112L6962431M3688648M9958870N2708688M6670240K7963749
12983D99185597p26799k9595323m8569150n5120137n2638391m5757299l8240135
12976B28538363l1653058k6345069k2019711j8449609j5583363j2869207j0235444
12969I1382902q559399p884766p094844n880977m685900m014470m057034m126093
12961D5079419l946865l673355k976614k441828k475060k297285j259812k4000
12953B5984600M06779L14523K42790M09821O93841N41174j22460r81287j441909
12944B6047872j133408m95443L11222J162065J279327N87602o23228j108094k45134
$$ y = [80489664, 92610169, 106289442, 121520130, 139360270, 160095775, 183523584, 210161859, 241232971, 278195402, 321884050, 371842920, 424551608, 471221848, 499185597, 498458798, 468863475, 420294325, 365174188, 312535797, 266778498, 228538363, 196885305, 170540236, 148520525, 130070916, 114487553, 101618346, 91382902, 82823503, 74938737, 67843893, 61962916, 57277016, 53262546, 49205512, 45079419, 41132554, 37459199, 34482585, 32040757, 29565697, 27268412, 26008600, 25984600, 26391379, 26705902, 26948692, 27358513, 28052354, 28593528, 28471068, 27489781, 26047872, 24914464, 24419021, 24730243, 25892308, 27171635, 27759237, 27136009, 26027915, 25782781]
12935B5782781Q99431J788851K453161K699293K458249K142390K262263K764191
12927D3250610L154408L175322K268667O48103k26616l1672K84644Q05478K040328
12918E5369272K731026K578530K507588L227966M624334N976584P259577Q337130
12910I2612007R171717J0303298J2292019J5091029J8524811K2910706K8615204
12903B09520791L5229577M2134280M8860669N4141901N4548148M5533153K4340766
12896E14309285n941469l4580439n1570946n5880947n2292333m5423608l8215510
12889B30404033l1875761k6329366k1434512j7555977j4806629j2840015j1347247
12882I4214526j0267194q694629o684293n201593l971937k843707k290499k449980
$$ y = [25782781, 26682212, 28471063, 30924224, 33623517, 36081766, 38224156, 40486419, 43250610, 46405018, 49580340, 51849007, 52497110, 52270494, 52238822, 52523466, 53328944, 55369272, 58100298, 60678828, 63186416, 66414382, 71038716, 77015300, 84274877, 92612007, 101783724, 112087022, 124379041, 139470070, 157994881, 180905587, 209520791, 244750368, 286884648, 335745317, 389887218, 444435366, 489968519, 514309285, 508367816, 473787377, 422216431, 366335484, 314043151, 268619543, 230404033, 198528272, 172198906, 150764394, 133208417, 118401788, 105561773, 94214526, 83947332, 75252703, 68568410, 63366817, 59394880, 56551173, 54260674, 51810694]
12874E1810694k736581k717433k779478l279256l913838l788383k590343j551766
12866B8453616j090825m10393J26153L35509L60963J80184k45552o74719m37188
12857B6597748K14169P00476M85608j79925m34820L5454R74968J062058L45704
12848B9801440K6409K92751Q06718Q03684R1159m38462k14697q8302k74793k86946
12838C0518961r7596N22761J737391K966455L290031K766823K338618K186281
12830D6229725K725816M654830O781865P962035Q295437Q635532R481789J0852356
12822A05619385J2806958J4763904J6787569J9705673K3715596K8574894L4257861
12815B56231840M0879982M7986720N3293633N2530675M0494476J6183113j3578037
$$ y = [51810694, 49074113, 46356680, 43577202, 40297946, 36384108, 32595725, 30005382, 28453616, 27362791, 26952398, 27078551, 27414060, 27775023, 27955207, 27709655, 27034936, 26597748, 26811917, 27512393, 27998001, 27818076, 27383256, 27418710, 28393678, 29455736, 29801440, 29827849, 30120600, 30927318, 31731002, 31822161, 31383699, 31169002, 31080700, 30805907, 30518961, 30421365, 30944126, 32681517, 35647972, 38938003, 41704826, 44043444, 46229725, 48955541, 53610371, 60392236, 68354271, 76649708, 85285240, 94767029, 105619385, 118426343, 133190247, 149977816, 169683489, 193399085, 221973979, 256231840, 297111822, 345098542, 398392175, 450922850, 491417326, 507600439, 494022402]
12808D94022402l8232455n1438284n4073875n0243699m3706678l6700550l0161539
12801A89465322k4841876k0768811j7202138j4234115j2253209j0693738r396005
12794H0075430q348695o877001m967198l939400m168790m793127n112917m466040
12786C7402262l230009k499785k513492k435274j730293p17362j51429l05738
12778B3818880m38126j34625J00114l05341q44219j196311j458802k170092l128249
12769A4243229l356485k451231r57477K28470Q52442Q10649K08673k39969J09276
12760I447577R83926R90004l12084j373874j019965R7341M30421m17634j360381
12751G465331j651015j313131l80181O53961J524761K096462J498998j60819j437122
$$ y = [494022402, 455789947, 404351663, 350277788, 300034089, 256327411, 219626861, 189465322, 164623446, 143854635, 126652497, 112418382, 100165173, 89471435, 80075430, 71726735, 64849734, 59882536, 55943136, 51774346, 46981219, 41868302, 37402262, 34172253, 31672468, 29158976, 26723702, 24993409, 24276047, 24124618, 23818880, 23380754, 23246129, 23346243, 23040902, 22196683, 21000372, 19541570, 17371478, 14243229, 10886744, 8435513, 7478036, 7706506, 8558948, 9369597, 9578270, 9338301, 9447577, 10431503, 11421507, 11109423, 9735549, 8715584, 8812925, 9243346, 8825712, 7465331, 5814316, 4501185, 4121004, 4774965, 6299726, 8396188, 9895186, 9734367, 8297245]
12742H297245j857522j806434j254770l18125K76470K86540M8714m6564K71389
12733C896943N31889M89564K01118l63998r79430j386076j311839o02790K93855
12724G69236R45745R87590M14209l18374n76398k15528M00862Q76905J019714
12715D303961P58869J85440R177M60107Q54627R82998P23341K68185j08365k83968
12705H154372J5753K23004M9427l10133p39391j009875j178884j617557j816337
12696A770379j236714l76660K04568L31621j15972m23798j81020j67193m88335
12687f83124n45624L0029J131354K014060J805021R78743L60093J21846J93773
12678E406171N27676O85814J47167n44189p24874o71353p02920p91443o30390
$$ y = [8297245, 6439723, 4633289, 3378519, 3060394, 3336864, 3623404, 3672118, 3625554, 3896943, 4428832, 4918396, 5119514, 4755516, 3776086, 2390010, 1078171, 475381, 769236, 1714981, 2702571, 3116780, 2798406, 2222008, 2006480, 2407342, 3284247, 4303961, 5062830, 5248270, 5257447, 5717554, 6572181, 7555179, 8278520, 8546705, 8438340, 8154372, 8170125, 8393129, 8442556, 8132423, 7393032, 6383157, 5204273, 3586716, 1770379, 533665, 157005, 361573, 693194, 577222, 153424, -27596, -194789, -683124, -1228748, -1198719, -67365, 1946695, 3751716, 4730459, 5090552, 5212398, 5406171, 5933847, 6619661, 6766828, 6222639, 5497765, 4826412, 4123492, 3332049, 2701659]
12669B701659K81531J073268Q58901n952j126073j803500j679257j348516j118956
12660b166895l78711Q17003J318486Q66023O52476J311041K017069J508908P1185
12651F016585m32704K63310Q12366J030592Q96676r7774j106400j363101q91221
12642E128329r8868N29037Q88418J060460R45470P78909L98268p83057k188828
12633F658138k630983k110393j216697l95597k18645o43284r35332o27918j47893
12624b268604j97245q68142j302188r19161q1422Q22000J554630J676580J056221
12615e27331K0012q82346j230868j068165l58822N41884Q11987N43255P04041
12606a446353J254454J396663R41045M09058K15808K53292L68460L93059J77121
$$ y = [2701659, 2983190, 4056458, 4915359, 4909407, 3783334, 1979834, 300577, -1047939, -2166895, -2545606, -1728603, -410117, 455906, 1108382, 2419423, 4436492, 5945400, 6016585, 5583881, 5847191, 6659557, 7690149, 8586825, 8489051, 7382651, 6019550, 5128329, 5029461, 5558498, 6446916, 7507376, 8452846, 9231755, 9630023, 8846966, 6658138, 4027155, 1916762, 700065, 304468, 85823, -557461, -1492793, -2120711, -2268604, -2465849, -3333991, -4636179, -5555340, -5636762, -4814762, -3260132, -1583552, -527331, -507319, -1389665, -2620533, -3688698, -4047520, -3505636, -2693649, -2150394, -1446353, -191899, 1204764, 2145809, 2554867, 2770675, 3023967, 3392427, 3785486, 3962607]
12597C962607m36379j318113j784760j379908n40721K7973L65558P99244J429823
12588A125324J701484J234201J02911r87515j289325q98575j71327M7225n62506
12579C01897r91207n06305J2216J06277q987l4944M89021J025951P15142j21300
12569I87761o32143p14982l73486M99628J498065J958149J625659N64494r21955
12560D491190j726863j557261j447325j520149j305282q39315j87470N03624J266893
12551b321958J521490J197022J073542Q14123K31784k8986M2035o4683n60211
12542A904158j157878j207975o89500l910Q71479J337614J203430O70878J08797
12533C037093j08214l915M83710Q32459J154050J755500J849645J219770M56920
$$ y = [3962607, 3526228, 2208115, 423355, -956553, -1497274, -1469301, -1103743, -304499, 1125324, 2826808, 4061009, 4163920, 3176405, 1887080, 988505, 817178, 864403, 301897, -689310, -1195615, -1183399, -1077122, -1086109, -1121053, -632032, 393919, 1109061, 987761, 355618, -359364, -732850, -233222, 1264843, 3222992, 4848651, 5413145, 4491190, 2764327, 1207066, -240259, -1760408, -3065690, -3905005, -4092475, -3588851, -2321958, -800468, 396554, 1470096, 2284219, 2516003, 2487017, 2529052, 2464369, 1904158, 746280, -461695, -1151195, -1155105, -283626, 1053988, 2257418, 2928296, 3037093, 2928879, 2924964, 3408674, 4241133, 5395183, 7150683, 9000328, 10220098, 10677018]
12524A0677018m2091m46328l96267M97713J034914N56037l58532j144626j545948
12515H831890j326227j150809j382223j591969j457043r65309j10848Q36990J225247
12506B909699P22919k97167r53494p80263l2316R09315J344332R37403N51379
12497E311807P45923Q36927M56162L7123k05976k28744j7536m2625m91191n83901
12487E817969j8566O20108R52007N75601n4417k63551m35499o79157q66850o66565
12477D981080K8788Q01215P98325j94976r06175n08699J29533L28995K59454P9793
12467E797333J60846K98620K78610K79234N31342Q48201N78491k51547j096263
12458G424867j717425k093005j919176j276276p64248o26528p05439r14267o32006
$$ y = [10677018, 10634927, 10188599, 9792332, 10290045, 11324959, 11880996, 11522464, 10377838, 8831890, 7505663, 6354854, 4972631, 3380662, 1923619, 958310, 847462, 1684452, 2909699, 3632618, 3335451, 2381957, 1601694, 1569378, 2478693, 3823025, 4760428, 5311807, 6057730, 6894657, 7350819, 7387942, 7181966, 6953222, 6935686, 6893061, 6401870, 5817969, 5799403, 6419511, 7371518, 7947119, 7892702, 7629151, 7193652, 6514495, 5647645, 4981080, 5009868, 5811083, 6609408, 6414432, 5508257, 4999558, 5129091, 5458086, 5717540, 5797333, 5958179, 6256799, 6535409, 6814643, 7345985, 8194186, 8772677, 8521130, 7424867, 5707442, 3614437, 1695261, 418985, -345263, -971791, -1677230, -2591497, -3223503]
12449c223503L07353J160556J577465J484181J263523J048415O29091k9049n73652
12440C644380m93691P4482J2793j218076k174877k006996j642014j152386j26302
12431e082687N33281L25256K3369l5565L2642k78855j085904j498921j047438
12422h114822K989J159661J971188J771303P59491m0141j93272k33472m10344
12413c327419k80144J1053K45919M45073N18221M01667J82873N0160k02043o66762
12403b621402r97559m43312O04406P28854j88523q93623j87085J189077K064228
12394g44939K305776J975166J457960J106477O84302l62557j594033j926667j432907
12385A468578j017135p01868j37332L55748M97430P02048P46433L95762J43245
$$ y = [-3223503, -2916150, -1755594, -178129, 1306052, 2569575, 3617990, 4247081, 4218032, 3644380, 3150689, 3225171, 3237964, 2019888, -154989, -2161985, -3803999, -4956385, -5082687, -4549406, -4224150, -4200781, -4236346, -4203704, -4482559, -5568463, -7067384, -8114822, -8111833, -6952172, -4980984, -3209681, -2450190, -2490331, -2683603, -2917075, -3327419, -3607563, -3596510, -3350591, -2905518, -2387297, -1985630, -1802757, -1752597, -1954640, -2621402, -3618961, -4062273, -3457867, -2729013, -2917536, -3811159, -3998244, -2809167, -744939, 1560837, 3536003, 4993963, 6100440, 6784742, 6422185, 4828152, 2901485, 1468578, 451443, -250425, -387757, -32009, 465421, 1167469, 1913902, 2309664, 2452909]
12376B452909k57386r31588j317707r08023L00373J182721R06546L89937J78589
12367A996371M78933J135836J357920Q66879J78735q4619L32801P80919J30179
12358G173954j078276j522767j644595j653157j212969n64051K14829P67787Q28217
12349A308972N77595L89734M60751N43567L77472K618n32533q45265o38819n81398
12339A062694p25466n72212k12247J59204O67319J420655J977632J924993J630873
12330G333445J051638j77501j220575j453975j482994j475154r74546k83861L2271
12321A348748j18210m60620j56939N89504N16255n2951l15162j28949J56945N13182
12311A891803J115533J454810J152400N81583K29323K05161L69636M63458K48759
$$ y = [2452909, 2195523, 1263935, -53772, -961795, -661422, 521299, 1427845, 1817782, 1996371, 2475304, 3611140, 4969060, 5835939, 6014674, 5930055, 6262856, 7043775, 7173954, 6095678, 4572911, 2928316, 1275159, 62190, -501861, -287032, 480755, 1308972, 1886567, 2276301, 2737052, 3280619, 3658091, 3660709, 3128176, 2282911, 1644092, 1062694, 337228, -234984, -447231, -288027, 379292, 1799947, 3777579, 5702572, 7333445, 8385083, 8207582, 6987007, 5533032, 4050038, 2574884, 1600338, 1316477, 1348748, 1230538, 769918, 612979, 1202483, 1718738, 1665787, 1350625, 1221676, 1378621, 1891803, 3007336, 4462146, 5614546, 6196129, 6425452, 6630613, 7000249, 7463707, 7712466]
12302G712466l36792j161513j506845j072593Q1882J320730J471173N41485k78606
12293F771387n24238l31671n4988K74608J154088J550100N02174j211645j859091
12284F270724r92676n52452r70869j123718o30355O4477J46293k50145o74536
12275A286743n17867L34902J123415R79903J77486j96150k8728l0175l66436q10658
12265A952435r33642j91918J031670J510759J332263J163489R01011L07484j26753
12256F946798n30458j017520q63049k47907J2481m16723p38596j62369O25835
12247C608492J153268J211859P21470L26446L44941O69037P04991L44807L77368
12238I462679M69178r0208p05308r47998o81965k85496o07889r78570n40460M1854
$$ y = [7712466, 7375674, 6214161, 4707316, 3634723, 3716605, 5037335, 6508508, 7049993, 6771387, 6247149, 5915478, 5860490, 6135098, 7289186, 8839286, 9341460, 8129815, 6270724, 5278048, 4725596, 3754727, 2631009, 2000654, 2065131, 2211424, 1961279, 1286743, 768876, 1103778, 2227193, 3207096, 3384582, 3188432, 3159704, 3129529, 2763093, 1952435, 1018793, 826875, 1858545, 3369304, 4701567, 5865056, 6766067, 7073551, 6946798, 6416340, 5398820, 4535771, 4287864, 4300345, 3883622, 3145026, 2982657, 3608492, 4761760, 5973619, 6695089, 7021535, 7366476, 8035513, 8740504, 9085311, 9462679, 9931857, 9841649, 9136341, 8188343, 7506378, 7220882, 6612993, 5634423, 5093963, 5135817]
12228E135817J21920j50826n60533p30305m08281q3530k67115l41671K99920Q80371
12218C895767P10946K46535J52416M37092L51549j01483q7147J03651L45255N08255
12208F562836J58544n74723j249166j165962n25269m32381q41232j141688q76914
12199h5955R8056J427276K399685K555481J716207M25064j50824j34395l95079
12190G855516m23428j45508k81132q07301j479932k116457k028553r93876K58521
12181a62150Q40824O56617M82287O97098O71351R7321m60516n66797l98361o44533
12171A213141j340451j372222r28786k39907N99978J062821J197042J247316J316311
12162B755243Q80613n9975q15749q92735n86614j49797J39991K76627P61541J193166
$$ y = [5135817, 5257737, 5106911, 4546378, 3816073, 3407792, 3324262, 3057147, 2715476, 3015396, 3895767, 4606713, 4853248, 5005664, 5442756, 5794305, 5692822, 5605675, 5709326, 6054581, 6562836, 6721380, 6146657, 4897491, 3731529, 3206260, 2773879, 1932647, 790959, -85955, 12101, 1439377, 3839062, 6394543, 8110750, 8535814, 8384990, 8250595, 7855516, 7432088, 7286580, 7005448, 6198147, 4718215, 2601758, 573205, -420671, -162150, 678674, 1335291, 1817578, 2514676, 3186027, 3283348, 2822832, 2256035, 1857674, 1213141, -127310, -1499532, -2428318, -2668225, -2068247, -1005426, 191616, 1438932, 2755243, 3635856, 3575881, 2760132, 1867397, 1280783, 1130986, 1270977, 1547604, 2309145, 3502311]
12152C502311J060933P38484K83584m95720p68352j73509O12501J022412L79812
12143F162456p09682q92943l85400j40802m26176l91324q6599l61872j130527
12134A637131j310365m52602M14565O70821O10614M92196L25726j92130o72525
12125A523431o31762k09190K78304N59770K33905o76777j171285l29031R49574
12116E26939J478040J029992J3992p22938l36312N30090M82860l96888j199733
12107A406042j091707l79778M51665J426685K298819K151280N25845j288709j709339
12098C790803p40939L39411P50770O32291L75411o7133n83767j031149j369145
12089B096553j662097j653705q77487K64699J561295K561542K140899P98522j5343
$$ y = [3502311, 4563244, 5301728, 5585312, 5089592, 4321240, 4147731, 4760232, 5782644, 6162456, 5452774, 4559831, 4174431, 4033629, 3607453, 3216129, 3129530, 2767658, 1637131, 326766, -125836, 288729, 959550, 1570164, 2062360, 2388086, 2195956, 1523431, 891669, 682479, 960783, 1520553, 1754458, 1077681, -93604, -422635, 526939, 2004979, 3034971, 3048963, 2326025, 1989713, 2519803, 3002663, 2605775, 1406042, 314335, -65443, 386222, 1812907, 4111726, 6263006, 6788851, 5500142, 3790803, 3049864, 3389275, 4140045, 4772336, 5147747, 5080614, 4496847, 3465698, 2096553, 434456, -1219249, -2096736, -1832037, -270742, 2290800, 4431699, 5230221, 5214878]
12080E214878j72294o05957j830603k683983k525744k021665j332793m77451K97240
12071f138372R15039J292245J060569M10739j05398m39160l66360l50721m87158
12062d208577j97854N93126J096589R50761M84087o1510o57087j202872j137436
12053d340773l76971L01749O51497R06939Q36336J86058k11671J09823K44597
12044a692416l6243J76966J099410J982852J881082P98701m56153j092368j057798
12035A604033r92523o46149l26166p71244j275688j297871j013535k93983M20095
12026d593031P17605P96021L92527L0299J01902M98873P83261R4166r42801j038548
12016c159726k58808P35711J053923O48704L46587O35376P74869k44311j553559
$$ y = [5214878, 5042584, 4436627, 2606024, -77959, -2603703, -4625368, -5958161, -6435612, -6138372, -5223333, -3931088, -2870519, -2459780, -2565178, -3004338, -3370698, -3721419, -4208577, -4406431, -3813305, -2716716, -1765955, -1281868, -1343378, -2000465, -3203337, -4340773, -4717744, -4415995, -3764498, -2857559, -2021223, -1835165, -2046836, -1937013, -1692416, -1728659, -1551693, -452283, 1530569, 3411651, 4210352, 3754199, 2661831, 1604033, 611510, -34639, -360805, -1132049, -2407737, -3705608, -4719143, -5013126, -4593031, -3875426, -3079405, -2686878, -2656579, -2554677, -2055804, -1272543, -1178377, -2121178, -3159726, -3418534, -2682823, -1628900, -980196, -633609, 1767, 776636, 532325, -1021234]
12007a021234j890034j507797r68531K16553J832335K301902R86048n39818p78987
11998a369563n02336o91453q47817n04004J16880N14058N53955M00250j87630
11989b517660p39049q08170q18297n90216k50426j72316l78481n35989m22527
11980g233131n99968q71350q32008k50012P00215J089303O71056J37622K23810
11971f964463Q04482J071229R05906L52272n45330j051469p13002J48205M85947
11962e506223O3082N876K63267L23393O53032J194603J524134J737798J708371
11953A967333J350540Q28592J21944m07269o57883o08967l65603l57013j088216
11944G83458k374682k916144k192775q02650P27171J886454J975990J635521J360041
$$ y = [-1021234, -2911268, -4419065, -5387596, -5171043, -3338708, -1036806, -50758, -590576, -1369563, -1871899, -2563352, -3411169, -3915173, -3798293, -3284235, -2730280, -2330030, -2517660, -3256709, -4064879, -4883176, -5473392, -5723818, -5896134, -6274615, -6810604, -7233131, -7833099, -8704449, -9536457, -9786469, -9086254, -7996951, -7325895, -7188273, -6964463, -6159981, -5088752, -4182846, -3830574, -4375904, -5427373, -6140375, -5992170, -5506223, -5443141, -5437265, -5173998, -4850605, -4197573, -3002970, -1478836, 258962, 1967333, 3317873, 4146465, 4268409, 3861140, 3203257, 2594290, 2228687, 1871674, 783458, -1591224, -4507368, -6700143, -7502793, -6775622, -4889168, -2913178, -1277657, 82384]
11935H2384Q22364L28401J81107L9156j17390Q604M52053P08781N87016M23355
11925C515831N31398L39978l89135j012165p62889J16074K00704r46424k044986
11916d51614k156546j401279k04165P23575J283335J606696J522616J356432R14641
11907C193691r6133q21615j305081j988892k123375j888355j533763n53066M39804
11898f676785O50197P49963J008280Q88389O33718Q86353J597952K145598J780198
11889C663863R13743K32541m01423q57926j098276j220213j320725j422079j810023
11880c320518j820336r47119J79616R45317J072042N24004J54415M77414J474129
11871a261036K289997J703477Q4809j063272j198458q12121n86377l09021N71527
$$ y = [82384, 904748, 1233149, 1414256, 1453412, 1336022, 1344626, 1796679, 2505460, 3092476, 3515831, 4047229, 4387207, 3998072, 2985907, 2223018, 2339092, 2539796, 1593372, -451614, -2608160, -4009439, -4213604, -3490029, -2206694, -599998, 922618, 2279050, 3193691, 3097558, 2275943, 970862, -1018030, -3141405, -5029760, -6563523, -7116589, -6676785, -6026588, -5276625, -4268345, -3379956, -2746238, -1859885, -261933, 1883665, 3663863, 4577606, 4810147, 4408724, 3550798, 2452522, 1232309, -88416, -1510495, -3320518, -5140854, -6087973, -5908357, -4963040, -3890998, -3366994, -3212579, -2735165, -1261036, 1028961, 2732438, 2817247, 1753975, 555517, -256604, -842981, -1152002, -580475]
11862e80475J362113J461708J052898N28281K86961K48518J28871q8404m00019
11853D000452o58853o10888k21372L40009P23032J023458J008633j19687j644225
11844C840559k094991j696077j202493p64613l35470J46612L23635K04431K27113
11835a351294J25048k01921o00149r86993r17670m73864L1546L07560K31656N6380
11825c779701J24979M19115M36475M4715m14034q88646r95326l60404M08375J156425
11815c848027K037715K195658J306298K97024r6069k54451l84661l93463l85648
11806D74376o19841q96353r41218q70382n22994k10800M4196J58423N1943K57681
11796c074969R98529J723152J873087J346964N92759q696j72080k26803l36786
$$ y = [-580475, 781638, 2243346, 3296244, 3824525, 4111486, 4360004, 4488875, 4400471, 4000452, 3341599, 2730711, 2509339, 2849348, 3572380, 4595838, 5604471, 5484784, 3840559, 1745568, 49491, -1153002, -1917615, -2253085, -2106473, -1782838, -1578407, -1351294, -1226246, -1428167, -2028316, -3015309, -3932979, -4406843, -4375297, -4067737, -3836081, -3779701, -3654722, -3235607, -2799132, -2754417, -3168451, -4057097, -5052423, -5412827, -5004452, -3848027, -1810312, 385346, 1691644, 1988668, 1892599, 1638148, 1253487, 860024, 474376, -145465, -1041818, -1983036, -2853418, -3376412, -3587212, -3543016, -3384593, -3332650, -3074969, -2076440, -353288, 1519799, 2866763, 3459522, 3450826, 3278746, 3051943, 2715157]
11787B715157k21790k66498o76145q80922q03224l18012P27247J119894L44616
11778A740323m23390o02699l52466K0505L78696R46490J321777Q82754m75174
11769C436816j928552k346086j902935j440002p38272L20175R40664O05347j70089
11760c222934n73186n24055l43979N8908P42230J350851J325013Q89830L81282
11751H3960m51313j111924r53503k26457L68689P77370J102585J258737J359448
11742B207592J155519M18224n04125p95381l74928j76435k19947Q53017K729169
11733E292705K983549K150286J539266K52426j479782k340680j987371j090064
11725E320335o74034n56673k16431m33428j363453k296965k527826j470352O7063
$$ y = [2715157, 2493367, 2226869, 1550724, 669802, -133422, -451434, 275813, 1395707, 1740323, 1316933, 714234, 361768, 382273, 760969, 1707459, 3029236, 3911990, 3436816, 1508264, -837822, -2740757, -4180759, -4919031, -4598856, -3658192, -3052845, -3222934, -3796120, -4320175, -4664154, -4605246, -3863016, -2512165, -1187152, -297322, 83960, -367353, -1479277, -2432780, -2659237, -2290548, -1513178, -410593, 848144, 2207592, 3363111, 3781335, 3277210, 2481829, 2106901, 1930466, 1710519, 2563536, 5292705, 8276254, 10426540, 11965806, 12218232, 10738450, 8397770, 6410399, 5320335, 4646301, 4089628, 3873197, 3439769, 2076316, -220649, -2748475, -4218827, -4151764]
11716d151764J308358J738901J083911K10552j29189k93612k05349K58111M96483
11707C16402K65614l40371p63532n42657k89819l55340k92975Q7609Q09151J254062
11697A48144J327626J536565J849783J944206J228012q5547j097723j322900j118763
11688D409403p21499l61824j28043l08566o96163o29781n39419q80800j242091
11679a098783r64498m39716j36491r4504n48171j189409j365839j396080j558984
11670h792475j582886j078747k58178O34419J485544J981040J897483J409840
11662d303960Q41750M18415M85369N96093M84361M06883L49522J13311J05850
11653e02406P64695J210821P53385o5274m24100k20741p4252r7297J81498L71968
$$ y = [-4151764, -2843406, -1104505, -20594, 189958, 60769, -232843, -438192, -180081, 316402, 582016, 241645, -521887, -1064544, -1354363, -1709703, -2002678, -1915069, -1105918, 148144, 1475770, 3012335, 4862118, 6806324, 8034336, 7948789, 6851066, 5528166, 4409403, 3687904, 3326080, 3198037, 2889471, 2193308, 1563527, 1024108, 143308, -1098783, -2063281, -2502997, -2639488, -2733992, -3282163, -4471572, -5837411, -7233491, -8792475, -10375361, -11454108, -11712286, -11077867, -9592323, -7611283, -5713800, -4303960, -3462210, -3043795, -2558426, -1962333, -1477972, -1071089, -721567, -608256, -502406, 262289, 1473110, 2226495, 2161221, 1737121, 1516380, 1442128, 1344831, 1526329, 1898297]
11643A898297k14432j009776r03679j21034K38884r2466m73035m71671j63051
11634a311963M2364R0959J76678M27181Q76261J237386J175959P41243J80341
11625C636409o9555N6976j28717p44810q47049p1556O03634R02520J291918J371609
11615F001379N45671r18203j772302j324072o68316o16751j025280j638881j709155
11606c125910j031425j45400Q55729J523697J484796Q79677l00225j073797p09963
11597a642821L6919L0207n36086n21919K47087P43106L45180L8096L42689M55927
11587d61615j5153n42715m53689J82056N07013O02686O45727Q89881J365717J254310
11577C974218M40920n00197o50394k58610J5657J70289k96477j529071k589726
$$ y = [1898297, 1683865, 674089, -229590, -350624, -111740, -204206, -677241, -1148912, -1311963, -1269599, -1178640, -1001962, -574781, 301480, 1538866, 2714825, 3456068, 3636409, 3566854, 3623830, 3495113, 2750303, 1903254, 1831698, 2435332, 3337852, 4629770, 6001379, 6547050, 5628847, 3856545, 2532473, 1864157, 1247406, 222126, -1416755, -3125910, -4157335, -4302735, -3447006, -1923309, -438513, 441164, 140939, -932858, -1642821, -1605902, -1575695, -2111781, -2633700, -2386613, -1643507, -1298327, -1260231, -917542, -461615, -476768, -1019483, -1473172, -1291116, -784103, -181417, 464310, 1354191, 2719908, 3974218, 4415138, 3914941, 3264547, 3005937, 3021594, 3191883, 2895406, 1366335, -1223391]
11568a223391k341778j167561r0358R14111J578780J240660K57686j77728Q4262
11559i25317P61945R33021n7940j100483j396595j255677p30432q7034L06567
11550c551945O87527J070544Q29558L4336k63328l41788n34190o72605r62132
11541c704023o02019N74813J034715O17628N11443Q13612O54865J8510k93062
11532c73518n59551r50816j032543q95927o85316o44287r02233q34770j14746
11523f993707J157294K369207K407567J554190Q38079M67340J37732q12619k209455
11514a084372k572726j221949J93707N62663L57416j95836r38834j188223q20915
11505f909069m00228K07382J089084J462331J202971L91536o58638j167984q70143
$$ y = [-1223391, -3565169, -4732730, -4823088, -3908977, -2330197, -1089537, -831851, -1009579, -925317, -163372, 769649, 711709, -388774, -1785369, -3041046, -3771478, -3858512, -3551945, -2864418, -1793874, -964316, -929980, -1193308, -1535096, -2069286, -2741891, -3704023, -4306042, -3731229, -2696514, -2078886, -1567443, -753831, -98966, -80456, -373518, -933069, -1883885, -2916428, -3812355, -4497671, -5141958, -6044191, -6878961, -6993707, -5836413, -3467206, -1059639, 494551, 1332630, 1799970, 1937702, 1125083, -1084372, -3657098, -4879047, -4685340, -4122677, -3765261, -3961097, -4899931, -6088154, -6909069, -7309297, -7101915, -6012831, -4550500, -3347529, -2955993, -3614631, -4782615, -5652758]
11496e652758j78420j98298o25670m56273m1342L56028O65594R56769J371111
11487c803259J258151L99165k36048l067L24119M15276O07220Q12484R76510O20802
11477A371353m55301j261261j065897l46770J24999O74410J153122J078531P06082
11468A979268k73088j706446j903770p03705M39643N28380j23370q37903r87728
11459c588719j83908Q18834J199192J258863J362594J273470O17393m4376k109
11450B711234N32410R89574J029457Q30398K92521l41895p56122r29120j085867
11441C272590j103999n58975J9640j55359k27952K4882k87003r66480j271157
11432a253813j575299j852360j745755j506709o10131J415373K735357J996871
$$ y = [-5652758, -5831178, -6029476, -6655146, -7111419, -7152761, -6796733, -6131139, -5174370, -3803259, -2545108, -2145943, -2381991, -2385058, -2060939, -1645663, -1038443, -225959, 750551, 1371353, 916052, -345209, -1411106, -1757876, -1632877, -958467, 194655, 1273186, 1979268, 1706180, -266, -1904036, -2607741, -2168098, -1639718, -1763088, -2600991, -3588719, -3772627, -2953793, -1754601, -495738, 866856, 2140326, 2757719, 2713343, 2711234, 3243644, 4233218, 5262675, 6093073, 6385594, 6043699, 5287577, 4358457, 3272590, 2168591, 1609616, 1629256, 1473897, 1245945, 1270827, 983824, 17344, -1253813, -2829112, -4681472, -6427227, -7933936, -8544067, -7128694, -4393337, -2396466]
11424b396466P86109j14063o48678r72753j284753j097005m16744P1705l28430
11415f401078m84931L79467Q65633O39124O24618O07275q3442j279388j902144
11406g034866j581596n86910O77853J315802J422749J334087R55872P77021R68221
11397a751767R25259N30866j46041j179649k108106k380407j659579j45939J198904
11388f716459J946711K517118K683478K082976P38271j09391L6389M92464M00523
11379D072080r8498R806K02235k96445q01732r14224j171965j518638j424648
11370a942029p29422L012P23882J182071J271481J295821R11207o4810q34021
11361A817192p82817n7803N09190M59217J63505k20453o61864r94121m35260J088932
$$ y = [-2396466, -1610357, -1724420, -2373098, -3345851, -4630604, -5727609, -6144353, -6072648, -6401078, -6886009, -6506542, -5640909, -5001785, -4377167, -3769892, -3853334, -5132722, -7034866, -8616462, -9203372, -8525519, -7209717, -5786968, -4452881, -3497009, -2719988, -1751767, -826508, -295642, -441683, -1621332, -3729438, -6109845, -7769424, -7915363, -6716459, -4769748, -2252630, 430848, 2513824, 3252095, 3142704, 3179093, 3671557, 4072080, 3973582, 3983388, 4185623, 3889178, 3087446, 2173222, 1001257, -517381, -1942029, -2671451, -2668439, -1944557, -762486, 508995, 1804816, 2716023, 2651213, 1817192, 1034375, 976572, 1485762, 1944979, 2108484, 1888031, 1226167, 232046, -203214, 885718]
11351H85718K292852K444455J493243J60703l93116k19982m75679j408381k024274
11342B755539k018161j786541j089999J31958J439699J880849J116608J52011
11334B581963O4558M93425N79427M62090M90737L42859l14063j096687j372895
11325B231414q61206J0610M50286M20872M27802K12719n14236j159668j304792
11316h6199p61362j40157j11964k93733o3462N47277J351711J992039J524116
11307C958266M73927k09601j30536O91556J351029J165632N16161k50083j285235
11298F281116j872199j335629l29623p6515o13173j154507j117005p83606j34987
11289a136128Q91290J171237J017725J021493N81198l27094r07042r57645j013478
$$ y = [885718, 3178570, 5623025, 7116268, 7276971, 6883855, 6663873, 6188194, 4779813, 2755539, 737378, -1049163, -2139162, -2007204, -567505, 1313344, 2429952, 2581963, 2646521, 3139946, 3719373, 4181463, 4672200, 5015059, 4700996, 3604309, 2231414, 1370208, 1380818, 1831104, 2251976, 2679778, 2892497, 2378261, 1218593, -86199, -847561, -987718, -1099682, -1393415, -1456877, -909600, 442111, 2434150, 3958266, 4432193, 4222592, 4092056, 4783612, 6134641, 7300273, 7816434, 7566351, 6281116, 4408917, 3073288, 2743665, 2667150, 2053977, 899470, -217535, -1001141, -1136128, -244838, 926399, 1944124, 2965617, 3546815, 3219721, 2312679, 1355034, 341556]
11280C41556q39851m82693j16994P64870J666934J419571O92857P49699R79636
11271E175585P57134J49751l78068q21272j298202j398816j026192k72736K52527
11262A139711k25982j188619j492586p03903O04770J367739J137082L86865L39799
11253A364876R87006J127553J011885J313285J265070N02028j81262j54720N10200
11244G745921P60424R6969r15267j503252j270359n93214L6777M4309k12185m53735
11234C736388q41039p10856O7212O02818P07876N86661M85861L37161k08100m16455
11224D347527o47635j784575k855586k568351j083678O67765J833306J809917
11216b81310O95065m27248n44230Q7369O50641N61115j05241p75973p25799l06123
$$ y = [341556, -498295, -980988, -1097982, -333112, 1333822, 2753393, 3446250, 4195949, 5175585, 5932719, 6082470, 5704402, 4883130, 3584928, 2186112, 1159920, 887184, 1139711, 913729, -274890, -1767476, -2471379, -1866609, -498870, 638212, 1025077, 1364876, 2351882, 3479435, 4491320, 5804605, 7069675, 7571703, 7390441, 7235721, 7745921, 8506345, 8603314, 7688047, 6184795, 4914436, 4321222, 4357999, 4402308, 4190123, 3736388, 2895349, 2184493, 2251705, 2854523, 3562399, 4149060, 4634921, 4972082, 4763982, 4347527, 3699892, 1915317, -940269, -3508620, -4592298, -3924533, -2091227, -281310, 413755, -13493, -557723, -470354, 180287, 741402, 636161, -139812, -865611, -1171734]
11206a171734n17396j074539r19938l68665j3666K54252K59671k57514r78588
11197d788117j150651n71455M73671J269607J793424K255677K121135R85012p98952
11188A589351j654258j433096q63277j61719J71295r7385k36049j10652k72213
11179c068003p0170Q22182J424923R23819j12348l54132n5192l36534j052207
11170a877662j384928j327337j353590j031163k34426N55331P13265r321p27166
11161f676997o20031K1560L48915K73383L12147M93224M38488L41417L88696M82900
11151d196298O01730P06406R30620J220008R82207J6571j017941j550995j519988
11142c827680j106033o80825j92522O11256J270230J329728R33968M70363P5104
$$ y = [-1171734, -1689130, -2763669, -3683607, -4052272, -4065938, -3811686, -3552015, -3809529, -4788117, -5938768, -6510223, -6036552, -4766945, -2973521, -717844, 1403291, 2388303, 1589351, -64907, -1498003, -2361280, -2522999, -2351704, -2449089, -2685138, -2795790, -3068003, -3138173, -2315991, -891068, 32751, -79597, -433729, -488921, -825455, -1877662, -3262590, -4589927, -5943517, -6974680, -7209106, -6653775, -5940510, -5949831, -6676997, -7297028, -7275468, -6926553, -6653170, -6341023, -5847799, -5409311, -5067894, -4679198, -4196298, -3594568, -2888162, -1957542, -737534, 244673, 261244, -756697, -2307692, -3827680, -4933713, -5614538, -5807060, -5195804, -3925574, -2595846, -1661878, -1191515, -1116411]
11133a116411r648m0271m0647O1272p6350o96554j691081k419239k236253j253845
11123i519027j6446Q73304J122517Q68719P25473J188206J930167K089388J328804
11114E91105J32619q19059q82279M8093N94238J01351k73391j29120J76638P04160
11104B44355J663032K279679J276145r4491l82112k65084k69595m61692o80730
11095C309507m01106M24367J042870Q92947M01014k56974j071582j408744q23510
11086B108789K46189P39133N93172L55567K40745J51069p2406n02083n21448j23061
11076C215666o3055n97687n22573L69168Q67130R31557P00184J28705q56911j420596
11066B751588j038641m69960k12214j4560K32008R2896j62916l36062p51809j062547
$$ y = [-1116411, -1126059, -1166330, -1206977, -1145705, -1222055, -1918609, -3609690, -6028929, -8265182, -9519027, -9535473, -8662169, -7539652, -6670933, -5945460, -4757254, -2827087, -737699, 591105, 723724, -95335, -977614, -929521, -335283, -233932, -507323, -636443, -459805, 244355, 1907387, 4187066, 5463211, 5368720, 4986608, 4721524, 4451929, 3990237, 3309507, 2908401, 3332768, 4375638, 5268585, 5669599, 5412625, 4341043, 2932299, 2108789, 2354978, 3094111, 3687283, 4042850, 4283595, 4434664, 4362258, 3860175, 3338727, 3215666, 3152611, 2554924, 2032351, 2401519, 3268649, 4200206, 4900390, 5029095, 4172184, 2751588, 1712947, 1242987, 1030773, 1016213, 1248221, 1341117, 1178201, 842139, 90330, -972217]
11056i72217o68694K024N68934R02585N87384k53658n69870J59013R86633P14380
11046A456514o25818j631768j579294j108995q47207r03075n38996M27320P82149
11037d569170m8668r3062J209090J639936N78157l90651o37202l37852L27846
11028b321576O08723L20900O1423K74774N15941M49827N42142R67668J130367
11019B550189Q82726K00073q91694j855201j818973n09702O77674O96909O35385
11010E67386J010820J239507P37125m37722j098797m63582O01503J106826Q79194
11001D142260J67331o31112j096060j239317r07421k18169K33022N53452Q60260
10992A864246R62902O56271N37534R48975R54525K06940n70140p61072q65793
$$ y = [-972217, -1640911, -1638887, -1069953, -167368, 420016, 166358, -403512, -244499, 742134, 1456514, 830696, -801072, -2380366, -3489361, -4336568, -5239643, -5778639, -5351319, -4569170, -4617838, -4710900, -3501810, -1861874, -1283717, -1674368, -2311570, -2649422, -2321576, -1712853, -1391953, -1330530, -1055756, -539815, -89988, 452154, 1419822, 2550189, 3432915, 3632988, 2741294, 886093, -932880, -1442582, -764908, -67999, 567386, 1578206, 2817713, 3554838, 3117116, 2018319, 1554737, 2156240, 3263066, 4142260, 4309591, 3678479, 2582419, 1343102, 435681, 217512, 450534, 1003986, 1864246, 2827148, 3483419, 4020953, 4969928, 5924453, 6131393, 5561253, 4800181, 3934388]
10983C934388j230801j250428j049853j185749j380473q16166O13399J717817
10975f47866J489311L19549o40246p19667j11984L98367Q53011R74936N04545
10966B419956k06088j029386j452048j631877k028660j837703q37381j17462K90884
10957f429765Q57615J172057P01649m23175q39604k16452N24110O29444P7630
10948c946491k57300L89390J415051J595410J046586P37699M17421k01103k82084
10939I14579J65318M26168K34324j39508r1259L59345N58366L44716j41196P630
10929B638483Q17179J060313N81508K83121K91035Q1847j43171j04567M9290J84490
10919E739528J6404l20733l75694j49527k1786J13675j77963p94417p10376n28083
$$ y = [3934388, 2703587, 1453159, 403306, -782443, -2162916, -2979082, -2365683, -647866, 841445, 1160994, 520748, -198919, -310903, 87464, 940475, 1915411, 2419956, 2213868, 1184482, -267566, -1899443, -3928103, -5765806, -6603187, -6720649, -6429765, -5572150, -4400093, -3698444, -4121619, -4961223, -5177675, -4653565, -4024121, -3946491, -4203791, -3814401, -2399350, -803940, 242646, 980345, 1397766, 1196663, 914579, 1079897, 1506065, 1740389, 1600881, 1509622, 1868967, 2427333, 2772049, 2630853, 2638483, 3455662, 4515975, 5097483, 5380604, 5671639, 5753486, 5610315, 5505748, 5555038, 5739528, 5755932, 5435199, 5059505, 4909978, 4888192, 5001867, 4823904, 4029487, 3319111, 2791028]
10909B791028q37203j081283q72271l98600J36101L38244l5759o61258j187905
10900a808906j357184j026637k93142K48042L69560M59543K52569m10809m29327
10891c996291M25041J072227J259433J125572M88893Q6721M92116O81725m6532
10882A588905r80414j529599j625432j371586r23299o14665r88402j511096j153031
10873i108619J8893Q94400J223990J554127J525680Q54360O2889k24999O9777
10864c129502L60987N24408P45791P17417J46509j35902K30508K48911M5363J64872
10854h0638L49919K69262K00619L23920L44846J57532j71245m35672l33477K14429
10844H39495N03401O5731n50761p23710r60306j169283j019992p18161m73466
$$ y = [2791028, 1953825, 872542, 271, -398329, -262228, 76016, 40257, -621001, -1808906, -3166090, -4192727, -4485869, -4237827, -3868267, -3408724, -3156155, -3566964, -3996291, -3571250, -2499023, -1239590, -114018, 374875, 461596, 953712, 1635437, 1588905, 608491, -921108, -2546540, -3918126, -4841425, -5456090, -6444492, -7955588, -9108619, -9089726, -8195326, -6971336, -5417209, -3891529, -3037169, -2974280, -3199279, -3129502, -2768515, -2244107, -1498316, -780899, -634390, -770292, -539784, -290873, -245510, -80638, 269281, 538543, 739162, 1063082, 1407928, 1565460, 1394215, 958543, 625066, 839495, 1342896, 1408627, 857866, 134156, -826150, -1995433, -3015425, -3733586, -4207052]
10835d207052k27699K97762P84827R11149O25779J86721Q1943N35191R19680N71492
10825D79793l82250j050444r76674k07801N65339N57676m7702n50853j36541P13427
10815a036030J447321K047662J879671J137968O77237M19674L60455M00516K32727
10806G567201k44608q58869j186528j209572o93576K64232J045720J160868K71050
10797F115918r41357j701098k284906k629192k309260j479255l69318N19145P25913
10788d353410Q01867Q52071Q40020J012398J266954J073900L24831j91406p02861
10779I24364j474783j307621k36772M17875M14087K43156J11147r80J76240N22880
10769b10407O29258J012036J215186O7482j580294k251485k204956j797284o97864
$$ y = [-4207052, -4434751, -4136989, -3352162, -2441013, -1815234, -1628513, -1546570, -1011379, -91699, 479793, 97543, -952901, -1929575, -2137376, -1572037, -1014361, -1062063, -1612916, -1749457, -1036030, 411291, 2458953, 4338624, 5476592, 6153829, 6573503, 6933958, 7334474, 7567201, 7322593, 6463724, 5277196, 4067624, 3374048, 3638280, 4684000, 5844868, 6115918, 5174561, 3473463, 1188557, -1440635, -3749895, -5229150, -5598468, -5079323, -4353410, -3551543, -2699472, -1859452, -847054, 419900, 1493800, 1818631, 1627225, 924364, -550419, -1858040, -2094812, -1676937, -1262850, -1019694, -908547, -909527, -733287, -210407, 418851, 1430887, 2646073, 2713555, 1133261, -1118224, -3323180, -5120464, -5818328]
10760e818328O29920J372065J460593J206233M62098k52846l5338M57449M20957
10751i7197L60512O72875P36748L68331K20934J000649J731785J144526j65433
10742E973730r89241j172077j006924o61407n93287j043483j688852j726666j011872
10733c920079m2053P91031J476911K041184K336999K138873J339771L61486n35749
10724E988374j079458j191244j174579p13324k53233l16832j55001J68404k85125
10715I87982j243504j459241j213134j166344q01609j88088M40226J267123J536155
10706a840434J047852O72585K81193l56273o63033n84774o46209n42546K42638
10697b389001J111936J696246J824252J285300L51271o39000j745451k271845
$$ y = [-5818328, -5188408, -3816343, -2355750, -1149517, -687419, -940265, -975603, -518154, -97197, 263315, 936190, 1672938, 2041269, 2262203, 3262852, 4994637, 6139163, 5973730, 4984489, 3812412, 2805488, 2144081, 1550794, 507311, -1181541, -2908207, -3920079, -3962132, -3171101, -1694190, 346994, 2683993, 4822866, 6162637, 6524123, 5988374, 4908916, 3717672, 2543093, 1829769, 1576536, 1259704, 1104703, 1273107, 987982, -255522, -1714763, -2927897, -4094241, -4895850, -5083938, -4643712, -3376589, -1840434, -792582, -119997, 161196, -195077, -858110, -1442884, -2089093, -2631639, -2389001, -1277065, 419181, 2243433, 3528733, 3880004, 3241004, 1495553, -776292]
10689g76292j504817l95255J16638N4326k58100m47338n09929k55363M40299Q32582
10679b703249O90594N24196N58711N53726M81505j27670j220990k319371k766886
10670f329434k083753p89173L10520P23289O86396M40632Q2672j8944N82172J316938
10660e078685J617897J343994Q03946M70041K50793n6134q67884j955371k179590
10651e650993j038631L88767Q87590N87345M31726N26631L83316k52576j012075
10642d748900j322487j217638n70740M51621J148157J408308J299555R59240O53703
10633a939181K61349j36501k00646K1247O7441L8257L78861O97194L93360k04459
10623f23078k38785J38712J30219r1354j3074K28278L75668L70732O5389k67362
$$ y = [-776292, -2281109, -2676364, -2559726, -2505400, -2763500, -3210838, -3720767, -3976130, -3535831, -2703249, -2012655, -1488459, -929748, -376022, 105483, -22187, -1243177, -3562548, -6329434, -8413187, -9202360, -8891840, -8168551, -7482155, -7041523, -6958851, -6977795, -6395623, -5078685, -3460788, -2116794, -1312848, -842807, -592014, -648148, -1516032, -3471403, -5650993, -6689624, -6300857, -5413267, -4825922, -4394196, -3867565, -3484249, -3736825, -4748900, -6071387, -7289025, -7859765, -7408144, -6259987, -4851679, -3552124, -2592884, -1939181, -1677832, -1814333, -2014979, -1993732, -1926291, -1888034, -1509173, -811979, -418619, -623078, -861863, -723151, -592932, -684286, -697360, -469082, -93414, 277318, 342707, 75345]
10613G5345n10445o70774q28671j419095j639016j196605m46712K99906O55995
10604e680072O32449M59614L80981P18063J233384R06171j38006k41242J005409
10595g23249J964926J477007K52000j092002j873694j063186J62078N73080N13381
10586A90341M47301P35976J492967J675071Q92561l1428m74884o95940j260540
10577B971425j839928j868757j217174n59542k32210j07791k51631l75496m70414
10568c951518l01859K5249J49915j33765o76045r81701p99734m91204k84654q9828
10558g535144n7712j02873K03297Q06606J286139J327249R69324N26550j39986
10549b716550j054814j601509j874093k051579j610981l41036R84570J375644
$$ y = [75345, -435100, -1105874, -1934545, -3353640, -4992656, -6189261, -6635973, -6336067, -5680072, -5047623, -4588009, -4207028, -3488965, -2255581, -1349410, -1487416, -1728658, -723249, 1241677, 2718684, 2970684, 1878682, 4988, -1058198, -896120, -323040, 190341, 637642, 1373618, 2866585, 4541656, 5434217, 5402789, 4927905, 4231965, 2971425, 1131497, -737260, -1954434, -2513976, -2746186, -2853977, -3105608, -3481104, -3951518, -4253377, -4228128, -4078213, -4211978, -4888023, -5869724, -6669458, -7160662, -7445316, -7535144, -7592856, -7695729, -7492432, -6685826, -5399687, -4072438, -3103114, -2576564, -2716550, -3771364, -5372873, -7246966, -9298545, -10909526, -11250562, -10265992, -8890348]
10541h890348J060284O83186P18455J073737Q60279j02489r29626j047536n77582
10532g151640k66740l23367k2358M72268J245892J973216J492723j89840j655473
10523d425319j747963r49572k22938K20628N29207N86319M39606J71672j64045
10514e562405n2191P31046J683314J751488P30645l34348q54940r03797o15787
10505c426975k21555l45758p55389q22820n98857j79356J00452k01519p83204
10496g234981r17085k81306L69039O38719J239609K166486K158657J299252N96842
10487C5232M47370N48889N27003K34331k47057n19350p17080r65985r86277j227828
10477b870752j913163j706263l33262P64507J159356J257659J394435J109896
$$ y = [-8890348, -7830064, -7146878, -6428423, -5354686, -4494407, -4596896, -5526522, -6574058, -7151640, -7418380, -7741747, -7764105, -7291837, -6045945, -4072729, -2580006, -2769846, -4425319, -6173282, -7122854, -7345792, -7125164, -6595957, -6009638, -5570032, -5398360, -5562405, -5614596, -4883550, -3200236, -1448748, -718103, -1052451, -1907391, -2811188, -3426975, -3648530, -3994288, -4749677, -5572497, -6171354, -6350710, -6250258, -6451777, -7234981, -8152066, -8433372, -8064333, -7425614, -6186005, -4019519, -1860862, -561610, 35232, 482602, 1031491, 1558494, 1792825, 1545768, 1026418, 309338, -656647, -1642924, -2870752, -4783915, -6490178, -6823440, -6058933, -4899577, -3641918, -2247483, -1137587]
10469a137587K33487k50740L4309J69420j42762p8162N11776J219458J547565
10460B106764J106211J86893o12534q40499o37340m15150l57942j46093M40836
10451H31146O64538k13642j159414j044967j94870N03640Q33790O57841J83306
10442A061368k12765k40820J11286P10733J163565R97812M14118K1073L4545j5421
10432D045494m79412r80387j137115o70423R7442O24159P37318N22685K68051
10423C027812J03701j64128j59094K82189M84961J55981k46136m54014o19173
10414B412099l71842J24715L18108L55505N79543J133765J286155R03894O63066
10405G405008Q61852Q68664J159p90212p03246j75723K22822L72643M07873r096
$$ y = [-1137587, -904100, -1154840, -1120531, -951111, -1093873, -1172035, -660259, 559199, 2106764, 3212975, 3399868, 2787334, 1946835, 1309495, 894345, 536403, 390310, 831146, 1495684, 1282042, 122628, -922339, -1117209, -613569, 220221, 878062, 1061368, 848603, 607783, 719069, 1429802, 2593367, 3591179, 4005297, 4026370, 4060915, 4045494, 3566082, 2585695, 1448580, 778157, 875599, 1499758, 2237076, 2759761, 3027812, 3131513, 2967385, 2808291, 3090480, 3575441, 3731422, 3485286, 3031272, 2412099, 2040257, 2164972, 2483080, 2838585, 3418128, 4551893, 5838048, 6741942, 7405008, 8266860, 9135524, 9136683, 8346471, 7643225, 7467502, 7690324, 8062967, 8470840, 8461744]
10395H461744r52859j965505k702983k979825k738607j897528q35346k38925J63230
10386e686604J146363J920341J906192J154203J32956m81192m82066m31502p29311
10377a550620p42091p89565j359147j185562k8937J076776J779191K264441K352516
10368A817002J723181N98951j41817J61695P25738P08237L08836j19956l83478
10359E398389r75536j626516r56341Q13638K223686K278198R06505l83191p38105
10350F940727p50126q10188p09966m08548J33294R40884J390822J410128R97160
10341I134187K43996k83435o65225j027315j249673j029671m01668j88543o36455
10332C896198j298487j650052j537038p88657K40497O10248L22701M6107l3111
$$ y = [8461744, 7508885, 5543380, 2840397, -139428, -2878035, -4775563, -5610909, -5849834, -5686604, -4540241, -2619900, -713708, 440495, 573451, 92259, -389807, -821309, -1550620, -2292711, -3082276, -4441423, -5626985, -5655922, -4579146, -2799955, -535514, 1817002, 3540183, 4139134, 3997317, 4159012, 4884750, 5592987, 5901823, 5781867, 5398389, 4422853, 2796337, 1839996, 2653634, 4877320, 7155518, 8062023, 7678832, 6940727, 6190601, 5380413, 4670447, 4261899, 4395193, 5336077, 6726899, 8137027, 9134187, 9378183, 9094748, 8429523, 7402208, 6152535, 5122864, 4721196, 4532653, 3896198, 2597711, 947659, -589379, -1378036, -1137539, -527291, -204590, -158483, -191594]
10323a91594j52281n86739q52104q25929n35389M03661J469901J174584k47528
10314c43418q22130o08862o35377p97721n82364m49427q77404j065713p6076J389332
10304d869160K312390K522416K367671J951983J239980P36546O66982O89892L89714
10295H008414q8115m60490j129484j855255j891061j596153j602694j275689q7019
10286a977546J133084J472103P24724j90586m8264P50615J125963R30226Q03111
10277D723430M96298j26024n34542o88278n06469J85672P77257N79174k37896
10268D668622o96364p77509j014946j157536j142987j273048j414786j191624
10260d000178j12536J271672J515991J072293Q64342K13655p83728j212996o43657
$$ y = [-191594, -343875, -930614, -1782718, -2608647, -3144036, -2740375, -1270474, -95890, -343418, -1165548, -1774410, -2409787, -3207508, -3789872, -4239299, -5116703, -6182416, -6258492, -4869160, -2556770, -34354, 2333317, 4285300, 5525280, 6261826, 6928808, 7618700, 8008414, 7920299, 7459809, 6330325, 4475070, 2584009, 987856, -614838, -1890527, -1977546, -844462, 627641, 1352365, 1161779, 1113515, 1864130, 2990093, 3920319, 4723430, 5219728, 5093704, 4559162, 3870884, 3364415, 3550087, 4327344, 4906518, 4668622, 3972258, 3194749, 2179803, 1022267, -120720, -1393768, -2808554, -4000178, -4112714, -2841042, -1325051, -252758, 611584, 825239, 41511, -1171485, -1815142]
10251a815142J75358M15951N91913J077311J105981L06691n29081r90251j562542
10242a223811j784073j148604l47258j60697l27715N9072R21483J349115J079076
10233a583412P79872Q89031R88666M27060o02075j647976k155713j361529m3655
10224d309731M21717K47404J4898k00562N097N16468M43184j92306m10938j45092
$$ y = [-1815142, -1639784, -1223833, -631920, 445391, 1551372, 1858063, 1328982, 338731, -1223811, -3007884, -4156488, -4503746, -4664443, -4992158, -4933086, -4011603, -2662488, -1583412, -803540, 85491, 1074157, 1501217, 899142, -748834, -2904547, -4266076, -4309731, -3888014, -3640610, -3625712, -3826274, -3821177, -3304709, -2861525, -3053831, -3464769, -3609861]
$$ [...]
##END NTUPLES=NMR SPECTRUM
##END=
