##TITLE=C13_Ser 5174
 CDCl3,1200 sc

 7.7.2023
##JCAMPDX= 6.0         $$ Bruker NMR JCAMP-DX V2.0
##DATA TYPE= NMR SPECTRUM
##DATA CLASS= NTUPLES
##ORIGIN= UXNMR, Bruker Analytische Messtechnik GmbH
##OWNER= root
$$ XWIN-NMR		Version 3.5
$$ Fri Jul  7 16:15:43 2023 Russian Standard Time (UT+4h)  she@DPX200
##.OBSERVE FREQUENCY= 50.327896
##.OBSERVE NUCLEUS= ^13C
##.ACQUISITION MODE= SIMULTANEOUS
##.ACQUISITION SCHEME= undefined
##.AVERAGES= 1201
##.DIGITISER RES= 17
##SPECTROMETER/DATA SYSTEM= spect
##.PULSE SEQUENCE= zgpg30
##.SOLVENT NAME= DMSO
##.SHIFT REFERENCE= (INTERNAL, DMSO, 0, 222.624)
##AUDIT TRAIL= $$ (NUMBER, WHEN, WHO, WHERE, WHAT)
$$ ##TITLE= Audit trail, XWIN-NMR		Version 3.5
$$ ##JCAMPDX= 5.01
$$ ##ORIGIN= Bruker BioSpin GmbH
$$ ##OWNER= she
$$ F:/spectra/data/she/nmr/c13/1/pdata/1/auditp.txt
$$ ##AUDIT TRAIL=  $$ (NUMBER, WHEN, WHO, WHERE, WHAT)
(   1,<2023-07-07 16:14:31.84 +0400>,<she>,<DPX200>,
      <created by zg, POWCHK disabled, PULCHK disabled
       terminated by command 'halt'
       configuration hash MD5:
       00 E9 B6 7A A2 85 ED C7 34 08 36 98 17 FE 4E 26
       data hash MD5: 32K
       A2 83 C6 A9 86 ED 81 FB 2C E0 CD 53 7E 1B 26 C4>)
(   2,<2023-07-07 16:14:34.10 +0400>,<she>,<DPX200>,
      <Start of raw data processing
       efp BC_mod = 2 LB = 2 FT_mod = 6 PKNL = 1 PHC0 = -382.7341 PHC1 = 22.33318 SI = 32K 
       data hash MD5: 32K
       4C 40 98 39 A9 71 38 DB 01 DC D6 F7 00 1B 36 33>)
(   3,<2023-07-07 16:14:36.84 +0400>,<she>,<DPX200>,
      <abs ABSG = 5 
       data hash MD5: 32K
       B9 EE E4 10 9F B6 C2 E3 25 79 7D 84 2F 06 18 32>)
(   4,<2023-07-07 16:15:08.04 +0400>,<she>,<DPX200>,
      <pk PHC0 = 3.938707 PHC1 = -10.4 
       data hash MD5: 32K
       FD 61 8A 81 F9 2A D9 BE FA 00 78 8A 04 8D 51 83>)
(   5,<2023-07-07 16:15:11.84 +0400>,<she>,<DPX200>,
      <abs ABSG = 5 
       data hash MD5: 32K
       EF 60 4A 97 14 73 85 67 A4 1E 5B E5 1E 17 20 46>)
$$ ##END=
$$ 
$$ hash MD5
$$ 0B A6 87 07 F7 45 8B A9 0D CE 58 8E 5F 4A 80 AF
##$RELAX= 
##$RELAX= 
##$RELAX= 
##$RELAX= 
##$RELAX= 
##$RELAX= 
##$RELAX= 
##$RELAX= 
$$ Bruker specific parameters
$$ --------------------------
##$DU= <F:/spectra>
##$EXPNO= 1
##$NAME= <c13>
##$PROCNO= 1
##$TYPE= <nmr>
##$USER= <she>
##$AMP= (0..31)
100 100 100 100 100 100 100 100 100 100 100 100 100 100 100 100 100 100 
100 100 100 100 100 100 100 100 100 100 100 100 100 100 
##$AQSEQ= 0
##$AQ_mod= 1
##$AUNM= <au_zg>
##$AUTOPOS= <>
##$BF1= 50.322709
##$BF2= 200.13
##$BF3= 50.322709
##$BF4= 500.13
##$BF5= 500.13
##$BF6= 500.13
##$BF7= 500.13
##$BF8= 500.13
##$BYTORDA= 1
##$CFDGTYP= 0
##$CFRGTYP= 5
##$CHEMSTR= <none>
##$CNST= (0..31)
1 1 145 1 1 1 1 1 1 1 1 1 1 1 1 1 1 1 1 1 1 1 1 1 1 1 1 1 1 1 1 1 
##$CPDPRG= <waltz16>
##$CPDPRG1= <>
##$CPDPRG2= <waltz16>
##$CPDPRG3= <>
##$CPDPRG4= <mlev>
##$CPDPRG5= <mlev>
##$CPDPRG6= <mlev>
##$CPDPRG7= <mlev>
##$CPDPRG8= <mlev>
##$CPDPRGB= <>
##$CPDPRGT= <>
##$D= (0..31)
$$ [...]
##$SUBNAM4= <"">
##$SUBNAM5= <"">
##$SUBNAM6= <"">
##$SUBNAM7= <"">
##$SUBNAM8= <"">
##$SUBNAM9= <"">
##$SW= 239.972175391363
##$SWIBOX= (0..15)
0 1 3 0 0 0 0 0 0 0 0 0 0 0 0 0 
##$SW_h= 12077.2946859903
##$TD= 32768
##$TD0= 1
##$TE= 0
##$TE2= 300
##$TE3= 300
##$TEG= 300
##$TL= (0..7)
120 120 120 120 120 120 120 120 
##$TP= (0..7)
150 150 150 150 150 150 150 150 
##$TP07= 0
##$TPNAME0= <>
##$TPNAME1= <>
##$TPNAME2= <>
##$TPNAME3= <>
##$TPNAME4= <>
##$TPNAME5= <>
##$TPNAME6= <>
##$TPNAME7= <>
##$TPOAL= (0..7)
0.5 0.5 0.5 0.5 0.5 0.5 0.5 0.5 
##$TPOFFS= (0..7)
0 0 0 0 0 0 0 0 
##$TUNHIN= 0
##$TUNHOUT= 0
##$TUNXOUT= 0
##$USERA1= <user>
##$USERA2= <user>
##$USERA3= <user>
##$USERA4= <user>
##$USERA5= <user>
##$V9= 5
##$VALIST= <valist>
##$VCLIST= <CCCCCCCCCCCCCCC>
##$VD= 0
##$VDLIST= <DDDDDDDDDDDDDDD>
##$VPLIST= <PPPPPPPPPPPPPPP>
##$VTLIST= <TTTTTTTTTTTTTTT>
##$WBST= 1024
##$WBSW= 4
##$XGAIN= (0..3)
0 0 0 0 
##$XL= 0
##$YL= 0
##$YMAX_a= 8468126
##$YMIN_a= -3004198
##$ZGOPTNS= <>
##$ZL1= 120
##$ZL2= 120
##$ZL3= 120
##$ZL4= 120
##$ABSF1= 222.624
##$ABSF2= -17.3728
##$ABSG= 5
##$ABSL= 3
##$ALPHA= 0
##$AQORDER= 0
##$ASSFAC= 0
##$ASSFACI= 0
##$ASSFACX= 0
##$ASSWID= 0
##$AUNMP= <proc_1d>
##$AZFE= 0.1
##$AZFW= 0.5
##$BCFW= 0
##$BC_mod= 2
##$BYTORDP= 0
##$COROFFS= 0
##$CY= -3
##$DATMOD= 1
##$DC= 0
##$DFILT= <>
##$DTYPP= 0
##$F1P= 0
##$F2P= 0
##$FCOR= 0.5
##$FTSIZE= 32768
##$FT_mod= 6
##$GAMMA= 0
##$GB= 0
##$INTBC= 1
##$INTSCL= 4.134877e-10
##$ISEN= 128
##$LB= 2
##$LEV0= 0
##$LPBIN= 0
##$MAXI= 10000
##$MC2= 0
##$MEAN= 0
##$ME_mod= 0
##$MI= 0.1934396
##$NCOEF= 0
##$NC_proc= -2
##$NLEV= 6
##$NOISF1= 120.0001
##$NOISF2= 80.00006
##$NSP= 0
##$NTH_PI= 0
##$NZP= 0
##$OFFSET= 222.624
##$PC= 1.4
##$PHC0= -378.7954
##$PHC1= 11.93318
##$PH_mod= 1
##$PKNL= yes
##$PPARMOD= 0
##$PSCAL= 0
##$PSIGN= 0
##$REVERSE= no
##$SF= 50.3227315983092
##$SI= 32768
##$SIGF1= 140
##$SIGF2= 120
##$SINO= 11.81781
##$SIOLD= 32768
##$SREGLST= <13C.CDCl3>
##$SSB= 0
##$STSI= 32768
##$STSR= 0
##$SW_p= 12077.2946859903
##$SYMM= 0
##$S_DEV= 0
##$TDeff= 32768
##$TDoff= 0
##$TI= <>
##$TILT= no
##$TM1= 0
##$TM2= 0
##$TOPLEV= 0
##$USERP1= <user>
##$USERP2= <user>
##$USERP3= <user>
##$USERP4= <user>
##$USERP5= <user>
##$WDW= 1
##$XDIM= 32768
##$YMAX_p= 277240554
##$YMIN_p= -6637357
$$ End of Bruker specific parameters
$$ ---------------------------------
##NTUPLES= NMR SPECTRUM
##VAR_NAME=  FREQUENCY,     SPECTRUM/REAL,   SPECTRUM/IMAG
##SYMBOL=    X,             R,               I
##VAR_TYPE=  INDEPENDENT,   DEPENDENT,       DEPENDENT
##VAR_FORM=  AFFN,          ASDF,            ASDF
##VAR_DIM=   32768,         32768,           32768
##UNITS=     HZ,            ARBITRARY UNITS, ARBITRARY UNITS
##FACTOR=    0.368581032318806, 1,           1
##FIRST=     11203.0474430531, 0,            0
##LAST=      -874.247242937185, 0,           0
##MIN=       -874.247242937185, -6637357,    0
##MAX=       11203.0474430531, 277240554,    0
$$ Real data points
##PAGE= N=1
##DATA TABLE= (X++(R..R)), XYDATA
$$ [...]
17868 703299 750954 823289 574288 -86553 -828618 -1261035 -1255817 -1106580 -1001222 -984291
17858 -984291 -1097292 -1293533 -1586767 -2030395 -2583642 -3203493 -3753057 -4067725 -4125327 -4001873
17848 -4001873 -3861845 -3871390 -3985086 -3973654 -3654539 -2966718 -2198778 -1716675 -1643796 -1813625
17838 -1813625 -1810923 -1222287 -41548 1213866 1921576 1818091 1164747 460427 -72273
17829 -72273 -624984 -1136548 -1243305 -996592 -672652 -427254 -417276 -596217 -746328 -644654
17819 -644654 -197473 556813 1105682 997182 383995 -288113 -753184 -1147754 -1502641 -1628607
17809 -1628607 -1467213 -1143755 -878024 -728676 -524248 -352361 -391214 -496662 -368023 -27157
17799 -27157 263514 520622 886306 1075027 855261 584804 450771 349649 334496 379217
17789 379217 308026 206010 349956 833492 1448097 1785392 1693774 1412681 1082734 677409
17779 677409 213379 -286217 -699677 -1043095 -1434015 -1817673 -2061061 -2058715 -1913513 -1651774
17769 -1651774 -1164502 -519443 80810 423223 428493 372200 685707 1261570 1692500 1746677
17759 1746677 1299166 569954 -56709 -538983 -1006624 -1505909 -1929964 -2133509 -2289558
17750 -2289558 -2697457 -3200505 -3422572 -3261386 -2814828 -2207326 -1401847 -536126 -57032
17741 -57032 93461 161077 178864 273794 344078 310369 189315 92244 115179 229161 324462
17730 324462 374156 460280 466763 452354 655503 1068809 1506254 1687023 1432470 832557
17720 832557 266518 6387 -100851 -246484 -266250 -68770 197910 451386 662062 757710
17710 757710 615813 162234 -517546 -1114424 -1466370 -1579027 -1445409 -1123542 -870352 -858970
17700 -858970 -1034081 -1251640 -1300162 -1096106 -782659 -602078 -710292 -1115659 -1579953 -1827159
17690 -1827159 -1723088 -1232688 -510491 147035 448967 293112 -155090 -513126 -678250
17681 -678250 -574393 -119189 464796 901595 1271977 1783049 2210286 2262712 2004179 1550526
17671 1550526 893195 216676 -252569 -554370 -832389 -1207807 -1580234 -1678679 -1547419 -1581017
17661 -1581017 -1853347 -2094764 -2039871 -1593388 -1006366 -481893 78013 829211 1468057 1447775
17651 1447775 661210 -379013 -1028140 -1212381 -1085115 -809835 -727984 -992129 -1423682
17642 -1423682 -1802148 -1921264 -1627850 -1003397 -340121 -51089 -486862 -1228322 -1529776
17633 -1529776 -1233451 -755562 -375247 -25230 396243 746846 727415 484877 422241 718186
17623 718186 1129309 1230700 838409 -1972 -962491 -1696501 -2066838 -2114152 -2181753 -2358687
17613 -2358687 -2211655 -1547333 -619704 242179 863542 1235042 1481992 1668539 1796316
17604 1796316 1915684 1973805 1700852 1082730 561157 328295 192877 18987 -234770 -646352
17594 -646352 -1176125 -1753767 -2403985 -3082121 -3461067 -3383925 -3074559 -2677632 -2144660 -1677345
17584 -1677345 -1641069 -2071685 -2608912 -2886841 -3035532 -3420454 -3805593 -3936537 -3970827 -3975182
17574 -3975182 -3805428 -3403728 -2824389 -2360381 -2139962 -1856822 -1386290 -790553 -41880
17565 -41880 790815 1403724 1418535 744695 -163743 -863625 -1296203 -1420360 -1209195 -896523
17555 -896523 -808258 -1003258 -1274793 -1577856 -1866656 -2007286 -1919370 -1527580 -1006595 -508282
17545 -508282 8274 349776 184643 -449707 -1074068 -1307003 -1249370 -1116504 -942927 -772579
17535 -772579 -855922 -1334387 -1881781 -2221143 -2297040 -2202580 -2164161 -2259651 -2436405 -2572976
17525 -2572976 -2679685 -2760171 -2711138 -2574652 -2403388 -2181273 -1815275 -1237997 -596614 -225562
17515 -225562 -217006 -258742 -210744 -339090 -570248 -457740 -118299 16456 -37238 31987 213376
17504 213376 224967 50753 -188336 -368840 -457176 -443667 -194542 245846 480822 300717
17494 300717 -104153 -407682 -482940 -438625 -305566 -20977 542530 1272096 1933970 2448175
17484 2448175 2811500 3078667 3369250 3556630 3488852 3179293 2707960 2165385 1531383 893551
17474 893551 485964 603327 1316720 2417995 3657736 4707799 5266860 5346666 5122293
17465 5122293 4796844 4402458 3971110 3551132 2905018 1964856 955379 40725 -585420
17456 -585420 -671531 -322875 214407 927445 1660718 2310384 2763302 2707159 2209120 1538934
17446 1538934 770344 -12645 -658512 -1101407 -1336372 -1315462 -1124583 -1021482 -1156470 -1447591
17436 -1447591 -1735214 -2000354 -2314223 -2745684 -3194094 -3597721 -3971545 -4096956 -3808534
17427 -3808534 -3151528 -2240885 -1283023 -495651 -60593 -10331 -162769 -287593 -155597 276784
17417 276784 776317 1057396 1090076 1004214 794536 239603 -640036 -1504409 -2039720 -2193681
17407 -2193681 -2187798 -2269189 -2284469 -1798790 -869570 62523 884733 1573492 2153223 2694269
17397 2694269 3134533 3424702 3334138 2894911 2482160 2439183 2711609 3037480 3269703 3247545
17387 3247545 2879292 2329786 1670009 823676 -115859 -808194 -983135 -830739 -777482 -859486
17377 -859486 -787404 -489840 -112835 121294 167008 196023 299772 444831 497162 421030
17367 421030 310420 180869 11898 -311763 -910799 -1779310 -2605561 -2837723 -2314110 -1389917
17357 -1389917 -406559 405278 947326 1256123 1517723 1865074 2227974 2476483 2597480
17348 2597480 2872159 3377396 3787086 3860014 3653997 3258920 2614081 1933859 1574688 1400497
17338 1400497 1083160 647043 232405 -87720 -143734 -89432 -334270 -796200 -1106032 -1140887
17328 -1140887 -1071843 -973617 -656685 -65467 540452 882903 970907 1050188 1296393 1567280
17318 1567280 1658632 1480169 1140921 828398 567796 256125 -209262 -712520 -913571 -681213
17308 -681213 -205301 236261 455531 396728 34265 -562371 -1012843 -900165 -322342 408213
17298 408213 989249 1160013 914698 285691 -522712 -1151933 -1484285 -1553534 -1553946 -1558025 -1537404
17287 -1537404 -1510890 -1319303 -815858 -75978 645373 1127399 1303768 1120627 665537 287251
17277 287251 272496 520086 903223 1332587 1589737 1529535 1149219 623018 99228 -391101
17267 -391101 -627738 -364795 126671 306583 -164123 -1013537 -1731072 -2134521 -2189818 -1945503
17257 -1945503 -1495990 -1049357 -791668 -695577 -678669 -625037 -437364 -301536 -348114 -387523
17247 -387523 -342157 -278306 -273211 -405485 -618758 -837878 -923161 -823473 -629093 -489143 -617164
17236 -617164 -965097 -1232065 -1195474 -965943 -962846 -1430150 -2006053 -2279986 -2167531 -1731980
17226 -1731980 -1218810 -942163 -936892 -1070685 -1306015 -1617723 -1886580 -1901626 -1560648 -1161865
17216 -1161865 -952767 -729840 -365829 116774 654179 1170358 1683485 2231657 2632907
17207 2632907 2585087 2048744 1370149 963890 867952 903593 922442 970445 1100081 1090154 979977
17196 979977 1235517 1844501 2160523 1845602 1319031 903697 680909 772431 1089165 1313287
17186 1313287 1104961 592233 217294 78153 92143 232804 361549 470172 587570 642019
17176 642019 603914 449856 106445 -380760 -988897 -1675609 -2017980 -1789332 -1323381 -905801
17166 -905801 -408198 492245 1680067 2775693 3684091 4495220 5195135 5556241 5413559
17157 5413559 4836195 4053612 3292298 2810895 2608168 2506192 2442317 2265262 1850128 1229950
17147 1229950 765334 701899 947396 1399820 1801450 1884784 1589963 902537 5553 -760104
17137 -760104 -1140191 -1046430 -658722 -421998 -554718 -848262 -1030177 -1122276 -1313975 -1484156
17127 -1484156 -1411554 -1152560 -924940 -797846 -552751 -161595 61516 -273629 -1061764 -1705469
17117 -1705469 -2076902 -2423311 -2762672 -2855139 -2652039 -2203999 -1613243 -1153564 -941075 -798144
17107 -798144 -494447 -253728 -415003 -955071 -1598527 -2091127 -2248850 -2005512 -1584239 -1166561
17097 -1166561 -867939 -906891 -1492103 -2503012 -3335436 -3497298 -3213052 -3044798 -3120580 -3133575
17087 -3133575 -2953493 -2702611 -2549507 -2607764 -2755221 -2713208 -2381105 -1840007 -1348196 -1008633
17077 -1008633 -764720 -637097 -767802 -1146543 -1621361 -2012143 -2176983 -1918815 -1135311
17068 -1135311 -72525 969732 1885415 2498496 2603913 2391665 2141101 1879561 1516915
17059 1516915 1084248 626844 121923 -426941 -970127 -1423562 -1702451 -1907033 -2258116
17050 -2258116 -2536726 -2370618 -1869683 -1271050 -614623 47466 499784 727371 808185 705264
17040 705264 520155 249025 -199436 -655129 -864323 -846905 -833755 -784703 -619423 -504718
17030 -504718 -475944 -471707 -405022 -188755 115514 387482 435625 187649 -282355 -899106
17020 -899106 -1537098 -2008373 -2305122 -2462995 -2450386 -2141774 -1479561 -578411 206158 546601
17010 546601 500149 321157 92466 -198483 -546655 -811784 -831305 -903840 -1345874 -2142079
17000 -2142079 -3016884 -3674699 -3963107 -3970073 -3990133 -4006324 -3826236 -3551880 -3452011 -3523859
16990 -3523859 -3733267 -4109586 -4513957 -4887700 -5150277 -5121123 -4801808 -4295002 -3556712 -2610397
16980 -2610397 -1582377 -716134 -251914 -151521 -178468 -178835 -439693 -1253182 -2314471 -3195967
16970 -3195967 -3686009 -3829542 -3790457 -3531497 -3008448 -2444369 -2085990 -1728024 -1232103 -873897
16960 -873897 -761228 -856115 -1059254 -1144120 -863463 -229932 451532 799410 733176 419679
16950 419679 -11006 -390377 -601476 -890416 -1411761 -1879897 -2003678 -1739561 -1269309 -944540
16940 -944540 -908915 -862017 -722783 -718626 -779925 -752277 -687344 -496820 -134189 62597 -182074
16929 -182074 -740733 -1359375 -2088528 -2834164 -3248100 -3375375 -3492346 -3650476 -3734351 -3675870
16919 -3675870 -3302635 -2659854 -2037803 -1599587 -1444472 -1432594 -1484650 -1737725 -2020036 -1984081
16909 -1984081 -1611412 -1394666 -1599834 -1914461 -2138605 -2154001 -1861948 -1285248 -588808 -259614
16899 -259614 -583950 -1161261 -1486244 -1394674 -1021343 -749531 -898659 -1377959 -1950465 -2324171
16889 -2324171 -2329996 -2164515 -2076553 -1940293 -1597954 -1388861 -1704621 -2370499 -2843385 -2922002
16879 -2922002 -2653338 -2163462 -1679930 -1318517 -895288 -335372 192966 501926 555366 509041
16869 509041 609679 881179 1143085 1277187 1039076 508481 207099 383284 863344 1328087
16859 1328087 1576133 1599834 1499647 1541955 1831279 2161501 2338478 2286956 2093898 1905958
16849 1905958 1725035 1572910 1417397 902430 -152200 -1264598 -1892621 -2068823 -2050267
16840 -2050267 -1943239 -1740673 -1330104 -679189 -27132 526244 1013632 1202282 764909
16831 764909 -60001 -873457 -1653047 -2295333 -2530029 -2377630 -2063736 -1646140 -1110920 -513449
16821 -513449 -42439 214379 461172 648723 614238 347106 -61441 -348906 -388727 -344814
16811 -344814 -362525 -483505 -712332 -906476 -851226 -649806 -425945 85245 901889 1600269
16801 1600269 1772914 1464019 1127849 1012959 1013183 1118751 1193551 881929 86125 -841425
16791 -841425 -1397870 -1579358 -1824853 -2291270 -2593900 -2416566 -1977224 -1653744 -1354297 -868917
16781 -868917 -414918 -319640 -519454 -831914 -1248181 -1622479 -1675702 -1349453 -906408 -449327
16771 -449327 -179502 -313795 -629406 -992252 -1309214 -1337985 -1187498 -1372928 -1938479 -2503161
16761 -2503161 -2883369 -3108609 -3178771 -3011668 -2677105 -2345483 -1934050 -1386191 -727963 164629
16751 164629 1134449 1854560 2035105 1714275 1320924 1050186 756009 240550 -595380 -1617736
16741 -1617736 -2267184 -2144539 -1520206 -928151 -649925 -410177 167559 1064610 2052573
16732 2052573 2943687 3618273 4008747 4027666 3866666 3779152 3660365 3530078 3516283 3569202
16722 3569202 3593787 3565329 3348296 2652431 1387154 25866 -889102 -1307120 -1519319
16713 -1519319 -1767531 -2045789 -2224123 -2139704 -1976964 -1937371 -1860425 -1694769 -1706199 -1951729
16703 -1951729 -2248504 -2322236 -2032150 -1728574 -1806576 -2035930 -2112924 -2037965 -1891772 -1630491
16693 -1630491 -1306648 -1261226 -1721978 -2480532 -3155542 -3530398 -3498873 -2985581 -2106046 -1253468
16683 -1253468 -818699 -961803 -1552422 -2278003 -2876609 -3235509 -3331790 -3142630 -2635200 -1913453
16673 -1913453 -1094739 -419363 -151516 -177060 -111295 313384 896567 1245685 1242690 908458
16663 908458 361757 -213562 -807769 -1354849 -1662683 -1587193 -1135418 -439974 246953 593722
16653 593722 629143 641753 899869 1345712 1728184 2022465 2049233 1743207 1349545 1102631
16643 1102631 1042165 964024 836114 740480 452912 -190420 -966208 -1586847 -1933411 -1996824
16633 -1996824 -1674275 -883824 51413 682052 955065 900020 577683 155666 -224824 -509892
16623 -509892 -775847 -1175229 -1664144 -1979660 -2050882 -1774813 -1242067 -955993 -1053533 -1308484
16613 -1308484 -1665169 -1920386 -1843129 -1575735 -1318420 -1230474 -1401789 -1661666 -1793171 -1831888
16603 -1831888 -1978569 -2138775 -2047943 -1677175 -1106660 -450715 101723 405220 455432 322696
16593 322696 48986 -230636 -451916 -870458 -1441366 -1807612 -1903333 -1754564 -1433561 -1005092
16583 -1005092 -494073 46697 476949 634500 684205 1000355 1612082 2261457 2579782 2325751
16573 2325751 1730842 973507 180124 -382142 -718499 -912749 -756120 -220322 469317
16564 469317 1101494 1501267 1613191 1520233 1493830 1576026 1424348 1013669 740295 967531
16554 967531 1595524 2087674 2052597 1584838 938236 355794 33908 -106788 -261285 -514738
16544 -514738 -747931 -860929 -928388 -1234708 -2053902 -3041689 -3776759 -4332727 -4746653 -4748148
16534 -4748148 -4302290 -3555267 -2683806 -2014489 -1663784 -1297471 -738053 -24256 816871
16525 816871 1559142 1852349 1601634 980278 113467 -978788 -2070784 -2746007 -2735008
16516 -2735008 -2192608 -1487915 -946565 -878265 -1097788 -1346362 -1807283 -2368666 -2709778 -2780282
16506 -2780282 -2540394 -1996710 -1355715 -930149 -735167 -753992 -969571 -1205204 -1433550 -1522372
16496 -1522372 -1325239 -958053 -677838 -588709 -618150 -852703 -1280488 -1644125 -1708094 -1509394
16486 -1509394 -1355920 -1432245 -1580543 -1414950 -779459 -139025 173904 356773 601165 805013
16476 805013 879282 1013369 1319267 1666952 1831401 1737389 1577322 1556128 1516999 1264478
16466 1264478 795046 99188 -732988 -1394436 -1545953 -1141322 -364374 354804 570130
16457 570130 347927 130349 168837 385092 746485 1299164 1956351 2312121 2156871 1774713
16447 1774713 1310374 908114 730559 642797 579745 613414 856736 1266395 1740936 2102943
16437 2102943 1981312 1332054 600097 189223 93965 168586 367180 629678 856525 1057407
16427 1057407 1205372 1145015 859907 577175 343751 34912 -313998 -668608 -1091621 -1595560
16417 -1595560 -2006752 -2265597 -2486099 -2559574 -2379178 -2133228 -2182857 -2465066 -2495881 -2172792
16407 -2172792 -1838985 -1690309 -1662199 -1484568 -1105377 -734841 -554171 -576262 -552305 -266368
16397 -266368 442528 1414739 2306502 2765621 2633687 2171114 1643750 1090010 440813 -286994
16387 -286994 -990170 -1645609 -2417189 -2975628 -2671243 -1687641 -751233 -183141 125187 397118
16377 397118 628171 741637 900325 1122492 1026464 513450 -137714 -523145 -439225 -93779
16367 -93779 190101 223510 178006 365957 735991 930937 907409 926033 1120203 1346333
16357 1346333 1474673 1424769 1273216 1220222 1234579 1315196 1497027 1704301 1852038 1869755
16347 1869755 1693929 1232601 693143 431716 593995 1054358 1392449 1247451 704936
16338 704936 93941 -294996 -288764 20973 474333 950563 1316912 1520579 1519102 1295418
16328 1295418 910552 440794 -91478 -705377 -1440155 -2176284 -2583638 -2598670 -2441867 -2345637
16318 -2345637 -2222858 -1889594 -1480508 -1068300 -568628 900 267322 -138938 -927542
16309 -927542 -1508082 -1731639 -1745199 -1764891 -1841119 -1761370 -1452326 -962820 -318326 322475
16299 322475 569740 346036 -108460 -677571 -1149061 -1310268 -1267901 -1282962 -1445226 -1590643
16289 -1590643 -1552640 -1383172 -1096799 -825257 -678768 -400933 37015 160487 -208326 -653348
16279 -653348 -898708 -1093504 -1325875 -1290934 -762188 173556 1149216 1883937 2396103 2726255
16269 2726255 2842618 2621058 1968945 945243 -41429 -703932 -1272088 -1950976 -2594067
16260 -2594067 -2966742 -3011677 -2934556 -2885328 -2794352 -2538552 -1955779 -1115629 -231206 526159
16250 526159 910443 908108 915506 1144136 1375071 1426523 1406181 1407912 1295264 954273 553711
16239 553711 466137 621125 741889 613515 76742 -662952 -1218967 -1317747 -1141614 -1071189
16229 -1071189 -1271496 -1576699 -1766346 -1911710 -2096355 -2299437 -2360749 -2158287 -1897850 -1846321
16219 -1846321 -2030466 -2309824 -2585970 -2859992 -2991293 -2710292 -2044900 -1405478 -1256590
16210 -1256590 -1562236 -1792974 -1719067 -1401793 -1137901 -1355882 -2130098 -2999805 -3366055 -3061802
16200 -3061802 -2360531 -1548960 -916530 -604345 -518689 -664993 -1101226 -1622099 -1845413 -1521431
16190 -1521431 -577320 630705 1642897 2389250 2905553 3224562 3334193 3244184 3037972
16181 3037972 2865497 2763819 2568607 2238529 1768114 1143927 554360 199663 95308
16172 95308 263669 776189 1546752 2291125 2785850 2924328 2693748 2219752 1804727 1555928
16162 1555928 1316399 1028016 875690 807348 528010 83458 -251962 -309331 -55225 466111
16152 466111 1023871 1334536 1340939 1148919 874236 541951 296417 403141 720903 823477
16142 823477 731008 840019 1207811 1639584 1905207 1921822 1793550 1406716 894180 700033
16132 700033 911878 1110185 1087513 1028072 1155483 1459647 1629243 1624347 1600637 1525359 1476379
16121 1476379 1506074 1373912 1030671 863138 1134473 1700912 2240331 2534730 2701032 2913712
16111 2913712 3077695 3058758 2776182 2207049 1594264 1104032 741831 408102 -32974 -427636
16101 -427636 -635978 -851464 -1300911 -1892033 -2177364 -1941224 -1369021 -733145 -373132 -483016
16091 -483016 -845606 -1148171 -1201867 -1034701 -847300 -628760 -461057 -467364 -472427 -218205
16081 -218205 281917 835700 1372958 1885415 2197127 2117507 1856855 1770962 1941745 2102341
16071 2102341 2066755 1939074 1881386 1922512 1968330 1961282 1757237 1330104 899463 664472
16061 664472 607839 625155 633913 499179 171287 -207768 -366137 -283009 -224735 -379253 -554010
16050 -554010 -424780 -135481 -93777 -361564 -767871 -1289868 -1684225 -1515973 -751276 90847
16040 90847 469095 356016 130630 40357 14028 40392 361479 1097105 2019023 2623601
16030 2623601 2668183 2267014 1514078 636508 73102 -168050 -289973 -318711 -490449 -714861
16020 -714861 -854900 -1046223 -1116426 -834401 -260262 485492 1218684 1634712 1584546 1235568
16010 1235568 917855 748810 509115 65239 -449221 -682682 -401907 274710 1011759
16001 1011759 1503287 1621486 1439756 1196158 1049739 1149353 1610836 2268044 2725551 2689565
15991 2689565 2314352 1981456 1927432 2161254 2409544 2415106 2255335 2172557 2254779 2349047
15981 2349047 2212372 1703911 953544 248255 -207199 -437485 -430875 -380345 -602472 -995817
15971 -995817 -1132522 -820231 -262296 163750 91873 -302636 -582806 -649749 -588441 -516594
15961 -516594 -503855 -415656 -103356 354050 820542 1045019 743278 144357 -232676 -122799
15951 -122799 346599 898814 1328388 1584071 1736566 1697983 1424533 1243503 1336545 1364621
15941 1364621 1085470 530898 -238655 -954441 -1338188 -1508703 -1651096 -1760827 -1801915 -1855722
15931 -1855722 -2053384 -2080561 -1647085 -933763 -241995 59601 -74749 -261055 -323684 -361993
15921 -361993 -396733 -341461 -215031 -68517 125972 259007 168685 -109852 -460225 -659242
15911 -659242 -626681 -481214 -211963 23346 -113274 -718562 -1430650 -1764535 -1512231 -881726
15901 -881726 -488341 -551243 -683724 -492348 -11142 365057 343762 -226720 -1207288 -2124433
15891 -2124433 -2713124 -2805783 -2418282 -1742211 -983431 -286115 276909 703561 1142423 1678241
15881 1678241 2204153 2671537 3017458 3072886 2729653 2141470 1564080 1187300 974697 763805
15871 763805 508391 307259 384242 747652 1282929 1842388 2274215 2637601 2925565 2889226
15861 2889226 2475916 1994397 1660229 1597181 1873270 2431309 3074538 3610726 3906228 3731907
15851 3731907 3259974 2838143 2493428 2094130 1808947 1775960 1789950 1768801 1741903 1556796
15841 1556796 1158444 669783 394347 542504 913178 1150448 1131648 934119 652345 368905
15831 368905 203209 240984 297408 139853 -27207 178186 574199 527585 85325 -177682
15821 -177682 -33670 319463 618641 821784 959840 944745 666947 133754 -454716 -860169
15811 -860169 -1093555 -1205978 -1207539 -1151557 -1151833 -1298632 -1387905 -1184366 -711614 -275332 -273689
15800 -273689 -715293 -1152621 -1209458 -845525 -243634 75028 -107156 -401085 -382209 105361
15790 105361 942675 1789820 2115279 1665871 832939 158995 -240762 -547473 -785457 -841641
15780 -841641 -761656 -644297 -524298 -478151 -474994 -354256 -46068 366366 666513 625054
15770 625054 245161 -133512 -286970 -440123 -827281 -1222064 -1296624 -1002157 -344513 510709
15760 510709 1258919 1640178 1674152 1604434 1481636 1318557 1424915 1929710 2486720 2452822
15750 2452822 1687306 880399 471400 271763 107576 128101 412064 784400 1162065 1529075
15740 1529075 1768358 1771707 1565109 1273048 923608 428118 -281732 -1110642 -1663304 -1632100
15730 -1632100 -1180675 -724799 -434778 -75107 391317 656699 552970 208556 -132795
15721 -132795 -330302 -370240 -290319 -191913 -197055 -303418 -363982 -329938 -333410 -448593 -696866
15710 -696866 -1116560 -1582914 -1854802 -1771787 -1303822 -651064 -85880 243749 361803 411917
15700 411917 577918 823632 861998 492152 -197727 -741136 -748473 -216089 537139 1099306
15690 1099306 1303744 1375469 1486685 1504216 1308284 997854 655139 307089 16101 -149718
15680 -149718 -288729 -573284 -976900 -1372967 -1670754 -1859191 -1945503 -1748169 -1273561 -735266
15670 -735266 -139088 595312 1323236 1741670 1971448 2388541 2669821 2290604 1365272 360232
15660 360232 -400837 -871436 -1083041 -1070847 -1005879 -1091575 -1310982 -1519059 -1774044 -2079947
15650 -2079947 -2296021 -2343156 -2013677 -1189804 -191171 764999 1670662 2466755 2949787 2877843
15640 2877843 2291840 1632076 1215176 1051481 1062873 969768 662172 360496 215021 104899
15630 104899 42216 80412 72262 -31095 -207213 -514927 -744685 -727334 -574553 -444771
15620 -444771 -445516 -469644 -299453 -64232 -37449 -235425 -559867 -1151174 -1987633 -2672598
15610 -2672598 -2833805 -2368497 -1558789 -880344 -818640 -1324899 -1766292 -1826401 -1633150 -1190936
15600 -1190936 -646860 -472956 -778415 -1239987 -1703559 -1960019 -1715476 -1033819 -280883
15591 -280883 306403 753900 1126804 1379668 1459615 1202987 619033 41726 -306983 -513664
15581 -513664 -599402 -471145 -218638 24814 -36172 -476658 -771556 -544004 19283 538999
15571 538999 821279 910609 946095 866178 695668 570233 481220 396466 324260 489141 986227
15560 986227 1424942 1522406 1461407 1488261 1438316 1175731 887166 734242 610911 413267
15550 413267 457438 934030 1489454 1776050 1769003 1621827 1652246 1898028 2085736 2007731
15540 2007731 1597554 1019541 511248 28661 -351258 -635037 -1085524 -1669401 -2075714
15531 -2075714 -2044563 -1663034 -1241990 -1214398 -1777014 -2517302 -3031899 -3284099 -3349811 -3321166
15521 -3321166 -3407351 -3587453 -3795515 -4072043 -4228389 -4145287 -3872952 -3432538 -2847017 -2148483
15511 -2148483 -1376236 -671296 -257384 -105594 -17714 197750 530905 658239 470397 115748
15501 115748 -338250 -753559 -1019825 -1143077 -1226948 -1284956 -1302757 -1219879 -1034788 -719249
15491 -719249 -192936 341393 721289 908769 721737 225319 -380348 -973853 -1237459 -938036
15481 -938036 -336641 -10416 -20016 18631 172545 222734 70698 -105361 -161480 -42812
15471 -42812 187388 330314 323203 127519 -149289 -420835 -825464 -1253050 -1549359 -1807975
15461 -1807975 -1926404 -1763244 -1312864 -657711 -353286 -797263 -1741622 -2674697 -3118697
15452 -3118697 -2898892 -2237706 -1578342 -1210563 -1117835 -1203676 -1179726 -872457 -488153 -416124
15442 -416124 -698429 -1015093 -1168057 -1291737 -1633338 -2072821 -2367595 -2622582 -2977618 -3381167
15432 -3381167 -3759809 -3935661 -3758418 -3428188 -3173993 -2902898 -2664445 -2687387 -2879195 -2825732
15422 -2825732 -2420480 -1979102 -1744073 -1840459 -2173043 -2459430 -2459412 -2153203 -1738145 -1384482
15412 -1384482 -1124494 -817591 -445350 -339998 -568416 -820026 -1037638 -1181233 -1250417 -1376035
15402 -1376035 -1423714 -1254628 -964216 -836967 -1012903 -1398352 -1936284 -2444049 -2453596 -1797254
15392 -1797254 -843454 140051 981128 1359832 1114597 434389 -255962 -606542 -604966 -361905
15382 -361905 2184 345943 522044 648452 797816 859404 950694 1154543 1352735 1458885
15372 1458885 1531726 1667833 1790258 1768960 1739154 1852722 2000300 1949655 1794899 1760766
15362 1760766 1649738 1446634 1400830 1464275 1289232 612672 -403569 -1234580 -1668621 -2031089
15352 -2031089 -2585426 -3219866 -3717579 -3847597 -3771064 -3924964 -4368601 -4596163 -4294396 -3679758
15342 -3679758 -2929134 -2074596 -1288319 -718707 -475779 -559643 -795522 -1015959 -948520 -401144
15332 -401144 420644 1130035 1528927 1632352 1640623 1669203 1632356 1480706 1185920 798400
15322 798400 430020 212977 248071 325494 256834 128282 45242 -33451 -61977 111855 280631
15311 280631 256636 150220 195978 350817 315538 115047 7244 75929 126150 75696 113192
15300 113192 189622 161183 141294 237015 383642 389446 197862 -91645 -389496 -733813 -1075612
15289 -1075612 -1198937 -1145798 -1139454 -1294521 -1619479 -1987979 -2410660 -2831094 -3062967 -2997142
15279 -2997142 -2599587 -1963242 -1381320 -1160562 -1248253 -1221276 -926341 -644030 -400873 -8149
15269 -8149 348201 291966 -276582 -1182569 -2019230 -2601784 -3052382 -3310176 -3213944 -2812495
15259 -2812495 -2331710 -1697512 -768525 -28839 88258 -316206 -954318 -1636629 -2189278
15250 -2189278 -2467281 -2611021 -2681891 -2364835 -1666041 -956754 -340339 259230 642772 590395
15240 590395 302199 32128 -108213 -67347 5730 8353 -100026 -319510 -516444 -587428
15230 -587428 -497813 -397547 -295655 -22976 251921 234365 -74435 -403517 -636655 -949843
15220 -949843 -1669051 -2717558 -3654941 -4164130 -4186851 -3875255 -3359445 -2661432 -1866112 -1179045
15210 -1179045 -793355 -700010 -766776 -866223 -891261 -906977 -830799 -424049 267387 1005762
15200 1005762 1575302 1900413 1978021 1812538 1459652 943958 379543 147118 473669 1093583
15190 1093583 1591919 1866953 2102461 2191494 1891162 1386767 1020615 671577 127942 -424317
15180 -424317 -713956 -879419 -1098921 -1392904 -1721692 -2115036 -2710594 -3462737 -4126587 -4449671
15170 -4449671 -4349483 -3900157 -3265658 -2658164 -2054432 -1246221 -308561 338660 365012 -47306
15160 -47306 -608576 -1197845 -1734228 -2102711 -2263462 -2218986 -1810457 -1016190 -176255 344480
15150 344480 458302 248868 -88158 -464638 -815582 -1035150 -1101751 -1075229 -993546 -876474
15140 -876474 -859521 -1103215 -1406306 -1439997 -1216882 -972000 -946787 -1126329 -1303388 -1398859
15130 -1398859 -1463947 -1559055 -1826353 -2434301 -3258563 -3854196 -3931124 -3719810 -3737195 -4036240
15120 -4036240 -4271830 -4380209 -4278641 -3808512 -3026256 -2155168 -1434061 -1091240 -1223928
15111 -1223928 -1796457 -2579062 -3250806 -3710053 -3841795 -3440754 -2667479 -1958651 -1557153
15102 -1557153 -1330567 -1147810 -1029673 -913221 -879004 -952872 -839190 -338227 576567 1711768
15092 1711768 2591534 3031861 3298522 3495790 3421175 3014180 2408608 1807683 1286738 788586
15082 788586 266695 -317693 -964563 -1448223 -1536917 -1398658 -1270622 -1334301 -1592654 -1717281
15072 -1717281 -1493674 -967082 -325444 207780 566980 923147 1353208 1600348 1367893
15063 1367893 747099 2106 -609056 -809826 -578896 -230423 178484 724776 1127828
15054 1127828 1081858 504564 -341748 -1050084 -1537156 -1851377 -2061947 -2346275 -2711404 -2863578
15044 -2863578 -2440048 -1485667 -413424 485932 1057044 1172606 704943 -210925 -1236624
15035 -1236624 -2143534 -2714501 -3114175 -3497174 -3741055 -3479569 -2531390 -1408792 -656566
15026 -656566 -416856 -445141 -504737 -727494 -1231399 -1928792 -2674289 -3240701 -3512150 -3568867
15016 -3568867 -3555541 -3455267 -3095393 -2442218 -1734325 -1217059 -920768 -909052 -1198501 -1451766
15006 -1451766 -1436686 -1343059 -1434669 -1606259 -1596285 -1469374 -1458247 -1686050 -1995749 -1973196 -1560121
14995 -1560121 -1120040 -830199 -613797 -471857 -691552 -1302170 -1775915 -1825110 -1568186 -1052428
14985 -1052428 -347658 323114 910691 1560249 2218773 2744122 2974726 2997352 3000906 3027443
14975 3027443 3042015 2992003 2714131 2000025 1061477 381287 109361 35248 -124508 -521782
14965 -521782 -828734 -701304 -311389 173141 835502 1583948 2076064 2079517 1577060 772204
14955 772204 71291 -294824 -388654 -536491 -974879 -1433725 -1433828 -1043017 -887911 -1147159
14945 -1147159 -1627528 -2309250 -3050207 -3507097 -3470464 -3019712 -2337544 -1555834 -839434 -406110
14935 -406110 -382831 -587559 -711347 -885599 -1321740 -1822813 -2178800 -2413199 -2527338 -2460500
14925 -2460500 -2163136 -1715009 -1230749 -803733 -421633 43681 496509 583248 89450 -607015
14915 -607015 -962438 -878955 -572891 -216698 224816 867423 1495567 1684834 1367891 964021
14905 964021 811436 934029 1195672 1302787 1213037 1273523 1580568 1944625 2176884 2074643
14895 2074643 1575241 1025359 699378 417711 -6392 -474434 -614796 -418658 -342058 -537663
14885 -537663 -772938 -836415 -854222 -997455 -1278996 -1674558 -2112146 -2401990 -2475894 -2241342
14875 -2241342 -1497623 -619950 -242208 -437341 -870964 -1307973 -1637074 -1782092 -1804475 -1882086
14865 -1882086 -2126290 -2460167 -2702933 -2835886 -2885589 -2945816 -3186169 -3653665 -4379976 -5249908
14855 -5249908 -5824315 -5747044 -5193086 -4328137 -3173851 -2052994 -1276218 -925016 -780324
14846 -780324 -638733 -454035 -243632 -96624 -15329 127856 327705 349133 120266 -144730
14836 -144730 -388575 -637354 -789928 -697099 -565960 -632899 -909958 -1332509 -1699368 -1983116
14826 -1983116 -2187164 -2188094 -2066866 -2094800 -2341771 -2427111 -2023818 -1212915 -276488 531548
14816 531548 1122763 1556073 1935821 2215033 2439250 2758077 3083734 3166997 2813378 2197810
14806 2197810 1620367 1120269 534152 -311572 -1302962 -2219742 -3010901 -3563357 -3519553 -2925355
14796 -2925355 -2251769 -1865780 -1734724 -1544814 -1283847 -1160163 -1282073 -1600739 -1951510
14787 -1951510 -2129119 -2192056 -2336550 -2657278 -2933045 -2871175 -2666198 -2796308 -3404930 -3939709
14777 -3939709 -3817561 -3112999 -2365798 -1972923 -1789459 -1397637 -724245 -90377 349477
14768 349477 720261 935511 832142 632356 514296 363610 314066 615795 1031138 1061792
14758 1061792 647676 171176 -29315 121260 444048 697693 547696 -189138 -1183635
14749 -1183635 -1813973 -1743778 -1123530 -417796 20823 338109 547186 505836 500718 757475
14739 757475 912378 702177 411385 359331 605741 912925 1149160 1296420 1302831 1321598
14729 1321598 1364965 1387579 1362631 1132398 730803 439392 363692 368649 173626 -274661
14719 -274661 -623458 -770309 -842185 -774834 -549996 -252804 34723 342333 726059 848701
14709 848701 518597 161423 106311 358830 921006 1447743 1422751 955276 634543 573950
14699 573950 405315 157132 90033 53277 -202610 -770224 -1749743 -2953246 -3779024 -3915989
14689 -3915989 -3633862 -3365098 -3123176 -2558626 -1729064 -945010 -254747 313096 743107
14680 743107 1170864 1722458 2403104 3044359 3476230 3494503 2985971 2090691 1139676 350921
14670 350921 -261975 -610867 -599196 -247463 96542 100269 -136655 -280287 -19212 713363
14660 713363 1596124 2137018 2168404 1755565 1238986 902597 727256 615049 440934 141965
14650 141965 -235149 -727133 -1374991 -2012403 -2393202 -2329220 -1948919 -1392335 -639663 190747
14640 190747 879158 1340836 1733578 2102327 2203261 1975073 1686196 1696973 1797312 1492257
14630 1492257 809527 80715 -307247 -320321 -368346 -441119 -330626 -170369 17432 280786
14620 280786 550844 750436 782838 505085 66769 -158237 -92292 26661 -37281 -233077
14610 -233077 -353264 -278404 54282 572395 988177 1129557 1079385 1058951 1183007 1492021
14600 1492021 2027375 2597259 2822024 2355903 1598390 1279027 1519016 1857291 1939236 1891426
14590 1891426 1876298 1900328 1741207 1262027 832938 877265 1381476 2031264 2674616 3058340
14580 3058340 2914348 2410672 1877615 1568230 1467161 1390954 1204326 895554 542339 233617
14570 233617 -18152 -346807 -924467 -1651131 -2164608 -2266022 -1911733 -1282362 -747551 -457847
14560 -457847 -312368 -301506 -549478 -1079599 -1697190 -2052637 -2002146 -1704088 -1262218 -645945
14550 -645945 -183215 -123460 -289099 -620678 -1217596 -1911935 -2427968 -2864063 -3310340 -3544602
14540 -3544602 -3533579 -3471795 -3402408 -3312609 -3027946 -2359781 -1354306 -144781 1030718 1792753
14530 1792753 1895043 1544158 1277157 1343697 1549392 1580604 1467411 1550667 1861778 2202554
14520 2202554 2527943 2718787 2555485 2004718 1334451 773259 448808 535466 845536 1111250
14510 1111250 1166630 1030282 996771 1110536 1184727 1164136 1108239 1046369 855466 583144
14500 583144 352337 116790 -68626 -148360 -246166 -486206 -885973 -1167811 -944547 -432234
14490 -432234 -81664 121712 291473 332063 389196 537171 560824 340940 -29989 -324570
14480 -324570 -426942 -323207 -125300 -28804 -160159 -405559 -505407 -481944 -450911 -436242
14470 -436242 -502413 -508083 -5901 1053249 2106542 2733123 2855511 2439136 1671468 890938
14460 890938 448982 555052 969325 1341345 1503204 1463681 1142373 649245 234672 22159
14450 22159 -20555 55722 129228 102801 153264 386543 605271 551108 289058 49077 -217379
14439 -217379 -529623 -584229 -297402 6617 165224 254115 293710 275326 217882 30952
14429 30952 -245819 -445673 -559331 -571329 -342135 174463 695994 1036129 1244288 1358945
14419 1358945 1334823 1163659 969480 935152 1018670 941092 651021 272511 -50022 -48704
14409 -48704 256195 595793 946056 1433291 1905817 2086298 1927102 1483854 906648 393580
14399 393580 62987 -43914 -69097 -238459 -682778 -1239515 -1594017 -1725931 -1786078 -1761619
14389 -1761619 -1549383 -1257795 -1101167 -1091422 -889276 -179724 838781 1719070 2181840 2241187
14379 2241187 2019405 1554958 979510 537935 213267 -91444 -183101 100677 592976 1040773
14369 1040773 1407501 1677879 1701171 1589958 1492917 1374283 1114724 754655 509078 593107
14359 593107 931703 1072897 584708 -415571 -1388485 -1949643 -2160335 -2278330 -2316601 -2027342
14349 -2027342 -1441557 -923540 -664955 -636456 -671230 -609024 -386883 -77170 145992 129928
14339 129928 -68722 -228126 -146552 8512 -18253 -183118 -382348 -621279 -609340 -9644
14329 -9644 881354 1515195 1636073 1395819 1172925 1190159 1482356 1878535 2214366 2276405
14319 2276405 1760981 824328 -48450 -409507 -209473 -29953 -264992 -653339 -789800
14310 -789800 -715308 -864493 -1269696 -1666619 -1868895 -1766799 -1442897 -1078201 -820280 -691616
14300 -691616 -642979 -901070 -1424295 -1687775 -1546793 -1148983 -599515 -182779 7235 66767
14290 66767 -34007 -361592 -706514 -791489 -758105 -878504 -1247464 -1727693 -2050808 -2156218
14280 -2156218 -2253601 -2445590 -2588031 -2553382 -2275008 -1735652 -1113545 -746204 -642991 -558694
14270 -558694 -378787 -55012 358298 750753 917403 831930 490856 -103605 -722158 -1021445
14260 -1021445 -1023661 -935582 -802490 -539744 -218449 -242244 -741109 -1309380 -1654215 -1773129
14250 -1773129 -1714064 -1622537 -1591470 -1374518 -979721 -588898 -185282 170272 385060 355485
14240 355485 75750 -311142 -667463 -909307 -942825 -718281 -497114 -530689 -714504 -934444
14230 -934444 -1167520 -1368580 -1490793 -1668031 -2111748 -2783379 -3368548 -3643265 -3649383 -3422003
14220 -3422003 -2886198 -1978524 -734935 492316 1261015 1412428 1130908 783854 604432
14211 604432 577551 462984 210944 -45931 -76895 46127 125898 138686 -3871 -337814
14201 -337814 -618724 -457290 156876 897378 1639426 2326060 2756668 2763858 2554310 2521855
14191 2521855 2564119 2266176 1765703 1569996 1755160 2026018 2144854 2059931 1693449 1221953
14181 1221953 985177 1057083 1396042 2069806 2908801 3538057 3755212 3511434 2780701 1823178
14171 1823178 911894 132382 -411261 -759741 -998772 -961833 -627504 -263823 -50014 188199
14161 188199 489191 537829 57429 -651205 -1166322 -1595162 -2140841 -2516628 -2472639 -2177894
14151 -2177894 -1892818 -1837619 -2123376 -2566580 -2806799 -2694481 -2322084 -1748067 -1103720 -754298
14141 -754298 -664225 -468515 -268289 -294161 -533002 -955533 -1530611 -2103277 -2305552 -1963767
14131 -1963767 -1240359 -484326 40637 350313 494070 488113 391531 187407 -165667 -517374
14121 -517374 -704292 -577851 -169561 109779 77604 80617 340097 665025 700621 542746
14111 542746 521782 620447 696177 706419 696230 806560 984686 895876 520690 84293 -53682
14100 -53682 110107 150932 -41257 -157804 -97932 -125295 -486748 -1058457 -1356235 -1136942
14090 -1136942 -771152 -724225 -941020 -983509 -653865 -77381 599695 1011971 1038919 1133792
14080 1133792 1445786 1654156 1900336 2457565 3322111 4134570 4477338 4464622 4293971 3940024
14070 3940024 3456933 3082093 2990538 3146916 3297202 3237392 2886558 2437185 2103014 1916742
14060 1916742 1877581 1836776 1779755 1725605 1557940 1373718 1448278 1781331 2125488 2248061
14050 2248061 2048377 1467756 517891 -427312 -978666 -1125397 -1036300 -891520 -755308 -557104
14040 -557104 -254993 1468 85417 59383 -3430 -129419 -458026 -1082110 -1852129 -2503438
14030 -2503438 -2945220 -3020516 -2582258 -1815027 -1265604 -1233576 -1461986 -1518722 -1137506 -438914
14020 -438914 142535 409256 576604 803367 1016112 1153098 1262460 1327516 1274195 1109807
14010 1109807 841886 497165 131474 -215462 -337413 -133078 233407 425686 181449
14001 181449 -292955 -596503 -504985 -132790 251651 693095 1203713 1487157 1449992 1412449
13991 1412449 1641494 1943128 2134619 2403824 2661509 2442689 1905333 1746614 2055178
13982 2055178 2394912 2587795 2645592 2572952 2372985 2284382 2470195 2497032 2041435 1311601
13972 1311601 717705 508523 541601 753686 972596 1005308 993771 920361 711575 507561
13962 507561 408924 336298 198348 35819 -95850 -220425 -232677 -24923 263488 400421
13952 400421 463910 721140 1138525 1461562 1434132 978000 312584 -387294 -1100504 -1675278
13942 -1675278 -1956642 -1950955 -1813556 -1758493 -1855707 -1923885 -1625836 -794929 123552 628547
13932 628547 811972 969739 1131536 1203079 1061994 538922 -402781 -1592972 -2607897
13923 -2607897 -3194022 -3408307 -3250996 -2705218 -1859358 -871527 -86609 327920 430574
13914 430574 240161 -110809 -467629 -707313 -726584 -510210 -121779 282371 723968 1309574
13904 1309574 1742233 1634768 1158506 699309 342103 21684 -265356 -439449 -401691 -154845
13894 -154845 204807 564529 616822 124968 -696392 -1480260 -2018523 -2182125 -1901688 -1255621
13884 -1255621 -548649 72637 547415 680142 367189 -165862 -454009 -463108 -610394 -1005206
13874 -1005206 -1536211 -2136373 -2610197 -2752406 -2664231 -2689084 -2913301 -3059991 -2842816 -2388644
13864 -2388644 -2096428 -2049887 -1928588 -1613116 -1157710 -651165 -311858 -412930 -1031316 -1854244
13854 -1854244 -2636894 -3267018 -3570127 -3452035 -2845935 -1950890 -1162897 -549256 -54083
13845 -54083 405162 875340 1199921 1211959 798585 -47346 -954758 -1516576 -1665911 -1604139
13835 -1604139 -1718546 -2126759 -2663223 -3121467 -3510503 -3915263 -4378897 -4765254 -4812884 -4363777
13825 -4363777 -3512231 -2503714 -1535598 -741912 -220577 132642 546601 1034568 1466802
13816 1466802 1819739 2025875 1974057 1621907 982781 118788 -597877 -876820 -1044923 -1155183
13806 -1155183 -1047247 -1077447 -1407212 -1825221 -2092045 -1932219 -1525136 -1322131 -1380753 -1499480
13796 -1499480 -1510928 -1199745 -581425 56308 509331 699793 638756 452105 159094 -258336
13786 -258336 -797812 -1371075 -1823644 -2041562 -1984419 -1629523 -1082113 -642770 -315475 247673
13776 247673 1124798 1829622 2015429 1731478 1031639 244487 -214621 -258883 162138 799200
13766 799200 1247743 1366725 1105860 565147 -20196 -395432 -566960 -704441 -802228 -698642
13756 -698642 -329503 -104164 -512705 -1320131 -2008775 -2234041 -1887945 -1212683 -487240 149843
13746 149843 737416 1158259 1146636 892788 910425 1364648 1734430 1429443 571272 -337020
13736 -337020 -970049 -1315753 -1549215 -1587501 -1318391 -972381 -768642 -727977 -999172 -1521814
13726 -1521814 -1890931 -1939095 -1859736 -1816703 -1835331 -2001933 -2187235 -2074316 -1679565 -1019989
13716 -1019989 10705 1055694 1591697 1424618 755213 178490 112495 290773 515393
13707 515393 793688 1068587 1239877 1120008 877005 879314 1166571 1396583 1564770 1795531
13697 1795531 1894071 1777497 1613375 1661457 1781629 1589232 1090610 600303 429243 689686
13687 689686 1062869 1157739 874420 454725 132520 -37189 -187263 -538345 -1078378 -1480885
13677 -1480885 -1500366 -1420425 -1451585 -1427500 -1269425 -1001576 -743382 -631177 -553698 -402670
13667 -402670 -154847 238229 841628 1579151 2210640 2620407 2761709 2763777 2774681 2721335
13657 2721335 2427725 1967632 1572865 1245647 887256 512047 162884 -63532 -82577 176179
13647 176179 764230 1422349 1775241 1859202 1830739 1545448 985372 425285 91631 -24623
13637 -24623 -55852 -242295 -822643 -1685340 -2430846 -2708193 -2360676 -1605647 -807854 -148055
13627 -148055 318192 351080 -62371 -480822 -562602 -337269 25709 513272 1206341 1863166
13617 1863166 2155596 2116554 1931454 1678963 1420596 1335648 1391495 1407560 1419506 1511980
13607 1511980 1723791 1877688 1610696 721752 -586403 -1903769 -2829571 -3219925 -3163693
13598 -3163693 -2888699 -2768764 -2936062 -3116132 -3009041 -2601992 -1971361 -1242786 -515040
13589 -515040 143937 692949 1150401 1575487 1925011 2045789 2016567 2180319 2658719 3098280
13579 3098280 3191917 2887126 2241510 1598570 1282499 1234518 1340100 1423002 1255995 1070148
13569 1070148 1194031 1645454 2270582 2866085 3356908 3701643 3732222 3420376 2886612 2238304
13559 2238304 1699337 1372563 1168214 981445 821895 866255 1053626 1148677 1134255 1123475
13549 1123475 1270228 1806907 2698910 3614799 4324564 4834360 5130589 5110555 4820437 4364541
13539 4364541 3768253 3076764 2554426 2288829 2099043 1889658 1595527 1246938 791761
13530 791761 220291 -340114 -654696 -551613 -184034 297572 927638 1633463 2086222 1992074
13520 1992074 1554869 1201731 1055878 921360 686791 395556 168673 205545 465166 737761
13510 737761 958048 1113994 1146171 1113165 1262817 1761446 2291925 2655590 2870877 2775340
13500 2775340 2226944 1384853 755254 466564 243059 204658 414113 466911 156295 -271377
13490 -271377 -583286 -808422 -890449 -859502 -921519 -1183969 -1597873 -2099836 -2584912 -2924609
13480 -2924609 -2897297 -2467950 -1848526 -1249096 -823750 -754105 -902026 -941000 -685183 -39244
13470 -39244 692363 963529 780667 620876 764757 1095590 1219609 1000823 828085 1040394
13460 1040394 1424799 1768998 1956089 1669699 952619 172404 -397474 -559638 -319395
13451 -319395 58028 344212 428096 143954 -544416 -1374681 -2068828 -2389214 -2190093 -1656135
13441 -1656135 -1191927 -831469 -303763 269926 655228 939599 1335817 1704789 1881335
13432 1881335 1957216 1927075 1468873 381757 -1023970 -2154968 -2637428 -2533823 -2127790
13423 -2127790 -1707410 -1393876 -1113869 -1025072 -1149226 -1222074 -1085216 -568527 353225 1410500
13413 1410500 2242304 2593956 2421392 1773159 816799 -35399 -330054 -184029 -107019 -332946
13403 -332946 -721263 -982274 -1054639 -1070572 -968395 -569487 43216 591844 1012594 1357863
13393 1357863 1664333 1901857 2079527 2292394 2475247 2438057 1981683 1173689 491405 362649
13383 362649 626401 835285 864505 791170 664651 530896 343251 106712 145830 746197
13373 746197 1544560 1957110 1932165 1761502 1514221 1127072 810367 633433 386659 72255
13363 72255 -100789 -112372 -223241 -568203 -769052 -547225 -317104 -488991 -855486 -1004582
13353 -1004582 -682944 -128393 298313 453236 396589 180335 -192597 -665881 -1181296 -1532788
13343 -1532788 -1679573 -1726228 -1829209 -2087239 -2398374 -2605828 -2581827 -2185212 -1207380 213360
13333 213360 1413627 1883187 1568252 858031 262953 32503 124702 233382 113325 -114622
13323 -114622 -336092 -568693 -609128 -448119 -208492 -36335 -223086 -600573 -882376 -1115668
13313 -1115668 -1205377 -874100 -136515 568563 1004340 1298712 1453049 1435194 1107514 369583
13303 369583 -550634 -1258638 -1373423 -1143235 -1160958 -1430298 -1701042 -1910004 -2005269 -1764877
13293 -1764877 -1249392 -821964 -668351 -549860 -157627 288358 388694 32145 -388262
13284 -388262 -464326 -240818 34681 227197 484752 1117878 2059068 2660014 2569590 2086347
13274 2086347 1497343 1019138 777331 709451 761081 765909 648633 756548 1391321 2291055
13264 2291055 3001613 3336923 3183388 2539881 1631211 926941 815360 1126626 1359208
13255 1359208 1322706 1251083 1271695 1311173 1353616 1370087 1149684 794412 607042 562359 486525
13244 486525 432509 519643 608378 412826 -128774 -735324 -1073551 -1051883 -973631 -1081263
13234 -1081263 -1343807 -1649070 -1826446 -1656489 -1163722 -574181 119666 783947 1127054
13225 1127054 1291573 1391705 1226814 818572 400514 175436 219107 476472 855682 1344972
13215 1344972 1898699 2342156 2483854 2325296 2012470 1710848 1553975 1588218 1574528 1433225
13205 1433225 1357932 1287725 1064543 935424 1001162 1002921 741448 319127 114834 124263 13479
13194 13479 -139464 -177485 -188431 -316430 -688060 -1127890 -1221220 -935947 -573446 -215055
13184 -215055 129349 418436 751155 1235927 1553298 1434238 1130485 763789 263727 -253981
13174 -253981 -529435 -347190 99468 497288 665471 547825 224056 -195401 -538494 -641088
13164 -641088 -481025 -262730 -222741 -274272 -158741 -89412 -431536 -1097674 -1712767 -2144546
13154 -2144546 -2476902 -2702547 -2698067 -2433257 -2104103 -1971904 -2045850 -2097474 -1962723 -1681055
13144 -1681055 -1485251 -1487237 -1494704 -1236625 -736771 -178756 140306 4840 -266908 -470576
13134 -470576 -814613 -1192145 -1253301 -905739 -218785 632417 1315806 1767053 2038717 2081739
13124 2081739 1850625 1298230 562538 15692 68805 658696 1290620 1648867 1914704 2358766
13114 2358766 2915828 3333242 3410666 3121277 2699550 2493827 2572414 2720072 2612703 2238345
13104 2238345 1998744 2078068 2149771 1844268 1359518 1133372 1112649 1029049 970527 1079636
13094 1079636 1366184 1716515 1981861 2199429 2580505 2957163 2844453 2081179 1091359
13085 1091359 284050 -207966 -201033 154448 559540 1040717 1492586 1647768 1238766 403599
13075 403599 -120260 135893 1012194 1964118 2613195 2990401 3226887 3547111 4037574 4428846
13065 4428846 4482312 4295494 4120767 4203779 4562198 5066074 5779316 6542922 6735788 6230084
13055 6230084 5564041 5195273 5107931 5060077 4766472 4259956 3845136 3630619 3655935 3885563
13045 3885563 4231526 4555607 4917504 5297692 5669006 5932845 5864713 5606960 5512228 5540357
13035 5540357 5660682 5889678 6095838 6172654 6018674 5753681 5572130 5565333 5740810 6065734
13025 6065734 6493990 6990067 7513260 7857864 7918118 7743523 7387866 7114601 7150508 7397311
13015 7397311 7674969 8092073 8793640 9748893 10902343 12021995 12776654 13125605 13359885
13006 13359885 13928962 14925012 16137019 17628682 19526238 21817077 24446788 27222496
12998 27222496 30016830 33178703 36981521 41247543 45807512 51091956 57691505 66050385
12990 66050385 76512137 89272146 104762565 123517786 146037069 172826323 203292327
12983 203292327 234470505 260057892 271841076 264719009 241171797 209357562 177162181
12976 177162181 148820965 125367234 106347795 90711239 77435772 66085117 56854275
12969 56854275 49745956 44263271 39860116 36005478 32457760 29376306 26857441 24898650
12961 24898650 23435343 22075421 20643971 19415272 18409088 17455788 16614064 15901705
12953 15901705 15245752 14709044 14481996 14470487 14463570 14419263 14343549 14205617 14039907 14107979
12943 14107979 14419494 14670664 14670021 14376137 13808763 13220123 13062678 13492565 14193829 14903937
12933 14903937 15616876 16265026 16622142 16850000 17348238 18204591 19466181 20975773 22433500
12924 22433500 23775733 25001576 25856154 26099991 25753241 25036332 24329952 24069084 24595880
12915 24595880 25856158 27376570 28898518 30363155 32039308 34475168 37691251 41555786
12907 41555786 46540806 53008550 60851675 70013982 80814757 93919992 109975871 129782874
12899 129782874 154146853 183005377 214830098 245944962 269478339 277240554 265808040
12892 265808040 239897066 207954007 176426217 148526324 125136384 105720587 89516580
12885 89516580 76188918 65449348 56876631 49894141 43900827 38743247 34436329 30939824
12877 30939824 28143065 25907635 24056389 22545581 21267332 19968530 18668813 17482591
12869 17482591 16245259 14885352 13604534 12439193 11290799 10223150 9341571 8742492
12861 8742492 8464651 8430222 8774694 9638940 10520442 10762271 10339150 9524428 8531340 7654779
12851 7654779 7122974 6826751 6600529 6532143 6557488 6428299 6126327 5968440 6181599 6691181
12841 6691181 7441371 8505347 9737515 10959360 12182741 13281766 14261711 15243212 16033000
12832 16033000 16537858 17139969 18396386 20497993 22918265 25052027 26913308 29011178
12824 29011178 31558474 34665554 38526890 43082181 48337659 54594396 62444693 72440910
12816 72440910 84675014 99020835 115819239 135825330 159501736 186912546 216929247
12809 216929247 245416780 265028729 268387740 253571039 225848037 193473350 162515019
12802 162515019 135661665 113473942 95378027 80571571 68495349 58878185 51308158
12795 51308158 44992315 39499837 34932162 31145069 27771561 24790740 22420277 20538607
12787 20538607 18811671 17225648 16024485 15111656 14220211 13422632 12871032 12470800 11912042
12778 11912042 10860570 9414190 8065504 7167415 6786542 6795260 7023966 7123172 6675162
12769 6675162 5783490 4941942 4417774 4066104 3587178 2921367 2208845 1672136 1404873
12760 1404873 1202112 950319 720292 395130 -81154 -485087 -785546 -1093879 -1292483
12751 -1292483 -1374073 -1414019 -1232415 -364728 1294805 3092908 4356602 4804893 4299092
12742 4299092 3027316 1508697 461339 383011 1032973 1687454 1920981 1887750 1840850
12733 1840850 1797883 1896820 2181168 2446018 2546009 2527553 2403872 2017937 1277253 340992
12723 340992 -308974 -284854 161221 380502 276386 329569 715807 1147119 1564822 2086380
12713 2086380 2582940 2754748 2456558 1861265 1322141 1043235 999406 1095432 1313367 1594233
12703 1594233 1773235 1767867 1601106 1245845 727389 152701 -409910 -1035615 -1779860 -2397867
12693 -2397867 -2588465 -2300927 -1945190 -1874844 -2008188 -2037342 -1901596 -1864804 -1916317 -1855790
12683 -1855790 -1617788 -1227316 -837119 -587336 -559482 -805278 -1163098 -1240493 -862714 -244204
12673 -244204 286832 754318 1329402 1817602 1973623 1840496 1670518 1574526 1453664 1214260
12663 1214260 918042 775573 815279 994084 1189294 1302196 1579777 2116834 2501716 2278601
12653 2278601 1449888 526551 -14382 -241868 -338908 -301942 -230258 -125414 143380 522121
12643 522121 958935 1450520 2053101 2606099 2732995 2384803 1738795 901967 -61063 -942221
12633 -942221 -1474691 -1644415 -1611033 -1314943 -511358 496378 1173156 1219179 693500 -72916
12623 -72916 -801563 -1294957 -1447560 -1266688 -845225 -552026 -713532 -1185665 -1591367 -1594783
12613 -1594783 -1169628 -507396 144513 476887 365626 -9606 -505797 -966817 -1136899
12604 -1136899 -922123 -480343 -109004 168749 518642 899512 1174813 1327496 1423114 1456562
12594 1456562 1353921 1033851 513241 -9426 -108303 387199 1157387 1932195 2598678 2887553
12584 2887553 2592671 1935786 1322989 893738 416722 -216866 -830724 -1364916 -1915949
12575 -1915949 -2307656 -2252428 -1726478 -1130607 -932624 -1169341 -1391757 -1438138 -1554416 -1723067
12565 -1723067 -1714884 -1482251 -1330708 -1484793 -1676128 -1759982 -1861726 -2063711 -2486041 -3074278
12555 -3074278 -3408138 -3173415 -2462254 -1623465 -808273 37029 866071 1587460 1890090
12546 1890090 1638492 896941 -198412 -1219678 -1642672 -1374472 -780249 -321441 -263221
12537 -263221 -420847 -447622 -293963 -105942 -12426 -13149 -42604 -204692 -478351 -758744 -1069102
12526 -1069102 -1240184 -1006434 -427621 158799 579861 688804 602241 766664 1193307 1454361
12516 1454361 1123245 437060 -63496 -302407 -459198 -510154 -282095 142797 443628 457987
12506 457987 385302 473301 659330 805708 817527 649910 505895 540928 475831 98997
12496 98997 -421841 -847980 -1062180 -1016886 -826599 -616635 -321828 2725 137461 -112412
12486 -112412 -633649 -994645 -891156 -408828 180859 814936 1367241 1417782 737302 -466653
12476 -466653 -1635426 -2386991 -2748093 -2868873 -2717351 -2106224 -1091149 -110328 341691
12467 341691 156172 -105897 -77735 -25497 -8018 184068 561941 803882 757760 561742
12457 561742 383258 239231 188168 442103 855486 1224514 1374802 1167586 756384 333282
12447 333282 128111 63756 -188481 -532155 -842616 -1144089 -1283609 -1264100 -1150153 -780641
12437 -780641 -136289 513612 925578 1025963 1041400 1138330 1147590 861530 508302 459424
12427 459424 477640 248783 -955 -88093 -373370 -1052013 -1709976 -1887332 -1503835 -758255
12417 -758255 -2167 501099 506464 -111489 -876346 -1199609 -1021571 -583302 -217180 -131240
12407 -131240 -292599 -460190 -305865 139565 435305 249744 -352523 -1025121 -1422163 -1604396
12397 -1604396 -1947365 -2479098 -2725336 -2283024 -1413416 -596512 -102516 47339 61237 -104763
12387 -104763 -632255 -1281400 -1674246 -1767076 -1586273 -1225282 -1021308 -1092317 -1180542 -1062896
12377 -1062896 -724244 -200457 282060 535506 608325 513334 344385 114569 -231998 -552328
12367 -552328 -861194 -1353004 -1902369 -2127304 -1875007 -1445396 -1135383 -829759 -414626 -64295
12357 -64295 -11591 -288892 -767230 -1296828 -1819080 -2110446 -2039183 -1864903 -1709080 -1362489
12347 -1362489 -648490 149180 742361 1161297 1288246 972504 412599 9241 -204551
12338 -204551 -414944 -575779 -649431 -879686 -1396300 -1863730 -2058062 -2115000 -2043636 -1624410
12328 -1624410 -645011 656327 1631374 2080321 2363663 2535391 2310496 1706024 1131651
12319 1131651 869067 807469 890907 1047315 1239720 1682799 2394681 3111019 3590732 3624403
12309 3624403 3270632 2853477 2468733 1824544 937812 277207 112766 292747 669632
12300 669632 1145967 1404374 1260537 922391 605668 138388 -664661 -1489350 -1902340 -1790238
12290 -1790238 -1445146 -1061102 -635524 -447883 -643517 -989777 -1236501 -1145490 -520287 569089
12280 569089 1749182 2687471 3198057 3094225 2557466 2059514 1995720 2347140 2547020 2247585
12270 2247585 1708655 1310270 1179002 1203180 1284960 1363786 1286122 992838 498434 -71418
12260 -71418 -400361 -438087 -210730 196774 639243 909683 879496 832531 966289 1071793
12250 1071793 1052619 1075733 1137769 1262261 1314691 1243842 1288255 1495904 1603040 1474780
12240 1474780 1240499 1001412 825727 703347 626929 678978 699953 453202 15999 -283467
12230 -283467 -325335 -399212 -863542 -1705123 -2420122 -2653734 -2646970 -2839539 -3181383 -3170702
12220 -3170702 -2789304 -2435498 -2145941 -1786410 -1347705 -983279 -605635 134677 989006
12211 989006 1153039 567393 -135125 -878998 -1621089 -1954691 -1669683 -1016625 -405425 -81651
12201 -81651 -44082 64505 417717 785568 970506 846131 460058 74019 -140740 -208774
12191 -208774 -119127 -50367 -251327 -479146 -470640 -263076 8205 217465 127270 -198879
12181 -198879 -337360 -55214 550641 1193888 1488807 1316423 846263 136135 -732044 -1475455
12171 -1475455 -1938251 -2126638 -2141367 -2136647 -2072266 -1851893 -1615997 -1439264 -1298347 -1456424
12161 -1456424 -2192402 -3320346 -4122509 -3982607 -3125017 -2167166 -1282641 -306094 552573
12152 552573 844343 597526 200870 8960 60162 90351 -30610 -340247 -688946 -850006
12142 -850006 -801291 -771782 -927403 -1201961 -1393069 -1353109 -1113897 -821218 -670084 -847258
12132 -847258 -1252245 -1450127 -1314469 -963923 -199368 832084 1468448 1374009 1018402 937199
12122 937199 978386 741992 279063 200607 844371 1529859 1295506 13366 -1610817 -2914476
12112 -2914476 -3789558 -4366296 -4671366 -4496409 -3898105 -3274886 -2758067 -2212326 -1790440
12103 -1790440 -1588795 -1518337 -1592370 -1865702 -2191529 -2192000 -1776309 -1263153 -985026 -942296
12093 -942296 -817237 -358629 261003 806083 1233715 1519730 1479669 1010548 251569 -507824
12083 -507824 -979083 -1041043 -868407 -860211 -1021619 -1174034 -1403503 -1807739 -2275487 -2584004
12073 -2584004 -2717260 -2956335 -3533066 -4221998 -4712313 -4983458 -5144189 -5133112 -4930201 -4937401
12063 -4937401 -5388480 -5816926 -5760340 -5272711 -4728040 -4230629 -3583722 -2889826 -2195517 -1438410
12053 -1438410 -759958 -214140 426529 1165039 1723793 2094895 2374902 2612040 2842654
12044 2842654 2909036 2829355 2673908 2438264 2223044 2092885 1921524 1551423 1135437 903983
12034 903983 892370 1163699 1738346 2554112 3410449 3903059 3832671 3488760 3004460 2241721
12024 2241721 1258906 365962 -173672 -466987 -657632 -833372 -1118325 -1387999 -1309399 -773576
12014 -773576 -10814 676942 1176329 1471371 1558142 1604448 1707760 1745247 1632706 1453412
12004 1453412 1395351 1506280 1704310 1810844 1748805 1778331 1994548 2084730 1694315 893462
11994 893462 13524 -550176 -771569 -1037761 -1537406 -2122594 -2558706 -2663685 -2359408 -1978794
11984 -1978794 -1877299 -1813233 -1350564 -478404 382823 832314 945258 880468 704571 513215
11974 513215 351211 300840 324671 276853 29149 -281358 -407478 -253243 80090 311950
11964 311950 321778 237160 24671 -375335 -749712 -903068 -848419 -858429 -1096106 -1258390
11954 -1258390 -1102020 -806765 -424943 -26870 18361 -308086 -648205 -701406 -420090 74738
11944 74738 624891 1032562 1193586 1269683 1379330 1449908 1476209 1546194 1616481 1613572 1450943
11933 1450943 1015026 339321 -218911 -510722 -586607 -443078 -485333 -986550 -1685396 -2276341
11923 -2276341 -2488496 -2187700 -1454852 -638637 -134119 -112881 -485381 -895702 -1179876 -1267451
11913 -1267451 -893020 -117015 671377 1235067 1554113 1735869 1830358 1820726 1699462 1387766
11903 1387766 867975 251418 -328976 -688716 -774046 -852364 -992175 -944978 -705467 -395596
11893 -395596 -7998 400713 740825 921881 834662 753029 1078099 1841118 2731895 3221137
11883 3221137 3070836 2595038 2081215 1644919 1593486 2108889 2989845 3821569 4064582 3732655
11873 3732655 3326963 3238577 3375450 3266881 2628760 1468246 136828 -928153 -1535051
11864 -1535051 -1749019 -1727717 -1450993 -911125 -233195 248510 341831 360405 702166 1331623
11854 1331623 1896438 2159875 2170505 2137300 2110568 1961718 1842075 1990683 2236673 2298386
11844 2298386 2151785 2012142 1890905 1530665 986813 460277 189817 299228 560404
11835 560404 751964 686087 351624 70264 67739 165390 147497 105887 152457 90274 -255546
11824 -255546 -660587 -862792 -817902 -644121 -452931 -219000 38507 202646 333364 588767
11814 588767 1005857 1522885 1969633 2261139 2332249 2077119 1378015 408069 -532048 -1185982
11804 -1185982 -1389134 -1218581 -864300 -624207 -550907 -515694 -459058 -487663 -895859 -1559571
11794 -1559571 -2031886 -2085403 -1678645 -871109 144778 1037323 1757868 2383123 2924269
11785 2924269 3328566 3386727 3050729 2714986 2767510 3214408 3781689 4017138 3792076 3341182
11775 3341182 3028121 2969818 2938293 2695151 2269574 1726914 984738 261262 2848 356787
11765 356787 895296 1213508 1304407 1205193 1135970 1314966 1485084 1551550 1808097 2221356
11755 2221356 2286894 1745314 933977 287637 -106812 -452286 -781220 -965244 -999298 -915910
11745 -915910 -774433 -728612 -945724 -1325644 -1478613 -1102136 -357499 410093 962047 1298918
11735 1298918 1603074 1704446 1352435 913643 676424 466381 107942 -370322 -770295
11726 -770295 -907834 -825604 -825721 -1161194 -1584986 -1786540 -1703850 -1289935 -557818 101465
11716 101465 173590 -362372 -1207418 -2067666 -2644213 -2722276 -2470955 -2215397 -2053266 -1774524
11706 -1774524 -1248983 -695881 -335389 -237744 -170547 199340 852255 1620287 2242882 2545918
11696 2545918 2641582 2588063 2210791 1527868 676030 -181163 -676087 -586393 -147934 263947
11686 263947 443787 403381 486473 848843 1141084 964252 421951 -46023 -228149 -371903
11676 -371903 -699878 -1061523 -1225851 -1156487 -958038 -754063 -397359 139939 450603 289529
11666 289529 -164504 -538666 -530342 -246217 67043 361710 498058 411280 186378 -21369
11656 -21369 -146217 4905 642143 1320293 1417234 956784 481825 272610 256361 414508
11646 414508 801693 1208067 1210543 858643 666371 943965 1467305 1999412 2340538 2166824
11636 2166824 1329114 -22930 -1522088 -2824635 -3611535 -3741361 -3323362 -2586408 -1711222
11627 -1711222 -1008848 -784765 -951523 -1137474 -953486 -347241 260167 470686 415757 424390
11617 424390 546508 734806 889036 765187 428108 206032 157814 183898 303606 632456
11607 632456 1042594 1267764 1304459 1250777 1276372 1538795 1949623 2029017 1476401 594112
11597 594112 -100234 -409301 -385396 -231037 -307284 -649084 -1026912 -1409802 -1897282 -2298887
11587 -2298887 -2422918 -2393062 -2230109 -1916940 -1569401 -1194423 -678228 -120433 215945 247569
11577 247569 87056 -46717 36634 176811 219843 124859 -57234 -189889 -255309 -287833
11567 -287833 -241627 -279874 -358205 -230019 -269064 -763091 -1321996 -1506987 -1322460 -1046509
11557 -1046509 -702859 -59137 880917 1795780 2424476 2566204 2266318 1918791 1821031 2004320
11547 2004320 2162745 1928481 1199085 406302 107556 188127 129940 -188971 -453949 -519388
11537 -519388 -497236 -565771 -857181 -1250524 -1394406 -1263909 -1069506 -860897 -645822 -443569
11527 -443569 -186482 133343 213087 72605 75275 67905 -339176 -750731 -588424 233558
11517 233558 1402734 2290513 2570926 2447134 2195825 1894512 1457440 897418 389594
11508 389594 154340 354469 867724 1128274 778043 -13585 -751304 -957532 -707978 -370046
11498 -370046 20042 408481 591690 655095 792580 922905 920124 806029 551079 389978
11488 389978 650000 1129836 1317948 1202016 1195380 1355115 1362037 1124947 731346 371205
11478 371205 365185 761173 1210193 1362559 1451769 1887931 2686399 3681747 4543582 4954662
11468 4954662 4973370 4933858 4927422 4472857 3073851 1077540 -611240 -1373611 -1306170 -1021863
11458 -1021863 -1062519 -1304352 -1203193 -869676 -744357 -820304 -781166 -571492 -241533 298890
11448 298890 830404 1060322 993476 757773 358938 -188563 -578914 -512680 -273300 -124396
11438 -124396 -12055 221851 618109 1025009 1329803 1585940 1876450 2163717 2175020 1813700
11428 1813700 1391515 1300074 1687781 2159729 1998372 1071923 -24576 -768271 -1074216
11419 -1074216 -1205336 -1242843 -960236 -551003 -339459 -114739 427301 1189970 1809644 2183132
11409 2183132 2329363 2178051 1760340 1279564 911821 486113 -14732 -315646 -182237
11400 -182237 170481 395076 666305 965739 956874 553003 -115907 -780597 -1119445 -969968
11390 -969968 -561705 -199573 -74429 -319131 -821574 -1367881 -1785147 -1679414 -924867 92151
11380 92151 1070651 1855833 2117935 1821546 1572713 1680119 1675446 1266625 720555 366595
11370 366595 119670 -345307 -1011630 -1559393 -1728833 -1551407 -1113749 -521806 19613 463971
11360 463971 815502 933724 789209 510407 354842 508373 706523 642810 467864 394880
11350 394880 449013 543505 571397 455673 425041 649756 950405 1062846 964330 772024
11340 772024 364349 -259126 -817684 -1238892 -1540093 -1595303 -1519581 -1374915 -1033601 -459003
11330 -459003 243095 795682 974908 913475 931570 1072336 1350183 1819830 2311868 2518345
11320 2518345 2369158 2167653 1934261 1216730 25894 -1050279 -1696078 -2063413 -2177511
11311 -2177511 -1934427 -1457340 -1204617 -1419782 -1774765 -1947226 -1907736 -1826039 -2029134 -2588494
11301 -2588494 -3061751 -3159119 -3129210 -3203175 -3328628 -3458864 -3390545 -2974111 -2369563 -1702216
11291 -1702216 -967255 -204599 531862 1206241 1764888 2135385 2481002 2936250 3320471
11282 3320471 3512358 3449972 3046462 2375808 1715125 1326456 1304220 1594415 1905564 1767607
11272 1767607 1032274 107584 -445096 -505650 -278172 28833 219363 292236 632277 1376493
11262 1376493 2242616 2995428 3585746 4052897 4316283 4268332 3977268 3405639 2597287 1876856
11252 1876856 1389921 931041 490697 224493 21250 -287935 -665091 -891021 -680892
11243 -680892 45048 919096 1401579 1360576 1191200 1033398 694042 196498 -166071 -190837
11233 -190837 -195852 -629532 -1434792 -2318562 -3062565 -3375782 -3126427 -2477599 -1655971 -940782
11223 -940782 -520832 -192157 220966 590607 670144 287552 -399016 -995673 -1419304 -1678492
11213 -1678492 -1680731 -1545874 -1395131 -1248668 -1112865 -946265 -808670 -864888 -1094743 -1412814
11203 -1412814 -1834487 -2194323 -2323924 -2358225 -2369121 -2272125 -2090681 -1934658 -2056455 -2372651
11193 -2372651 -2525525 -2478977 -2202109 -1629284 -946781 -153471 728825 1307034 1418830 1346806
11183 1346806 1345363 1482928 1547359 1267124 600586 -193065 -831088 -1230420 -1342863 -1159563
11173 -1159563 -793503 -336404 104717 374115 511714 601493 761770 1072668 1285878 1161765
11163 1161765 806008 398292 117152 40932 164021 511269 1075507 1576980 1587194 1052226
11153 1052226 325636 -367926 -889392 -1087784 -1014461 -986515 -1033420 -1006617 -1034953 -1198408
11143 -1198408 -1522547 -1972614 -2214961 -2058708 -1741081 -1482635 -1176111 -623345 -132329
11134 -132329 -154442 -750454 -1694385 -2417566 -2559297 -2315435 -2044671 -1989120 -2197252 -2442157
11124 -2442157 -2469088 -2353828 -2441586 -2760224 -3007630 -3040550 -2877627 -2553134 -2113544 -1732381
11114 -1732381 -1577202 -1657121 -1821297 -2001419 -2223955 -2501027 -2827906 -3075248 -2989701 -2423693
11104 -2423693 -1595117 -891144 -374163 32195 127820 -275426 -1106156 -1788447 -1846602 -1484960
11094 -1484960 -960464 -353960 -4573 -163911 -724531 -1377319 -1743220 -1708205 -1381185 -983915
11084 -983915 -703404 -512329 -322024 -213401 -257327 -404950 -671744 -1000206 -1239956 -1457200
11074 -1457200 -1907108 -2605378 -3330794 -3924980 -4181640 -3859772 -3037399 -1975641 -972832
11065 -972832 -342508 -91420 -76461 -41401 98958 17451 -403040 -921002 -1368568 -1637060
11055 -1637060 -1834470 -2065965 -2084721 -1847903 -1653699 -1629101 -1514969 -1131681 -626488 -49676
11045 -49676 580715 1053109 1176259 1050409 857724 720676 779782 709021 188893 -489193
11035 -489193 -722387 -252281 572332 1368781 1975932 2273981 2304530 2282483 2336353 2534670
11025 2534670 2782060 2740003 2316204 1780035 1327894 991803 767316 583715 285792 -136375
11015 -136375 -451016 -395621 -7345 339402 559259 577524 289195 -102362 -359495 -326057
11005 -326057 -82501 17054 19424 248909 737290 1284996 1703253 1972906 2077029 2000269
10995 2000269 1831751 1732650 1766466 1829725 1983809 2309467 2496211 2330491 1973040 1622593
10985 1622593 1128556 463802 -85738 -353943 -273361 169796 777731 1324609 1719872 1916891
10975 1916891 1900161 1804473 1687034 1423269 1079281 1001870 1334853 1695969 1702231 1353543
10965 1353543 1002465 909410 922617 817586 448831 -272184 -1165953 -1898528 -2207195 -1884880
10955 -1884880 -752669 877953 2418798 3411452 3634578 3306754 2874831 2334195 1521660
10946 1521660 830238 579300 497744 349891 224682 291987 499295 822003 1500508 2327622
10936 2327622 2874845 3065354 2928451 2530482 2167257 2080789 2116861 2136764 2146520 2036324
10926 2036324 1698875 1161002 640000 201745 -215871 -586264 -1055770 -1696751 -2145449
10917 -2145449 -1954225 -1297594 -635712 -186452 -46799 -202009 -564247 -823854 -745619 -676864
10907 -676864 -1148399 -2099231 -2902706 -3183987 -3141217 -3113934 -3299315 -3690139 -4019047 -3940606
10897 -3940606 -3371755 -2689431 -2474767 -2785335 -3093591 -3142517 -2899014 -2414225 -2104991 -2278692
10887 -2278692 -2788912 -3170903 -3026602 -2488462 -2009295 -1856550 -1992775 -2149436 -2083903 -1806431
10877 -1806431 -1450457 -1194397 -1230741 -1365983 -1295310 -1000309 -636419 -401833 -458666 -780360
10867 -780360 -1155010 -1517381 -1806333 -1878181 -1615575 -1083070 -698294 -791876 -1292947 -1931281
10857 -1931281 -2485503 -2733073 -2507035 -1937882 -1464936 -1216019 -1104582 -1120509 -1193714 -1456710
10847 -1456710 -1892232 -2258823 -2651081 -3066279 -3214865 -3162492 -3047051 -2883422 -2747148 -2694858
10837 -2694858 -2656171 -2572318 -2743827 -3234149 -3810727 -4344178 -4644782 -4611967 -4225286 -3558620
10827 -3558620 -2736279 -1823389 -1110628 -717533 -534370 -531923 -529147 -446686 -446659 -530052 -386226
10816 -386226 88544 599244 957771 1172660 1253516 1192609 818681 -49883 -1148006 -2123569
10806 -2123569 -2937637 -3535804 -3639375 -3086017 -2155810 -1179289 -410715 152991 733249
10797 733249 1240015 1700413 2205888 2586090 2763021 2866991 2947640 2903457 2532526 1872330
10787 1872330 1354979 1112124 914956 649077 240853 -191857 -333701 -142278 222535
10778 222535 396069 74544 -536603 -1127469 -1424842 -1295150 -795308 -220067 140743 299118
10768 299118 324507 193743 56389 202290 523746 702351 687484 762840 1127642 1578737
10758 1578737 1774454 1516093 899051 244402 -167438 -402713 -662338 -904817 -1044273
10749 -1044273 -1078927 -896862 -540540 -341159 -426144 -660188 -1005527 -1412549 -1783255 -2168703
10739 -2168703 -2672561 -3171608 -3487130 -3539304 -3312006 -3010605 -2826707 -2636564 -2219920 -1616161
10729 -1616161 -1215413 -1349519 -1907902 -2497159 -2839757 -2908701 -2849064 -2723991 -2571166 -2394919
10719 -2394919 -2128257 -1800202 -1432192 -890974 -82373 720830 1303112 1687175 1968151
10710 1968151 2214273 2316458 2050998 1394099 607311 -120353 -688033 -805088 -580024
10701 -580024 -389304 -249277 -58885 222088 554926 790408 782534 638343 587444 518816
10691 518816 221154 -251825 -728452 -980170 -937690 -809831 -709761 -624772 -592016 -506660
10681 -506660 -191075 200988 214222 -207875 -741651 -1200935 -1416208 -1241608 -737965 -211519
10671 -211519 31482 -154003 -670646 -1237593 -1495847 -1163855 -533239 -139193 92331 434556
10661 434556 714114 699557 564500 505388 622007 726114 402760 -342550 -1015489 -1291241
10651 -1291241 -1331988 -1404533 -1438531 -1264672 -954621 -712596 -730287 -1057723 -1705716 -2484911
10641 -2484911 -2929241 -2817658 -2181995 -1206497 -238255 458066 957118 1302236 1273351 907091
10631 907091 538958 427595 650922 1014783 1210489 1172011 907443 666247 800998 1152674
10621 1152674 1237459 1065139 991933 1121690 1296961 1199914 753313 318374 221762 431828
10611 431828 623115 522115 230170 -68544 -259394 -480826 -728919 -617814 -246224 -20246
10601 -20246 -28564 -197527 -386723 -561768 -723781 -621376 -200368 332556 738658 859924
10591 859924 629143 323272 388570 576109 303008 -241986 -695155 -953297 -831891 -507789
10581 -507789 -235465 -48517 -132879 -631822 -1397205 -2322826 -3226097 -3825563 -4232892 -4588995
10571 -4588995 -4746531 -4840501 -5055771 -5261731 -5316637 -5154061 -4789916 -4523842 -4538629 -4492352
10561 -4492352 -4080921 -3531484 -3084364 -2622327 -2073392 -1654332 -1560227 -1589290 -1470403 -1323204
10551 -1323204 -1456334 -1730937 -1902217 -1966480 -1865917 -1513844 -1131706 -828158 -448042 -83953
10541 -83953 57792 -69323 -507278 -1001083 -1165818 -968396 -727638 -611081 -538746 -552893
10531 -552893 -853748 -1644131 -2719384 -3553249 -3964712 -4230315 -4470856 -4552704 -4482328 -4219753
10521 -4219753 -3739089 -3097962 -2465149 -1945081 -1400414 -831298 -459695 -323465 -325408 -525176
10511 -525176 -974855 -1507352 -1910359 -2019096 -1714619 -1128862 -485053 143149 707731 1146652
10501 1146652 1623811 2340188 3162897 3538782 3166477 2350580 1479273 873037 605272
10492 605272 425711 313669 158196 -229182 -671507 -917907 -1017080 -1010953 -816382 -398382
10482 -398382 142826 645183 1001519 1092508 753466 -23457 -926994 -1454100 -1452243 -1015309
10472 -1015309 -531040 -320418 -296356 -313948 -177239 11619 -168714 -558065 -606280 -179213
10462 -179213 389258 637351 508535 167790 -334168 -866236 -1164321 -1347933 -1804871 -2475430
10452 -2475430 -3017720 -3196246 -2954569 -2461878 -2014136 -1838395 -1855530 -1968612 -2107511 -2239305
10442 -2239305 -2437589 -2727980 -2946241 -2783357 -2091173 -966183 456729 1832407 2681246
10433 2681246 2950136 2821371 2512116 2341655 2386831 2394690 2210939 1972653 1789989 1727471
10423 1727471 1763761 1713228 1384288 1004125 887988 1026982 1333198 1527986 1457447 1336079
10413 1336079 1448134 1732072 1914093 1902130 1674397 1278831 749695 109598 -362647 -523306
10403 -523306 -485957 -394964 -322356 -330380 -357794 -331482 -381744 -523397 -707804 -861720 -876551
10392 -876551 -811335 -700170 -410003 145439 799984 1373096 1651413 1446468 776803 -154411
10382 -154411 -994929 -1460923 -1319503 -811453 -513775 -439216 -277723 -59603 108279 267931
10372 267931 419996 450097 200511 -62669 -39945 33461 53641 292848 676424 831956
10362 831956 717739 478143 304633 552657 1222608 1876485 2341991 2500061 2115591 1239379
10352 1239379 308099 -291883 -389964 70870 800331 1258626 1192460 915181 895069 972844
10342 972844 724972 212622 -130009 -337164 -764025 -1225588 -1291988 -894070 -265803 345288
10332 345288 720325 697669 347642 -24054 -304715 -511076 -598657 -354132 369596 1258016
10322 1258016 1873833 2086139 1977947 1934355 2226419 2411225 1991641 1250686 843547 900998
10312 900998 1228581 1615817 1686279 1270292 578200 -16293 -290412 -297025 -304341 -526009
10302 -526009 -901042 -1413579 -1899004 -2157626 -2314171 -2552601 -2803643 -2861202 -2642634 -1882073
10292 -1882073 -515087 1064075 2407823 3114386 3162589 2954529 2533967 1656854 586986
10283 586986 -43485 18925 503995 960409 1208077 1235591 1087622 969348 818879 629313
10273 629313 504270 287531 -84859 -457654 -672141 -786554 -1024575 -1378107 -1625364 -1718519
10263 -1718519 -1836076 -2012017 -2077413 -2025318 -1975232 -1896065 -1709112 -1466066 -1186308 -717379
10253 -717379 -102722 394759 726914 834983 552968 66630 -171879 -132637 -234485 -738790
10243 -738790 -1398383 -1809727 -1930254 -1845384 -1481127 -974752 -530287 -133260 151046 66685
10233 66685 -418015 -899378 -1035673 -955771 -899581 -744637 -282948 294621 602480 474047
10223 474047 124182 -65937 88529 484401 660024 200640 -764503 -1629997 -2019566 -2071671
10213 -2071671 -2088916 -2119542 -1926197 -1442584 -1063964 -1182841 -1697615 -2145253 -2212992 -2109637
10203 -2109637 -2248631 -2570392 -2763163 -2823126 -2768373 -2467142 -2095060 -1896904 -1812820 -1683643
10193 -1683643 -1362162 -750759 -11917 564881 747794 435285 -243343 -1079955 -1570224
10184 -1570224 -1445625 -994144 -264630 743456 1485157 1556226 1348989 1330895 1510477 1862010
10174 1862010 2417185 2974848 3461471 3922567 4271627 4378168 4268987 4249887 4483693 4941102
10164 4941102 5230930 4875353 4036430 3061265 1983699 826262 -149650 -675449 -575007
10155 -575007 -96558 334253 568834 636805 640111 599381 400688 77331 -133535 -63897
10145 -63897 217706 478513 485298 280421 109388 -90137 -228469 16187 507169 951892
10135 951892 1170268 884958 67129 -836148 -1157289 -740742 -101443 293404 299195 -133946
10125 -133946 -849254 -1500778 -1836744 -1807381 -1487897 -990463 -313684 429700 796742 514804
10115 514804 -329253 -1446738 -2441790 -2983295 -3079727 -2833318 -2241996 -1286993 -120710
10106 -120710 870010 1353288 1192122 629741 209029 260299 554260 505758 -151192 -984683
10096 -984683 -1366194 -1205849 -927190 -750373 -547517 -256054 -129941 -576025 -1371657 -1956165
10086 -1956165 -2074634 -1827227 -1401475 -827809 -161508 539232 1327421 2100603 2645662
10077 2645662 2785855 2482619 1757273 749110 -241682 -964631 -1399752 -1657889 -1661477 -1208986
10067 -1208986 -554319 -26439 242335 260566 230659 290883 563160 1072907 1653667 2164915
10057 2164915 2265166 1661588 720381 -97560 -569989 -625802 -199485 613431 1383321 1696459
10047 1696459 1500214 1182432 900147 473466 -4889 -285174 -341690 -253236 -236401 -477843
10037 -477843 -724714 -578182 -111084 139800 -66466 -485172 -765538 -861337 -786576 -594254
10027 -594254 -422818 -365171 -459627 -684035 -819697 -592429 43496 740732 1087933 1013369
10017 1013369 666096 86674 -615761 -1089365 -940857 -260696 454869 893183 974056 800655
10007 800655 582042 547960 693016 656801 189180 -333425 -488903 -375275 -213896 -183998
9997 -183998 -283268 -286819 69619 822746 1577103 1877732 1745595 1410641 961856 504327
9987 504327 322460 552802 997575 1354594 1513235 1700347 2165639 2757466 3219031 3402313
9977 3402313 3272308 2864626 2244318 1543975 1032987 737542 521529 507465 864534 1428112
9967 1428112 1898612 2081319 1847798 1345094 934059 584456 21967 -537389 -704649 -527988
9957 -527988 -290055 -168539 -216686 -327495 -326181 -266600 -302048 -141417 464968 1110125 1092423
9946 1092423 456453 -118999 -386649 -590895 -786631 -923076 -1154704 -1495190 -1780172 -2011044
9936 -2011044 -2209266 -2210893 -1981593 -1478571 -727024 -77760 55389 -439853 -1274194 -2071879
9926 -2071879 -2540742 -2620881 -2414502 -1905719 -1081310 -335385 -38103 -143109 -405691 -766336
9916 -766336 -1159435 -1284044 -1108751 -907864 -902231 -946153 -664430 -103127 364703 609639
9906 609639 813926 977760 1108299 1231415 1337901 1589137 1857942 1969716 2008047 2014607
9896 2014607 1960507 1910744 1922421 1838030 1599323 1394195 1174502 827268 480055 153453
9886 153453 -350825 -1003890 -1302718 -886980 -185555 -25412 -788646 -1927818 -2776789 -3089944
9876 -3089944 -2804115 -2102637 -1325667 -581989 347927 1354799 1910184 1923082 1810084 1925937
9866 1925937 2201655 2383848 2515011 2649965 2664436 2474045 2219042 2035192 1789888 1563127
9856 1563127 1557783 1557027 1478835 1367531 1119000 788678 481891 319671 493902 986146 1395347
9845 1395347 1492824 1430498 1362760 1229019 1017340 768368 523712 207072 -250828 -597639
9835 -597639 -603752 -380707 -84648 196979 280307 39997 -522071 -1178276 -1624765 -1909260
9825 -1909260 -2173319 -2236676 -1854492 -1186421 -756077 -732064 -816277 -978333 -1232119 -1271968
9815 -1271968 -1005151 -627159 -154417 427269 951668 1208647 1137560 1045235 1282533 1743465
9805 1743465 2089254 2259426 2383953 2359038 1911735 1097217 103024 -845095 -1400548 -1451332
9795 -1451332 -1082114 -359043 470850 1124853 1432586 1298674 813109 198756 -458929 -1085093
9785 -1085093 -1517422 -1546404 -1033395 -269981 344704 659755 552243 219642 168495 612747
9775 612747 1223736 1474036 1203356 661513 168370 -199771 -577047 -856330 -864674 -751991
9765 -751991 -817668 -1070671 -1256597 -1318743 -1342241 -1164334 -648726 -152787 -1268 -150195
9755 -150195 -439660 -760365 -1073430 -1354981 -1574718 -1595831 -1496922 -1404904 -1220147 -882357
9745 -882357 -618795 -600973 -650321 -465010 162567 1028163 1596678 1754429 1773026 1582542
9735 1582542 1044175 457578 238422 374154 756169 1254033 1588926 1696374 1652404 1596228
9725 1596228 1721585 2301634 3137308 3693329 3954757 4150880 4344904 4487845 4660378 4948733
9715 4948733 5308368 5879530 6627982 7217385 7341725 6811468 5592293 4019793 2659420
9706 2659420 1911419 1893491 2313728 2860762 3299300 3343712 3023794 2649262 2354737 2116455
9696 2116455 1951249 1831992 1756148 1814038 1951494 2194569 2508250 2619751 2240766 1389250
9686 1389250 530046 265 -344647 -683785 -980243 -1169096 -1123333 -707401 -219016 -43476
9676 -43476 -76130 -228646 -479097 -671689 -640319 -308308 104910 369469 449487 320566
9666 320566 38364 -391737 -908430 -1214705 -1137852 -814512 -433572 -110520 79603 174005
9656 174005 70144 -220035 -540894 -751188 -654217 -183711 518728 1334335 2108207 2575118
9646 2575118 2728588 2786770 2861232 3039559 3284127 3387071 3055780 2196857 1188306 453586
9636 453586 111818 -48636 -255458 -368464 -144199 332153 705589 843400 1037298 1520990
9626 1520990 2258587 3003841 3497056 3497716 3055433 2459568 1834859 1346241 921171 222760
9616 222760 -653066 -1274600 -1493555 -1546768 -1534768 -1443212 -1436930 -1550804 -1725577 -2010543 -2201193
9605 -2201193 -2085415 -1743027 -1454444 -1410421 -1478750 -1470888 -1423630 -1315215 -1047598 -720334
9595 -720334 -412754 -284367 -438544 -536470 -367497 -24041 270404 254246 52301 -111403
9585 -111403 -320077 -654700 -990950 -1312613 -1709965 -2166326 -2577113 -2803139 -2695530 -2283816
9575 -2283816 -1635318 -797918 35812 531141 560429 252357 -289224 -973874 -1665995 -2384229
9565 -2384229 -2896070 -2781008 -2030823 -960732 -86987 298981 211358 -221921 -748763 -1151912
9555 -1151912 -1443416 -1653116 -1640027 -1165645 -393265 332320 996762 1650351 2115289 2357866
9545 2357866 2564701 2678299 2550306 2155887 1582783 861316 147692 -176980 -171019 -26107
9535 -26107 153354 214077 156160 153042 239591 397458 831485 1490715 2091597 2453947 2420553
9524 2420553 2024940 1599599 1245482 945111 697522 198796 -703624 -1665883 -2451897 -2933674
9514 -2933674 -3026536 -2821071 -2337790 -1399479 -92982 1104263 1749202 1963582 1900010 1424942
9504 1424942 746517 337527 446985 1002750 1793956 2483293 2803027 2588831 1946586 1187493
9494 1187493 464341 -126431 -462076 -606558 -517591 -120278 442301 1018303 1392237 1561245
9484 1561245 1804053 2132871 2523506 2971858 3129344 2812703 2143955 1401883 820839 388224
9474 388224 -75681 -734258 -1463296 -1969150 -2183908 -2333372 -2575289 -2869819 -3031455 -2914674
9464 -2914674 -2647184 -2478737 -2459999 -2362761 -2068057 -1630255 -1121093 -807134 -841440 -1041547
9454 -1041547 -1247867 -1552377 -1970368 -2167997 -1992488 -1406730 -496700 365343 854301 933460
9444 933460 954085 1007248 793938 263020 -347480 -896710 -1207103 -1056870 -689456 -550846
9434 -550846 -735824 -1020487 -1301198 -1681158 -2059069 -2212386 -2038742 -1514126 -738429 148942
9424 148942 993421 1717256 2275014 2481279 2308824 1907636 1521651 1254268 969995 558985
9414 558985 48505 -372595 -650893 -921486 -1185803 -1398657 -1602841 -1804969 -1834338 -1526613
9404 -1526613 -1046010 -764033 -753502 -595010 -187895 150669 324767 276648 -76870 -516371
9394 -516371 -819530 -1062293 -1279168 -1370016 -1313398 -1077927 -583165 -21799 353245 485168
9384 485168 431624 346433 356618 386508 215629 -31046 46088 587345 1289381 1693508 1575464
9373 1575464 1087490 474796 -26023 -338680 -479681 -555882 -659803 -594455 -271930 -15775
9363 -15775 -142633 -314536 -49188 545264 1133193 1724134 2387993 2829193 2715500 2046612
9353 2046612 1113025 255011 -398984 -831155 -968250 -795310 -343337 267424 781356 1045413
9343 1045413 1088530 992307 836432 733160 671843 437873 -133918 -792553 -1103007 -1037931
9333 -1037931 -961332 -972241 -893178 -825094 -931013 -1223660 -1592289 -1913206 -2022848 -1766833
9323 -1766833 -1147293 -332078 310674 512830 340664 122737 232883 526282 505209 32143
9313 32143 -538387 -891279 -1118046 -1218414 -1105675 -859459 -640533 -444971 -161976 65594
9303 65594 141724 172982 125079 62482 77883 46201 -196367 -639058 -1028478 -1151859 -1009256
9292 -1009256 -815012 -703031 -560126 -318983 11512 468139 988226 1272087 1029244 554966
9282 554966 353823 522106 756385 788319 643875 476050 545052 1093149 2061121 3175816
9272 3175816 4351388 5570897 6529397 7035155 7381447 7816687 8224567 8276085 7896249
9263 7896249 7529640 7574110 7816137 7842860 7641963 7499100 7597978 7790557 7833001 7842914 8098249
9252 8098249 8594356 9251501 10102054 11289212 12882528 14552107 16053170 17260229 17892320
9243 17892320 17634407 16335912 14232477 11905148 9887043 8422099 7504688 7092716 7072656
9234 7072656 7121288 6967093 6581872 6113937 5673872 5192211 4592010 4027238 3532328 3046490
9224 3046490 2760544 2763765 3069598 3535682 3920213 4138526 4147666 3911252 3429223 2806494
9214 2806494 2248285 1881808 1675784 1497140 1227024 764961 217462 45952 379329 800352
9204 800352 1202153 1642061 1885500 1756594 1348448 903221 601037 333481 137527 232895
9194 232895 593796 1021820 1369564 1496516 1281644 683568 -262396 -1280210 -2135129 -2925908
9184 -2925908 -3584298 -3845320 -3543090 -2765677 -1752971 -865109 -509666 -669438 -1006022
9175 -1006022 -1134987 -1027217 -982339 -1133681 -1284389 -1241635 -923608 -487443 -312249 -449429
9165 -449429 -642586 -683643 -509976 -253306 133038 788846 1444599 1816927 2078425 2404200
9155 2404200 2800593 3218920 3613302 4010010 4270580 4229233 3817459 2959736 1777893 570373
9145 570373 -564828 -1638549 -2426017 -2682752 -2458210 -2037908 -1686949 -1370760 -807496
9136 -807496 42549 908776 1531591 1703785 1224109 266884 -607670 -943687 -780633 -379303
9126 -379303 -16703 -103017 -675729 -1235287 -1456670 -1313209 -790888 -145712 218373 267019
9116 267019 138020 643 65215 328646 565290 516400 176933 -191917 -541755 -779032
9106 -779032 -704830 -467668 -391036 -622989 -1089358 -1510493 -1574740 -1166587 -515136 78287
9096 78287 483275 442545 -99066 -697887 -748123 -129153 522138 751998 627113 329937
9086 329937 -62619 -636704 -1246815 -1654148 -1807154 -1693318 -1540726 -1724620 -2093955 -2104929
9076 -2104929 -1689706 -1224114 -1089764 -1253775 -1327883 -1271246 -1336943 -1537794 -1875046 -2269715
9066 -2269715 -2593185 -2889823 -3212125 -3492241 -3531282 -3230184 -2917713 -2984961 -3258063 -3416648
9056 -3416648 -3444211 -3446911 -3432441 -3250568 -2831485 -2285012 -1632976 -994895 -527271 -400765
9046 -400765 -556688 -750718 -944158 -1039246 -788746 -155533 478319 815078 959856 944033
9036 944033 523755 -585066 -2106627 -3449731 -4483444 -5308134 -5836910 -5826247 -5132877
9027 -5132877 -3956177 -2948225 -2589034 -2647733 -2690288 -2656446 -2608579 -2526403 -2445116 -2364052
9017 -2364052 -2189854 -1852445 -1515807 -1456006 -1555142 -1473907 -1229432 -1156925 -1461970 -1949562
9007 -1949562 -2418740 -2880547 -3339007 -3614916 -3657022 -3648942 -3628070 -3518251 -3253443 -2735843
8997 -2735843 -1846622 -703233 386018 1127700 1364186 1209901 932465 639385 370799
8988 370799 280984 367662 270638 -135779 -553798 -867835 -1217798 -1561484 -1820066 -2137578
8978 -2137578 -2502963 -2691540 -2695539 -2782649 -3135326 -3639913 -3899349 -3595781 -2898276 -2135113
8968 -2135113 -1479104 -998603 -620560 -370833 -301941 -374353 -593377 -907457 -1004004 -687863
8958 -687863 -322336 -121207 144426 332195 327601 248307 -25979 -554247 -1134488 -1451118
8948 -1451118 -1395041 -1190217 -969035 -793357 -809545 -849262 -677975 -273936 296872 890608
8938 890608 1193712 1154069 1021557 866009 649285 277237 -352861 -1221510 -2029430 -2595739
8928 -2595739 -2994757 -3172204 -3005370 -2660843 -2303428 -1925455 -1586584 -1395844 -1298333 -1187229
8918 -1187229 -1116011 -1205886 -1457999 -1736707 -1769345 -1341547 -394343 886258 2154283 3170379
8908 3170379 3810235 4099424 4042757 3713880 3371862 3155937 2974481 2777091 2623239 2460980
8898 2460980 2179813 1653783 1018269 234975 -776342 -1817817 -2554953 -2826796 -2879541
8889 -2879541 -2851162 -2707997 -2580108 -2642788 -2714490 -2423448 -1674774 -766664 -224575 -327172
8879 -327172 -852271 -1452209 -1870976 -2007384 -1929394 -1823275 -1829513 -1744953 -1175072 -251478
8869 -251478 519035 859561 926900 1031588 1277263 1602366 1882439 1883110 1474555 962269
8859 962269 649346 505555 627200 966140 1172568 1097434 704610 214017 -47498 -144731
8849 -144731 -316708 -711114 -1305224 -1940928 -2497993 -2805090 -2695776 -2196772 -1595030 -1195039
8839 -1195039 -950863 -697568 -293752 278798 933501 1736400 2705226 3649517 4384134 4556148
8829 4556148 4154341 3510291 2738014 2084209 1697308 1217601 379538 -465036 -889793 -930342
8819 -930342 -890813 -951929 -1120407 -1193754 -839114 -66757 822701 1648189 2226689 2291521
8809 2291521 1800655 1063231 336627 -478273 -1364757 -1972155 -2135974 -2002695 -1632789 -1081579
8799 -1081579 -513684 28102 459805 608822 530310 401908 255075 254160 624860 1146652
8789 1146652 1200070 505816 -471870 -1170807 -1514569 -1772892 -2041657 -2204415 -2192046 -2039535
8779 -2039535 -1840658 -1620428 -1446955 -1240682 -885949 -567048 -565528 -986118 -1553275 -1873001
8769 -1873001 -1736577 -1298500 -761744 -266314 54706 17847 -274427 -453567 -362403 -120851
8759 -120851 120787 293700 347145 231135 184541 358510 564520 715936 677070 366147
8749 366147 -73796 -343843 -317660 -249253 -462649 -1030174 -1686108 -2143168 -2118113 -1627582
8739 -1627582 -1131163 -1107270 -1482460 -1851301 -2158008 -2401691 -2329259 -1748151 -786156 386655
8729 386655 1612613 2490466 2808204 2800841 2677719 2462737 2223486 2017093 1797193 1601321
8719 1601321 1577502 1554610 1083481 251721 -306466 -334680 -241577 -418810 -731720 -897640
8709 -897640 -996429 -1117318 -1075709 -864574 -696320 -578050 -364891 -70525 150968 147848
8699 147848 -134656 -499286 -810702 -1174921 -1646960 -2029441 -1955311 -1407071 -802260 -426701
8689 -426701 -315769 -408303 -558272 -526602 -193380 459457 1430093 2484236 3355039 3895101
8679 3895101 4108113 4168274 4133078 3945732 3749973 3874149 4282791 4534723 4510320 4481851
8669 4481851 4506746 4441029 4170853 3682690 3029588 2399287 2019193 1829618 1672435 1378559
8659 1378559 880947 288383 -237284 -502649 -569932 -449316 -120713 118760 23715 -129553
8649 -129553 -60087 119447 158130 3650 -40242 86885 81470 -159036 -446786 -799654 -1235650
8638 -1235650 -1625783 -1818731 -1712850 -1449326 -1303998 -1333628 -1243004 -965146 -702175 -599827
8628 -599827 -654879 -874701 -1325257 -1960474 -2501547 -2558749 -1989503 -1282613 -1002075 -1228357
8618 -1228357 -1801889 -2406102 -2646334 -2494598 -2126180 -1558961 -739415 70021 426102 419910
8608 419910 446072 523634 448493 224154 11441 -63997 -54912 64731 328570 573510 623209
8597 623209 639494 832072 1017794 983951 855720 781298 705822 667506 650904 672374 708718
8586 708718 724317 762650 704673 521940 379364 439851 797840 1415735 2129721 3027512
8576 3027512 4368007 6057171 7735664 9086278 10197562 11462146 13067875 14733465
8568 14733465 15831719 15902232 15050279 13817377 12378903 10706082 8996513 7349710 5775853
8559 5775853 4398416 3469366 3051401 2843814 2457562 1853853 1227436 878988 970532 1379818
8549 1379818 1935086 2383945 2365077 1831909 1273718 979418 498480 -542920 -1734100
8540 -1734100 -2369284 -2180948 -1452868 -520565 292471 651983 452626 -180751 -987822 -1585839
8530 -1585839 -1637417 -1249842 -676461 87362 1080932 2072861 2641417 2532321 1839923 992957
8520 992957 321361 -73180 -97478 79943 270259 631305 1272994 1999331 2406942 2345708
8510 2345708 2008746 1657799 1492680 1589022 1767749 1795956 1568717 1095804 621346 406131
8500 406131 436541 460171 301963 126080 128664 240587 135460 -375110 -906371 -965282 -654878
8489 -654878 -333616 -106047 84292 81653 -244015 -657477 -816462 -562991 32242 717986
8479 717986 1170585 1148116 806975 675117 912533 1306578 1676027 1882124 1890897 1806293
8469 1806293 1781591 1914231 2116365 2270062 2395340 2381466 1983811 1219482 600216 487502
8459 487502 683982 849152 765207 572840 565044 702141 686991 421647 180361 248048 701470
8448 701470 1502983 2380972 2748947 2230184 1064377 -249498 -1202905 -1493730 -1256613
8439 -1256613 -691555 88807 808164 1103381 912117 448135 22942 -338921 -735983 -1187083
8429 -1187083 -1604754 -1668847 -1195596 -361972 226972 226125 -117962 -431302 -672106 -924456
8419 -924456 -1096514 -967683 -462200 244480 1097660 2183297 3244281 3724528 3475194
8410 3475194 2727855 1792529 1021518 722831 767352 801276 754681 655603 363869 -94615
8400 -94615 -430412 -635927 -850047 -984163 -879016 -816355 -1145009 -1850020 -2533430 -2863370
8390 -2863370 -2904006 -2582600 -1873770 -1077720 -298657 556134 1111117 1035240 526323 77923
8380 77923 112454 461954 715525 653222 325015 -69533 -485311 -866038 -955176 -623726
8370 -623726 2616 519915 635428 434661 39044 -495275 -1020094 -1381323 -1641275 -1891008
8360 -1891008 -2139511 -2345431 -2616228 -2909414 -2949627 -2695850 -2306471 -1925216 -1681609 -1522517
8350 -1522517 -1286603 -1016126 -872837 -1008771 -1382347 -1752377 -1972893 -2041830 -1895952 -1611428
8340 -1611428 -1295016 -928919 -553119 -249774 88535 535724 886200 880338 436084 -152557
8330 -152557 -496521 -551671 -519757 -307359 53943 125651 -328882 -1089473 -1610426 -1658745
8320 -1658745 -1504250 -1435373 -1577509 -1847222 -1962515 -1657073 -1111355 -727742 -547963 -347798
8310 -347798 -107127 68994 272820 619801 997750 1084419 773794 451460 339659 283524
8300 283524 171154 -73293 -441286 -948567 -1590645 -2192506 -2395923 -1978364 -1141539 -313590
8290 -313590 438158 1239887 2022919 2631013 2816299 2465803 1587377 410924 -553635 -948965
8280 -948965 -847175 -380691 165609 436042 335576 -27051 -467621 -785606 -805421 -581623
8270 -581623 -345702 -343329 -586254 -797245 -834395 -917121 -1169902 -1462748 -1550635 -1441912 -1344265
8259 -1344265 -1336896 -1336192 -1137035 -611714 121746 750125 1035047 947014 758410 793452 918471
8248 918471 618545 -191739 -914437 -1039936 -626182 10213 684678 1360257 2006147 2475990
8238 2475990 2549983 1884974 735857 -185013 -649316 -727172 -508337 -157381 227378 626593
8228 626593 765945 470120 15919 -328915 -486747 -303405 250285 942201 1580025 2026969
8218 2026969 2321750 2706976 3296749 4113714 5099353 5829965 5843635 5161427 4077331 2997581
8208 2997581 2117293 1078743 -180797 -1286287 -1995083 -2073980 -1464808 -424909 512935
8199 512935 838668 614901 192751 -359976 -1049129 -1565963 -1581114 -1261793 -965464 -831992
8189 -831992 -822521 -738889 -443066 -145128 -272439 -868439 -1630903 -2310938 -2643831 -2545880
8179 -2545880 -2267988 -1972650 -1518419 -886177 -134904 711103 1543869 2125975 2306001 2324100
8169 2324100 2474415 2628841 2332619 1384233 115613 -1088439 -1904963 -2129841 -1979732
8160 -1979732 -1875136 -1894974 -1803391 -1404175 -708171 -39736 268742 117404 -321260 -809997
8150 -809997 -1274857 -1798690 -2443567 -3049553 -3563342 -4073908 -4399048 -4238794 -3541342 -2610736
8140 -2610736 -1764555 -1191226 -1174908 -1728671 -2404079 -2835388 -3056184 -3353549 -3797016 -4021517
8130 -4021517 -3946188 -3901948 -3845733 -3488438 -2850360 -2104301 -1346101 -776583 -636662 -728723
8120 -728723 -955643 -1462408 -1907484 -1647550 -799744 -213943 -212295 -375318 -480803 -810798
8110 -810798 -1543521 -2483014 -3204288 -3443051 -3298618 -2916750 -2315976 -1512711 -623863 110504
8100 110504 582715 848169 790283 369424 -158981 -744908 -1378462 -2010718 -2580094 -2926530
8090 -2926530 -3001249 -2907878 -2811454 -2692655 -2543143 -2505047 -2770803 -3209333 -3505059 -3393914
8080 -3393914 -2794901 -1980850 -1145868 -374125 224280 563622 619306 346151 -222419 -885017
8070 -885017 -1231756 -1151513 -881131 -477552 63991 454283 493418 222763 -186468 -508698
8060 -508698 -653698 -588794 -294759 193286 752411 1127015 1067479 763404 802319 1435682
8050 1435682 2206862 2771651 3015601 2820524 2185295 1266349 419746 5162 129872 578840
8040 578840 970398 1096847 1157389 1378345 1645569 1749728 1631529 1425407 1268903 1140528
8030 1140528 1045252 944249 821029 768528 868308 1064020 1111856 1143623 1469238 1866328
8020 1866328 2016593 1808328 1224698 462079 -230116 -675329 -760373 -514989 50571 873857
8010 873857 1705779 2409970 2983420 3298872 3031073 2187502 1231326 552311 300886 437115
8000 437115 831966 1259856 1348325 1125426 851520 619729 296773 -114953 -431146 -714982
7990 -714982 -1160273 -1694263 -2167596 -2651037 -3117025 -3390242 -3258306 -2814088 -2505923 -2550751
7980 -2550751 -2646368 -2611081 -2489269 -2303836 -2009486 -1647640 -1513017 -1624179 -1800313 -1926106
7970 -1926106 -1853427 -1599122 -1445515 -1427150 -1525325 -1952330 -2602695 -3194172 -3526861 -3475568
7960 -3475568 -3147355 -2906555 -2942986 -2979030 -2592343 -1840211 -1116264 -565869 -23117 478972
7950 478972 571822 225681 -268753 -904062 -1786538 -2586259 -2904193 -2695075 -2197065 -1854050
7940 -1854050 -1886367 -2168020 -2493267 -2545713 -2116265 -1496769 -1022077 -608240 -157022 137989
7930 137989 32338 -338423 -644462 -867212 -948214 -854316 -688978 -425850 -91079 73523
7920 73523 -19166 -235968 -359340 -310010 -152847 243495 997242 1853822 2384613 2415816
7910 2415816 2072986 1678517 1470870 1330387 1064922 748417 502158 307681 230624 405145
$$ [...]
##END NTUPLES=NMR SPECTRUM
##END=
