##TITLE=C13_Ser 5144
 CDCl3, 22300sc

 25.7.2024
##JCAMPDX= 6.0         $$ Bruker NMR JCAMP-DX V2.0
##DATA TYPE= NMR SPECTRUM
##DATA CLASS= NTUPLES
##ORIGIN= UXNMR, Bruker Analytische Messtechnik GmbH
##OWNER= root
$$ XWIN-NMR		Version 3.5
$$ Fri Jul 26 15:40:36 2024 Russian Standard Time (UT+4h)  she@DPX200
##.OBSERVE FREQUENCY= 50.327896
##.OBSERVE NUCLEUS= ^13C
##.ACQUISITION MODE= SIMULTANEOUS
##.ACQUISITION SCHEME= undefined
##.AVERAGES= 25268
##.DIGITISER RES= 17
##SPECTROMETER/DATA SYSTEM= spect
##.PULSE SEQUENCE= zgpg30
##.SOLVENT NAME= CDCl3
##.SHIFT REFERENCE= (INTERNAL, CDCl3, 0, 222.565)
##AUDIT TRAIL= $$ (NUMBER, WHEN, WHO, WHERE, WHAT)
$$ ##TITLE= Audit trail, XWIN-NMR		Version 3.5
$$ ##JCAMPDX= 5.01
$$ ##ORIGIN= Bruker BioSpin GmbH
$$ ##OWNER= she
$$ F:/spectra/data/she/nmr/c13/1/pdata/1/auditp.txt
$$ ##AUDIT TRAIL=  $$ (NUMBER, WHEN, WHO, WHERE, WHAT)
(   1,<2024-07-25 15:39:50.01 +0400>,<she>,<DPX200>,
      <acquisition in progress>)
(   2,<2024-07-26 15:39:48.70 +0400>,<she>,<DPX200>,
      <Start of raw data processing
       efp BC_mod = 2 LB = 2 FT_mod = 6 PKNL = 1 PHC0 = -538.8404 PHC1 = 31.58855 SI = 32K 
       data hash MD5: 32K
       43 82 D1 82 8C B1 8F E3 7C F6 DA BE 8F F7 D2 1C>)
(   3,<2024-07-26 15:39:51.71 +0400>,<she>,<DPX200>,
      <abs ABSG = 5 
       data hash MD5: 32K
       5E BF D6 9B BE C7 04 86 E2 5F 1D BA 8E 2D 0C 82>)
$$ ##END=
$$ 
$$ hash MD5
$$ D1 0A E5 B9 9F 4B 1C F9 2F EC 90 43 88 F0 6E 64
##$RELAX= 
##$RELAX= 
##$RELAX= 
##$RELAX= 
##$RELAX= 
##$RELAX= 
##$RELAX= 
##$RELAX= 
$$ Bruker specific parameters
$$ --------------------------
##$DU= <F:/spectra>
##$EXPNO= 1
##$NAME= <c13>
##$PROCNO= 1
##$TYPE= <nmr>
##$USER= <she>
##$AMP= (0..31)
100 100 100 100 100 100 100 100 100 100 100 100 100 100 100 100 100 100 
100 100 100 100 100 100 100 100 100 100 100 100 100 100 
##$AQSEQ= 0
##$AQ_mod= 1
##$AUNM= <au_zg>
##$AUTOPOS= <>
##$BF1= 50.322709
##$BF2= 200.13
##$BF3= 50.322709
##$BF4= 500.13
##$BF5= 500.13
##$BF6= 500.13
##$BF7= 500.13
##$BF8= 500.13
##$BYTORDA= 1
##$CFDGTYP= 0
##$CFRGTYP= 5
##$CHEMSTR= <none>
##$CNST= (0..31)
1 1 145 1 1 1 1 1 1 1 1 1 1 1 1 1 1 1 1 1 1 1 1 1 1 1 1 1 1 1 1 1 
##$CPDPRG= <waltz16>
##$CPDPRG1= <>
##$CPDPRG2= <waltz16>
##$CPDPRG3= <>
##$CPDPRG4= <mlev>
##$CPDPRG5= <mlev>
##$CPDPRG6= <mlev>
##$CPDPRG7= <mlev>
##$CPDPRG8= <mlev>
##$CPDPRGB= <>
##$CPDPRGT= <>
##$D= (0..31)
0 2 0.00345 0 0 0 0 0 0 0 0 0.03 2e-05 3e-06 0 0 0 0 0 0 0 0 0 0 0 0 0 
0 0 0 0 0 
##$DATE= 1721907676
##$DBL= (0..7)
120 120 120 120 120 120 120 120 
##$DBP= (0..7)
150 150 150 150 150 150 150 150 
##$DBP07= 0
##$DBPNAM0= <>
##$DBPNAM1= <>
##$DBPNAM2= <>
##$DBPNAM3= <>
##$DBPNAM4= <>
##$DBPNAM5= <>
##$DBPNAM6= <>
##$DBPNAM7= <>
##$DBPOAL= (0..7)
0.5 0.5 0.5 0.5 0.5 0.5 0.5 0.5 
##$DBPOFFS= (0..7)
0 0 0 0 0 0 0 0 
##$DE= 6
##$DECBNUC= <off>
##$DECIM= 12
##$DECNUC= <off>
##$DECSTAT= 4
##$DIGMOD= 1
##$DIGTYP= 9
##$DL= (0..7)
120 120 120 120 120 120 120 120 
##$DP= (0..7)
150 150 150 150 150 150 150 150 
$$ [...]
##$SUBNAM4= <"">
##$SUBNAM5= <"">
##$SUBNAM6= <"">
##$SUBNAM7= <"">
##$SUBNAM8= <"">
##$SUBNAM9= <"">
##$SW= 239.972175391363
##$SWIBOX= (0..15)
0 1 3 0 0 0 0 0 0 0 0 0 0 0 0 0 
##$SW_h= 12077.2946859903
##$TD= 32768
##$TD0= 1
##$TE= 0
##$TE2= 300
##$TE3= 300
##$TEG= 300
##$TL= (0..7)
120 120 120 120 120 120 120 120 
##$TP= (0..7)
150 150 150 150 150 150 150 150 
##$TP07= 0
##$TPNAME0= <>
##$TPNAME1= <>
##$TPNAME2= <>
##$TPNAME3= <>
##$TPNAME4= <>
##$TPNAME5= <>
##$TPNAME6= <>
##$TPNAME7= <>
##$TPOAL= (0..7)
0.5 0.5 0.5 0.5 0.5 0.5 0.5 0.5 
##$TPOFFS= (0..7)
0 0 0 0 0 0 0 0 
##$TUNHIN= 0
##$TUNHOUT= 0
##$TUNXOUT= 0
##$USERA1= <user>
##$USERA2= <user>
##$USERA3= <user>
##$USERA4= <user>
##$USERA5= <user>
##$V9= 5
##$VALIST= <valist>
##$VCLIST= <CCCCCCCCCCCCCCC>
##$VD= 0
##$VDLIST= <DDDDDDDDDDDDDDD>
##$VPLIST= <PPPPPPPPPPPPPPP>
##$VTLIST= <TTTTTTTTTTTTTTT>
##$WBST= 1024
##$WBSW= 4
##$XGAIN= (0..3)
0 0 0 0 
##$XL= 0
##$YL= 0
##$YMAX_a= 46213088
##$YMIN_a= -159393779
##$ZGOPTNS= <>
##$ZL1= 120
##$ZL2= 120
##$ZL3= 120
##$ZL4= 120
##$ABSF1= 222.5654
##$ABSF2= -17.4314
##$ABSG= 5
##$ABSL= 3
##$ALPHA= 0
##$AQORDER= 0
##$ASSFAC= 0
##$ASSFACI= 0
##$ASSFACX= 0
##$ASSWID= 0
##$AUNMP= <proc_1d>
##$AZFE= 0.1
##$AZFW= 0.5
##$BCFW= 0
##$BC_mod= 2
##$BYTORDP= 0
##$COROFFS= 0
##$CY= -3
##$DATMOD= 1
##$DC= 0
##$DFILT= <>
##$DTYPP= 0
##$F1P= 0
##$F2P= 0
##$FCOR= 0.5
##$FTSIZE= 32768
##$FT_mod= 6
##$GAMMA= 0
##$GB= 0
##$INTBC= 1
##$INTSCL= 4.134877e-10
##$ISEN= 128
##$LB= 2
##$LEV0= 0
##$LPBIN= 0
##$MAXI= 10000
##$MC2= 0
##$MEAN= 0
##$ME_mod= 0
##$MI= 0.1934396
##$NCOEF= 0
##$NC_proc= 1
##$NLEV= 6
##$NOISF1= 120.0001
##$NOISF2= 80.00006
##$NSP= 0
##$NTH_PI= 0
##$NZP= 0
##$OFFSET= 222.5654
##$PC= 1.4
##$PHC0= -538.8404
##$PHC1= 31.58855
##$PH_mod= 1
##$PKNL= yes
##$PPARMOD= 0
##$PSCAL= 0
##$PSIGN= 0
##$REVERSE= no
##$SF= 50.3227345484362
##$SI= 32768
##$SIGF1= 140
##$SIGF2= 120
##$SINO= 11.81781
##$SIOLD= 32768
##$SREGLST= <13C.CDCl3>
##$SSB= 0
##$STSI= 32768
##$STSR= 0
##$SW_p= 12077.2946859903
##$SYMM= 0
##$S_DEV= 0
##$TDeff= 32768
##$TDoff= 0
##$TI= <>
##$TILT= no
##$TM1= 0
##$TM2= 0
##$TOPLEV= 0
##$USERP1= <user>
##$USERP2= <user>
##$USERP3= <user>
##$USERP4= <user>
##$USERP5= <user>
##$WDW= 1
##$XDIM= 32768
##$YMAX_p= 441358561
##$YMIN_p= -4166817
$$ End of Bruker specific parameters
$$ ---------------------------------
##NTUPLES= NMR SPECTRUM
##VAR_NAME=  FREQUENCY,     SPECTRUM/REAL,   SPECTRUM/IMAG
##SYMBOL=    X,             R,               I
##VAR_TYPE=  INDEPENDENT,   DEPENDENT,       DEPENDENT
##VAR_FORM=  AFFN,          ASDF,            ASDF
##VAR_DIM=   32768,         32768,           32768
##UNITS=     HZ,            ARBITRARY UNITS, ARBITRARY UNITS
##FACTOR=    0.368581032318806, 1,           1
##FIRST=     11200.0995020947, 0,            0
##LAST=      -877.195183895579, 0,           0
##MIN=       -877.195183895579, -4166817,    0
##MAX=       11200.0995020947, 441358561,    0
$$ Real data points
##PAGE= N=1
##DATA TABLE= (X++(R..R)), XYDATA
$$ [...]
11372i42641q7658k29137k95204k08085l9233J34051L26761L86040K30178r6233
$$ -942641 -1030299 -1259436 -1554640 -1762725 -1801958 -1667907 -1341146 -955106 -724928 -821161
11362h21161l60649k64541J11J18819R3713J16012J70833J08678j29982l83525
$$ -821161 -1181810 -1446351 -1446240 -1327421 -1233708 -1117696 -946863 -838185 -968167 -1351692
11352a351692m24373k56996K4939K77644L64045K59186J27953L8650o0404j56668
$$ -1351692 -1776065 -2033061 -2008122 -1730478 -1366433 -1107247 -979294 -940644 -1001048 -1157716
11342a157716j89336j75780l8140J73416K32726J54832N0169O1641K08252Q3197
$$ -1157716 -1347052 -1522832 -1560972 -1387556 -1154830 -999998 -949829 -888188 -679936 -596739
11332e96739l44335n37867l36994j64092j27015q043J29061O8997p2554o8891
$$ -596739 -941074 -1478941 -1815935 -1980027 -2107042 -2115085 -1986024 -1917027 -1989581 -2058472
11322b058472N2238J49657J83368K16679J78026K460j73219j62987j919P4759
$$ -2058472 -2006234 -1856577 -1673209 -1456530 -1278504 -1276044 -1449263 -1612250 -1614169 -1539410
11312a539410l8136j55726n2623K50907L95745K90800J63444J56391K28111L06708
$$ -1539410 -1577546 -1733272 -1785895 -1534988 -1139243 -848443 -684999 -528608 -300497 6211
11302F211L24960J89985J4253N361J0638k25274m67073n25022m45212k30012O7184
$$ 6211 331171 521156 535409 540770 551408 326134 -140939 -665961 -1111173 -1341185 -1274001
11291a274001K29923J32898J11598L35506M75817L63231J90242J38260J10660
$$ -1274001 -1044078 -911180 -799582 -464076 11741 374972 565214 703474 814134
11282H14134p4155k68923k00605J28315L32544L17235K36918M0474k04551m23815
$$ 814134 739979 471056 270451 398766 731310 1048545 1285463 1325937 1121386 697571
11272F97571n60238m83253k06288N1788R3097l1638j20708o8046m1904j09168
$$ 697571 137333 -345920 -552208 -500420 -407323 -438961 -559669 -627715 -669619 -778787
11262g78787j42914j01563l6481M236K3906L2819P0467L8301k1304J07144L25660
$$ -778787 -921701 -1023264 -1059745 -1055509 -1031603 -998784 -928317 -890016 -911320 -804176 -478516
11251d78516M02960K88746J22170P0489o741j62527k91681l19085j67180K5555
$$ -478516 -75556 213190 335360 405849 399108 236581 -55100 -374185 -541365 -515810
11241e15810J26613Q4929l788n6730j5259J46237K57067K35595J82293J57166
$$ -515810 -389197 -304268 -308056 -364786 -380045 -233808 23259 258854 441147 598313
11231E98313J3665k43932l37813k25453r0878r722Q7263J78866K67553L34949
$$ 598313 611978 368046 30233 -195220 -286098 -295820 -208557 -29691 237862 572811
11221E72811L00881K43901K03973J29913K6806j92706m54621n37664m86674m56010
$$ 572811 873692 1117593 1321566 1451479 1478285 1285579 830958 293294 -193380 -649390
11211f49390l64757j34514L6507K2786J3043J09630L4538j57624j07209K27276
$$ -649390 -1014147 -1148661 -1112154 -1089368 -1076325 -966695 -932157 -1089781 -1196990 -969714
11201i69714M69846L64325J9157l49679n31348m76346l18676j82091j35990j44530
$$ -969714 -499868 -135543 -116386 -466065 -997413 -1473759 -1792435 -1974526 -2110516 -2255046
11191b255046p9168J28496K68976K26617J54442J30875Q8436m9374j59927j26290
$$ -2255046 -2334214 -2205718 -1936742 -1710125 -1555683 -1424808 -1336372 -1385746 -1545673 -1671963
11181a671963q1912k01202l29501j98461P6754O0551k63093m44861k73569j4210
$$ -1671963 -1753875 -1955077 -2284578 -2483039 -2406285 -2345734 -2608827 -3053688 -3327257 -3341467
11171c341467J17759J69843K61440M37115N88564N65449M61365M83647N69828
$$ -3341467 -3223708 -3053865 -2792425 -2355310 -1766746 -1201297 -739932 -256285 313543
11162C13543N73463M66779K73968M5609p5125j07481j57221j86682j60860j78376
$$ 313543 887006 1353785 1627753 1673362 1598237 1490756 1333535 1146853 985993 807617
11152H07617k61535l54236m09408l22287j66200j7863M2024J0545J1167J60764
$$ 807617 546082 191846 -217562 -539849 -706049 -723912 -681888 -671343 -660176 -499412
11142d99412K39251K9450k76875l45861j36500P2032P4674J3009R7315J55224
$$ -499412 -260161 -230711 -507586 -853447 -989947 -917915 -843241 -830232 -732917 -577693
11132e77693O7412l3203l7452j765Q0644J54693R0092m8146n0842O9173J92963
$$ -577693 -510281 -543484 -580936 -582701 -502057 -347364 -257272 -305418 -356260 -287087 -94124
11121i4124K76406K59460K01825J58256J00510J00211J80508K60652J37885j60866
$$ -94124 182282 441742 643567 801823 902333 1002544 1183052 1443704 1581589 1420723
11111A420723l94921m33256l44991l07821l46078l12537q2612J98581J84268j9703
$$ 1420723 1025802 592546 247555 -60266 -406344 -718881 -801493 -602912 -418644 -438347
11101d38347l6104J10578J64808J38588Q3830l4802r7322J42833N14124M64134
$$ -438347 -474451 -363873 -199065 -60477 23353 -11449 -108771 34062 548186 1012320
11091A012320P2862k11622l52228m43558n69231o31154m93930k55087o4928M0443
$$ 1012320 1085182 873560 521332 77774 -491457 -1122611 -1616541 -1871628 -1936556 -1896113
11081a896113J19852J73640K26374K45243K75747L35787M45985M88201L21507
$$ -1896113 -1776261 -1602621 -1376247 -1131004 -855257 -519470 -73485 414716 736223
11072G36223J06929j3467o0036p2180j07364j47347j34218j34518j60177j25423
$$ 736223 843152 829685 769649 697469 590105 442758 308540 174022 13845 -111578
11062a11578L9396N6453l32655q12700r12396o58482l39655n7393J65787K85315
$$ -111578 -72182 -15729 -348384 -1161084 -2073480 -2731962 -3071617 -3129010 -2963223 -2677908
11052b677908L22570K62887J83481J66518R8016N2052P4124J77226K42113J91877
$$ -2677908 -2355338 -2092451 -1908970 -1742452 -1644436 -1592384 -1518260 -1341034 -1098921 -907044
11042i07044J81808K42837K66081J23857j20846j93552o0013J41468K61806K15009
$$ -907044 -725236 -482399 -216318 -92461 -213307 -406859 -466872 -325404 -63598 151411
11032A51411j7688k62213l62087l62866k86527k33109k68851k85601l29845l25119
$$ 151411 133723 -128490 -490577 -853443 -1139970 -1373079 -1641930 -1927531 -2257376 -2582495
11022b582495r4230L12843N78186N08126K70295N1928j21513r0658J33763L32758
$$ -2582495 -2676725 -2363882 -1785696 -1277570 -1007275 -955347 -1076860 -1167518 -1033755 -700997
11012g00997M76394M39960K37991O3233K1122M9087O8165q3135l31626m58923
$$ -700997 -224603 215357 453348 516581 537703 586790 654955 571820 240194 -218729
11002b18729l32940p7253J23116K20281J87783J1584k03643j97550R8590N16280
$$ -218729 -551669 -628922 -505806 -285525 -97742 -86158 -289801 -487351 -388761 127519
10992A27519P25388N77915L16929J69833P6679j3231j23096j74502k10874l20341
$$ 127519 852907 1430822 1747751 1917584 1994263 1981032 1857936 1683434 1472560 1152219
10982A152219m15184l28902j18920j69036m16286l20705j9501R232l1211N2286
$$ 1152219 737035 408133 289213 120177 -296109 -616814 -636315 -627083 -658294 -606008
10972f06008J892j92447k70571k29325j41875j7349P0248P7599K2742k0109Q2523
$$ -606008 -604116 -796563 -1067134 -1296459 -1438334 -1455683 -1385435 -1307836 -1285094 -1305203 -1222680
10961a222680K98207L97353K88046J71686Q6304K4755J70505M17468M57671J98587
$$ -1222680 -924473 -527120 -239074 -67388 18916 43671 214176 631644 1089315 1287902
10951A287902j60917k91655k39636k47509l42674l90356k08802O5613J31097J9685
$$ 1287902 1126985 835330 595694 348185 5511 -384845 -593647 -528034 -396937 -377252
10941c77252n623P1358J21306J55592J72004J46844J41960J29548J61614K76953
$$ -377252 -382875 -311517 -190211 -34619 137385 284229 426189 555737 717351 994304
10931I94304K71607O1587j11388j29568j20308j05083l9702K2871k4623j56007
$$ 994304 1265911 1327498 1216110 1086542 966234 861151 821449 844320 819697 663690
10921F63690l11954m55380l97807j65058k2143J7849j8294j30979k66523l15865
$$ 663690 351736 -103644 -501451 -666509 -688652 -670803 -689097 -820076 -1086599 -1402464
10911a402464j35973J40396K48587K39079J99537O7938j43239l53197m46279m04061
$$ -1402464 -1538437 -1398041 -1149454 -910375 -710838 -642900 -786139 -1139336 -1585615 -1989676
10901a989676k22226N925K12364M29304N91705O63667O14101M75583K63400j4216
$$ -1989676 -2211902 -2205977 -1993613 -1564309 -972604 -308937 305164 780747 1044147 1029931
10891A029931j94727j63179p3404q1471j13882q7555r1244j18878n0737l771n4668
$$ 1029931 835204 672025 598621 517150 403268 315713 224469 105591 54854 51083 -3585
10880c585k02363k43772j21283j9396q7064k03347k17210k02424j65540q7859
$$ -3585 -205948 -449720 -571003 -590399 -677463 -880810 -1098020 -1300444 -1465984 -1553843
10870a553843M6921L22968N69113N42700K85398N0351l4523r5179q9519j9458
$$ -1553843 -1506922 -1183954 -614841 -72141 213257 263608 229085 133906 44387 24929
10860B4929K2206J36760L20980L60487K73923K01146O3485j16168k53361m13885
$$ 24929 47135 183895 504875 865362 1139285 1340431 1403916 1287748 1034387 620502
10850F20502n10801m57809k22792j8017M931p0541k00485l27616l58246k65464
$$ 620502 109701 -348108 -570900 -588917 -583986 -654527 -855012 -1182628 -1540874 -1806338
10840a806338k03877o3101K15415L64005M34974N51842O23489O44780N10071J44575
$$ -1806338 -2010215 -2073316 -1857901 -1493896 -1058922 -507080 116409 761189 1271260 1415835
10830A415835o9943r3064j58012j73497k6704J69365J59169J2879J8484J45534
$$ 1415835 1345892 1252828 1094816 921319 894615 1063980 1223149 1236028 1254512 1400046
10820A400046J99219J41362l9974k58263l80604l89385l48738l02973j82635j07408
$$ 1400046 1599265 1740627 1700653 1442390 1061786 672401 323663 20690 -161945 -269353
10810b69353j58574j52744n1587k0874j14829j98974j17787J03834K25802J27946
$$ -269353 -427927 -580671 -632258 -653132 -767961 -966935 -1084722 -980888 -755086 -627140
10800f27140N313p3919j61863k28331k67832l34716k98784o0743J76699K08904
$$ -627140 -621827 -695746 -857609 -1085940 -1353772 -1688488 -1987272 -2048015 -1871316 -1662412
10790a662412K14420L30339M34567L48127J34897N0583J02753P7066N3474J15723
$$ -1662412 -1447992 -1117653 -683086 -334959 -200062 -149479 -46726 30340 83814 199537
10780A99537M2265j61297k89896l33280k79729j55747q6240j01540n1270R6776
$$ 199537 241802 80505 -209391 -542671 -822400 -978147 -1064387 -1165927 -1217197 -1120421
10770a120421J71441J12161n2739k50256l68080l40654k17498k1478K06030M05764
$$ -1120421 -948980 -836819 -889558 -1139814 -1507894 -1848548 -2066046 -2087524 -1881494 -1475730
10760a475730N63276N95465L89787J66113N2674k9993j01757j03243r401J86820
$$ -1475730 -912454 -316989 72798 238911 291585 261592 159835 56592 47191 234011
10750B34011L67201L19357P3063q3849J0809J18421J87670K63327K30122J53049
$$ 234011 601212 920569 993632 909783 920592 1039013 1226683 1490010 1720132 1873181
10740A873181N3702r5396j88139j30878j044R3797R6050o200j46044j91309q7895
$$ 1873181 1926883 1831487 1643348 1512470 1511426 1605223 1701273 1695073 1549029 1357720 1269825
10729A269825L4487J4691j64508l01156l15627k78212j91195j43377j91187k06999
$$ 1269825 1304312 1319003 1154495 853339 537712 259500 68305 -75072 -266259 -473258
10719d73258p1841J83122L24331K65136J19763m4586j67468r8576Q8189O1201
$$ -473258 -545099 -361977 -37646 227490 347253 302667 135199 36623 124812 186013
10709A86013p0344o8869o0447l7904J7142m747j4833J7450K0480L9383Q3147J48482
$$ 186013 115669 46800 -13647 -51551 -34409 -39156 -53989 -36539 -16059 23324 106471 254953
10697B54953K29170K18160J40948J44047O0930k05028l63241k59289k765J33475
$$ 254953 484123 702283 843231 987278 1048208 843180 479939 220650 217885 351360
10687C51360l8203l49659l63678m3509J63726J72477J90232K03273R4136l4859
$$ 351360 313157 -36502 -400180 -443689 -279963 -107486 82746 286019 380155 345296
10677C45296k5839K3643k2688j51967k76479k87999k10242q7374R4796K78074
$$ 345296 319457 343100 320412 168445 -108034 -396033 -606275 -693649 -598853 -320779
10667c20779L75376M19482N65143P91076Q45415P53302P42447P69253P97061Q93940
$$ -320779 54597 474079 1039222 1830298 2675713 3429015 4171462 4940715 5737776 6631716
10657F631716R74813R92199J191262J676829K320800K949151L471692L834691
$$ 6631716 7606529 8598728 9789990 11466819 13787619 16736770 20208462 24043153
10649B4043153L840803L708242L986341M793214O079950P715528R658331J2034423
$$ 24043153 27883956 31592198 35578539 40371753 46451703 54167231 63825562 75859985
10641G5859985J4122625J3661770Q208971j477549j0266909j4300959j4464462
$$ 75859985 89982610 103644380 111853351 110375802 100108893 85807934 71343472
10634G1343472j2896791j0696990q541935o874092n593278m535436l600931k670203
$$ 71343472 58446681 47749691 39207756 32333664 26740386 22204950 18604019 15933816
10626A5933816j828646j270289j028421q98119o02397k14786o6088k05395l60353
$$ 15933816 14105170 12834881 11806460 10908341 10305944 10091158 10025070 9819675 9459322
10617I459322m54638m84829l08763K58Q7714m8289j63013k43090m09229n86515
$$ 9459322 9004684 8519855 8211092 8211350 8299064 8250775 8087762 7844672 7435443 6848928
10607F848928n79130m00574k39225j71770q6620l7267j27434j86323j28681j40233
$$ 6848928 6269798 5869224 5629999 5458229 5371609 5334342 5206908 5020585 4891904 4751671
10597D751671k77905n23345q12405r43592p89859m02814R2679M78365N56188L76432
$$ 4751671 4473766 3950421 3138016 2194424 1404565 1001751 1094430 1572795 2128983 2505415
10587B505415N7503k00674k90786l24256l89716l82719l12856l49244m85614n44689
$$ 2505415 2562918 2362244 2071458 1747202 1357486 974767 661911 312667 -172947 -717636
10577g17636n34407l94078l3430L29956N37743M69653J61862j13533j84327j72298
$$ -717636 -1252043 -1646121 -1679551 -1349595 -811852 -342199 -180337 -293870 -478197 -650495
10567f50495j55955j05516k7055K1762P4496J80631K24333K42282L11204L12909
$$ -650495 -806450 -911966 -939021 -917259 -842763 -662132 -437799 -195517 115687 428596
10557D28596J76106N5767J50601L16817L24404K04389M9992j16055j14120O0679
$$ 428596 604702 660469 811070 1127887 1452291 1656680 1706672 1590617 1476497 1537176
10547A537176Q8064n7472p0752P4034R5683q2443k31737k93856k85553k60870
$$ 1537176 1625240 1567768 1497016 1571050 1666733 1584290 1352553 1058697 773144 512274
10537E12274l30345m69441n66219m49185j23629J89231K45482J28150Q5020J95441
$$ 512274 181929 -287512 -853731 -1302916 -1426545 -1237314 -991832 -863682 -778662 -583221
10527e83221L17407K94567J95882J07166O7967j2099j29359j07402o513O2248
$$ -583221 -265814 28753 224635 331801 399768 387669 258310 150908 144395 206643
10517B06643Q0337l7360j97128k48092k76505k81440j85774l5357J29515K54550
$$ 206643 286980 249620 52492 -195600 -472105 -753545 -939319 -974676 -845161 -590611
10507e90611K35343J63759J83372M1401k39979k71275j54508j92864k72204j71919
$$ -590611 -355268 -191509 -8137 33264 -206715 -477990 -632498 -825362 -1097566 -1269485
10497a269485n874N8887K8465m3002j25052q5401K7074Q1082J94347M05547N26416
$$ -1269485 -1275359 -1216472 -1188007 -1231009 -1356061 -1441462 -1414388 -1333306 -1138959 -733412 -206996
10486b06996N19449M81466L69811J33243j53129l52424l74612j72566J31771J94614
$$ -206996 312453 793919 1163730 1296973 1143844 791420 416808 244242 376013 570627
10476E70627k4131k50021l47685k53950j04801m3816j1124N0584J01134J74842
$$ 570627 546496 296475 -51210 -305160 -409961 -453777 -464901 -414317 -313183 -138341
10466a38341J48976l0268j72653j51485k2451O4152j3627j25714j12461n4200
$$ -138341 10635 -19633 -192286 -343771 -366222 -302070 -315697 -441411 -553872 -608072
10456f08072R1266M30339Q13637Q50374M67193q5578m93384o67684p97212p80185
$$ -608072 -516806 -86467 727170 1577544 2044737 1959159 1465775 798091 879 -779306
10446g79306m88563j13004J64769L40987M41710M17332J97583q7732j72851m1471
$$ -779306 -1267869 -1380873 -1216104 -875117 -433407 -16075 181508 93776 -79075 -120546
10436a20546J82170K79230K23749K02688J54074O1529K202L5228J03357P0098
$$ -120546 61624 340854 564603 767291 921365 982894 985096 1020324 1123681 1193779
10426A193779K2500J49593L58641M04692L09907J07820j11347k17868k40394l54620
$$ 1193779 1216279 1365872 1724513 2129205 2439112 2546932 2435585 2217717 1977323 1622703
10416A622703n02184n01039m48946m47857l50033j59139Q4320J69432J11451J22098
$$ 1622703 1120519 619480 170534 -277323 -627356 -786495 -702175 -532743 -421292 -299194
10406b99194J83172K48920K31851J17740q260J727N2377L4186K1108R3112J63416
$$ -299194 -116022 132898 364749 482489 474229 475956 528333 562519 583627 676739 840155
10395H40155K22102J76712j9143j58108j99539k30027j97763j94555j49974J13670
$$ 840155 1062257 1238969 1219826 1061718 862179 632152 434389 239834 89860 203530
10385B03530L43186L27466J22630j31414k11991j66070k75180m08779l06882n691
$$ 203530 546716 874182 996812 865398 653407 487337 212157 -196622 -503504 -509195
10375e09195L36411N74366N84298L05734r2946l42709m31793l62942j43314L3740
$$ -509195 -172784 401582 985880 1291614 1198668 855959 424166 61224 -82090 -48350
10365d8350J02613J70454K45069J81326Q771k8480J52914L47235K96633N1057
$$ -48350 54263 224717 469786 651112 659883 631403 784317 1131552 1428185 1479242
10355A479242j24210k05889k27631k42150k71733k13420l5670J69321K84436L08953
$$ 1479242 1355032 1149143 921512 679362 407629 194209 158539 327860 612296 921249
10345I21249L43896L22273K33552P5161j68714l18332l49683k77812p4588J54466
$$ 921249 1265145 1587418 1820970 1896131 1727417 1409085 1059402 781590 707002 861468
10335H61468J46810j57297l84681l65461k99421k26102j70862q9215K4759J38453
$$ 861468 1008278 850981 466300 100839 -198582 -424684 -595546 -684761 -660002 -521549
10325e21549K38604J95785R58j07960k8482N9469L41o4682N2488K76825L95023
$$ -521549 -282945 -87160 -86202 -194162 -222644 -163175 -162834 -227516 -175028 101797 496820
10314D96820J80867k76458o08581o73699n67423l16624J6609K22214K37354K88349
$$ 496820 677687 401229 -207352 -881051 -1448474 -1765098 -1748489 -1526275 -1288921 -1000572
10304a000572M29651M40460K07627o3974j67214j62831j53852j14256l7282L3999
$$ -1000572 -570921 -130461 77166 13192 -154022 -316853 -470705 -584961 -622243 -588244
10294e88244P9186P5389J3736q0466j34499j33105r8735Q194J32466P2107k48864
$$ -588244 -509058 -433669 -419933 -500399 -634898 -768003 -866738 -858544 -726078 -653971 -902835
10283i02835n89647n33900j49733P0991R4939J11207K24937L32436K69769J21091
$$ -902835 -1492482 -2026382 -2176115 -2105124 -2010185 -1898978 -1674041 -1341605 -1071836 -950745
10273i50745j4706J1214J21041N6991j54299k30239m8221K24405L87146L56091
$$ -950745 -965451 -954237 -833196 -776205 -930504 -1160743 -1208964 -984559 -597413 -241322
10263b41322K45937J91200K06438J15507j39099l45823m33104m31593k90407l9375
$$ -241322 4615 195815 402253 517760 378661 32838 -400266 -831859 -1122266 -1161641
10253a161641J65906K79476K68999M9192k56887m09241m26475l43953j25302P1301
$$ -1161641 -995735 -716259 -447260 -398068 -654955 -1064196 -1490671 -1834624 -1959926 -1888625
10243a888625J91883K99409L60855K96438J8266k65187k57957l6733J39475K80043
$$ -1888625 -1696742 -1397333 -1036478 -740040 -721774 -986961 -1244918 -1281651 -1142176 -862133
10233h62133M69983M99016K87522J19163Q5437q2622l97313n56349m39063j45027
$$ -862133 -392150 106866 394388 513551 598988 516366 119053 -437296 -876359 -1021386
10223a021386R8827J68304J96923K44294K16449J53192J09658J00292Q7001N3420
$$ -1021386 -922559 -754255 -557332 -313038 -96589 56603 166261 266553 353554 406974
10213D06974m2648k57106m13448l25108j34182l0593O3085J23932l9942l34927
$$ 406974 364326 107220 -306228 -631336 -765518 -796111 -733026 -609094 -649036 -983963
10203i83963m39380k62300j2644J07167P9455P8103J04892K63895N04131M45516
$$ -983963 -1423343 -1685643 -1698287 -1591120 -1511665 -1433562 -1328670 -1064775 -560644 -115128
10193a15128K05260N3816r2924k67989l46445k17298o3086m8662O19J43653K85185
$$ -115128 90132 143948 51024 -216965 -563410 -780708 -843794 -892456 -891837 -748184 -462999
10182d62999L61542L94110L65357K22310K2033q698K30105M84164N06763K48220
$$ -462999 -101457 292653 658010 880320 902353 893655 1123760 1607924 2114687 2362907
10172B362907j24816m16283o01735n59368l33174j96968k49523k77511k39552
$$ 2362907 2238091 1821808 1220073 660705 327531 130563 -118960 -396471 -636023
10163f36023k04582n8483J24795J91751J22658p5817k41286j78483j2992L4630
$$ -636023 -840605 -899088 -774293 -582542 -459884 -535701 -776987 -955470 -968462 -933832
10153i33832K2416O5887M4297L984Q9876J02215M5693J91970L62398L45198K87368
$$ -933832 -911416 -845529 -801232 -797248 -707372 -605157 -559464 -367494 -5096 340102 627470
10142F27470K83068K75661K04136N9737r9146k60249m67984n96836n39422l91354
$$ 627470 910538 1186199 1390335 1450072 1350926 1090677 622693 25857 -513565 -904919
10132i04919k02999l4529J57669M41998N88993M69442J83571p2571j25850j5630
$$ -904919 -1107918 -1142447 -984778 -542780 46213 515655 699226 626655 500805 485175
10122D85175L4884j7885k6414R6650J06331k2605q841J89327L63244L22289J86946
$$ 485175 520059 502174 475760 572410 678741 656136 647295 836622 1199866 1522155 1709101
10111A709101O4792j07757l29254n61140o78467n77007l55081j29726M7571J50228
$$ 1709101 1773893 1666136 1336882 775742 97275 -479732 -834813 -964539 -916968 -766740
10101g66740J89007J02390k08082n55251p05130o72964m89120j25842J69574K19677
$$ -766740 -577733 -475343 -683425 -1238676 -1943806 -2616770 -3105890 -3231732 -3062158 -2842481
10091b842481J63674J16689K32231N19873O86434N96159L73700P1420k15340l23094
$$ -2842481 -2678807 -2562118 -2329887 -1810014 -1123580 -527421 -153721 -82301 -297641 -620735
10081f20735k69560j64932m5088J3261L0978P5811Q3530k0274q9092l1503J665
$$ -620735 -890295 -1055227 -1100315 -1087054 -1056076 -980265 -896735 -917009 -1006101 -1037604 -1035939
10070a035939k9601k2283L8797J00317Q9223M5630n134q1272j55019k32031k04772
$$ -1035939 -1065540 -1087823 -1049026 -948709 -859486 -813856 -818990 -900262 -1055281 -1287312 -1492084
10059a492084q5959J1383R4984J99203K28974J45840k5528k70229m28410k87458
$$ -1492084 -1578043 -1566660 -1471676 -1272473 -1043499 -897659 -923187 -1193416 -1621826 -1909284
10049a909284k1600O7530k4161q9713k8359J86957N16874O74356N56015M46887
$$ -1909284 -1930884 -1863354 -1887515 -1977228 -2005587 -1818630 -1301756 -627400 -71385 375502
10039C75502M98090N05364L85239K51518Q1291j36334l54028m63961l89285k30090
$$ 375502 873592 1378956 1764195 2015713 2097004 1960670 1606642 1142681 753396 523306
10029E23306k19300l80004l37516n8580J42032J13677q1260k58451l69099l83203
$$ 523306 304006 -75998 -413514 -472094 -330062 -216385 -297645 -556096 -925195 -1308398
10019a308398k14416J73840N90154P75361P37072N70923L71222Q9843k66245n00795
$$ -1308398 -1522814 -1348974 -758820 16541 753613 1324536 1695758 1785601 1519356 1018561
10009A018561n72954o54336o87277m94728k26978k06282l57635k86505j4356K66327
$$ 1018561 445607 -208729 -896006 -1390734 -1617712 -1823994 -2181629 -2468134 -2482490 -2216163
9999b216163M34984N00672M67101K78821P3299n9888q9884p5490j14000j54604
$$ -2216163 -1781179 -1280507 -813406 -534585 -461286 -521174 -611058 -686548 -800548 -955152
9989i55152q3413Q9115K52431L12581K95698J01144j77089k56475j28784k5867
$$ -955152 -1038565 -949450 -697019 -384438 -88740 12404 -164685 -421160 -549944 -575811
9979e75811m7500l884P0730L4742m9663j55727j51715K8642J87118K38303K41543
$$ -575811 -623311 -627195 -556465 -521723 -571386 -727113 -878828 -850186 -663068 -424765 -183222
9968a83222J72680R7173K4492j00047k31563j17755J35894K04495J46394N982
$$ -183222 -10542 86631 111123 11076 -220487 -338242 -202348 2147 148541 154523
9958A54523j36367j74542m7955J56761K88018L00030K68885J52657p5436l21710
$$ 154523 18156 -156386 -204341 -47580 240438 540468 809353 962010 886574 564864
9948E64864n36600n91967m34075k16746o5428N6385K48775L65528K31553M077
$$ 564864 28264 -563703 -997778 -1214524 -1279952 -1223567 -974792 -609264 -377711 -373634
9938c73634j44910j35783K7890Q9243n948p9544k4218Q8754J13236K5771j24648
$$ -373634 -518544 -654327 -626437 -537194 -543142 -622686 -646904 -558150 -444914 -419143 -543791
9927e43791j99768j18697k6298M4060J89532L16678L05888J61600J14413J68170
$$ -543791 -743559 -862256 -888554 -844494 -654962 -338284 -32396 129204 243617 411787
9917D11787J21110O7697J90102K38547m4178l75474m91411m87681m20648k07358
$$ 411787 532897 600594 790696 1029243 985065 609591 118180 -369501 -790149 -997507
9907i97507J47181K79712N7165j88517k68564p2175L14746N71337N32545L08886
$$ -997507 -850326 -570614 -513449 -701966 -970530 -1042705 -727959 -156622 375923 684809
9897F84809Q5060J0271L582p8907k81364m14531l50997k96176k76567k0993L06424
$$ 684809 769869 780140 783722 704815 423451 8920 -342077 -638253 -914820 -935813 -629389
9886f29389L43461J98743M6009m6477k2909J0369P0944J36624Q6622j2740p0674
$$ -629389 -285928 -87185 -41176 -87653 -110562 -100193 -29249 107375 193997 181257 110583
9875A10583K5516J69471J52328O7143N568K274O6152N3091m1255q2489k8318o828
$$ 110583 136099 305570 457898 525041 530609 532883 599035 652126 610871 528382 500064 493236
9863D93236n0052j89244l75347m82186l68201j81756j78930j99303j77025j50708
$$ 493236 443184 253940 -121407 -603593 -971794 -1153550 -1332480 -1531783 -1708808 -1859516
9853a859516j44734q5890J52032M72984N68134L45523K0645j67400j64635j41035
$$ -1859516 -2004250 -2090140 -1938108 -1465124 -896990 -551467 -530822 -698222 -862857 -1003892
9843a003892j69383j05954M1732J18904J01574P0658j0769p7079m0572P1419K45168
$$ -1003892 -1173275 -1279229 -1237497 -1118593 -1017019 -946361 -957130 -1034209 -1074781 -1003362 -758194
9832g58194L24144J35512j84703k87583j24493M8522J08474J37874J94724J73141
$$ -758194 -434050 -298538 -483241 -770824 -895317 -846795 -738321 -600447 -405723 -232582
9822b32582o9115l65993l96101k75709j62658N7178L44393M81150M32026L55153
$$ -232582 -301697 -667690 -1063791 -1339500 -1502158 -1444980 -1100587 -619437 -187411 167742
9812A67742L12716K31722J7547k59179m39425l99106k60800k38890l12501l11001
$$ 167742 480458 712180 729727 470548 31123 -367983 -628783 -867673 -1180174 -1491175
9802a491175j14009M4967L2270J29504L78933L94936J82957J11637K6251j44008
$$ -1491175 -1605184 -1560217 -1527947 -1398443 -1019510 -624574 -441617 -329980 -303729 -447737
9792d47737k24170k25716j96038j64242j28526j7659R6042R2016K3577R0058L39985
$$ -447737 -671907 -897623 -1093661 -1257903 -1386429 -1404088 -1308046 -1216030 -1192453 -1102395 -762410
9781g62410M86425L42750R2456m9942k4592J36549K41638J47038o6113j64380
$$ -762410 -275985 66765 159221 109279 84687 221236 462874 609912 543799 379419
9771C79419n5207N2478N1556N5892N1797k8345r5462n8936K5389k4067j61704
$$ 379419 324212 376690 428246 484138 535935 507590 412128 353192 378581 354514 192810
9760A92810j66180j44211j55361p3679L0070j2448j00435k6910Q5523l9042k56731
$$ 192810 26630 -117581 -272942 -346621 -316551 -328999 -429434 -456344 -370821 -409863 -666594
9749f66594l12075k11960j0872K62681M97708N44554M50470K91121J6717l09443
$$ -666594 -978669 -1190629 -1201501 -938820 -441112 103442 553912 845033 861750 552307
9739E52307m22756l52178l00311j52932J00113K50897K12253Q164k17785l02506
$$ 552307 129551 -222627 -522938 -675870 -575757 -324860 -112607 -104443 -322228 -624734
9729f24734k33085j08267N8698K58820L42992K65481J01635p5153j37601r9139
$$ -624734 -857819 -966086 -907388 -648568 -305576 -40095 61540 -13613 -151214 -250353
9719b50353k7782P0641R5537N8828L801n9828l3206J07159L58655O28226O39315
$$ -250353 -278135 -207494 -111957 -53129 -49328 -109156 -142362 -35203 323452 951678 1590993
9708A590993L58291N441k36539l66959m88659n85537n54649l77155k02289k5188
$$ 1590993 1949284 1954725 1718186 1351227 862568 277031 -277618 -654773 -857062 -882250
9698h82250O5767J4425l7994R776L5820m6091m8452J16212L19342L24195J6655
$$ -882250 -816483 -802058 -840052 -830276 -794456 -840547 -888999 -772787 -453445 -129250 -112595
9687a12595m00718n74987m12420j53551q670O732m7951j04017r8708o2700j0348
$$ -112595 -513313 -1088300 -1500720 -1654271 -1662941 -1656209 -1704160 -1808177 -1906885 -1969585 -1979933
9676a979933J44213L29061L80478L28855K95701K96724K73672J94856n1124l41954
$$ -1979933 -1835720 -1506659 -1126181 -797326 -501625 -204901 68771 263627 212503 -129451
9666a29451n44476o68247n89607l96399j89139R3392L58965M15412K80971J59455
$$ -129451 -673927 -1342174 -1931781 -2328180 -2517319 -2423927 -2064962 -1649550 -1368579 -1209124
9656a209124O9642m420M677k726q7032q4778J8329J58566K59361L39998M41361
$$ -1209124 -1139482 -1143902 -1139225 -1141951 -1228983 -1313761 -1295432 -1136866 -877505 -537507 -96146
9645i6146L91994J42396j41584k86033k08977J9892J16187j6154j72920k63598
$$ -96146 295848 438244 296660 10627 -198350 -178458 -62271 -78425 -251345 -514943
9635e14943j93919N381J93805L52174M43418M82172L78251J98161j7011k23373
$$ -514943 -708862 -703481 -509676 -157502 285916 768088 1146339 1344500 1327489 1104116
9625A104116l64975l86602l08253j98114j24283j50817k63115l63373l46046j96618
$$ 1104116 739141 352539 44286 -153828 -278111 -428928 -692043 -1055416 -1401462 -1598080
9615a598080N2738K39928K72806K19984Q0330m118O4163J05514j35j21871j34546
$$ -1598080 -1545342 -1305414 -1032608 -812624 -732294 -736412 -672249 -566735 -566870 -688741 -823287
9604h23287j31218j81144k19770k00703j55454j24025m9293J01049J52048J45290
$$ -823287 -954505 -1135649 -1355419 -1556122 -1711576 -1835601 -1884894 -1783845 -1631797 -1486507
9594a486507K62815L50797L12286J76413R3801Q6535m7573l13938n28368n63020
$$ -1486507 -1223692 -872895 -560609 -384196 -290395 -203860 -251433 -565371 -1093739 -1656759
9584a656759m80621l58200k64351k29912j09495N1471J35955K58142L59755L10486
$$ -1656759 -2137380 -2495580 -2759931 -2989843 -3099338 -3047867 -2911912 -2653770 -2294015 -1983529
9574a983529J51720K6874J61234L89616L84094K31900P2197j87812m17811l94982
$$ -1983529 -1831809 -1804935 -1643701 -1254085 -869991 -638091 -565894 -753706 -1171517 -1566499
9564a566499k83141k21557l7261J86340K53135K93174L80839L91040K85660K15131
$$ -1566499 -1849640 -2071197 -2108458 -1922118 -1668983 -1375809 -994970 -603930 -318270 -103139
9554a03139J73968M6999o7454j68890k66120k08452r7409j43321k61865k67777
$$ -103139 70829 117828 50374 -118516 -384636 -593088 -690497 -833818 -1095683 -1363460
9544a363460j60424M8002K20905K41093J26002J5896J31403K99053J85677n7753
$$ -1363460 -1523884 -1475882 -1254977 -1013884 -887882 -871986 -740583 -441530 -255853 -313606
9534c13606j74033j82283r6292J64401K83831R5405M0572J99671J86737j15667
$$ -313606 -487639 -669922 -766214 -601813 -317982 -222577 -182005 17666 204403 88736
9524H8736m20218l92927k24512j83734j15705J20369M13600N03318K58446j06601
$$ 88736 -331482 -724409 -948921 -1132655 -1248360 -1127991 -714391 -211073 47373 -59228
9514e9228l68740l65505n0315K18696K01177R8134P0381Q5370R0014K2781o7738
$$ -59228 -427968 -793473 -843788 -625092 -423915 -325781 -255400 -170030 -80016 -57235 -124973
9503a24973j61036j20552J05062K28133P4072n3726O2358J19749j4267j17482
$$ -124973 -286009 -406561 -301499 -73366 706 -53020 9338 129087 114820 -2662
9493b662L183L02079N37037N27421L58818K09706R9653r454l0688r3829j88720
$$ -2662 521 302600 839637 1367058 1725876 1935582 2035235 2025781 1995093 1901264 1712544
9482A712544j59490r9859q9736p5172j07120k06779k21510j21889j113q1012k66429
$$ 1712544 1553054 1453195 1363459 1288287 1181167 974388 752878 630989 629876 548864 282435
9471B82435k25023j29000j54777r0887J7181j3698j56146l02471k34422J4587
$$ 282435 57412 -71588 -226365 -317252 -300071 -313769 -469915 -772386 -1006808 -992221
9461i92221P5736l8091o3923J3460R9220J28080J23199K18497L49360L47442K02230
$$ -992221 -916485 -954576 -1018499 -1005039 -905819 -777739 -654540 -436043 -86683 260759 462989
9450D62989O1597R1292O2537j38466k55255k88301l25802l20295j89897M2921
$$ 462989 524586 615878 678415 539949 284694 -3607 -329409 -649704 -839601 -796680
9440g96680K12273K28037J29659R4894J19569J12590M1290o5497j42624j39089
$$ -796680 -584407 -356370 -226711 -131817 -12248 100342 141632 76135 -66489 -205578
9430b05578j12389j6240J35192J47860m5546l12417n49530o93086o37734m37290
$$ -205578 -317967 -334207 -199015 -51155 -96701 -409118 -958648 -1651734 -2289468 -2726758
9420b726758q4925L79845O92151P56993O26814M58766L67284K48836J30905O7603
$$ -2726758 -2811683 -2431838 -1739687 -982694 -355880 102886 470170 719006 849911 917514
9410I17514j6041k71853o61974q36393o42622k27459J71021M09598M85919L90172
$$ 917514 901473 629620 -32354 -868747 -1511369 -1738828 -1567807 -1158209 -672290 -282118
9400b82118K15512J80724L22254M89461N77381M92998K59358J12443J83008K74544
$$ -282118 -66606 114118 436372 925833 1503214 1996212 2255570 2368013 2551021 2825565
9390B825565P1424m68897q74305o85044k39037R3878L24091K82988j3673k18481
$$ 2825565 2896989 2428092 1553787 868743 629706 723584 1047675 1330663 1316990 1098509
9380A098509j74814o2079q2167n2595K01413M46293N52710N74258L79625l0056
$$ 1098509 923695 861616 779449 726854 928267 1374560 1927270 2501528 2881153 2851097
9370B851097l99557m74848l71385l38089k54819K541K53795K26451Q4608j942
$$ 2851097 2451540 1976692 1605307 1267218 1012399 1014940 1268735 1495186 1579794 1577852
9360A577852j27511k83671l81202l40420k50455j90049o3086J34721K86245K67874
$$ 1577852 1450341 1166670 785468 445048 194593 4544 -58542 76179 362424 630298
9350F30298J65162K43254L52886K79511J11741N6663J01744K7000j27277l44594
$$ 630298 795460 1038714 1391600 1671111 1782852 1839515 1941259 1968259 1840982 1496388
9340A496388n31011n46561l66395k98252l02722j22995J53296L22696K78761J10173
$$ 1496388 965377 418816 52421 -245831 -548553 -671548 -518252 -195556 83205 193378
9330A93378N5032R8431J14232Q1120L6106R5911J97605J52342J2311j74600l63513
$$ 193378 248410 346841 461073 542193 578299 674210 871815 1024157 1036468 861868 498355
9319D98355m78127o44420q16036p07496l59955j59540o4561K23720N45250O08598
$$ 498355 20228 -624192 -1440228 -2147724 -2507679 -2667219 -2731780 -2508060 -1962810 -1354212
9309a354212N34726M48066K39053j3402j56869k00883j04011J07010K06194K13937
$$ -1354212 -819486 -371420 -132367 -145769 -302638 -503521 -607532 -500522 -294328 -80391
9299h0391K52873J91279J10990K17779L40925K03977r4338k41166j55438l3472
$$ -80391 172482 363761 474751 692530 1033455 1237432 1143094 901928 746490 713018
9289G13018n4462j09575m8464J8366n8476l20223m97137l31085p6438j4216M5621
$$ 713018 658556 548981 500517 518883 460407 140184 -356953 -688038 -764476 -778692 -733071
9278g33071J84475J47634L1454N4347J26502J70613P7060q4791m455K91622L88004
$$ -733071 -548596 -400962 -369508 -315161 -188659 -18046 59014 -25777 -30232 261390 649394
9267F49394J76084o5105j30107q525J53330K54327K39616P5136j10811q2687J46382
$$ 649394 825478 760373 630266 621741 775071 1029398 1269014 1344150 1233339 1150652 1297034
9256A297034K14152J6375j89618k77545k34348j03363j89740m13729l46439R47
$$ 1297034 1511186 1527561 1337943 1060398 826050 722687 532947 119218 -227221 -226274
9246b26274K75676L08088K90100L67005L97703L71922K60492J14219L6346n9877
$$ -226274 49402 357490 647590 1014595 1412298 1784220 2044712 2158931 2195277 2135400
9236B135400k00903k57981j02692O5372Q7322J7027k6508O8232K50917L36438
$$ 2135400 1934497 1676516 1573824 1639196 1726518 1743545 1717037 1785269 2036186 2372624
9226B372624J65043j47087l42328l53401j72825O5443J40467J14265M6456j02394
$$ 2372624 2537667 2390580 2048252 1694851 1522026 1587469 1727936 1842201 1888657 1786263
9216A786263j73265j30296N844R8206k9644j87570j02966J02896R9944j15030
$$ 1786263 1612998 1482702 1488546 1586752 1557108 1369538 1266572 1369468 1469412 1354382
9206A354382k93958k65473r6699N2884P0470p8642k41566k67666j02459Q8293
$$ 1354382 1060424 794951 698252 751136 821606 742964 501398 233732 131273 219566
9196B19566R0988o4032j86134k83991k80218l9101J91445J89937J28001J75957
$$ 219566 310554 246522 60388 -223603 -503821 -542922 -351477 -161540 -33539 142418
9186A42418J88787P3420j11662l54328m39677k81223j30975j42677k83061l30298
$$ 142418 331205 404625 292963 -61365 -501042 -782265 -913240 -1055917 -1338978 -1669276
9176a669276q6085J50951N6783j82391k97240j63515J53630L47310J78448j03322
$$ -1669276 -1755361 -1604410 -1547627 -1730018 -2027258 -2190773 -2037143 -1689833 -1511385 -1614707
9166a614707r7670R0244J74069J66288J66166J83841J70894J96047K32500J36245
$$ -1614707 -1712377 -1622133 -1448064 -1281776 -1115610 -931769 -760875 -564828 -332328 -196083
9156a96083K6143O9718K39132M65559M61593K88959K04224R9084q0494k16189
$$ -196083 -169940 -100222 138910 604469 1066062 1355021 1559245 1658329 1577835 1361646
9146A361646m07822n22130l42258j09034M4453K28419L61644L08107P0954j67097
$$ 1361646 953824 431694 89436 -19598 24855 253274 614918 923025 993979 826882
9136H26882k22322j37247j02979j01706K5273K21201K88705L03067L61599L80250
$$ 826882 604560 467313 364334 262628 287901 509102 797807 1100874 1462473 1842723
9126A842723L94654M73467M40394J80556j92153m92268n68152m17878l02387l29080
$$ 1842723 2237377 2710844 3151238 3331794 3139641 2647373 2079221 1661343 1358956 1029876
9116A029876l38739j83586Q7372K41553J49361j86333m91160n66985n18048m19138
$$ 1029876 691137 507551 594923 836476 985837 799504 308344 -258641 -776689 -1195827
9106a195827k38840O3132M51467P51261P98578O37876M66756L65560K20674K5331
$$ -1195827 -1434667 -1371535 -920068 -168807 629771 1267647 1734403 2099963 2320637 2345968
9096B345968j13559j80480j56321J845J93633K06699Q1741j8484q2166j89208
$$ 2345968 2232409 2051929 1895608 1897453 2091086 2297785 2379526 2361042 2278876 2089668
9086B089668l33564l74115k89485l06132l61890k17586k8981N2229N0437N732
$$ 2089668 1756104 1381989 1092504 786372 424482 206896 177915 230144 280581 286313
9076B86313L9823J22536J01783P936k8564j04588k77491m49386m93738l22196
$$ 286313 326136 448672 550455 558391 529827 425239 147748 -301638 -795376 -1117572
9066a117572j7180K36231L86135M17883L22317J57447n574j34017k21942j76326
$$ -1117572 -1134752 -898521 -512386 -94503 227814 385261 379687 245670 23728 -152598
9056a52598O1990L30920L94085K70687J94192K60513M03867M62246L24280M9022
$$ -152598 -90608 240312 634397 905084 1099276 1359789 1763656 2225902 2550182 2599204
9046B599204j98126l46149m48576m57830l06600k2724K75659M25620L61406K57149
$$ 2599204 2401078 2054929 1606353 1148523 841923 819199 1094858 1520478 1881884 2139033
9036B139033J90872P6964q5407j69510j41107k04543k88231k41096j39495q06
$$ 2139033 2329905 2406869 2321462 2151952 2010845 1806302 1518071 1276975 1137480 1136674
9026A136674J91145M41196N79742L77170k9905l63961m57570l70308j82605L3593
$$ 1136674 1327819 1769015 2348757 2725927 2696022 2332061 1874491 1504183 1321578 1355171
9016A355171J01149O8576K9173J0064M4499N1253J1313j03589k54798k01050J2053
$$ 1355171 1456320 1524896 1554069 1564133 1608632 1659885 1671198 1567609 1312811 1111761 1123814
9005A123814R3754j0344j37913j52611j43926j46322j00966K801J14877M0884
$$ 1123814 1217568 1207224 1069311 916700 772774 626452 525486 528287 643164 684048
8995F84048k08469k68601j02762P7038J71253K40803L74999M64552K99521N0302
$$ 684048 475579 206978 104216 181254 352507 593310 968309 1432861 1732382 1782684
8985A782684j22685k12461k18038j18238Q3201L32182M39480L72242K55387J45132
$$ 1782684 1659999 1447538 1229500 1111262 1194463 1526645 1966125 2338367 2593754 2738886
8975B738886M8547k1115j01436j87730k21756k05583j59341j08441k6168M5872
$$ 2738886 2787433 2766318 2664882 2477152 2255396 2049813 1890472 1782031 1755863 1801735
8965A801735K7339J6909R5933J22762P7551J22780K38119J66698j21546k94411
$$ 1801735 1829074 1845983 1941916 2064678 2142229 2265009 2503128 2669826 2548280 2253869
8955B253869j83201n4983k9976N9076K47436L53512K94183J20850m3558j31511
$$ 2253869 2070668 2015685 1985709 2044785 2292221 2645733 2939916 3060766 3017208 2885697
8945B885697r4018l0930n772j8845j59809l48038m05411l57317j64935J37385
$$ 2885697 2791679 2760749 2754977 2736132 2576323 2228285 1822874 1465557 1300622 1438007
8935A438007K74842K16045J88104K15654K30744J58360Q1933J08554J05342P74
$$ 1438007 1712849 1928894 2116998 2332652 2563396 2721756 2803689 2912243 3017585 3018359
8925C018359p7816j22271j55434j32354j34139j60254j92287j54006L6804K84215
$$ 3018359 2940543 2818272 2662838 2530484 2396345 2236091 2043804 1889798 1926602 2210817
8915B210817M33750L68393J35612q6785k3937L04216N79651N56698K73726O7039
$$ 2210817 2644567 3012960 3148572 3061787 3037850 3342066 3921717 4478415 4752141 4819180
8905D819180j779j03626p8258J54472L70129M22633L38788J02702r9967j19867
$$ 4819180 4817401 4713775 4635517 4789989 5160118 5582751 5921539 6024241 5924274 5804407
8895E804407j1118J34800K88415M14448N01046O65724R05963J051371R84091Q85941
$$ 5804407 5793289 5928089 6216504 6630952 7131998 7797722 8703685 9755056 10739147 11625088
8885A1625088J030784J328377J548376J757449K046577K288427K435886K617818
$$ 11625088 12655872 13984249 15532625 17290074 19336651 21625078 24060964 26678782
8877B6678782L091067L955798M988694N918930O704485P105760O647635N081852
$$ 26678782 29769849 33725647 38714341 44633271 51337756 58443516 65091151 70173003
8869G0173003K537869m08415l098658n176356o444861o743388o304061n581223
$$ 70173003 72710872 72302457 69203799 64027443 57582582 50839194 44535133 38953910
8861C8953910m881312m274060l738183l240015k658590k100172j793956j766617
$$ 38953910 34072598 29798538 26060355 22820340 20161750 18061578 16267622 14501005
8853A4501005j760644j588303j278236r16386n99706l30444r9990L1455p3412
$$ 14501005 12740361 11152058 9873822 8957436 8357730 8027286 7927296 7958751 7885339
8844G885339l45237m75329n12067o21253p47538p30783n28043k89748r1765O6728
$$ 7885339 7540102 7064773 6552706 5931453 5183915 4453132 3925089 3635341 3543576 3610304
8834C610304K06780K24260P1923j20707j76606j88180k89645l43638l29266k13689
$$ 3610304 3817084 4041344 4113267 3992560 3815954 3627774 3338129 2994491 2665225 2451536
8824B451536L9243L66012N47579M13499M8452l27898m60514l17968j34298m1690
$$ 2451536 2490779 2856791 3404370 3817869 3866321 3538423 3077909 2759941 2625643 2583953
8814B583953L9258R3551J15617K23537K65717J15303m7111q8522p8149j24337
$$ 2583953 2623211 2716762 2832379 3055916 3321633 3436936 3389825 3301303 3223154 3098817
8804C098817j98345k58084k21228m3607K1318j96922l87474l14503j13506K2681
$$ 3098817 2900472 2642388 2421160 2377553 2398871 2201949 1814475 1499972 1386466 1409147
8794A409147J34999K48186K96306K70506K75760K99850J45066n0915j27413k01272
$$ 1409147 1544146 1792332 2088638 2359144 2634904 2934754 3079820 3028905 2901492 2700220
8784B700220j90547j07079l893J64358K95106K55090J05778q500j05367j70995
$$ 2700220 2509673 2402594 2398701 2563059 2858165 3113255 3219033 3210533 3105166 2934171
8774B934171q2002J34560L41225M17559L02909Q7507k4362K7338R0429M0751r7868
$$ 2934171 2852169 2986729 3327954 3745513 4048422 4135929 4111567 4138905 4229334 4270085 4172217
8763D172217j61036n3880L7059M524j07801k20491j89808M381K49943L47313K62592
$$ 4172217 4011181 3957301 3994360 3998884 3891083 3670592 3480784 3485165 3735108 4082421 4345013
8752D345013K02483K71329M25592N45143N71164M84819K19198k13133m29122l18893
$$ 4345013 4547496 4818825 5244417 5789560 6360724 6845543 7064741 6851608 6422486 6103593
8742F103593k33599j96750r8401L9196J08110N6787o67m5034p9371m3990k7107
$$ 6103593 5869994 5673244 5574843 5614039 5722149 5778936 5778269 5733235 5653864 5609874 5582767
8731E582767j08729j27980L045J33805J96061J41028m1315j51547r4575n2760
$$ 5582767 5474038 5346058 5349103 5482908 5678969 5819997 5778682 5627135 5532560 5479800
8721E479800r1653j71183j84835j98035k78151j42939J62633L91056M11666K19462
$$ 5479800 5388147 5216964 5032129 4834094 4555943 4413004 4575637 4966693 5378359 5597821
8711E597821k5688j07232o8134k9990M6026J67812K11443L8056j90667j43258
$$ 5597821 5572133 5464901 5396767 5366777 5412803 5580615 5792058 5830114 5639447 5496189
8701E496189J40991L62552L15301J68228J65977J47079Q1188K01542M16670N99036
$$ 5496189 5637180 5999732 6315033 6483261 6649238 6796317 6877505 7079047 7495717 8094753
8691H094753N88456K25895j92069l26914k08707o0797M7760L51262P72892R47043
$$ 8094753 8683209 8909104 8717035 8390121 8181414 8120617 8168377 8519639 9292531 10239574
8681A0239574R35278R61728J047440J200489J433608J728868K056655K348022
$$ 10239574 11174852 12136580 13184020 14384509 15818117 17546985 19603640 21951662
8673B1951662K557735K850836L305785L780686M298264M832380N271454N418464
$$ 21951662 24509397 27360233 30666018 34446704 38744968 43577348 48848802 54267266
8665E4267266N098020M379940L435358K300484Q88718q21205k610665m045853
$$ 54267266 59365286 63745226 67180584 69481068 70369786 69548581 66937916 62892063
8657F2892063m880263n098179m776806m052892l074634k153391j468468q93639
$$ 62892063 58011800 52913621 48136815 44083923 41009289 38855898 37387430 36493791
8649C6493791j27642P72449J516846K002426K317717K657347L150004L583048
$$ 36493791 36366149 37138598 38655444 40657870 42975587 45632934 48782938 52365986
8641E2365986L657077L463936L224557K897378K456544J862839J151713N53376
$$ 52365986 56023063 59486999 62711556 65608934 68065478 69928317 71080030 71633406
8633G1633406j0645p78345j634249k231778k621677l042968l403316l357328k861570
$$ 71633406 71622761 70844416 69210167 66978389 64356712 61313744 57910428 54553100 51691530
8624E1691530k056393j246706n28228K35151J091804K096721L193867M395544
$$ 51691530 49635137 48388431 47860203 48095354 49187158 51283879 54477746 58873290
8616E8873290N806201P455120R320760J1159125J2757958J4167870J5111413J5232464
$$ 58873290 64679491 72134611 81455371 92614496 105372454 119540324 134651737 149884201
8608A49884201J4473035J2802679J0021308N981192Q98093m702633j0152166j4553612
$$ 149884201 164357236 177159915 187181223 193162415 194060508 189357875 179205709 164652097
8600A64652097j7080000j7495311j6328456j4298641j1899948r642592p940743
$$ 164652097 147572097 130076786 113748330 99449689 87549741 77907149 69966406
8593F9966406o665020n530681m391785l254875k280426j526543r29674m80019
$$ 69966406 63301386 57770705 53378920 50124045 47843619 46317076 45387402 44907383
8585D4907383l82256n14831n10358n33014p96742j114512j225318j040366p18685
$$ 44907383 44525127 44010296 43499938 42966924 42170182 41055670 39830352 38789986 38071301
8576C8071301m57679l07087j66300J02045M67504R45171J526585K006663K400849
$$ 38071301 37613622 37306535 37140235 37242280 37709784 38654955 40181540 42188203 44589052
8567D4589052K855435L423269M091571M956590O002924P209104Q750992J0772939
$$ 44589052 47444487 50867756 54959327 59915917 65918841 73127945 81878937 92651876
8559I2651876J3302661J6231610J9409667K2676535K5797024K8528546L0496501
$$ 92651876 105954537 122186147 141595814 164272349 190069373 218597919 249094420
8552B49094420L1331588L0658155K7812599K2172467J3711078K961393q898258
$$ 249094420 280426008 311084163 338896762 361069229 374780307 377741700 368843442
8545C68843442k0033708k8694111l3734643l4982295l3299309k9796757k5352875
$$ 368843442 348809734 320115623 286380980 251398685 218099376 188302619 162949744
8538A62949744k0733058j6567170j3189667j0491611q370963o797632n559459
$$ 162949744 142216686 125649516 112459849 101968238 93597275 86799643 81240184
8531H1240184m395560l223664k186367j572654j384853j519310j897600k183507
$$ 81240184 76844624 73620960 71434593 69861939 68477086 66957776 65060176 62876669
8523F2876669k220071k203990k312155k223156j781317j195366o04289o2531N48856
$$ 62876669 60656598 58452608 56140453 53917297 52135980 50940614 50336325 50273794 50822650
8514E0822650J228029J844815K274405K574601L070646L853990M726388N645480
$$ 50822650 52050679 53895494 56169899 58744500 61815146 65669136 70395524 76041004
8506G6041004O853821Q436940J0208425J2284880J4981763J8268323K1823956
$$ 76041004 82894825 91331765 101540190 113825070 128806833 147075156 168899112
8499A68899112K5486764K9127092L2388255L4743615L5744785L5083342L2129292
$$ 168899112 194385876 223512968 255901223 290644838 326389623 361472965 393602257
8492C93602257K6161139J6903726M691439r192621k2654106l3494341m0119518
$$ 393602257 419763396 436667122 441358561 432165940 409511834 376017493 335897975
8485C35897975m2146177m0376043l6122623l0811003k5516526k0837218j6898924
$$ 335897975 293751798 253375755 217253132 186442129 160925603 140088385 123189461
8478A23189461j3575693j0841338q659087o926672n548156m429709l542069k842933
$$ 123189461 109613768 98772430 90113343 83186671 77638515 73208806 69666737 66823804
8470F6823804k323230k017982j898277j778700j634193j675637j825956j852894
$$ 66823804 64500574 62482592 60584315 58805615 57171422 55495785 53669829 51816935
8462E1816935j661765j270760q04184n03504l13655L7799N57243J136481J686685
$$ 51816935 50155170 48884410 48080226 47576722 47263067 47300866 47858109 48994590 50681275
8453E0681275K199339K842459L677821M594501N742660P288356R039305J0980645
$$ 50681275 52880614 55723073 59400894 63995395 69738055 77026411 86065716 97046361
8445I7046361J3211110J5783104J8659557K1708365K4755796K7483162K9418094
$$ 97046361 110257471 126040575 144700132 166408497 191164293 218647455 248065549
8438B48065549L0243767K9593962K7057523K2262119J4774536M690237o923899
$$ 248065549 278309316 307903278 334960801 357222920 371997456 376687693 369763794
8431C69763794j8403842k7845090l3615149l5545309l4518713l1503223k7463516
$$ 369763794 351359952 323514862 289899713 254354404 219835691 188332468 160868952
8424A60868952k3185306j9085878j5438259j2386857r874896p895717o452399
$$ 160868952 137683646 118597768 103159509 90772652 80897756 73002039 66549640
8417F6549640n305592m292212l440314k765281k225572j918020j912990k016767
$$ 66549640 61244048 56951836 53511522 50746241 48520669 46602649 44689659 42672892
8409D2672892j954978j817754j833568j881959j720906j306603p88363m17246
$$ 42672892 40717914 38900160 37066592 35184633 33463727 32157124 31368761 30951515
8401C0951515k33800k1572K39000N20919Q88123J236267J514545J736705J961165
$$ 30951515 30717715 30696143 30935143 31456062 32344185 33580452 35094997 36831702 38792867
8392C8792867K398163L152498M034805M968975O081183P426149Q967985J0519320
$$ 38792867 41191030 44343528 48378333 53347308 59428491 66854640 75822625 86341945
8384H6341945J2004705J3480636J4624127J4975060J4641520J3621418J1415545
$$ 86341945 98346650 111827286 126451413 141426473 156067993 169689411 181104956
8377A81104956P743413K800524l092374r107377j4090434j7265646j8510863j8038821
$$ 181104956 188848369 191648893 188556519 179449142 165358708 148093062 129582199 111543378
8369A11543378j6193045j3769402j1412936r336841p685066o464825n483368m642105
$$ 111543378 95350333 81580931 70167995 60831154 53146088 46681263 41197895 36555790
8361C6555790l857081l154550k738055k389691j893600j398583j026421r10077
$$ 36555790 32698709 29544159 26806104 24416413 22522813 21124230 20097809 19187732
8353A9187732r65646r02218p23949o62932p35241o83769m60388k20715q9607J9109
$$ 19187732 18222086 17319868 16595919 15932987 15197746 14513977 14053589 13832874 13743267 13762376
8343A3762376K49606M34868M50288L76395L26080L73881M43756N03764P00355
$$ 13762376 14011982 14446850 14897138 15273533 15599613 15973494 16417250 16921014 17621369
8334A7621369J027893J359875J710677K109270K561467K997225L338544L716456
$$ 17621369 18649262 20009137 21719814 23829084 26390551 29387776 32726320 36442776
8326C6442776M157422M404868M411375M277711L987049L509186K549368R88861
$$ 36442776 40600198 45005066 49416441 53694152 57681201 61190387 63739755 64728616
8318F4728616r03252k909923m598642n620567n956795n774138n287073m514633
$$ 64728616 63825364 60915441 56316799 50696232 44739437 38965299 33678226 29163593
8310B9163593l628635k912496k508848k213766j824499j408046j105406r64784
$$ 29163593 25534958 22622462 20113614 17899848 16075349 14667303 13561897 12597113
8302A2597113r26128r22217q28931o07206m69137n63919p30458p79351o43259
$$ 12597113 11670985 10748768 9919837 9312631 8843494 8279575 7549117 6769766 6126507
8293F126507n12561n08194m72230l49231k76661j76915K6060K03112L03011L57608
$$ 6126507 5613946 5105752 4633522 4284291 4007630 3830715 3856775 4059887 4362898 4720506
8283D720506K73410l4242l67674n84910o02039l49632P0942L75458M00655K45807
$$ 4720506 4993916 4959674 4592000 4007090 3405051 3055419 3126361 3501819 3902474 4148281
8273D148281K6461q8649k4288m6825k44438m06396m54434l82184k16165m6741
$$ 4148281 4174742 4086093 4061805 4014980 3770542 3364146 2909712 2527528 2311363 2264622
8263B264622j9950j42043k27129j39808Q5308K17317K61043L36499K86430K06060
$$ 2264622 2244672 2102629 1875500 1735692 1821000 2038317 2299360 2635859 2922289 3128349
8253C128349J81502J17125N7043l7182j24860j32393j43912l19840n23890m56517
$$ 3128349 3309851 3426976 3484019 3446837 3321977 3189584 3045672 2725832 2201942 1745425
8243A745425k08202m2257M8204P2159R0160J27225K05170L35160L15141J25089
$$ 1745425 1537223 1494966 1543170 1615329 1705489 1832714 2037884 2373044 2688185 2813274
8233B813274k7516j0173N4021M1086K6791M7711L0218M934l4501p4101Q394J76898
$$ 2813274 2785758 2775585 2829606 2870692 2897483 2945194 2975412 2980346 2945845 2871744 2880138 3057036
8221C057036K00046J0471k42412m41689n62463m79231k74233q5093M3364K9798
$$ 3057036 3257082 3267553 3025141 2583452 2020989 1541758 1267525 1182432 1225796 1255594
8211A255594m0943J8722J41080J51749O1267O057J5974P8857J05302l1369j78269
$$ 1255594 1214651 1233373 1374453 1526202 1587469 1593526 1609500 1688357 1793659 1762290 1584021
8200A584021k21707j30736j1859j1362j27608j46431P140J38214J72661J75069
$$ 1584021 1362314 1231578 1219719 1208357 1080749 934318 941458 1079672 1252333 1427402
8190A427402J65655O2270j00131j69823n1113J54457K49045J83382m3042l12488
$$ 1427402 1593057 1655327 1555196 1385373 1334260 1488717 1737762 1921144 1878102 1565614
8180A565614l81477j68014M9287J730j69522j97159m1037P3482P6476K3846N5213
$$ 1565614 1184137 1016123 1065410 1067140 897618 700459 659422 732904 809380 833226 888439
8169H88439K02457L26333L47692J90821n1856k26988k84833m06898m51411j84516
$$ 888439 1090896 1417229 1764921 1955742 1903886 1676898 1392065 985167 533756 349240
8159C49240Q7724K54984L51468K37089J1196k51J89103K31930P7806r0165j84813
$$ 349240 436964 691948 1043416 1280505 1291701 1291450 1480553 1712483 1790289 1700124 1515311
8148A515311k29783j98558m6349J24406K08805K08945J33220l0457k70676m04466
$$ 1515311 1285528 1086970 1040621 1165027 1373832 1582777 1715997 1685540 1414864 1010398
8138A010398l34152l06489l70670l50157j46873J94120M75088N08816K97121Q8071
$$ 1010398 676246 369757 -913 -351070 -497943 -303823 171265 680081 977202 1065273
8128A065273O8643J07727J5479j64096k27928j35047p4014j9376J23142K42647
$$ 1065273 1133916 1241643 1257122 1093026 865098 730051 656037 636661 759803 1002450
8118A002450J84370q445j65223j47284p7439J6529J90742J23649j36147k04003
$$ 1002450 1186820 1178375 1013152 865868 788429 804958 995700 1119349 983202 779199
8108G79199j27258J5252K60604L53917K71471K55463K75169J90793L9398j16754
$$ 779199 651941 667193 927797 1281714 1553185 1808648 2083817 2274610 2314008 2197254
8098B197254j95789p0050J06019j9754l34776n66435n83769m73219m11929m27655
$$ 2197254 2001465 1931415 2037434 2017680 1682904 1116469 532700 59481 -352448 -780103
8088g80103m04205l08070j06085J58358M75850P18745O21276K95706K8845j3347
$$ -780103 -1184308 -1492378 -1598463 -1440105 -964255 -245510 375766 671472 700317 686970
8078F86970N227o825L1348Q4009L2097r7046j59742k33302k98539k02335k9129
$$ 686970 692197 685372 716720 800729 832826 735780 576038 342736 44197 -158138 -187267
8067a87267Q4486J70141J98825J85100J94952O1719j68920k38317j98237o4345
$$ -187267 -102781 67360 266185 451285 646237 707956 539036 300719 102482 38137
8057C8137J43037L27407M13875L00011J3095l51504n63391l68851J84470P46389
$$ 38137 181174 508581 922456 1222467 1235562 884058 320667 -48184 136286 882675
8047H82675R68314P57818K63474j33243k18325k03823j84648r6366J8469l2344
$$ 882675 1850989 2608807 2872281 2739038 2520713 2316890 2132242 2035876 2054345 2022001
8037B022001j78295k30088k35376j50634K5193J11526J3340j41636j26843l9111
$$ 2022001 1843706 1613618 1378242 1227608 1252801 1364327 1377667 1236031 1109188 1070077
8027A070077J2123O4745J54868J44990O207o1917k3838O4451J27764Q4112J3087
$$ 1070077 1082200 1146945 1301813 1446803 1453010 1391093 1367255 1431706 1559470 1643582 1656669
8016A656669L9009J22713J25357R0296J64256K56278R9296j77189k84992k39769
$$ 1656669 1695678 1818391 1943748 2034044 2198300 2454578 2553874 2376685 2091693 1851924
8006A851924j46993m9081L5529J08849R8567m5928k32287k25350J41956N30296
$$ 1851924 1704931 1655850 1691379 1800228 1898795 1852867 1620580 1395230 1537186 2067482
7996B067482O23916L82160p2031l83436m18347k90893j27008n3452r2738n1126
$$ 2067482 2691398 3073558 3001527 2618091 2199744 1908851 1781843 1728391 1635653 1584527
7986A584527P8052L7666j23807j23257J385N4875N6530R0168K00280L12488K83143
$$ 1584527 1662579 1700245 1576438 1453181 1454566 1509441 1565971 1656139 1856419 2168907 2452050
7975B452050J14753r1233j92574k29440k51179k12206r5106P4466K04728K20269
$$ 2452050 2566803 2475570 2282996 2053556 1802377 1590171 1495065 1569531 1774259 1994528
7965A994528N3889p4531J3686R6095m3348j31658K1196K14747J88816j3160n8946
$$ 1994528 2048417 1973886 1987572 2083667 2040319 1908661 1929857 2144604 2333420 2320260 2261314
7954B261314R1413K43320K37552J13713K6011Q2539K10038K48685L01762L73582
$$ 2261314 2352727 2596047 2833599 2947312 2973323 3055862 3265900 3514585 3816347 4189929
7944D189929L27881M02559O66076Q23039Q09066O68428M86052M00524M07512K78368
$$ 4189929 4517810 4920369 5586445 6409484 7218550 7886978 8373030 8773554 9181066 9459434
7934I459434Q8615J22916L00946L96962M83483P07624J055789J505173J841837
$$ 9459434 9548049 9670965 9971911 10368873 10852356 11559980 12615769 14120942 15962779
7925A5962779J971374K120736K455335K896345L426415M035555M629808N091527
$$ 15962779 17934153 20054889 22510224 25406569 28832984 32868539 37498347 42589874
7917D2589874N380222N399388M919458L765082J889984m44037k685168m278871
$$ 42589874 47970096 53369484 58288942 62054024 63944008 63499971 60814803 56535932
7909E6535932n168967n516138n398757m956342m413096l781023l075256k528801
$$ 56535932 51366965 45850827 40452070 35495728 31082632 27301609 24226353 21697552
7901B1697552k204738k002205j836387j475037r60817p00040p04343p53373p87752
$$ 21697552 19492814 17490609 15654222 14179185 13218368 12518328 11813985 11060612 10272860
7892A0272860q32881q63195p59961n95449m62102l48739k95140l40114l34603
$$ 10272860 9439979 8576784 7816823 7221374 6759272 6410533 6115393 5775279 5440676
7883E440676k36542j79419j44881q5162N8287J07719J3434k3153n6198j75388
$$ 5440676 5204134 5024715 4879834 4794672 4852959 4960678 4974112 4950959 4894761 4719373
7873D719373l29329m48491m97460m93157m57135l74271l02858l01669l34254l69124
$$ 4719373 4390044 3941553 3444093 2950936 2493801 2119530 1816672 1515003 1180749 811625
7863H11625k24836l007n0081k80745m23041m59284m04439j71069K25713O02491
$$ 811625 586789 583782 533701 252956 -170085 -629369 -1033808 -1204877 -979164 -376673
7853c76673P08231M88116J43394r5980j63662j92384k09662q9597J13311K97724
$$ -376673 331558 819674 963068 867088 703426 511042 301380 211783 325094 622818
7843F22818L66847K39295O0398K6980M7228j9364j23654j30367l3909N3669N5626
$$ 622818 989665 1228960 1289358 1316338 1363566 1344202 1220548 1090181 1056272 1109941 1165567
7832A165567l4068q5790q3287j56067k13177j03018N5233K5445j49918k39855
$$ 1165567 1131499 1045709 962422 806355 593178 490160 545393 570838 420920 181065
7822A81065j43174J11541K74258K94628K23434L8288j80010k98499k39680k0102
$$ 181065 37891 149432 423690 718318 941752 980040 800030 501531 261851 241749
7812B41749L09416N23950M89265L71907K48981J34297n6108l09826m13647l79365
$$ 241749 551165 1075115 1564380 1936287 2185268 2319565 2263457 1953631 1539984 1160619
7802A160619l23463j49677J53317L36379L18411J71532R6622J46714K28505K01079
$$ 1160619 837156 687479 840796 1177175 1495586 1667118 1763740 1910454 2138959 2340038
7792B340038L4568r49O3567l7089l04464m99650m26348j92183Q9886L41766L74369
$$ 2340038 2374606 2373657 2437224 2400135 2095671 1596021 1169673 977490 1067376 1409142 1783511
7781A783511L64013L67134L47584L37613L07822K76010K51429K01949J74519K91909
$$ 1783511 2147524 2514658 2862242 3199855 3507677 3783687 4035116 4237065 4411584 4703493
7771D703493M87490N80783N29429M29899M86129O48153P33832Q97392J109060
$$ 4703493 5190983 5771766 6301195 6731094 7217223 7865376 8599208 9496600 10605660
7762A0605660J213042J290003J462498J793019K330218L035452L752782M448817
$$ 10605660 11818702 13108705 14571203 16364222 18694440 21729892 25482674 29931491
7754B9931491N265527O317430P630861R021251R875326R370721O783000K002041
$$ 29931491 35197018 41514448 49145309 58166560 68041886 77412607 84195607 86197648
7746H6197648l559734p754714r578633r505772q446734p059123n641475m373160
$$ 86197648 82637914 74883200 65304567 55798795 47352061 40292938 34651463 30278303
7738C0278303l573118l266361l106445k871582k534140k020175j434618j083347
$$ 30278303 26705185 23438824 20332379 17460797 14926657 12906482 11471864 10388517
7730A0388517j076052j220936j272306j092329o53664j99145O2661J84940K72394
$$ 10388517 9312465 8091529 6819223 5726894 5073230 4874085 4936746 5121686 5394080
7721E394080L19759K43021m6685l27344m07551m64931n69471n32453l18883j63859
$$ 5394080 5713839 5956860 5910175 5582831 5175280 4710349 4140878 3608425 3289542 3125683
7711C125683j01246K4123K05229L10806K86567K25358K05912J87444J05447J6700
$$ 3125683 3024437 3048560 3253789 3564595 3851162 4076520 4282432 4469876 4575323 4592023
7701D592023l3995j12153j65497p4243N2203o4738l78808n57736n08613k80809
$$ 4592023 4558028 4445875 4280378 4206135 4258338 4193600 3814792 3257056 2748443 2467634
7691B467634l3223J3730j78309l10380k10397r5292m1779r657q8595j54334m0660
$$ 2467634 2434411 2448141 2269832 1959452 1749055 1653763 1611984 1602327 1513732 1359398 1318738
7680A318738M4259M5479J94952M07650L77322J24772n7610j52036j99984k14385
$$ 1318738 1362997 1408476 1603428 2011078 2388400 2513172 2455562 2303526 2103542 1889157
7670A889157j42029J04016K98278K02831p5602k52753k99439l68379l75644l14901
$$ 1889157 1747128 1851144 2149422 2352253 2276651 2023898 1724459 1356080 980436 665535
7660F65535k16676N6952M24659N63727M24981K04923j6312j28373j52204j72535
$$ 665535 448859 505811 930470 1494197 1919178 2124101 2107789 1979416 1827212 1654677
7650A654677k16906l37098m09458k41229L2222J85711K09133J49333M6630p1116
$$ 1654677 1437771 1100673 691215 449986 482208 667919 877052 1026385 1073015 1001899
7640A001899k13513l32568k79901j00518N0682J60355J68002k9105j79369n9224
$$ 1001899 788386 455818 175917 75399 126081 286436 454438 425333 245964 186740
7630A86740R9489J52611K30087K85938J43800j84353l93611l00423k05215k72152
$$ 186740 286229 438840 668927 954865 1098665 914312 520701 220278 15063 -257089
7620b57089l82356m01941k06108J54430L44119L08489K02564J04979K48212M47928
$$ -257089 -639445 -1041386 -1247494 -1093064 -748945 -440456 -237892 -132913 115299 563227
7610E63227L22084J20529J06137K33476K66999R7541L4990J44500O5061j31492
$$ 563227 885311 1005840 1111977 1345453 1612452 1709993 1744983 1889483 1954544 1823052
7600A823052k78447l13185j25656J2551J420p3294k32509k87984k82823l48293
$$ 1823052 1544605 1231420 1105764 1118315 1119735 1046441 813932 525948 243125 -105168
7590a05168l22943j70002P3682L45781L66972L3343k98144l08886j22930N0534
$$ -105168 -428111 -598113 -524431 -178650 188322 221665 -76479 -385365 -508295 -457761
7580d57761K40761M23250M63101L11978J08228o0041j49196j21729o7834j44502
$$ -457761 -217000 206250 669351 981329 1089557 1029516 880320 758591 690757 546255
7570E46255k38040j34575J17203K03918Q0625N9253J97091J49825j11506k97676
$$ 546255 308215 173640 290843 494761 575386 634639 831730 981555 870049 572373
7560E72373k96046k14305k23742k12699q8817J9653J57589L05597L11747K21411
$$ 572373 276327 62022 -161720 -374419 -463236 -443583 -285994 19603 331350 552761
7550E52761J37310P9275j4398m7592k5155l9724L3786K00921J72719l2152j89420
$$ 552761 690071 769346 754948 707356 682201 642477 676263 877184 1049903 1017751 828331
7539H28331j82239m360J51140J60695J2347k93029n01554l52425l1318J55428
$$ 828331 646092 641732 792872 953567 965914 672885 171331 -181094 -212412 -56984
7529e6984J86796J79405J96531K55928J76699K0218O0469K88738M40607M15003
$$ -56984 129812 309217 505748 761676 938375 958593 1019062 1307800 1748407 2163410
7519B163410L67847K65205J25008L338j17844j77693j19177K0600L9157j07722
$$ 2163410 2531257 2796462 2921470 2924808 2806964 2629271 2510094 2530694 2569851 2462129
7509B462129k13294j92217j10550j1375K2202m5499r8955m5689J1039p5723k38740
$$ 2462129 2248835 2056618 1946068 1934693 1956895 1911396 1812441 1766752 1777791 1702068 1463328
7498A463328l81513m69607l79163j95898l1142J51043K57157J40140j29532l07122
$$ 1463328 1081815 612208 233045 37147 6005 157048 414205 554345 424813 117691
7488A17691k50869L7507K98483L44017K01057m5275k30814k68833j82357L9783
$$ 117691 -133178 -95671 202812 546829 747886 702611 471797 202964 20607 60390
7478F0390J86011N6906k07481l49475l13798j87904K3952K06847K65940K46432
$$ 60390 246401 303307 95826 -253649 -567447 -755351 -731399 -524552 -258612 -12180
7468a2180K23321J96758K25619L09941K84904J50937q8542l68376m22956k04202
$$ -12180 211141 407899 633518 943459 1228363 1379300 1290758 922382 499426 295224
7458B95224L8619J77036J70522R1533O5418K801n1494o0214m7930L1141j9318
$$ 295224 333843 510879 681401 772934 838352 841153 789659 729445 681515 712656 693338
7447F93338k35286m26319m89117m53909l40483n3929K12047K47580K52534K33083
$$ 693338 458052 31733 -457384 -911293 -1251776 -1305705 -1093658 -846078 -593544 -360461
7437c60461R9709n7431j06941o4736j61472m06065m42363k11644L487O9499J06440
$$ -360461 -260752 -318183 -425124 -489860 -651332 -1057397 -1499760 -1711404 -1707917 -1638418 -1531978
7426a531978K36149L62768L53868K95888L42156M14829L41481J07999j00328j85185
$$ -1531978 -1295829 -933061 -579193 -283305 58851 473680 815161 923160 822832 637647
7416F37647k28860j22888J10259J79138K07973L77953N22419L98541P0705k18523
$$ 637647 408787 285899 396158 575296 783269 1161222 1683641 2082182 2152887 1934364
7406A934364l11473j96503m6357M009M7396J36100K17323K61076J12763j60342
$$ 1934364 1622891 1426388 1380031 1384040 1431436 1567536 1784859 2045935 2158698 1998356
7396A998356k74793k02375M411K90301N71599M88364L014m06090n29873m92382
$$ 1998356 1723563 1521188 1525599 1815900 2387499 2875863 2878877 2472787 1942914 1450532
7386A450532l71938j11984J58772J85090p4696l27834l41050j28236N0742m4136
$$ 1450532 1078594 966610 1125382 1310472 1235776 907942 566892 438656 489398 445262
7376D45262k21598k15515q9080R6824K27986J71502R1188L6520j5961j2476J4854
$$ 445262 223664 8149 -80931 15893 243879 415381 506569 543089 527128 514652 529506
7365E29506K3108j49906m39102n67123l47813O1747M32434N88955N67799M51945
$$ 529506 552614 402708 -36394 -603517 -951330 -889583 -457149 131806 699605 1151550
7355A151550J96308n4063j17810j0860Q8724J14198O857k45035l83484m11023
$$ 1151550 1347858 1293795 1175985 1165125 1253849 1368047 1374904 1129869 746385 335362
7345C35362m69618l31744l0827J61900J86670J42562K62533M50070M04103J95777
$$ 335362 -134256 -466000 -496827 -334927 -148257 -5695 256838 706908 1111011 1306788
7335A306788m1616j49417k2128J19901J23013Q8890J6470n9003o0742o7027l0972
$$ 1306788 1265172 1115755 1093627 1213528 1336541 1425431 1441901 1382898 1322156 1255129 1224157
7324A224157J9482l1768p0504n1786o3199j04862j62061k10049o8539K69523M80286
$$ 1224157 1243639 1211871 1141367 1089581 1026382 921520 759459 549410 480871 750394 1230680
7313A230680M01947K59414K06857J74434R8469M1397R3899K66969M70334N70285
$$ 1230680 1632627 1892041 2098898 2273332 2371801 2413198 2507097 2774066 3244400 3814685
7303C814685N39285M12847K11915N8116J28992L47586N27465O12903O37145N59663
$$ 3814685 4353970 4766817 4978732 5036848 5165840 5513426 6040891 6653794 7290939 7850602
7293G850602L43250J48498R3244J54110J53696J06743K00105M46652O57952O83400
$$ 7850602 8193852 8342350 8435594 8589704 8743400 8850143 9050248 9496900 10154852 10838252
7283A0838252O61809Q14426J168978J668431K261906K757654K970043L149873
$$ 10838252 11500061 12314487 13483465 15151896 17413802 20171456 23141499 26291372
7275B6291372L631532M258639M861627N498519O247143P127421P992268Q765879
$$ 26291372 29922904 34181543 39043170 44541689 50788832 57916253 65908521 74674400
7267G4674400R000199P974603N375745J656962j888034l873017l949759k901763
$$ 74674400 83674599 91649202 97024947 98681909 96793875 92920858 88971099 86069336
7259H6069336j439380K83145J888902K639125K106781L02719k396608n153011
$$ 86069336 84629956 84913101 86802003 89441128 91547909 91850628 89454020 84301009
7251H4301009p192097q136635q056928p408487o597103n792567n044135m381841
$$ 84301009 77108912 68972277 60915349 53506862 46909759 41117192 36073057 31691216
7243C1691216l835571l374650k879371k352673j957659j671040j527504j635551
$$ 31691216 27855645 24480995 21601624 19248951 17291292 15620252 14092748 12457197
7235A2457197j742981j520775j064778o61126m04093k94100k62139l10767m10288
$$ 12457197 10714216 9193441 8128663 7467537 7063444 6769344 6507205 6196438 5786150
7226E786150m50864l92604k62708r7115N6953j4801k45851k82721p6530J41670
$$ 5786150 5335286 4942682 4679974 4582859 4639812 4625011 4379160 4096439 4019909 4161579
7216D161579J96684R5755j23349k75592k74569j44268R0597J94666J00677J08854
$$ 4161579 4358263 4454018 4330669 4055077 3780508 3636240 3726837 3921503 4022180 4131034
7206D131034K90750K66024L7938o9909j35203k02901j39615k1282K3659L7583
$$ 4131034 4421784 4687808 4725746 4655837 4520634 4317733 4178118 4156836 4180495 4218078
7196D218078L9469N9680J77236K26606J31079n162q3638j16271k49784m83733
$$ 4218078 4257547 4317227 4494463 4721069 4852148 4846986 4763348 4647077 4397293 3913560
7186C913560o58506o49127m90176l20061j42867k8775l4204k7442p759l0055o093
$$ 3913560 3255054 2605927 2115751 1795690 1652823 1624048 1589844 1562402 1554643 1524588 1518495
7175A518495J00285K54893L74079K62622O1817r016n1476j21686j07687k991M0809
$$ 1518495 1618780 1873673 2247752 2510374 2572191 2563175 2511699 2390013 2282326 2279335 2320144
7164B320144L1548M2233n0763k12572j99396o3867M0254M5090p1875k35925k64906
$$ 2320144 2351692 2393925 2343162 2130590 1931194 1867327 1907581 1952671 1880796 1644871 1379965
7153A379965r2285p5408l03080m30855l85811k35374J8856K63571M41750N13844
$$ 1379965 1287680 1212272 909192 478337 92526 -142848 -123992 139579 581329 1095173
7143A095173L89058J25237q3349j81298k64697l44415l26069j39565K2343Q4663
$$ 1095173 1484231 1609468 1526119 1344821 1080124 735709 409640 270075 292418 377081
7133C77081Q9418n6533j73047j17155k5628M7269J25374J97739K41447K05456
$$ 377081 466499 409966 236919 119764 94136 141405 266779 464518 705965 911421
7123I11421R0949O713J87521N99559Q32928O31045R9961m47333p24919o93771
$$ 911421 1002370 1009083 1196604 1796163 2629091 3260136 3360097 2912764 2187845 1494074
7113A494074m93473l21219k06552j82990k33790j56752J08644L75749M14837K25359
$$ 1494074 1000601 679382 472830 289840 56050 -100702 7942 383691 798528 1023887
7103A023887P9667J35396J91549Q4327q6722k39309k63532k06177j99042k54848
$$ 1023887 1103554 1238950 1430499 1514826 1428104 1188795 925263 719086 520044 265196
7093B65196k27552j04149m324o5198j10409R9376K74460J50856K1974K8462R170
$$ 265196 37644 -66505 -70829 -136027 -246436 -147060 127400 278256 300230 328692 337862
7082C37862k566O1728J22133P2593j16428k25337k33094l59969m67896l93259
$$ 337862 335296 397024 519157 591750 475322 249985 16891 -343078 -810974 -1204233
7072a204233j22032K31813N20872N98665M27700K19723J74406K70467K97013K02218
$$ -1204233 -1326265 -1094452 -573580 25085 452785 672508 846914 1117381 1414394 1616612
7062A616612J48244J28125Q8752m413o4220j06526r0976M2489J45861J09618L9566
$$ 1616612 1764856 1892981 1981733 1977320 1913100 1806574 1715598 1758087 1903948 2013566 2053132
7051B053132j5559r6688m9794K02755L58945K27511j3243k10904l90083n83748
$$ 2053132 2037573 1940885 1891091 2093846 2452791 2680302 2667059 2456155 2066072 1482324
7041A482324n54493l36734p7709J99051L24042K87507K23414R7842k1962k8013
$$ 1482324 927831 591097 513388 712439 1036481 1323988 1547402 1645244 1623282 1595269
7031A595269M4987O7053K4572J04943K31241K68993J94770L9435o2387j32299
$$ 1595269 1640256 1707309 1731881 1836824 2068065 2337058 2531828 2571263 2508876 2376577
7021B376577k69586l33351k27691r0757q327n9643k27722l14512l02411l03981
$$ 2376577 2106991 1773640 1545949 1455192 1446865 1387222 1159500 844988 542577 238596
7011B38596l27112l13199k53195j95153j05529L085P1559J05080J24592J41088
$$ 238596 -88516 -401715 -654910 -850063 -955592 -952507 -880948 -775868 -651276 -510188
7001e10188J58282K03667K50280K44310K30619K10895O0684k01123l36590k15947
$$ -510188 -351906 -148239 102041 346351 576970 787865 848549 647426 310836 94889
6991I4889o740J32324K17026J69988j1256j74071k49676k36517k20994j98436
$$ 94889 88149 220473 437499 607487 596231 422160 172484 -64033 -285027 -483463
6981d83463j22954m2175K3476K05295N17255O99775N90782L28001J21761L9427
$$ -483463 -606417 -648592 -625116 -419821 97434 797209 1387991 1715992 1837753 1877180
6971A877180j33632m82691o31482m37250k65966j77029m3001J06556J09938m092
$$ 1877180 1743548 1260857 629375 192125 -73841 -250870 -293871 -187315 -77377 -81469
6961h1469j37538k68123k50982l4370J94141K73651K71587J96775N2142J3970
$$ -81469 -219007 -487130 -738112 -772482 -578341 -304690 -33103 163672 215814 229784
6951B29784J55058L11797M30253L80079R8264k03543l95594m93858n46347n07069
$$ 229784 384842 696639 1126892 1506971 1605235 1401692 1006098 512240 -34107 -541176
6941e41176l62759k73691j53809J20690K80852J25974j96221k85242l3624L31779
$$ -541176 -903935 -1177626 -1331435 -1210745 -929893 -803919 -1000140 -1285382 -1319006 -987227
6931i87227O36091Q26789P87918N10265J53987j62419k62086j84804q704K71593
$$ -987227 -351136 475653 1263571 1773836 1927823 1765404 1503318 1318514 1309810 1581403
6921A581403M44592L45971O2151j83706k32976k24203l55503n60247o43096n11446
$$ 1581403 2025995 2371966 2434117 2250411 2017435 1793232 1437729 877482 234386 -277060
6911b77060k63815m6313J54448L04966K74100J62706Q6407K4287j22320k89679
$$ -277060 -540875 -587188 -432740 -127774 146326 309032 395439 419726 297406 7727
6901G727k21746O0660L03282K65484M1003q081R9775J13539N172j32843k35023
$$ 7727 -214019 -153359 149923 415407 456410 448329 548104 661643 666815 533972 298949
6890B98949k04854j32J75085J06440j5958J29365L13092K53990Q3769k1417k0494
$$ 298949 94095 93963 269048 375488 359530 488895 801987 1055977 1139746 1118329 1097835
6879A097835N5497N9092q5117k61129l11589k88027l18913l15250j61643N9898
$$ 1097835 1153332 1212424 1127307 866178 554589 266562 -52351 -367601 -529244 -469346
6869d69346J98824J60753N9231P3294J74952K81588K17870M1400n8467j54222
$$ -469346 -270522 -109769 -50538 22756 197708 479296 697166 738566 680099 525877
6859E25877k50800k03306L952K63713M15076L81872J31395j64927k94593k03703
$$ 525877 275077 71771 75723 339436 754512 1136384 1267779 1102852 808259 604556
6849F04556j2408J11713K45675M66099M78867K39987P2564J6786o3092j32898
$$ 604556 592148 703861 949536 1415635 1894502 2134489 2207053 2223839 2160747 2027849
6839B027849j76752k27975l13749l74400k99629k62399m16022l90445L1795M22528
$$ 2027849 1851097 1623122 1309373 934973 635344 372945 -43077 -433522 -401727 20801
6829B0801O01716N85043K78938j19364j49883J64281K41776j02955m43011n03749
$$ 20801 622517 1207560 1486498 1367134 1217251 1381532 1623308 1520353 1077342 573593
6819E73593m04121k15194r5378j12292r1605j03902j71953j19651N5616K64827
$$ 573593 169472 -45722 -141100 -253392 -344997 -448899 -620852 -740503 -684887 -420060
6809d20060L82865L30948K07591J51636K11534K50673J49031L428j24272l00952
$$ -420060 -37195 293753 501344 652980 864514 1115187 1264218 1267646 1143374 842422
6799H42422m92700n61245l74540j18370l67O8377J33869J82902J95737J17005
$$ 842422 349722 -211523 -586063 -704433 -704800 -636423 -502554 -319652 -123915 -6910
6789f910M0947l3338j84445k33495j11226J29362L55661L74926K88945J99943
$$ -6910 34037 699 -183746 -417241 -528467 -399105 -43444 331482 620427 820370
6779H20370R0816O6611K7082j62839k23745n4120J36014K53086K75576K70810
$$ 820370 911186 977797 1004879 842040 618295 564175 700189 953275 1228851 1499661
6769A499661J66175p5576k48459l14626l56769l74828l54029k63768j45289m273
$$ 1499661 1665836 1590260 1341801 1027175 670406 295578 -58451 -322219 -467508 -471781
6759d71781J75872J98142O8027O9300J73588J84294Q9002M117M5521J76532K26663
$$ -471781 -295909 -97767 -29740 39560 213148 397442 486444 490561 536082 712614 939277
6748I39277J31384L0530j79919m83493o00312l80032o6972O7496R8550J66745
$$ 939277 1070661 1101191 921272 437779 -162533 -542565 -609537 -542041 -443491 -276746
6738b76746J96668R7326m3613j86849j59488R2634K97659K97576J08446o2824
$$ -276746 -80078 17248 -26365 -213214 -372702 -280068 17591 315167 423613 360789
6728C60789n4822J8088M7447M2899K7804J2712K2692P9228J54173J75107K3635
$$ 360789 305967 324055 371502 414401 442205 454917 477609 556837 711010 886117 909752
6717I09752k56309m61729m54513k32140M2646K33194K77659J76278M748p3413
$$ 909752 653443 191714 -262799 -494939 -452293 -219099 58560 234838 239586 166173
6707A66173L9140J28452J39609J08884L3684m6269j24218j13925J7277j0254j80779
$$ 166173 205313 333765 473374 582258 615942 569673 445455 331530 348807 338553 157774
6696A57774j25970Q1533J86293K05688K30322K19906K43096J87441o6818l01610
$$ 157774 31804 113337 299630 505318 735640 955546 1198642 1386083 1319265 1017655
6686A017655l53853k99645j96476q5854j03549j79861k41868k24219p6364L4901
$$ 1017655 663802 364157 167681 81827 -21722 -201583 -443451 -667670 -744034 -709133
6676g09133R8186J77512J78274O4043j16441k52017l01716l07497j91892L6981
$$ -709133 -610947 -433435 -255161 -191118 -307559 -559576 -861292 -1168789 -1360681 -1323700
6666a323700J84583K64629K64800J88131J48563O0190r1414j15127P9201L58959
$$ -1323700 -1139117 -874488 -609688 -421557 -272994 -212804 -304218 -419345 -340144 18815
6656A8815L92522K9368k98227k62208m9337J1011o702J78833L62398K93549L9483
$$ 18815 411337 440705 142478 -119730 -169067 -158056 -164758 14075 376473 670022 709505
6645G09505k47989l70791j78657K39356N07781N14048M14743L33921L36211L13954
$$ 709505 461516 90725 -87932 151424 659205 1173253 1587996 1921917 2258128 2572082
6635B572082J83114M1713k6395j12976k37925k18237J2121K08139J13946j54680
$$ 2572082 2755196 2796909 2770514 2657538 2419613 2201376 2213497 2421636 2535582 2380902
6625B380902l17027l36671m00195n34460n55919l87377j25528J15952K11876Q8682
$$ 2380902 2063875 1727204 1327009 792549 236630 -150747 -276275 -160323 51553 140235
6615A40235j01350j27753p0079q4079n8614R1105K54593L01022K39314J47897
$$ 140235 38885 -88868 -158947 -243026 -301640 -210535 44058 345080 584394 732291
6605G32291P2870J55258K77781J75589m5555j40613l1879Q6864Q6781J47696K43892
$$ 732291 805161 960419 1238200 1413789 1368234 1227621 1195742 1282606 1369387 1517083 1760975
6594A760975J37789r2794j36454j08196j91380l47975m31214l55629l12387k94079
$$ 1760975 1898764 1805970 1669516 1561320 1369940 1021965 590751 235122 -77265 -371344
6584c71344j23283o239q8642j93948j99272j55718q8642L8176J25629J24883J97199
$$ -371344 -494627 -500866 -589508 -783456 -982728 -1138446 -1227088 -1188912 -1063283 -938400 -741201
6573g41201L06849L55130M80708N14273L46034R6843j25062k61981k74159j87284
$$ -741201 -434352 -79222 401486 915759 1261793 1358636 1233574 971593 697434 510150
6563E10150j32339k7788J93052L43236K71806Q0358r2293k10757j43891N2854
$$ 510150 377811 350023 543075 886311 1158117 1238475 1146182 935425 791534 844388
6553H44388K19451J80556k2230j36884j22980j81997k11694j17800j6653L9052
$$ 844388 1063839 1244395 1222165 1085281 962301 780304 568610 450810 434157 473209
6543D73209j2597j14289j53252q1854L0759M5825l0183j12349j12145J0630J32909
$$ 473209 460612 346323 193071 111217 141976 187801 157618 45269 -66876 -56246 76663
6532G6663L9573k88248n40733m58720j25180J72224K35022K17075L01706L33808
$$ 76663 116236 -172012 -712745 -1171465 -1296645 -1124421 -889399 -672324 -370618 -36810
6522c6810J50402j59979m00047n18122m35085j68811L0608M5621j4873l6410K6082
$$ -36810 113592 -46387 -446434 -964556 -1399641 -1568452 -1537844 -1492223 -1507096 -1543506 -1517424
6511a517424K9203l0347Q56R4204J40854J55146J72514J96769J65228m2925l20241
$$ -1517424 -1488221 -1518568 -1517712 -1423508 -1282654 -1127508 -954994 -758225 -592997 -635922 -956163
6500i56163m30448m01430l55877j91953R2822K79203L01467K68631L03592L49317
$$ -956163 -1386611 -1788041 -2143918 -2335871 -2243049 -1963846 -1662379 -1393748 -1090156 -740839
6490g40839K53411J21393Q2214J41041K70756L40321L17103K40249Q2945K5493
$$ -740839 -487428 -366035 -283821 -142780 127976 468297 785400 1025649 1108594 1134087
6480A134087J18651J28522R4225M7813K5118L0996j5377q7660j56866j90370o0426
$$ 1134087 1252738 1381260 1475485 1523298 1548416 1579412 1564035 1476375 1319509 1129139 1068713
6469A068713P9419l7165j08704q249P8523J4487j39847j42151J480J58828J38548
$$ 1068713 1148132 1110967 1002263 994014 1072537 1087024 947177 805026 806506 965334 1103882
6458A103882j03736l67303l63645k52655k75906l23502k95323k63956k47172k04313
$$ 1103882 1000146 632843 269198 16543 -259363 -582865 -878188 -1142144 -1389316 -1593629
6448a593629j25040J2954J25961P3445k4261O6850K72486M27906M92318M08847
$$ -1593629 -1718669 -1705715 -1579754 -1506309 -1530570 -1463720 -1191234 -763328 -271010 137837
6438A37837J68703n1931j61066j54961j3444L842k53997m73820m52529l27284
$$ 137837 306540 254609 93543 -61418 -74862 -71020 -325017 -798837 -1251366 -1578650
6428a578650j21042J11244J79247K19866L59565M15304K77972l9304l39657l75522
$$ -1578650 -1699692 -1588448 -1409201 -1189335 -829770 -414466 -136494 -175798 -515455 -890977
6418h90977k66703j89710k19064k04082m4383J73297K51297L18217N00144N61601
$$ -890977 -1157680 -1347390 -1566454 -1770536 -1814919 -1641622 -1390325 -1072108 -571964 -10363
6408a0363L75765P9700k7828O8825R1652K2026j5700j4335J492M4241L9417p3827
$$ -10363 365402 445102 417274 486099 577751 599777 584077 569742 571234 615475 654892 581065
6396E81065j55469j12233n8266n9906l7261r1610k37791k59730j90687j33500
$$ 581065 425596 313363 255097 195191 157930 66320 -171471 -431201 -621888 -755388
6386g55388m7636J7882Q3559K32775L71839L63384K89886J36953j56994l31934
$$ -755388 -803024 -785142 -701583 -468808 -96969 266415 556301 693254 536260 204326
6376B04326j43480J30407K61064K85279J76347K6272j31540k03955j55472j35916
$$ 204326 60846 191253 452317 737596 913943 940215 808675 604720 449248 313332
6366C13332j87927j91296p9494L2243J14192J82631K24695J95360J21978R7339
$$ 313332 125405 -65891 -145385 -113142 1050 183681 408376 603736 725714 823053
6356H23053J41177J59581J07206Q4474J02832M3321j22811k79628l05646k04400
$$ 823053 964230 1123811 1231017 1315491 1418323 1461644 1338833 1059205 753559 549159
6346E49159j05504q2329j37419k70362l80719l98013l36692k08785m6883J44311
$$ 549159 443655 361326 223907 -46455 -427174 -825187 -1161879 -1370664 -1417547 -1273236
6336a273236L53070M01607K15502p0362j83640l112K13493K89286K80168J95361
$$ -1273236 -920166 -518559 -303057 -373419 -557059 -560171 -346678 -57392 222776 418137
6326D18137j8977k07962j91072k152K38870L74857L59311K50075R6027r0034j80121
$$ 418137 399160 191198 126 -2026 236844 611701 971012 1221087 1317114 1227080 1046959
6315A046959j58033j56064k84364n14085n88378l80054j4447K29153R2941j95360
$$ 1046959 888926 732862 448498 -65587 -653965 -1034019 -1048466 -819313 -726372 -921732
6305i21732k92718k97407k65629n6856R8427J31427K03467J75718J8400o6535
$$ -921732 -1214450 -1511857 -1777486 -1834342 -1735915 -1604488 -1401021 -1225303 -1206903 -1273438
6295a273438j60768l45304l41006o0227J93536K06343J72664K67822L73250K78479
$$ -1273438 -1434206 -1779510 -2120516 -2180743 -1987207 -1780864 -1608200 -1340378 -967128 -688649
6285f88649M0279j33503j39871n1118n3680q3195j3959Q0337J54587J98541L11573
$$ -688649 -648370 -781873 -921744 -972862 -1026542 -1109737 -1123696 -1043359 -888772 -690231 -378658
6274c78658M88360N84450M85796K40926L025m0307J8129r0333l12244l88853k69502
$$ -378658 109702 694152 1179948 1420874 1423899 1383592 1401721 1311388 999144 610291 340789
6263C40789j72453j49685j79113k32117j42292J35138L48065L25655K42855K36065
$$ 340789 168336 18651 -160462 -392579 -534871 -399733 -51668 273987 516842 752907
6253G52907K71098K14738J73621K22886J23766k40151n23948m73228l22844j78179
$$ 752907 1024005 1238743 1412364 1635250 1759016 1518865 994917 521689 198845 20666
6243B0666R5656M61786N40027J72049k54652l61560j15593J40281J49706M5604
$$ 20666 116322 578108 1118135 1290184 1035532 673972 558379 698660 848366 893970
6233H93970k3431n3934n7569l2021j4152L0940J39617K52480L13111K90069K03751
$$ 893970 870539 816605 759036 727015 712863 743803 883420 1135900 1449011 1739080 1942831
6222A942831J11369l1662j70459j43052J496J42994K10553L47594N13483M01445
$$ 1942831 2054200 2022538 1852079 1709027 1710523 1853517 2064070 2411664 2925147 3326592
6212C326592R5177L9199J06785n9893k67667k42373l2556J59667K31775J90310
$$ 3326592 3421769 3460968 3567753 3507860 3240193 2997820 2965264 3124931 3356706 3547016
6202C547016J39371K63931M82042N53183O65156J016387J324741J369911J308744
$$ 3547016 3686387 3950318 4432360 4985543 5650699 6667086 7991827 9361738 10670482
6193A0670482J510167J958483K519973L183306L848334M633564N585984O638143
$$ 10670482 12180649 14139132 16659105 19842411 23690745 28324309 33910293 40548436
6185D0548436P955264R408565J0398778J0257237Q083628L315961l033331q257749
$$ 40548436 48503700 57912265 68311043 78568280 86651908 89967869 86934538 78676789
6177G8676789j0489208j0269321q887720p297593n892405m715033l852589l214651
$$ 78676789 68187581 57918260 49030540 41732947 35840542 31125509 27272920 24058269
6169B4058269k700767k359509k295997k317227k125217j747031j292119q39127
$$ 24058269 21357502 18997993 16701996 14384769 12259552 10512521 9220402 8381275
6161H381275m92528l25682l40649m39450m29460k44370j12690j11552k27310n25735
$$ 8381275 7888747 7563065 7222416 6782966 6353506 6109136 5996446 5884894 5657584 5131849
6151E131849q23904r04975p27277m76631k91802l1365K20159K46533J60477J43153
$$ 5131849 4307945 3402970 2675693 2199062 1907260 1875895 2096054 2342587 2503064 2646217
6141B646217K30990K80936K63826L21336K98727L4859j68101k02238k53769l42256
$$ 2646217 2877207 3158143 3421969 3743305 4042032 4076891 3908790 3706552 3452783 3110527
6131C110527l66278k22000j26936j62434k20585k34660j34161p1900r0937l3271
$$ 3110527 2744249 2522249 2395313 2232879 2012294 1777634 1643473 1571573 1480636 1447365
6121A447365R4651P9356p3220k09977l05892l75122l97505l71770k30483R7051
$$ 1447365 1542016 1621372 1548152 1338175 1032283 657161 259656 -112114 -342597 -245546
6111b45546L98142M26466J81002j46816l28826l17043j77248k1072J56804L04175
$$ -245546 152596 579062 760064 613248 284422 -32621 -209869 -230941 -74137 230038
6101B30038K38445R0742N2774J19741J86412J21804p629k9223M1686O0716j1955
$$ 230038 468483 559225 611999 731740 918152 1039956 1032327 1003104 1044790 1105506 1093551
6090A093551p9018j00677j60336l18565l89945l04059k78164k95763j77772K1853
$$ 1093551 1014533 913856 753520 434955 45010 -259049 -537213 -832976 -1010748 -988895
6080i88895N2945l3162l0282k696N900O7155J75353J74510J52905K55334L14374
$$ -988895 -935950 -969112 -999394 -1002090 -996190 -929035 -753682 -579172 -426267 -170933 143441
6069A43441K47391J53381L5114j14342j12286L8065J38255J31567J35012J16518
$$ 143441 390832 544213 579327 464985 352699 390764 529019 660586 795598 912116
6059I12116j3206j11868j45688k31932l29529k84899j07732m490L437M3976O5856
$$ 912116 898910 787042 641354 409422 79893 -205006 -312738 -317228 -313791 -269815 -203959
6048b03959j3006j23144k22361l20159l28330j58628K8276J17463J59187J61532
$$ -203959 -216965 -340109 -562470 -882629 -1210959 -1369587 -1341311 -1223848 -1064661 -903129
6038i03129Q4928r450n7404j26853k43675k42283N9880L41229L60245J04435k28314
$$ -903129 -818201 -827651 -885055 -1011908 -1255583 -1497866 -1437986 -1096757 -736512 -632077 -860391
6027h60391l94673l60314j37967J51718L42083M29245L52530J46260L181P9076
$$ -860391 -1255064 -1615378 -1753345 -1601627 -1259544 -830299 -477769 -331509 -328328 -249252
6017b49252K47861L44794L00785J12571o9892m3870J27648K24409J65050J4837
$$ -249252 -1391 343403 644188 756759 686867 642997 770645 995054 1160104 1174941
6007A174941q2933q3315j02836j43843k76573m33423k90452J82025M45501K49596
$$ 1174941 1092008 1008693 905857 762014 485441 52018 -238434 -56409 389092 638688
5997F38688m5908j94971k24624k51501k56776j62137n2809m8219k8586K39090
$$ 638688 592780 397809 173185 -78316 -335092 -497229 -550038 -598257 -626843 -387753
5987c87753O84476R65652Q86434N95971K30028j30374l79189m66662m18093m11759
$$ -387753 296723 1262375 2148809 2744780 2974808 2844434 2465245 1998583 1580490 1168731
5977A168731l57277j70896j07889j22700K872R9279j5388k59004l42903k28883
$$ 1168731 811454 640558 532669 409969 412841 512120 496732 237728 -105175 -334058
5967c34058k5100J82474L05248L68995M82622M72889J17181l59151n51974m37199
$$ -334058 -359158 -176684 128564 497559 980181 1453070 1570251 1211100 659126 221927
5957B21927k30081j19987m4268P7610J32433J33973J95920L32179M36028L45989
$$ 221927 -8154 -128141 -172409 -94799 37634 171607 367527 699706 1135734 1481723
5947A481723J25211m5275q4675l600K12064M37999M54120K80393P4028j46019
$$ 1481723 1606934 1561659 1476984 1473384 1685448 2123447 2577567 2857960 2931988 2785969
5937B785969l20968l85747l60299k73189k31142l69852n66842n55626m35736l51160
$$ 2785969 2465001 2079254 1718955 1445766 1214624 844772 277930 -277696 -713432 -1064592
5927a064592k39864j67975k18621j79560J6727J68907K35904L37418M07688L59628
$$ -1064592 -1304456 -1472431 -1691052 -1870612 -1853885 -1684978 -1449074 -1111656 -703968 -344340
5917c44340K78313K40822J95675J42256J91303K96526K52081o8940l43974k97966
$$ -344340 -66027 174795 370470 512726 704029 1000555 1252636 1183696 839722 541756
5907E41756j14349N2981O9434R994L0351K4560o7071j14761q6750j47720k93389
$$ 541756 427407 480388 549822 559816 590167 614727 547656 432895 346145 198425 -94964
5896i4964m08655l99639k36956l831J51944J16374J6391J07535K23890K17779
$$ -94964 -503619 -903258 -1140214 -1144045 -992101 -875727 -859336 -751801 -527911 -310132
5886c10132J68758M7517j71589l76484l78292j17717L24658O17440O32342N24774
$$ -310132 -141374 -93857 -265446 -641930 -1020222 -1137939 -813281 -195841 436501 961275
5876I61275L19366J43294J31854J66608J76976K19110K30873K4817k71906l96720
$$ 961275 1280641 1423935 1555789 1722397 1899373 2118483 2349356 2374173 2102267 1705547
5866A705547k34327n028O5966P8776J62127K60786K26434Q4028l8609q6170j68926
$$ 1705547 1471220 1466192 1532158 1610934 1773061 2033847 2260281 2344309 2305700 2219530 2050604
5855B050604k09839j65604j65486k08120k26813l01934m53678m96751l78553k37644
$$ 2050604 1840765 1675161 1509675 1301555 1074742 772808 319130 -177621 -556174 -793818
5845g93818n0630K24593N07686O74752O09947K42875j91852l61707l01630j44012
$$ -793818 -844448 -619855 -112169 562583 1172530 1415405 1223553 861846 560216 416204
5835D16204l2969j0773r83O1280J48446J23170J5030m3989P143P415p4698j61725
$$ 416204 383235 372462 371479 432759 581205 704375 719405 675416 682559 689974 615276 453551
5823D53551k37148j73774K2703J81148J68295o0222m38259p09561o60538k23662
$$ 453551 216403 42629 65332 246480 414775 354553 -83706 -793267 -1453805 -1677467
5813a677467K89815N25986M55149J97088N7821J55688J80774Q8634P3025J14924
$$ -1677467 -1387652 -861666 -406517 -209429 -151608 4080 184854 273488 346513 461437
5803D61437N0270p6984j42823j63812j15405J562R2425J49104J21150j693o0220
$$ 461437 511707 434723 291900 128088 12683 14245 106670 255774 376924 375231 315011
5792C15011l4328p4516k04040k39907j11252L8039J81956K95160K37610Q6008
$$ 315011 280683 206167 2127 -237780 -349032 -310993 -129037 166123 403733 489741
5782D89741n5990j78374j60343r2009j31554j73010j88372j79349j49559k43170
$$ 489741 433751 255377 95034 3025 -128529 -301539 -489911 -669260 -818819 -1061989
5772a061989k75926j01822O1343J50390K06056J13564n4890p9546j8835j4699
$$ -1061989 -1337915 -1439737 -1378394 -1228004 -1021948 -908384 -963274 -1042820 -1061655 -1076354
5762a076354p4889j31309j09449Q9173L81896N83270N29656K41752o9718k91357
$$ -1076354 -1151243 -1282552 -1392001 -1302828 -920932 -337662 191994 433746 364028 72671
5752G2671m14482l09910l2045K10388J93764p9208l39567m66015m93606m80335
$$ 72671 -341811 -651721 -683766 -473378 -279614 -358822 -698389 -1164404 -1658010 -2138345
5742b138345m12410k98060k58161l08159j78239K15352N21116N68740M70692L22911
$$ -2138345 -2550755 -2848815 -3106976 -3415135 -3593374 -3378022 -2856906 -2288166 -1817474 -1494563
5732a494563J52191L5589K2187J06407J84222J04858p7836j11198Q5135K95486
$$ -1494563 -1342372 -1306783 -1284596 -1178189 -993967 -889109 -966945 -1078143 -993008 -697522
5722f97522L30500K01204l8059k36594k36296o0683J91231L12624K20330O7822
$$ -697522 -367022 -165818 -203877 -440471 -676767 -737450 -546219 -233595 -13265 54557
5712E4557q602M1632J11738j8692k57162l20386j98313j32719k29393l12537k64454
$$ 54557 45955 87587 199325 180633 -76529 -396915 -595228 -727947 -957340 -1269877 -1534331
5701a534331j21258j3720L921M4090K01043L65086M25145M99410N50509L87587
$$ -1534331 -1655589 -1669309 -1665388 -1621298 -1420255 -1055169 -630024 -130614 419895 807482
5691H07482R0027j00730j28093j36606j99083j85993K5579K67440K94942J68201
$$ 807482 897509 796779 668686 532080 332997 147004 172583 440023 734965 903166
5681I03166J9661r3216r9127k6418M1134Q5455J16086J91851L10705L82516L32098
$$ 903166 922827 829611 730484 704066 745200 830655 946741 1138592 1449297 1831813 2163911
5670B163911K17444J16970M6577J0358K2592J6082m4835j50803k04952j62492
$$ 2163911 2381355 2498325 2544902 2555260 2577852 2593934 2549099 2398296 2193344 2030852
5660B030852j92643l50780m35057l98441m48719o36136p21074n36792k24473j5221
$$ 2030852 1838209 1487429 1052372 653931 205212 -430924 -1151998 -1688790 -1913263 -1928484
5650a928484M4705Q1751K28172N00316O53477M57475J86294l6519k26710l31541
$$ -1928484 -1883779 -1802028 -1573856 -1073540 -420063 37412 223706 187187 -39523 -371064
5640c71064k24031Q6286L05291L68032L30964K24997J06560q801q6935k30165
$$ -371064 -595095 -508809 -203518 164514 495478 720475 827035 818234 731299 501134
5630E01134m35844m49024k67537p6331o0593k02979l52746m03945k84123l6471
$$ 501134 65290 -383734 -651271 -727602 -788195 -991174 -1343920 -1747865 -2031988 -2068459
5620b068459P8768m167m4152n154M9725R4770J41495K48504L77212M71962M83393
$$ -2068459 -1989691 -1993858 -2038010 -2043164 -1993439 -1898669 -1757174 -1508670 -1131458 -659496 -176103
5609a76103L62272J45763j29285m23919n51493m57414j85032P4813J79578J42248
$$ -176103 186169 331932 202647 -221272 -772765 -1230179 -1415211 -1340398 -1160820 -1018572
$$ [...]
##END NTUPLES=NMR SPECTRUM
##END=
