##TITLE=C13_ser 5-6-V-5
 DMSO-d6, 22200 sc

 7.6.2022
##JCAMPDX= 6.0         $$ Bruker NMR JCAMP-DX V2.0
##DATA TYPE= NMR SPECTRUM
##DATA CLASS= NTUPLES
##ORIGIN= UXNMR, Bruker Analytische Messtechnik GmbH
##OWNER= root
$$ XWIN-NMR		Version 3.5
$$ Thu Jun  9 13:48:41 2022 Russian Standard Time (UT+4h)  she@DPX200
##.OBSERVE FREQUENCY= 50.327896
##.OBSERVE NUCLEUS= ^13C
##.ACQUISITION MODE= SIMULTANEOUS
##.ACQUISITION SCHEME= undefined
##.AVERAGES= 22203
##.DIGITISER RES= 17
##SPECTROMETER/DATA SYSTEM= spect
##.PULSE SEQUENCE= zgpg30
##.SOLVENT NAME= CDCl3
##.SHIFT REFERENCE= (INTERNAL, CDCl3, 0, 222.653)
##AUDIT TRAIL= $$ (NUMBER, WHEN, WHO, WHERE, WHAT)
$$ ##TITLE= Audit trail, XWIN-NMR		Version 3.5
$$ ##JCAMPDX= 5.01
$$ ##ORIGIN= Bruker BioSpin GmbH
$$ ##OWNER= she
$$ F:/spectra/data/she/nmr/c13/1/pdata/1/auditp.txt
$$ ##AUDIT TRAIL=  $$ (NUMBER, WHEN, WHO, WHERE, WHAT)
(   1,<2022-06-09 13:45:23.75 +0400>,<she>,<DPX200>,
      <created by zg, POWCHK disabled, PULCHK disabled
       terminated by command 'halt'
       configuration hash MD5:
       00 E9 B6 7A A2 85 ED C7 34 08 36 98 17 FE 4E 26
       data hash MD5: 32K
       40 4E C5 81 54 AC 61 88 31 BB 44 23 05 CE 56 DB>)
(   2,<2022-06-09 13:45:42.90 +0400>,<she>,<DPX200>,
      <Start of raw data processing
       efp BC_mod = 2 LB = 1 FT_mod = 6 PKNL = 1 PHC0 = -367.726 PHC1 = 29.28472 SI = 32K 
       data hash MD5: 32K
       CA ED 4B 73 4E 26 06 8A 8A 11 90 86 E2 88 C2 96>)
(   3,<2022-06-09 13:45:45.78 +0400>,<she>,<DPX200>,
      <abs ABSG = 5 
       data hash MD5: 32K
       8E 38 06 DD DF 5B 68 C8 26 18 82 51 E8 F4 12 1E>)
(   4,<2022-06-09 13:46:19.10 +0400>,<she>,<DPX200>,
      <pk PHC0 = -38.94668 PHC1 = 66.00001 
       data hash MD5: 32K
       37 22 77 3E 5E F8 24 EE 63 96 AE D0 89 9A A7 43>)
(   5,<2022-06-09 13:46:25.18 +0400>,<she>,<DPX200>,
      <abs ABSG = 5 
       data hash MD5: 32K
       09 35 E2 16 3D 7C 0F 96 96 63 31 63 78 23 74 BA>)
(   6,<2022-06-09 13:46:50.45 +0400>,<she>,<DPX200>,
      <pk PHC0 = 40.69475 PHC1 = -67.40001 
       data hash MD5: 32K
       01 2B 32 BB 8C 6A D8 2F 0B 67 3A 29 CA D7 E5 4A>)
(   7,<2022-06-09 13:46:54.00 +0400>,<she>,<DPX200>,
      <abs ABSG = 5 
       data hash MD5: 32K
       08 9B 36 FF 88 1C 91 96 4F 48 35 06 DE 78 3F 0D>)
(   8,<2022-06-09 13:47:59.87 +0400>,<she>,<DPX200>,
      <abs ABSG = 5 
       data hash MD5: 32K
       06 79 CB 7B 2A FC C0 36 55 FC 8C D7 69 78 B8 26>)
$$ ##END=
$$ 
$$ hash MD5
$$ 52 3A 4B A7 13 CD 8D 32 0E 3D 25 68 CA 0F 1F E6
##$RELAX= 
##$RELAX= 
##$RELAX= 
##$RELAX= 
##$RELAX= 
##$RELAX= 
##$RELAX= 
##$RELAX= 
$$ Bruker specific parameters
$$ --------------------------
##$DU= <F:/spectra>
##$EXPNO= 1
##$NAME= <c13>
##$PROCNO= 1
##$TYPE= <nmr>
##$USER= <she>
##$AMP= (0..31)
100 100 100 100 100 100 100 100 100 100 100 100 100 100 100 100 100 100 
100 100 100 100 100 100 100 100 100 100 100 100 100 100 
##$AQSEQ= 0
##$AQ_mod= 1
##$AUNM= <au_zg>
##$AUTOPOS= <>
##$BF1= 50.322709
##$BF2= 200.13
$$ [...]
##$SUBNAM4= <"">
##$SUBNAM5= <"">
##$SUBNAM6= <"">
##$SUBNAM7= <"">
##$SUBNAM8= <"">
##$SUBNAM9= <"">
##$SW= 239.972175391363
##$SWIBOX= (0..15)
0 1 3 0 0 0 0 0 0 0 0 0 0 0 0 0 
##$SW_h= 12077.2946859903
##$TD= 32768
##$TD0= 1
##$TE= 0
##$TE2= 300
##$TE3= 300
##$TEG= 300
##$TL= (0..7)
120 120 120 120 120 120 120 120 
##$TP= (0..7)
150 150 150 150 150 150 150 150 
##$TP07= 0
##$TPNAME0= <>
##$TPNAME1= <>
##$TPNAME2= <>
##$TPNAME3= <>
##$TPNAME4= <>
##$TPNAME5= <>
##$TPNAME6= <>
##$TPNAME7= <>
##$TPOAL= (0..7)
0.5 0.5 0.5 0.5 0.5 0.5 0.5 0.5 
##$TPOFFS= (0..7)
0 0 0 0 0 0 0 0 
##$TUNHIN= 0
##$TUNHOUT= 0
##$TUNXOUT= 0
##$USERA1= <user>
##$USERA2= <user>
##$USERA3= <user>
##$USERA4= <user>
##$USERA5= <user>
##$V9= 5
##$VALIST= <valist>
##$VCLIST= <CCCCCCCCCCCCCCC>
##$VD= 0
##$VDLIST= <DDDDDDDDDDDDDDD>
##$VPLIST= <PPPPPPPPPPPPPPP>
##$VTLIST= <TTTTTTTTTTTTTTT>
##$WBST= 1024
##$WBSW= 4
##$XGAIN= (0..3)
0 0 0 0 
##$XL= 0
##$YL= 0
##$YMAX_a= 126107399
##$YMIN_a= -31509986
##$ZGOPTNS= <>
##$ZL1= 120
##$ZL2= 120
##$ZL3= 120
##$ZL4= 120
##$ABSF1= 222.6533
##$ABSF2= -17.34351
##$ABSG= 5
##$ABSL= 3
##$ALPHA= 0
##$AQORDER= 0
##$ASSFAC= 0
##$ASSFACI= 0
##$ASSFACX= 0
##$ASSWID= 0
##$AUNMP= <proc_1d>
##$AZFE= 0.1
##$AZFW= 0.5
##$BCFW= 0
##$BC_mod= 2
##$BYTORDP= 0
##$COROFFS= 0
##$CY= -3
##$DATMOD= 1
##$DC= 0
##$DFILT= <>
##$DTYPP= 0
##$F1P= 0
##$F2P= 0
##$FCOR= 0.5
##$FTSIZE= 32768
##$FT_mod= 6
##$GAMMA= 0
##$GB= 0
##$INTBC= 1
##$INTSCL= 4.134877e-10
##$ISEN= 128
##$LB= 1
##$LEV0= 0
##$LPBIN= 0
##$MAXI= 10000
##$MC2= 0
##$MEAN= 0
##$ME_mod= 0
##$MI= 0.1934396
##$NCOEF= 0
##$NC_proc= 2
##$NLEV= 6
##$NOISF1= 120.0001
##$NOISF2= 80.00006
##$NSP= 0
##$NTH_PI= 0
##$NZP= 0
##$OFFSET= 222.6533
##$PC= 1.4
##$PHC0= -365.9779
##$PHC1= 27.88472
##$PH_mod= 1
##$PKNL= yes
##$PPARMOD= 0
##$PSCAL= 0
##$PSIGN= 0
##$REVERSE= no
##$SF= 50.322730123286
##$SI= 32768
##$SIGF1= 140
##$SIGF2= 120
##$SINO= 11.81781
##$SIOLD= 32768
##$SREGLST= <13C.CDCl3>
##$SSB= 0
##$STSI= 32768
##$STSR= 0
##$SW_p= 12077.2946859903
##$SYMM= 0
##$S_DEV= 0
##$TDeff= 32768
##$TDoff= 0
##$TI= <>
##$TILT= no
##$TM1= 0
##$TM2= 0
##$TOPLEV= 0
##$USERP1= <user>
##$USERP2= <user>
##$USERP3= <user>
##$USERP4= <user>
##$USERP5= <user>
##$WDW= 1
##$XDIM= 32768
##$YMAX_p= 346518745
##$YMIN_p= -2657812
$$ End of Bruker specific parameters
$$ ---------------------------------
##NTUPLES= NMR SPECTRUM
##VAR_NAME=  FREQUENCY,     SPECTRUM/REAL,   SPECTRUM/IMAG
##SYMBOL=    X,             R,               I
##VAR_TYPE=  INDEPENDENT,   DEPENDENT,       DEPENDENT
##VAR_FORM=  AFFN,          ASDF,            ASDF
##VAR_DIM=   32768,         32768,           32768
##UNITS=     HZ,            ARBITRARY UNITS, ARBITRARY UNITS
##FACTOR=    0.368581032318806, 1,           1
##FIRST=     11204.5221812756, 0,            0
##LAST=      -872.772504714734, 0,           0
##MIN=       -872.772504714734, -2657812,    0
##MAX=       11204.5221812756, 346518745,    0
$$ Real data points
##PAGE= N=1
##DATA TABLE= (X++(R..R)), XYDATA
$$ [...]
15933c00491l70987K98991N85242K33626k33045m93352r7999L98340M14208O9092
$$ -300491 -671478 -372487 212755 446381 213336 -280016 -378015 20325 434533 503625
15923E03625r8028j69443l72711l16475J76100O30393L76107M07899M65949R3585
$$ 503625 405597 236154 -136557 -453032 -276932 353461 729568 1137467 1603416 1697001
15913A697001m07581p59079m70195l41909m38018J74993L02644K03650M5190o43060
$$ 1697001 1289420 530341 60146 -281763 -719781 -544788 -242144 -38494 6696 -636364
15903f36364p24287J10484L2789j52998N6993L67672J96513M5222M4374O9132
$$ -636364 -1360651 -1250167 -1217378 -1370376 -1313383 -945711 -749198 -703976 -659602 -590470
15893e90470k74249k96917L12157K69603J19251M974Q1312L14962O123j78800
$$ -590470 -864719 -1161636 -849479 -579876 -460625 -455651 -374339 -59377 -53254 -232054
15883b32054L78212L17248K195l87444l42642j22436o4592o2221M6986L44600
$$ -232054 146158 463406 465601 78157 -264485 -386921 -451513 -513734 -466748 -122148
15873a22148K38345l64316l4428P38584O41984L59590o08667q34285m38942m54714
$$ -122148 116197 -248119 -282547 456037 1098021 1457611 848944 14659 -424283 -878997
15863h78997J02185L53482N2569r3770m0329J0809J64013J1602j62396j76072
$$ -878997 -776812 -423330 -370761 -464531 -504860 -494051 -330038 -318436 -480832 -656904
15853f56904J34305j66813o3267M42013K36101J11134K921j98225J88303M75217
$$ -656904 -522599 -689412 -752679 -310666 -74565 36569 39490 -158735 29568 504785
15843E04785J47859J1153k08472m2653J43656l54270m39327R365N23553M44869
$$ 504785 652644 663797 455325 412672 556328 202058 -237269 -227904 295649 740518
15833G40518N2894k18544k51120j99555n43999k02588M76388L90433L84791M13831
$$ 740518 793412 574868 323748 124193 -419806 -622394 -146006 244427 629218 1043049
15823A043049j53236k77527m6366k21088o18637q9573N18998O33728L77815m04293
$$ 1043049 889813 612286 565920 344832 -273805 -363378 155620 789348 1167163 762870
15813G62870n98329j17227L81007J05283K7131m11006k59346j56661J84272M22277
$$ 762870 164541 47314 428321 533604 560735 149729 -109617 -266278 -82006 340271
15803C40271K33023k59877m51180o338j82143K75799O64439j61465j1196J02967
$$ 340271 573294 313417 -137763 -144101 -326244 -50445 613994 452529 441333 544300
15793E44300l27971m02100j31281Q9725l78224j75479j26302j0517O80479L67575
$$ 544300 216329 -185771 -317052 -227327 -605551 -781030 -907332 -917849 -237370 130205
15783A30205K8787J50048j74682q551K46830K68409l49883o01004m40640Q2675
$$ 130205 158992 309040 134358 125807 372637 641046 291163 -309841 -750481 -667806
15773f67806L11237M77030J33522m4313j5578j54639J58564M8609K40468J43736
$$ -667806 -356569 120461 253983 209670 194092 39453 198017 246626 487094 630830
15763F30830J11835J25187l34217N4315K88718J73866j61884j80507m12194k74419
$$ 630830 742665 867852 533635 587950 876668 1050534 888650 708143 295949 21530
15753B1530K39687j1611l98212j67692J63226n6262q6934l51645k84060N01771
$$ 21530 261217 249606 -148606 -316298 -153072 -209334 -296268 -647913 -931973 -430202
15743d30202M03972p3340M70634N07712N31291J34119k71227l67306j55232Q4724
$$ -430202 -26230 -99570 371064 878776 1410067 1544186 1272959 905653 750421 835145
15733H35145K3295q2751j99251k12591p4586K40166M59226Q5253l45660j30961
$$ 835145 858440 775689 576438 363847 289261 529427 988653 1073906 728246 597285
15723E97285j48048j6382l75618m80464o284L21655j53362j64639L92187r1837
$$ 597285 449237 432855 57237 -423227 -429511 -107856 -261218 -425857 -33670 -125507
15713a25507k51761L52104L31768j09242j7236k3356K67565m2183m64280r6895
$$ -125507 -377268 -25164 306604 197362 180126 156770 424335 382152 -82128 -179023
15703a79023J71086K70756L83102r6955j90117l39062o15831k08311J95371K49908
$$ -179023 -7937 262819 645921 548966 358849 19787 -596044 -804355 -608984 -359076
15693c59076P2188J47922Q699l9934K28425J23253m61723p15339k34506N92001
$$ -359076 -286888 -138966 -130267 -170201 58224 181477 -280246 -995585 -1230091 -638090
15683f38090P13824J80796j71306K3659J32437m7253p9758j54224M8254R34847
$$ -638090 75734 256530 85224 108883 241320 194067 114309 -39915 8339 943186
15673I43186L37057l80446j94479r0066m74487l65166J57202P825j58996m35003
$$ 943186 1280243 899797 705318 615252 140765 -224401 -67199 -59374 -218370 -653373
15663f53373j12097K97101J19841m6865o78067k51442J04769j42194o03525l42531
$$ -653373 -765470 -468369 -348528 -395393 -1073460 -1324902 -1220133 -1362327 -1965852 -2308383
15653b308383N04697M17274L0316M86543O14820O8634k91266j21862L81627L0956
$$ -2308383 -1803686 -1386412 -1356096 -869553 -254733 -186099 -477365 -599227 -217600 -186644
15643a86644n5740q8192k51760o1549J2820K38264M33232M7165m9165P7145n1126
$$ -186644 -242384 -330576 -582336 -643885 -631065 -392801 40431 87596 38431 115576 64450
15632F4450m15176j20167M031r4126O3695L17414J76050j2267j60519o8943L00298
$$ 64450 -350726 -470893 -466862 -560988 -497293 -179879 -3829 -16096 -176615 -245558 54740
15621E4740M49869K25501K03953j57608n2954k78878k34393j0614m51884k14430
$$ 54740 504609 730110 934063 776455 723501 444623 210230 199616 -252268 -466698
15611d66698J9542j22307J09007K82275M9595N1308J46972j0668k70183l13119
$$ -466698 -447156 -569463 -460456 -178181 -128586 -77278 69694 59026 -211157 -524276
15601e24276l44687k4451L26513J66551k51317J77945K69311o9414o8454K85095
$$ -524276 -868963 -893414 -566901 -400350 -651667 -473722 -204411 -273825 -342279 -57184
15591e7184L32868m7603l63689l21539J14969M68182J15548k19922k5026J35138
$$ -57184 275684 228081 -135608 -457147 -342178 126004 241552 21630 -3396 131742
15581A31742k82333p04235m56497k49106j30439M46175P82167O27882L67197P0535
$$ 131742 -150591 -854826 -1311323 -1560429 -1690868 -1244693 -462526 165356 532553 603088
15571F03088J19285p2852l23240k48034p8872q6332Q5436P8186M91730M57044
$$ 603088 722373 649521 326281 78247 -625 -86957 -1521 76665 568395 1025439
15561A025439j90772l30703j30476J76088j75567l95655m62650j83608j03829
$$ 1025439 834667 503964 373488 549576 374009 -21646 -484296 -667904 -771733
15552g71733J35420Q6032K11047L48586N18775N24580m1827k97218l02159j33189
$$ -771733 -636313 -550281 -339234 9352 528127 1052707 1010880 713662 411503 278314
15542B78314o8078n3925j78527m02639J49762N69079M34808M8144j50254m64517
$$ 278314 210236 156311 -22216 -424855 -275093 293986 728794 776938 626684 162167
15532A62167k53835L3937N85147K85108j41776m13463n83081k94662J09585Q4689
$$ 162167 -91668 -57731 527416 812524 670748 257285 -325796 -620458 -510873 -426184
15522d26184k34907j95953p0096l585M79664M85474K59646j1808j89523k48237
$$ -426184 -661091 -857044 -927140 -930725 -451061 34413 294059 282251 92728 -155509
15512a55509l18743k61583j46154L25705J46154k36518J43647J10347k99270K58948
$$ -155509 -474252 -735835 -881989 -556284 -410130 -646648 -503001 -392654 -691924 -432976
15502d32976N83385L99277J80179J4688l67646k59017k13945M07154O46501M9115
$$ -432976 150409 549686 729865 744553 376907 117890 -96055 311099 957600 1006715
15492A006715k53115n37921n97077k00928K95695M65580L22702J72595R1968J5796
$$ 1006715 753600 215679 -381398 -582326 -286631 178949 501651 674246 766214 782010
15482G82010n05860j72387j13576k38776K89410O9708l21612l26453K49416N01759
$$ 782010 276150 103763 -9813 -248589 40821 110529 -211083 -537536 -288120 213639
15472B13639L72373J37712m21231m65783J947J02249K000J9421j18286j97148
$$ 213639 586012 723724 302493 -163290 -161343 -59094 -57094 -37673 -155959 -353107
15462c53107n196N17096j79054l97362j78606M45047K39508K52579p298m5978
$$ -353107 -358303 158793 -20261 -417623 -596229 -151182 88326 340905 333607 287629
15452B87629k6253n26552k68846j1606J87047O15560M22731K0927k57076m01028
$$ 287629 261376 -265176 -534022 -545628 -358581 256979 679710 700637 443561 42533
15442D2533m12144j06037R3467q9779J57833Q220N4875J47685m0617o99448n72428
$$ 42533 -369611 -475648 -382181 -471960 -314127 -305907 -251032 -103347 -143964 -843412 -1415840
15431a415840j1778K30899m4267m87491k92206M3058K00126L61897M39981L32528
$$ -1415840 -1427618 -1196719 -1240986 -1728477 -2020683 -1977625 -1777499 -1415602 -975621 -643093
15421f43093Q8075L19445N43335L10338J19374J90909L380j51057m92086n01997
$$ -643093 -555018 -235573 307762 618100 737474 928383 931763 780706 288620 -213377
15411b13377k7964M81433N93681J70027R8001J43720j59699j36287j23648j20852
$$ -213377 -241341 240092 833773 1003800 1101801 1245521 1085822 949535 825887 705035
15401G05035l75541n2115O09333K73029j49286m64254o06585p00739k85130M19177
$$ 705035 329494 277379 886712 1159741 1010455 546201 -60384 -761123 -1046253 -627076
15391f27076O85028K65423l41894N780L26608q3700p34O52921J28295n14032n09237
$$ -627076 57952 323375 -18519 -12739 313869 230169 229435 882356 1010651 496619 -12618
15380a2618l91306L10043N2643k95490K72039N53743r5262r4830j40065L3880
$$ -12618 -403924 -93881 -41238 -336728 -64689 489054 393792 298962 158897 192777
15370A92777K78140O440k71121m24766k36541k41437L00219O48878K03665k49005
$$ 192777 470917 477357 206236 -218530 -455071 -696508 -396289 252589 456254 207249
15360B07249r9276K20589K54575k85797l32850p7606P988k23334r1555L32694
$$ 207249 107973 328562 583137 297340 -35510 -113116 -105128 -328462 -420017 -87323
15350h7323M16531L06674K48554L84792k07115r41074p40901j47434L53821K76456
$$ -87323 329208 635882 884436 1269228 1062113 121039 -619862 -767296 -413475 -137019
15340a37019j00898j28031K6231k80556n72455R5296K47043J23500j72341n06853
$$ -137019 -237917 -365948 -339717 -620273 -1192728 -1097432 -850389 -726889 -899230 -1406083
15330a406083j85228J05442j46564J42454L36756K40572L80005L63395L10645
$$ -1406083 -1591311 -1485869 -1632433 -1489979 -1153223 -912651 -532646 -169251 141394
15321A41394K98818K51511o699l89653l78220j19637K52002N93067L62164P4102
$$ 141394 440212 691723 685024 295371 -82849 -202486 49516 642583 1004747 1078849
15311A078849l19255l61580l24403k16390l40159k17613K02989p8416J15089L87705
$$ 1078849 759594 398014 73611 -142779 -482938 -700551 -497562 -575978 -460889 -73184
15301g3184M03932k33250j65986R5115n757n0640l70394m73261n6843N04236P65104
$$ -73184 330748 97498 -68488 26627 20870 -29770 -400164 -873425 -930268 -426032 339072
15290C39072P73846K84311j94582K8339K80714l97366n28229m52747l98902q6210
$$ 339072 1112918 1397229 1202647 1230986 1511700 1114334 586105 133358 -265544 -351754
15280c51754m091j51701n8467j31943J46664J1510L30511N31783K1907K19794
$$ -351754 -355845 -507546 -566013 -697956 -551292 -539782 -209271 322512 344419 564213
15270E64213j4425m25830j00841R8145M3971l54931o82235q8319L01958R5352
$$ 564213 549788 123958 23117 121262 165233 -189698 -871933 -960252 -658294 -562942
15260e62942K81968M41616N5629N2521m02952l09819K26042J40369j31997l99301
$$ -562942 -280974 160642 216271 268792 -134160 -443979 -217937 -77568 -209565 -608866
15250f08866n23255j2908P7460J73720J31985r1297o1198M50955M08368L81089
$$ -608866 -1132121 -1145029 -1067569 -893849 -761864 -853161 -914359 -463404 -55036 326053
15240C26053K8051k98536n7461J93731l773j4165j28033K5645R9283j09451J8343
$$ 326053 354104 55568 -1893 191838 188065 173900 45867 71512 170795 61344 79687
15229G9687m1564p6929J07951k68213O7794J66520p486q142k97754q41949l37770
$$ 79687 38123 -38806 69145 -199068 -131274 35246 27760 19618 -278136 -1120085 -1457855
15218a457855Q2921m0273O0349M1205P7054M0636L28162L44538n1779N1042J28602
$$ -1457855 -1374934 -1415207 -1354858 -1313653 -1236599 -1195963 -867801 -523263 -575042 -524000 -395398
15207c95398R9450L20095j48620k23689O9J44554m47410j9209J6305j92820r1979
$$ -395398 -295948 24147 -124473 -348162 -348093 -203539 -650949 -670158 -653853 -846673 -938652
15196i38652J84609N52492M68451K82395Q3548n21442l67911K77744M96518J34205
$$ -938652 -754043 -201551 266900 549295 632843 111401 -256510 21234 517752 651957
15186F51957m32025k27280l40822m32140L87806O29017k3721j30897K7463J96563
$$ 651957 219932 -7348 -348170 -780310 -392504 236513 212792 81895 109358 305921
15176C05921Q426k29253j51318q8178J50235M60902L75646K1067k80942j45495
$$ 305921 314347 85094 -66224 -154402 -4167 456735 832381 853448 572506 427011
15166D27011K78935K94562K80734L50428n00529r49993n63808l86910o8510N77965
$$ 427011 705946 1000508 1281242 1631670 1131141 181148 -382660 -769570 -838080 -260115
15156b60115K88674M4188K71282k7110j11919K2567L29810l89700l91145k74038
$$ -260115 28559 72747 344029 316919 205000 227567 557377 167677 -223468 -497506
15146d97506l71226o2306K55940K98087K00513o0306J43729J30908J4712r9840
$$ -497506 -868732 -931038 -675098 -377011 -176498 -236804 -93075 37833 52545 -47295
15136d7295K28426Q8910j80998o4665J09270j69725o24484l41536q3782j95580
$$ -47295 181131 270041 89043 24378 133648 -36077 -660561 -1002097 -1085879 -1281459
15126a281459P3696Q6442l501J30035K82217J72577J67647M00965J03354n648
$$ -1281459 -1207763 -1121321 -1124822 -994787 -712570 -539993 -372346 28619 131973 126325
15116A26325k13006o2148K02102Q4277N51189L28671n87651n51213m8631J97205
$$ 126325 -86681 -148829 53273 137550 688739 1017410 429759 -121454 -170085 27120
15106B7120L37739K18791K23629o4803k90496j05611j59335o48461m04151O49657
$$ 27120 364859 583650 807279 742476 451980 346369 187034 -461427 -865578 -215921
15096b15921N51950J99503L26584P9463n58701n21129l45341l67353m2761J10118
$$ -215921 336029 535532 862116 941579 382878 -138251 -483592 -850945 -893706 -783588
15086g83588J86652o0915K5211K62838J19674J54561J06981K51213N07888l07779
$$ -783588 -596936 -657851 -632640 -369802 -250128 -95567 11414 262627 770515 462736
15076D62736k2262M33437O965l39611o95983k33692M0668k94706j00114L97126
$$ 462736 440474 873911 880876 541265 -154718 -388410 -347742 -642448 -742562 -345436
15066c45436L53987m50425m99037J62659N11058N97588K07633j674m70132l41032
$$ -345436 8551 -441874 -940911 -778252 -267194 330394 538027 536353 66221 -274811
15056b74811K46153K38456M08136J40818l4898k25881m31118l9169O03761K24802
$$ -274811 -28658 209798 617934 758752 723854 497973 66855 27686 631447 856249
15046H56249m17450o95253k06387J53921k01206l46394q6127K02181N33655R41226
$$ 856249 438799 -256454 -462841 -308920 -510126 -856520 -942647 -740466 -206811 734415
15036G34415R33954N25927N968m10695k29484M6291l40885M6450L79325J65894
$$ 734415 1668369 2194296 2200264 1789569 1560085 1606376 1265491 1311941 1691266 1857160
15026A857160l38966m87008j69892q5422J77960j4040l25892m66061j23687J55743
$$ 1857160 1518194 1031186 861294 775872 953832 939792 613900 147839 24152 179895
15016A79895j42729l40718r7927L19987L24837P30652L30289k30628j73397j69119
$$ 179895 37166 -303552 -401479 -81492 243345 973997 1304286 1073658 900261 731142
15006G31142l07890k01442j61839m47498l06780K65383J36801K07913l6584m98372
$$ 731142 423252 221810 59971 -387527 -694307 -428924 -292123 -84210 -120794 -619166
14996f19166J85411M71907L61734J64236Q1765n8877j39573l84825o25618j63080
$$ -619166 -433755 38152 399886 564122 645887 587010 447437 62612 -563006 -726086
14986g26086Q00511Q72636l23982p23837n46825j49181L34745L90978K03111n3530
$$ -726086 74425 947061 623079 -100758 -647583 -796764 -462019 -71041 132070 78540
14976G8540k6246J37455n56645m78807N69635Q17649m0853q6816O3349J7994j78212
$$ 78540 52294 189749 -366896 -845703 -276068 541581 500728 413912 477261 495255 317043
14965C17043m15200j15292M01946J14799k05186o315q7378k7980m3291j56625
$$ 317043 -98157 -213449 188497 303296 98110 91795 4417 -23563 -66854 -223479
14955b23479J26454K96054J70449l2156l90998k04814j39987j43197J37569J82855
$$ -223479 -97025 199029 369478 337322 -53676 -258490 -398477 -541674 -404105 -221250
14945b21250o0932l72808j48537L81439K80140L87306K86140k57940M0645K28193
$$ -221250 -282182 -654990 -803527 -422088 -141948 245358 531498 273558 314203 542396
14935E42396p615j87909K3659n3004m21601k88292L54146N44578K73250K75892
$$ 542396 534781 346872 370531 317527 -104074 -392366 -38220 506358 779608 1055500
14925A055500R1588o4193j79362J37291K29814l39173m38511k76112j24493P3042
$$ 1055500 1147088 1082895 903533 1040824 1270638 931465 492954 216842 92349 165391
14915A65391K2891l75719n67751K72525P19662M92360K85571j77273k59220n796
$$ 165391 188282 -187437 -755188 -482663 236999 729359 1014930 837657 578437 572641
14905E72641K81632j76582q57416n77578P5991M10637J84565j07991j56774n3324
$$ 572641 854273 677691 -179725 -757303 -681312 -270675 -86110 -194101 -350875 -404199
14895d04199K19922K10228K8563l03180o60270n51093J13193L82633j94587j65925
$$ -404199 -184277 25951 54514 -248666 -908936 -1460029 -1346836 -964203 -1158790 -1324715
14885a324715K3106j64327k3923L95984O20388N7738N5857J80397J5899j28370
$$ -1324715 -1301609 -1465936 -1489859 -1093875 -473487 -415749 -359892 -179495 -163596 -291966
14875b91966j78684k09295K16562P40181N97710k82542o80322k03209j87816l03400
$$ -291966 -470650 -679945 -463383 276798 874508 591966 -88356 -291565 -479381 -782781
14865g82781K80286J78971N6315M70737J37954j69254Q8284r1858M3904J82610
$$ -782781 -502495 -323524 -267209 203528 341482 172228 260512 168654 212558 395168
14855C95168j19468l10140J15063L06496P0008o06122j07510K81064R5679j50536
$$ 395168 275700 -34440 80623 387119 457127 -148995 -256505 24559 120238 -30298
14845c0298k58469o20386n63941R2159J06393K73660L97400M2150m7021J93821
$$ -30298 -288767 -909153 -1473094 -1380935 -1274542 -1000882 -603482 -561332 -608353 -414532
14835d14532K497n776O0880L8632L59757K47766J30634K48815k56781j4116N47777
$$ -414532 -412035 -417811 -356931 -318299 41458 289224 419858 668673 411892 397776 945553
14824I45553K61932Q995r2623k1060n2680k37217k23360j08087l14250k05598
$$ 945553 1207485 1216480 1123857 1102797 1050117 812900 589540 481453 167203 -38395
14814c8395k58610L6593K53796L32181J87747M9763K75749j71171j44208J78253
$$ -38395 -297005 -260412 -6616 325565 513312 563075 838824 667653 523445 701698
14804G01698m5886k67539k29056K79316M24965j73493k98401o6119J42996l676
$$ 701698 655812 388273 159217 438533 863498 690005 391604 325485 468481 464805
14794D64805j98375J51494L08237l3687n05281l58840Q2377L19092J3557k60668
$$ 464805 266430 417924 726161 692474 187193 -171647 -89270 229822 243379 -17289
14784a7289j80773n6278J77525q782l50361n18574K84761M99201J22646k7071
$$ -17289 -198062 -254340 -76815 -85597 -435958 -954532 -669771 -170570 -47924 -74995
14774g4995J25829N10587J17971k00102J6325J30935k73262l76780J49607J00442
$$ -74995 50834 561421 679392 479290 495615 626550 353288 -23492 126115 226557
14764B26557n12854k98893L45926O59579M66375J23053l18953n22074j96684J5654
$$ 226557 -286297 -585190 -239264 420315 886690 1009743 690790 168716 -27968 -12314
14754a2314J96583J39469J21835j12290r1908M06092L78042k47552n41874o81662
$$ -12314 184269 323738 445573 333283 241375 647467 1025509 777957 236083 -445579
14744d45579L04994P64330R1462m69686k46691K05967J74583J9031J91641K7104
$$ -445579 -140585 623745 715207 245521 -1170 204797 379380 398411 590052 617156
14734F17156m4638o6292j48055j97831n46914l75193L77190J99405p5776J49819
$$ 617156 572518 506226 358171 160340 -386574 -761767 -384577 -185172 -260948 -111129
14724a11129n9712J03674K16742k49904L08029M97861r3794k12054J1566m5135
$$ -111129 -170841 -67167 149575 -100329 207700 705561 611767 399713 411279 366144
14714C66144k10438j90764K91333k270P1860N39475o8703p07054l65150q1425
$$ 366144 155706 -35058 256275 254005 325865 865340 796637 89583 -275567 -356992
14704c56992Q3634K70577K36950l58437L3181J19157J8950j01428k40047j60084
$$ -356992 -273358 -2781 234169 -124268 -91087 28070 47020 -54408 -294455 -454539
14694d54539m01253p2867K28800J91493J44034K08498J05225J83207L97284J63047
$$ -454539 -855792 -928659 -699859 -508366 -364332 -155834 -50609 132598 529882 692929
14684F92929k52988n761J91335l25637p42437q1047O43383N11813P1701m18334
$$ 692929 439941 434180 625515 299878 -442559 -523606 119777 631590 703291 284957
14674B84957l55268l22161k43826J87615l53130n03749K00542L39216J63880O2337
$$ 284957 -70311 -392472 -636298 -448683 -801813 -1305562 -1105020 -765804 -601924 -539587
14664e39587J02040l6075M4473k3015j3856M29184L33778l7307j4888J44071K37624
$$ -539587 -437547 -473622 -429149 -452164 -466020 -36836 296942 259635 244747 388818 626442
14653F26442J09113K0072M01010J73879m24498m65131n70770n0870M18139Q0527
$$ 626442 735555 755627 1156637 1330516 906018 440887 -129883 -180753 237386 317913
14643C17913J47036N35007L75964j94761m48086r24595n09803K69788O8405m32166
$$ 317913 464949 999956 1375920 1181159 733073 -191522 -701325 -431537 -363132 -795298
14633g95298J75650L00664k9918j27466j70907n2275M98438K03053o64455N5762
$$ -795298 -619648 -318984 -348902 -476368 -647275 -699550 -201112 1941 -662514 -606752
14623f06752N40130j05386J78166K14211k29118l06884j44162j35915n8957j21475
$$ -606752 -66622 -172008 6158 220369 -8749 -315633 -459795 -595710 -654667 -776142
14613g76142k9074M80777J60939j65028k762L07205K91084O4277J69097J22596
$$ -776142 -805216 -324439 -163500 -328528 -331290 -24085 266999 331276 500373 622969
14603F22969k9519k32108j29059J24759K34244j91908n03684r7647M37863K43160
$$ 622969 593450 361342 232283 357042 591286 399378 -104306 -201953 235910 479070
14593D79070K9080M81914M4126K02284J17367k37521M0233j66995n64841m32411
$$ 479070 508150 990064 1034190 1236474 1353841 1116320 1156553 989558 424717 -7694
14583g694k22056J3706L2107k08520j82794L9230L47606K77736J01768k75022
$$ -7694 -229750 -216044 -183937 -392457 -575251 -536021 -188415 89321 191089 -83933
14573h3933k42883L4285L8558N00602J92714j87312k69999n79171m20833k86917
$$ -83933 -326816 -292531 -253973 246629 439343 252031 -17968 -597139 -1017972 -1304889
14563a304889k89305O38096P34645L11735l22674n33600J00432N67747P42254
$$ -1304889 -1594194 -956098 -221453 90282 -232392 -765992 -665560 -97813 644441
14554F44441L39665j79437j74481m29806k76648Q2249M72125J81053m49745m54937
$$ 644441 984106 804669 630188 200382 -76266 5983 478108 659161 209416 -245521
14544b45521j33296j44664j94363J28698N72426N20409k15651n35093l55389j75612
$$ -245521 -378817 -523481 -717844 -589146 -16720 503689 288038 -247055 -602444 -778056
14534g78056K16127M40818Q9340k33404J20106N03401K28258j64534k02670q411
$$ -778056 -561929 -121111 -31771 -265175 -145069 358332 586590 422056 219386 210975
14524B10975J70193J3871J12435k16080n87930j67461L5034l39598L8858J98172
$$ 210975 381168 395039 507474 291394 -296536 -463997 -428963 -768561 -729703 -531531
14514e31531j29277j06541K52859L3308n1772P0117K8520l5832K3846k42945n11112
$$ -531531 -660808 -767349 -514490 -481182 -532954 -462837 -434317 -470149 -446303 -689248 -1200360
14503a200360M862K35284L31340L34620M63341K04388L1512L8224R9154J26700
$$ -1200360 -1195498 -960214 -628874 -294254 169087 373475 404987 443211 542365 669065
14493F69065L0719o03426o67125l05945P7851L73866K31483J39780M8778j23569
$$ 669065 699784 96358 -570767 -876712 -798861 -424995 -193512 -53732 -4954 -128523
14483a28523R9415L32795N14256l7598l59162k04229j25357j40219J64099M33959
$$ -128523 -29108 303687 817943 780345 421183 216954 91597 -48622 115477 549436
14473E49436m3762q88111q52400k30624K33737O95491O01000l30125l86492p9721
$$ 549436 505674 -382437 -1234837 -1465461 -1231724 -536233 64767 -265358 -651850 -731571
14463g31571m15807l03800K78378O07276O50555L47885m31844q3954L60013j47882
$$ -731571 -1147378 -1451178 -1172800 -565524 85031 432916 1072 -82882 277131 129249
14453A29249J01360K86761P2623K27502r635n82166m93964J7998L43778j48325
$$ 129249 230609 517370 589993 817495 807860 225694 -268270 -250272 93506 -54819
14443e4819J017j51235k20977j77526k70689J43853L47486J58665L36665M2727
$$ -54819 -53802 -205037 -426014 -603540 -874229 -730376 -382890 -224225 112440 155167
14433A55167k88858j62197j4725m7353J3512k20515J6846O5732Q4619L29219r448
$$ 155167 -133691 -295888 -310613 -357966 -344454 -564969 -548123 -482391 -397772 -68553 -78001
14422g8001J05937P759o4995K31606j96843j34336L30426J78497l61549o39589
$$ -78001 27936 35695 -29300 202306 5463 -128873 201553 380050 18501 -621088
14412f21088m19069J04260N01178M57922L52365J55138k98070j51197q1580q0998
$$ -621088 -1040157 -935897 -434719 23203 375568 530706 232636 81439 -141 -81139
14402h1139j40410n3929R1319K00657M3004k35704j57574M88661L76190J35815
$$ -81139 -221549 -275478 -184159 16498 59502 -176202 -333776 154885 531075 666890
14392F66890k4150K80573L78421N9779q082k17241j99835k57833j53390j33927
$$ 666890 642740 923313 1301734 1361513 1353431 1136190 936355 678522 525132 391205
14382C91205j71392m38765l24174J17374L3584J0785j08264J98846O83145J69538
$$ 391205 219813 -218952 -543126 -425752 -392168 -381383 -489647 -290801 392344 561882
14372E61882l13342j56206K02711j24117l20558q2092L20133J48579m5386O1492
$$ 561882 248540 92334 295045 170928 -149630 -231722 88411 236990 191604 253096
14362B53096j00332j76159m9611o5020N32067N39710l73095n87869l00555k95890
$$ 253096 152764 -23395 -73006 -138026 394041 933751 560656 -27213 -327768 -623658
14352f23658J77241M34861K82876L0224j70811k71699l97403K5146L25151N8174
$$ -623658 -446417 -11556 271320 301544 130733 -140966 -538369 -513223 -188072 -129898
14342a29898m38734K2063J33568N1866J84203J58706J52138J22005K83924O8777
$$ -129898 -568632 -546569 -413001 -361135 -176932 -18226 133912 255917 539841 608618
14332F08618k32212m52755m18128p804Q900m95612J92942N59075L5239n57647
$$ 608618 376406 -76349 -494477 -502281 -493381 -988993 -796051 -236976 -201737 -759384
14322g59384j25235J06224K88595L10376j98368l61120k41759m0287K4731N52162
$$ -759384 -884619 -778395 -489800 -179424 -377792 -738912 -980671 -1020958 -996227 -444065
14312d44065L38214J03212O0635l5363J63039K46098J55552Q2979j38473m0921
$$ -444065 -105851 -2639 57996 22633 185672 431770 587322 670301 531828 490907
14302D90907l638j81198j95962k6283k22304l33900j94030L32539N78086O48430
$$ 490907 487269 306071 110109 83826 -138478 -472378 -666408 -333869 244217 892647
14292H92647M24020k97184p99214o54170k15694J39009m5774n33329k90746k90288
$$ 892647 1316667 1019483 220269 -433901 -649595 -510586 -556360 -1089689 -1380435 -1670723
14282a670723r3656N26544O25849L40921Q7162j84312k26078j89218K456M19591
$$ -1670723 -1764379 -1237835 -611986 -271065 -183903 -368215 -594293 -783511 -781055 -361464
14272c61464J44712j33608j56832J36220M17123P7416k31378l61368l15313p2673
$$ -361464 -216752 -350360 -507192 -370972 46151 123567 -107811 -469179 -784492 -857165
14262h57165j7832n2548L65878O11285K34274q0307j78596k8400k26697R5280
$$ -857165 -874997 -927545 -561667 49618 283892 203585 24989 -3411 -230108 -134828
14252a34828M01946l62380n45110m48387r1735K67226J3950J80288M91021j76496
$$ -134828 267118 -95262 -640372 -1088759 -1180494 -913268 -899318 -719030 -228009 -404505
14242d04505o49506P7359O01314O38513K96235q05631m69711j46010k86426l2194
$$ -404505 -1054011 -976652 -375338 263175 559410 -246221 -715932 -861942 -1148368 -1180562
14232a180562M85428P87609O12274k8334o04817k61965L97571J89134n13336n34226
$$ -1180562 -695134 92475 704749 676415 71598 -190367 207204 396338 -116998 -651224
14222f51224K28912L22821L71380M02361L4537l41283j73534p8872k64776j04532
$$ -651224 -422312 -99491 271889 674250 708787 367504 193970 115098 -149678 -254210
14212b54210K93053N95316K13813l42390l30383m67565n13397j69073M80663n1627
$$ -254210 38843 634159 847972 505582 175199 -292366 -805763 -974836 -494173 -545800
14202e45800k32643l11190K22N13218L08894k0711m02493k99034j86814J08906
$$ -545800 -778443 -1089633 -1089411 -576193 -267299 -288010 -690503 -989537 -1176351 -1067445
14192a067445J02546K61348K35618K04667K32880K33353k78893n42722r6774J09157
$$ -1067445 -964899 -703551 -467933 -263266 -30386 202967 -75926 -618648 -715422 -606265
14182f06265J34953j40340n3849K48663L82169j7855m80972J23690N33534K19231
$$ -606265 -471312 -611652 -665501 -416838 -34669 -52524 -533496 -409806 123728 342959
14172C42959K2100k57882o21039j327j06059r9447L53929q1662m46997n09394
$$ 342959 365059 107177 -513862 -515189 -621248 -720695 -366766 -448428 -895425 -1404819
14162a404819l4093R96478J110389N4224m46594j85310K05872K09273j87295j03690
$$ -1404819 -1438912 -442434 667955 722179 275585 90275 296147 505420 318125 214435
14152B14435N26513K35962K1368j76640k07221j35522L46874K49417k27336J10976
$$ 214435 740948 976910 998278 821638 614417 478895 825769 1075186 847850 958826
14142I58826L1728l07911n95810m90626l26499R59M41589L61972L214m25759l17824
$$ 958826 990554 682643 86833 -403793 -730292 -729333 -287744 74228 77442 -348317 -666141
14131f66141l84215n7622M0108j22938J61653M02314K23244P552K4592j60318
$$ -666141 -1050356 -1107978 -1067870 -1190808 -1029155 -626841 -403597 -396045 -371453 -531771
14121e31771l44890J381j23842L09674N04121l14309p45908l40490J61361N84195
$$ -531771 -876661 -875280 -999122 -689448 -185327 -499636 -1245544 -1586034 -1424673 -840478
14111h40478R2884l78376j38310K75607O36365N25474p6644k59408k6043k51075
$$ -840478 -747594 -1125970 -1264280 -988673 -352308 173166 96522 -162886 -188929 -440004
14101d40004l1325O9778Q5995K93998K11621J06533L3526k81227O5265L17655
$$ -440004 -471329 -401551 -315556 -21558 190063 296596 330122 48895 114160 431815
14091D31815N0013p5153j89555p40501k54680j02012n84940L650Q60447P01955
$$ 431815 481828 406675 217120 -523381 -778061 -880073 -1465013 -1461363 -600916 101039
14081A01039P8801k31673j19900m565l73520k81231L72595K81653Q4008J13258
$$ 101039 179840 -51833 -171733 -176298 -549818 -831049 -458454 -176801 -92793 20465
14071B0465j9145K4277k80564k87890N0586J94599M71168O38966J7230n17289
$$ 20465 1320 25597 -254967 -542857 -492271 -297672 173496 812462 829692 312403
14061C12403o62109l27701K23618K60138J27620j50130L3278M72999K32960j38106
$$ 312403 -349706 -677407 -453789 -193651 -66031 -216161 -182883 290116 523076 384970
14051C84970N2331q7246J9623K26549l71271r73007l68858K74492P04125O59024
$$ 384970 437301 350055 369678 596227 224956 -748051 -1116909 -842417 -138292 520732
14041E20732L97093o3546q14730n84884k38033L2696K25426M17618L06767K93558
$$ 520732 917825 854279 39549 -545335 -783368 -750672 -525246 -107628 199139 492697
14031D92697K21168k71295m92888K5414P1281q3344K22516o2207K5942o0084o9371
$$ 492697 713865 442570 -50318 -24904 46377 -36967 185549 123342 149284 89200 19829
14020A9829L73409L82882j61819o25150o24051l02712o4686J57249M52734K69596
$$ 19829 393238 776120 614301 -10849 -634900 -937612 -1002298 -845049 -392315 -122719
14010a22719k49703j82007M3804m869J14557J15597k12453J33601M11984J25678
$$ -122719 -372422 -554429 -510625 -515494 -400937 -285340 -497793 -364192 47792 173470
14000A73470n69344l05300J98700O5404J42727R729K55446k31255m33573j02864
$$ 173470 -395874 -701174 -502474 -437070 -294343 -284614 -29168 -260423 -693996 -796860
13990g96860J6087j68239k49730j06233J94972L04886n4667k80515o5702N93117
$$ -796860 -780773 -949012 -1198742 -1304975 -1110003 -805117 -859784 -1140299 -1206001 -612884
13980f12884K13931m19623j92042l91174m1112K52784K01403L88602N12742L78976
$$ -612884 -398953 -818576 -1010618 -1401792 -1442904 -1190120 -988717 -600115 -87373 291603
13970B91603j98446k21943k72797l13184k74234j51732R3652L12187O4059n61317
$$ 291603 93157 -128786 -401583 -714767 -989001 -1140733 -1047081 -734894 -670835 -1232152
13960a232152J03063L53353L23668Q73228L31790K13273J74383K11500N9235m99256
$$ -1232152 -1129089 -775736 -452068 421160 752950 966223 1140606 1352106 1411341 912085
13950I12085l76813k50061q8519r6561j83685K39063q1262n00090l39164R6613
$$ 912085 535272 285211 196692 100131 -83554 155509 74247 -425843 -765007 -668394
13940f68394l4994k52944L50732N48176K63050K08631L7629j94292K8900K64803
$$ -668394 -703388 -956332 -605600 -57424 205626 414257 451886 257594 286494 551297
13930E51297R9544m88980o65140M9156M3384R4701k45718n9124J38797J57318
$$ 551297 650841 161861 -503279 -454123 -410739 -316038 -561756 -620880 -482083 -324765
13920c24765O8739M0874o5157r3747k6079K60683M40980n3920j18776L63388J62111
$$ -324765 -256026 -215152 -280309 -374056 -400135 -139452 301528 247608 128832 492220 654331
13909F54331k56659l38050j14140l55109j8955L97489L0146o31442r45645m12680
$$ 654331 397672 59622 -54518 -409627 -428582 -31093 -947 -632389 -1578034 -1990714
13899a990714P71685Q03769j46247j96716p8204l55226j4706K25910L91530N16329
$$ -1990714 -1219029 -415260 -561507 -758223 -836427 -1191653 -1206359 -980449 -588919 -72590
13889g2590K35463k50204l76191R0806N2034J85041j18805k30699q226L793K36581
$$ -72590 162873 -87331 -463522 -372716 -320682 -135641 -254446 -485145 -493371 -489578 -252997
13878b52997K90533k82469l42101k7100P0351L86221K58182m03358m12276k38921
$$ -252997 37536 -244933 -587034 -614134 -543783 -157562 100620 -302738 -715014 -953935
13868i53935k64114M50879O04294N26203K24496k90818l30543j28439j28919K58936
$$ -953935 -1218049 -767170 -162876 363327 587823 297005 -33538 -161977 -290896 -31960
13858c1960K78254J56190P4839l73j46102K90786P01196O6313n66675m97908j29947
$$ -31960 246294 402484 477323 476950 330848 621634 1322830 1389143 822468 324560 194613
13847A94613J77122n9385k39275j11079k57452k71801P1519L28448Q2798M22710
$$ 194613 371735 312350 73075 -38004 -295456 -567257 -495738 -167290 -84492 338218
13837C38218L19374J09586l05910n28373l78110k23288K05296J18043K52337J39499
$$ 338218 657592 767178 461268 -67105 -445215 -668503 -463207 -345164 -92827 46672
13827D6672k58421M11083M33129q7351j90890j16769k58277o8796M41322L82020
$$ 46672 -211749 199334 632463 545112 354222 237453 -20824 -89620 351702 733722
13817G33722l4897k89293n14649K2464M6699j65137J79672n2536n25698n21729
$$ 733722 698825 409532 -105117 -82653 -35954 -201091 -21419 -73955 -599653 -1121382
13807a121382m33254J26282L28597J40249Q9849K51862O73826M9488n89945R3857
$$ -1121382 -1554636 -1428354 -1099757 -959508 -869659 -617797 56029 105517 -484428 -390571
13797c90571P41066P69958l6297p33564m53824J16525K67469K06813n4287l58891
$$ -390571 350495 1120453 1084156 350592 -103232 13293 280762 487575 433288 74397
13787G4397L09373K63955m21940j49671j23639m88821m41232l5461O50623L87605
$$ 74397 383770 647725 225785 76114 -47525 -536346 -977578 -1013039 -362416 25189
13777B5189j00088k48091k17505K46521N02551K82334j67683J95980J9338r3733
$$ 25189 -74899 -322990 -540495 -293974 208577 490911 323228 519208 538546 444813
13767D44813k47845n06153J6392L74280O00733N81827n54778p10345n6977M98355
$$ 444813 196968 -309185 -292793 81487 682220 1264047 709269 -1076 -58053 440302
13757D40302J6913k64238k0259j54965R895k0197j97472j18344j63852K41956
$$ 440302 457215 192977 172718 17753 27648 7451 -190021 -308365 -472217 -230261
13747b30261M62113k0640m40367o12659k45937p9247J35145J42223J29779o9931
$$ -230261 231852 211212 -229155 -841814 -1087751 -1166998 -1031853 -889630 -759851 -829782
13737h29782m55182p379O83769N53477K41786q5957n35288l63511j57636j81886
$$ -829782 -1284964 -1292343 -608574 -55097 186689 100732 -434556 -798067 -955703 -1137589
13727a137589k6916n6613J17146K66809M18263M87275O04406K74595j16212l67327
$$ -1137589 -1164505 -1221118 -1103972 -837163 -418900 68375 672781 947376 831164 463837
13717D63837o40592n96141k36093K22250J75078N42933K95839j80482j01722M16085
$$ 463837 -176755 -772896 -1008989 -786739 -611661 -68728 227111 46629 -55093 360992
13707C60992j84421n83907k14088K93693P27894M89497q2781o7085j26829l74041
$$ 360992 176571 -407336 -621424 -327731 400163 889660 806879 739794 612965 238924
13697B38924m42897J75195N18152L13186j4961L0048k33140n37979r154M28337
$$ 238924 -203973 -28778 489374 802560 787599 817647 584507 46528 37374 465711
13687D65711M37619J76754k10315j19124j25471J31852J69829l04125j33473j66623
$$ 465711 903330 1080084 869769 750645 625174 757026 926855 622730 489257 322634
13677C22634P5471k47225l74562j59340k32426J50271K16736J36715K37699K1277
$$ 322634 398105 150880 -223682 -383022 -615448 -465177 -248441 -111726 125973 147250
13667A47250l64532m22211l84591j60931l25947k59899L8633M3808K42656n107
$$ 147250 -217282 -639493 -1024084 -1185015 -1510962 -1770861 -1732228 -1688420 -1445764 -1450871
13657a450871O4788M71574N82476M43695o52193j64642O05874J21776J06170J40509
$$ -1450871 -1386083 -914509 -332033 111662 -540531 -705173 -99299 22477 128647 269156
13647B69156k73919k54647l5154J23513q9758l21331m19517j23734M09723N32676
$$ 269156 -4763 -259410 -294564 -171051 -260809 -582140 -1001657 -1125391 -715668 -182992
13637a82992O03368O03026J53486l87461m15340j53275k87303l15779l04546N9585
$$ -182992 420376 1023402 1176888 789427 374087 220812 -66491 -382270 -686816 -627231
13627f27231N14914N12466K94348l56840l10107J29711k46331m34930k5382K56666
$$ -627231 -112317 400149 694497 337657 27550 157261 -89070 -524000 -549382 -292716
13617b92716j79399m26509j07951p3533R2159M5934k18174j96980J08984J51999
$$ -292716 -472115 -898624 -1006575 -1080108 -987949 -942015 -1160189 -1357169 -1248185 -1096186
13607a096186l0160r1266K33709j76709k26126L9369J26102Q9132L56570L80758
$$ -1096186 -1126346 -1217612 -983903 -1160612 -1386738 -1347369 -1221267 -1132135 -775565 -394807
13597c94807K30262Q9881P5465n5877o59770j78415M50123R8642o9221l3588n4898
$$ -394807 -164545 -74664 801 -55076 -714846 -893261 -443138 -344496 -413717 -447305 -502203
13586e02203K62336J93054k72903j93942j60123K75432K84940j79782k28743L12843
$$ -502203 -239867 -46813 -319716 -513658 -673781 -398349 -113409 -293191 -521934 -209091
13576b09091L70969K20440r5695j44610J79373J37943J74154L96646K47969k14033
$$ -209091 161878 382318 286623 142013 321386 459329 633483 1030129 1278098 1064065
13566A064065j02563j07744m92842l12342J37890J60379J20364K01298k9411j90643
$$ 1064065 961502 853758 360916 48574 186464 346843 467207 668505 639094 448451
13556D48451l28463k65005j29809L608J81860P50954L06147o6627J19103k70804
$$ 448451 119988 -145017 -274826 -271218 -89358 661596 967743 901116 1020219 749415
13546G49415l98843l92146j97166k62202k74570J40899J12664o60544n34076J45654
$$ 749415 350572 -41574 -238740 -500942 -775512 -634613 -521949 -1182493 -1716569 -1570915
13536a570915J61715K67958J68169j04946k76412J3753L47644L59664J7469n3913
$$ -1570915 -1409200 -1141242 -973073 -1078019 -1354431 -1340678 -993034 -633370 -615901 -669814
13526f69814j54800k90954K72962Q4101l49636j79549J69021M27707N88334N78903
$$ -669814 -824614 -1115568 -842606 -758505 -1108141 -1287690 -1118669 -690962 -102628 476275
13516D76275K31334J26745L60899J63315m37751k91205l65392o7174l17425n00434
$$ 476275 707609 834354 1195253 1358568 920817 629612 264220 197046 -120379 -620813
13506f20813K49758L06739O2108m00584j23959J87985o3996j34567j70648K30060
$$ -620813 -371055 -64316 -2208 -402792 -526751 -338766 -402762 -537329 -707977 -477917
13496d77917N47530o2917m37888k54885K46847O93226M48961j76740m11860k32725
$$ -477917 69613 6696 -431192 -686077 -439230 253996 702957 526217 114357 -118368
13486a18368K98672P8922k72442n7754l0600R8319k1659m35741l6496J98096j79713
$$ -118368 180304 259226 -13216 -70970 -101570 -3251 -24910 -460651 -497147 -299051 -478764
13475d78764k58702J55043Q18112M3645m95861L5981M71326J06064J74055K81116
$$ -478764 -737466 -582423 235689 279334 -216527 -180546 290780 396844 570899 852015
13465H52015j38523O098J78216J6513k41545j70738k70159m97070n70453l5794
$$ 852015 713492 719590 897806 914319 672774 502036 231877 -265193 -835646 -871440
13455h71440M57680L79685L41010J24528J45158r0182o7301L27386L33871r3986
$$ -871440 -413760 -34075 306935 431463 576621 486439 419138 746524 1080395 986409
13445I86409k72574o52947n55589k31400k75374k94811L29758P76404N51841K06501
$$ 986409 713835 60888 -494701 -726101 -1001475 -1296286 -966528 -190124 361717 568218
13435E68218K8677l2207j65785j44531j86277k59550m63963k90083K67824N03047
$$ 568218 596895 564688 398903 254372 68095 -191455 -655418 -945501 -677677 -174630
13425a74630P0935n20159o17077L16873M31807k29570j91289J59025J9751j53986
$$ -174630 -103695 -623854 -1240931 -924058 -492251 -721821 -913110 -754085 -734334 -888320
13415h88320J58193j35772o8706M97817Q55752M91204j43503n00849k04453K62966
$$ -888320 -730127 -865899 -934605 -436788 418964 910168 766665 265816 61363 324329
13405C24329K24805j36712m25787j00080N18858O80975K0464l50759o11231n60981
$$ 324329 549134 412422 -13365 -113445 405413 1086388 1106852 756093 144862 -416119
13395d16119K12983K83489k9169K11447J87122R4847K55224j5748k21517O836
$$ -416119 -203136 80353 51184 262631 449753 544600 799824 784076 562559 569395
13385E69395M63232k84701k32369l5162J74189R00388K32194r27051j091327k72377
$$ 569395 1032627 747926 515557 480395 654584 1554972 1787166 860115 -231212 -503589
13375e03589K40516K34025P25357M74765k05847p9227j39149l03062j75367k45463
$$ -503589 -263073 -29048 696309 1171074 965227 886000 746851 443789 268422 22959
13365B2959J34188J97810J07058j39308P1882Q9217n73255k0218J75409k91861
$$ 22959 157147 354957 462015 322707 394589 483806 -89449 -109667 65742 -226119
13355b26119j28546R7851M25415K86256J09846O5823J34880N07556L18488L06443
$$ -226119 -354665 -256814 168601 454857 564703 630526 765406 1272962 1591450 1897893
13345A897893l0307o36100l78375J24461J52421j76805m12026J20765N4597P4116
$$ 1897893 1867586 1231486 853111 977572 1129993 953188 541162 661927 716524 790640
13335G90640P4159j30760l20889J85172k2018m79001j84446L73728M56732J43471
$$ 790640 864799 734039 413150 598322 576304 97303 -87143 286585 743317 886788
13325H86788l84261j45377L1597K51925q824l31820N7224N45798L6054n96096
$$ 886788 502527 357150 388747 640672 631848 300028 357252 903050 939104 343008
13315C43008m12297L7831K08648M46130K03334j60012k02425o8266J22055K69298
$$ 343008 -69289 -31458 177190 623320 826654 666642 464217 395951 518006 787304
13305G87304M41494j4535l5889K73650m9310j80158n27778M7644P8190j78269
$$ 787304 1228798 1214263 1178374 1452024 1402714 1222556 694778 742422 820612 642343
13295F42343k24078k28393J67510L21156J33263m48253n26788j43564m3067J28557
$$ 642343 418265 189872 357382 678538 811801 363548 -163240 -306804 -349871 -221314
13285b21314K14152J57390m3273l6205M20680P70185M92445J33172K69122k9629
$$ -221314 -7162 150228 106955 70750 491430 1261615 1754060 1887232 2156354 2126725
13275B126725k33030j97639j40369m76867l55486k47144k03216m44682l55492
$$ 2126725 1893695 1696056 1555687 1078820 723334 476190 272974 -171708 -527200
13266e27200J39588L71049L40557L27730M26797J74645l05747p4461n59690l3738
$$ -527200 -387612 -16563 323994 651724 1078521 1253166 947419 872958 313268 279530
13256B79530O56188L2525k69643l69095K24782K36621K49224j309j75989p0852
$$ 279530 935718 968243 698600 329505 554287 790908 1040132 1038823 862834 791982
13246G91982j74497o40251J69845M20889m85352l16330n1363P2518L23043K74782
$$ 791982 617485 -22766 147079 567968 82616 -233714 -285077 -212559 110484 385266
13236C85266o0717j82898J58118j84767k14838k16026l4010L68610k08614k52159
$$ 385266 324549 141651 299769 115002 -99836 -315862 -349872 18738 -189876 -442035
13226d42035K93230K8155m98521J72836O96948L50011J12418K0510k40760l63857
$$ -442035 -148805 -120650 -619171 -446335 250613 600624 713042 733552 492792 128935
13216A28935J5270J66360J35477j56082L50005N53954L27513j80544q59528k45812
$$ 128935 144205 310565 446042 289960 639965 1193919 1521432 1340888 481360 235548
13206B35548L80355j42868k40467R0444j81758o55916n86862l57204K35628N99609
$$ 235548 615903 473035 232568 323012 141254 -514662 -1101524 -1458728 -1223100 -623491
13196f23491L89655q0770k61936J88105P07116P95522M84587P346l91966j75860
$$ -623491 -233836 -314606 -576542 -388437 318679 1114201 1598788 1606134 1214168 1038308
13186A038308K032q3929K39608M46919m01492r50369j16276K83993r4678l9914
$$ 1038308 1040340 956411 1196019 1642938 1241446 291077 174801 458794 364116 324202
13176C24202j18687L9024J14754J26915j39106K18677M63270L32092j54753J93942
$$ 324202 205515 244539 359293 486208 347102 565779 1029049 1361141 1206388 1400330
13166A400330L30844m04866j45151K55554J4855j87571j02777k01618p56236p34845
$$ 1400330 1731174 1326308 1181157 1436711 1451566 1263995 1161218 959600 203364 -531481
13156e31481m44064K37845P76219J70635K03796K67790j28616J73526n3666n57638
$$ -531481 -975545 -737700 38519 209154 412950 680740 552124 725650 671984 114346
13146A14346Q9234Q293m83735j18576L53963N22371N89093O91290M49635j51622
$$ 114346 203580 211873 -271862 -390438 -36475 485896 1074989 1766279 2215914 2064292
13136B064292p35166l20349K4168k64934N4816J93324j33624O2797N84547J17367
$$ 2064292 1329126 1008777 1032945 768011 822827 1016151 882527 945324 1529871 1647238
13126A647238n74558j60213L99779n7974m16138J51911j7511l06645m85767j76022
$$ 1647238 1072680 912467 1312246 1254272 838134 990045 972534 665889 180122 4100
13116D100L32078L56609p2348J95691O1282k07130j06142M7417j15525J51276
$$ 4100 336178 692787 620439 816130 877412 670282 564140 611557 496032 647308
13106F47308M60160M97016j37916n90658l26416j70274k30281L54272O95691J014
$$ 647308 1107468 1604484 1466568 875910 549494 379220 148939 503211 1198902 1199916
13096A199916O6985J04912n9615k76898m17008P2582K78284M0339K44104M62857
$$ 1199916 1266901 1371813 1312198 1035300 618292 690874 969158 1009497 1253601 1716458
13086A716458j44496r8592j12917k83534l39424l87144j28145J86987L10152P3817
$$ 1716458 1571962 1473370 1360453 1076919 737495 350351 222206 409193 719345 793162
13076G93162J00668L99163K82927J82670k3346J70225N09776K3116j21303p1287
$$ 793162 893830 1292993 1575920 1758590 1735244 1905469 2415245 2438361 2317058 2245771
13066B245771J88227j29077k21996j14663r6917L12535L90436L76967j53112l90729
$$ 2245771 2433998 2304921 2082925 1968262 1871345 2183880 2574316 2951283 2798171 2407442
13056B407442K14033L2005l56607P6512k5814N567L6575k61788q0275J38772J48272
$$ 2407442 2621475 2653480 2296873 2373385 2347571 2353138 2389713 2127925 2047650 2186422 2334694
13045B334694K33037L9588j1664J88690k41841j21084K88473L41307j37874o6102
$$ 2334694 2567731 2607319 2595655 2784345 2542504 2421420 2709893 3051200 2913326 2847224
13035B847224K8275J17130P11600O56145J69077Q5388j94184q9587L52744J82432
$$ 2847224 2875499 2992629 3704229 4360374 4529451 4614839 4420655 4331068 4683812 4866244
13025D866244j21246l80616n69226N6122N30749N0569K54137N50578K41563J37564
$$ 4866244 4744998 4364382 3795156 3851278 4382027 4432596 4686733 5237311 5478874 5616438
13015E616438P031l271j18318J52873M87375N11459K56334L77134R74530R26121
$$ 5616438 5623469 5620198 5501880 5654753 6142128 6653587 6909921 7287055 8261585 9187706
13005I187706Q02700M49759N12021Q55724J149150Q41792Q24539J218017J085322
$$ 9187706 9990406 10440165 10952186 11807910 12957060 13798852 14623391 15841408 16926730
12996A6926730Q78293J326842J443397J842412K459184K148461K934237M002399
$$ 16926730 17805023 19131865 20575262 22417674 24876858 27025319 29959556 33961955
12988C3961955M345854M743654N588227O117883P128357R018280J1577404J4639984
$$ 33961955 38307809 43051463 48639690 54757573 61885930 70904210 82481614 97121598
12980I7121598J8165322K2998092L0789789M0180729M7119295M6920631L1981110
$$ 97121598 115286920 138285012 169074801 209255530 256374825 303295456 335276566
12973C35276566L510480k7431277m6606853m9652685m2935510l4028686k6043195
$$ 335276566 338787046 311355769 264748916 215096231 172160721 138132035 112088840
12966A12088840j9427383j4908220j1151207q992300p911976o330136n010402
$$ 112088840 92661457 77753237 66602030 57609730 49697754 43367618 38357216
12959C8357216m367661l361049k603098k225077j805815j412491j532337j641325
$$ 38357216 33989555 30628506 28025408 25800331 23994516 22582025 21049688 19408363
12951A9408363j462137j026971q61998q83883q47748q24070p83889m19014j64113
$$ 19408363 17946226 16919255 16057257 15173374 14325626 13501556 12717667 12298653 12134540
12942A2134540m11269o30715l94587J6119P7633j11650n61136m04897O9079J1825
$$ 12134540 11723271 11092556 10697969 10714088 10791721 10680071 10118935 9714038 9783117 9794942
12932I794942J05054J54964J2837J13997J73148L07768J63738j04363N5681M66134
$$ 9794942 9899996 10054960 10067797 10181794 10354942 10662710 10826448 10722085 10777766 11243900
12922A1243900J036016J354523J304885J628066K632366L405455K752141J767262
$$ 11243900 12279916 13634439 14939324 16567390 19199756 22605211 25357352 27124614
12914B7124614O77955n48617j013301p87074n87463p6507N92138J122248J255614
$$ 27124614 27802569 27253952 26240651 25453577 24866114 24789607 25381745 26503993 27759607
12905B7759607J606783J748794K275596L342636M171277M777566N580614O477657
$$ 27759607 29366390 31115184 33390780 36733416 40904693 45682259 51262873 57740530
12897E7740530P788955R783664J1561550J5033568K0337329K6693546L4125039
$$ 57740530 65529485 75313149 86874699 101908267 122245596 148939142 183064181
12890A83064181M3080999M9628328M5500543K5244694o688370l6464413n1357844
$$ 183064181 226145180 275773508 321274051 346518745 339830375 303365962 252008118
12883B52008118n0335706m1173886l1471522k3751795j7766024j3580050j0531410
$$ 252008118 201672412 160498526 129027004 105275209 87509185 73929135 63397725
12876F3397725p782717o457611n875054n226271m129696l527587k999860k239473
$$ 63397725 55615008 49157397 43282343 38056072 33926376 30398789 27398929 25159456
12868B5159456j830048j588455j444786j587213j329248j023666o54420p42950
$$ 25159456 23329408 21740953 20296167 18708954 17379706 16356040 15701620 14958670
12860A4958670n76044m03877q64641q09633q53784p24545k19741J1915J67561
$$ 14958670 14382626 13978749 13114108 12304475 11450691 10726146 10506405 10518320 10685881
12851A0685881k29381k15838j12554l64031l44967k40165P3558j64948j90184
$$ 10685881 10456500 10240662 10128108 9764077 9419110 9178945 9252503 9087555 8897371
12842H897371L38203N27045P4257n2608j01180k53338J89598M47415L85601O12434
$$ 8897371 9235574 9762619 9836876 9784268 9683088 9429750 9619348 10066763 10452364 11064798
12832A1064798O72806M12508J99069L02234L45621Q43115J256583Q08090P37564
$$ 11064798 11737604 12150112 12349181 12651415 12997036 13840151 15096734 15904824 16642388
12823A6642388J232431J630061J770910J871168K121921K446235K757501K955126
$$ 16642388 17874819 19504880 21275790 23146958 25268879 27715114 30472615 33427741
12815C3427741L429566M090290M796785N659396O923270Q315721J0094259J2928006
$$ 33427741 36857307 40947597 45744382 51403778 58327048 66642769 76737028 89665034
12807H9665034J7102141K1987036K8147582L6103929M4253549M7572376L9588095
$$ 89665034 106767175 128754211 156901793 193005722 237259271 284831647 324419742
12800C24419742J6550226j4950115m0510444n0582985m6788034l7844824k8924110
$$ 324419742 340969968 326019853 285509409 234926424 188138390 150293566 121369456
12793A21369456k1894946j6941820j3155638j0031177p850597o673246n765259
$$ 121369456 99474510 82532690 69377052 59345875 51495278 44822032 39056773
12786C9056773m934846l696450k849981k618734k735218k522318k028896j321141
$$ 39056773 34121927 30425477 27575496 24956762 22221544 19699226 17670330 16349189
12778A6349189r08284j306111j393478j230436o41944l89858m81107n52725p83249
$$ 16349189 15440905 14134794 12741316 11510880 10868936 10479078 9997971 9445246 8661997
12769H661997p13528l97837o48064m94345m40350o37514p84113n61763j19898
$$ 8661997 7948469 7550632 6902568 6408223 5967873 5330359 4546246 3984483 3864585
12760C864585J08317q6074j30761p3586P9989j63848k84485j12225k73292P1815
$$ 3864585 3972902 3886828 3756067 3682481 3762470 3598622 3314137 3201912 2928620 3000435
12750C000435J80261J9501M1601j07594m17758l54848k44910m7305J64179K41564
$$ 3000435 3180696 3200197 3241798 3134204 2716446 2361598 2116688 2069383 2233562 2475126
12740B475126K40227J41653j04929m2893J29200j47848n06175n35909m67345k4668
$$ 2475126 2715353 2857006 2752077 2709184 2838384 2690536 2184361 1648452 1181107 1156439
12730A156439j87346K44148P18263J18827l80260m28925r4577R552j24900l60184
$$ 1156439 969093 1213241 1931504 2050331 1670071 1241146 1146569 1156121 1031221 671037
12720F71037k70163J22918M04641M61614J41114j93484j02809k88698p6045k64779
$$ 671037 400874 523792 928433 1390047 1531161 1337677 1234868 946170 870125 605346
12710F05346k26434L37363O80709N30618r1854l7981J4711Q0367m37818r44150
$$ 605346 378912 716275 1396984 1927602 1835748 1797767 1812478 1892845 1455027 510877
12700E10877o16937k47969L24555N84247M05201o7932n55480l71423L17372O08544
$$ 510877 -106060 -354029 -29474 554773 959974 892042 336562 -34861 282511 891055
12690H91055J36682P8938n1440J24757L84884M5833l04792m20395j94580K48440
$$ 891055 1027737 1106675 1055235 1179992 1564876 1610709 1305917 885522 690942 939382
12680I39382o0014K47390k1296k50861J04734p8580r3905Q5020j21365l03209
$$ 939382 879368 1126758 1105462 854601 959335 880755 786850 871870 750505 447296
12670D47296r4152J11065O5280j85268k61650m20595k25254J37241O15682O47255
$$ 447296 353144 464209 529489 344221 82571 -338024 -563278 -426037 189645 836900
12660H36900L58265J91318L56079M49756k22779n49003q5489K90806k59899q31819
$$ 836900 1195165 1386483 1742562 2192318 1969539 1420536 1335047 1625853 1365954 534135
12650E34135m17011K83282M19753M7200k3200k52337k88422Q4113M1638J28709
$$ 534135 117124 400406 820159 867359 844159 591822 303400 387513 429151 557860
12640E57860M91901O45185Q1436k54738k41754j6672r9203j57223j60682k49361
$$ 557860 1049761 1694946 1776382 1521644 1279890 1263218 1164015 1006792 846110 596749
12630E96749m54476p58945n94252o7786l802J42087K24899M44851L33441M23148
$$ 596749 142273 -616672 -1210924 -1278710 -1282512 -1140425 -915526 -470675 -137234 285914
12620B85914K95165k66829j07424k0277Q88j60103l29281J52489K16271J79028
$$ 285914 581079 314250 206826 186549 187437 27334 -301947 -149458 66813 245841
12610B45841M08246L48364R4974l25975p08722n78345j49685J74642O83371N68693
$$ 245841 654087 1002451 1097425 771450 62728 -515617 -665302 -490660 192711 761404
12600G61404J29804k97382m06033l51956M8641O1066L1675K00371P0194k9733
$$ 761404 891208 593826 187793 -164163 -115522 -54456 -22781 177590 247784 218051
12590B18051N14242L87867J01623k17745l69630j88473q9848K12306J29486J13710
$$ 218051 732293 1120160 1221783 1004038 634408 445935 356087 568393 697879 811589
12580H11589o917L42370L98258m83151p41260n81722n63357J57872K16822M7018
$$ 811589 804672 1147042 1545300 1062149 320889 -260833 -824190 -666318 -449496 -402478
12570d02478l5694L7787m8230l77857j37601N05754O24426K24588K9767J81145
$$ -402478 -438172 -400385 -448615 -826472 -964073 -458319 166107 390695 420462 601607
12560F01607J92133o6719J25876K79760j69698m21845m7858j00393k74297k14632
$$ 601607 793740 727021 852897 1132657 962959 541114 493256 392863 118566 -96066
12550i6066k41012L358L68321K43924J75932k06627k05900K22171j91038l53921
$$ -96066 -337078 -333720 34601 278525 454457 247830 41930 264101 73063 -280858
12540b80858l65798l19869K5734n0502K5676L15003J97692P3767K61352l93973
$$ -280858 -646656 -966525 -940791 -991293 -965617 -650614 -452922 -379155 -117803 -511776
12530e11776n34988q9330p6692J72056N93484J55480K65465N86596K55195l91937
$$ -511776 -1046764 -1136094 -1212786 -1040730 -447246 -291766 -26301 560295 815490 423553
12520D23553o41815K0955M00247J60357k48310j0574M1828J03920N10274K79102
$$ 423553 -218262 -197307 202940 363297 114987 104413 146241 250161 760435 1039537
12510A039537j74930l34546k96559J86374J77517p7469Q6593l37684l99183m91845
$$ 1039537 864607 530061 233502 419876 597393 519924 606517 268833 -130350 -622195
12500f22195k15836K86609L66069K71245M2657P6935L16157o641j88568l49987
$$ -622195 -838031 -551422 -185353 85892 128549 205484 521641 515000 326432 -23555
12490b3555n00199l1839n7836j76896J4524L8003L48359M84631O99931M53886
$$ -23555 -523754 -555593 -613429 -790325 -775801 -737798 -389439 95192 795123 1249009
12480A249009j91675n28815l88336k82600L5794J55933K58599j32488j22308Q0911
$$ 1249009 1057334 528519 140183 -142417 -106623 49310 307909 175421 53113 134024
12470A34024J13168L07869K91698N4729q9644j97662k83320k69678Q0365L58061
$$ 134024 247192 555061 846759 901488 811844 614182 330862 61184 141549 499610
12460D99610J39908q992Q7802L19083p0657k6303L24248M09848j3536M2235j543
$$ 499610 639518 630526 718328 1037411 966754 940451 1264699 1674547 1661011 1703246 1701703
12449A701703l23904n81843o94302o28728j14563J66048k0060K87833N26052K02179
$$ 1701703 1377799 795956 101654 -527074 -641637 -475589 -495649 -207816 318236 520415
12439E20415M1937j81616J89083L75980N3653m55141n59090m39933m5285L25132
$$ 520415 562352 380736 569819 945799 999452 544311 -14779 -454712 -499997 -174865
12429a74865M38206L09566L08503K26263m00292m84606j6534J50614k73774m35089
$$ -174865 263341 572907 881410 1107673 707381 222775 206241 356855 83081 -352008
12419c52008k1034K092r3433K33650L33876n2127J35527J95626l87747j81532
$$ -352008 -373042 -370950 -464383 -230733 103143 51016 186543 382169 -5578 -187110
12409a87110J42482N07775M12870k60304k16271J0179L74920L14079l24267m99020
$$ -187110 -44628 463147 876017 615713 399442 409621 784541 1098620 774353 275333
12399B75333l48274j98699R6466L03139K3908P1892K92706K4152n8230J35123
$$ 275333 -72941 -271640 -175174 127965 151873 223765 516471 540623 482393 617516
12389F17516K67073P2585l24410j54900m11248n68210J17638P81949L65507k52656
$$ 617516 884589 957174 632764 477864 66616 -501594 -383956 397993 763500 510844
12379E10844n78661k27878L7500J39018J87871L9199k10575J0019R3090J26069
$$ 510844 -67817 -295695 -258195 -119177 68694 107893 -102682 -92663 427 126496
12369A26496r4204m80437n01322l25623K35542J022249P72979l06969l35538l75805
$$ 126496 32292 -448145 -949467 -1275090 -1039548 -17299 755680 448711 113173 -262632
12359b62632k88887K76010M28137J08555J81737K24926n30551m34605j58051P2161
$$ -262632 -551519 -275509 152628 261183 442920 667846 137295 -297310 -455361 -383200
12349c83200J00838m61540o01941n4153N003k02715K16711M18705r2899l98939
$$ -383200 -282362 -743902 -1345843 -1399996 -1394993 -1597708 -1380997 -962292 -1055191 -1454130
12339a454130m2881J16617L29418M24990M66229k2238l88648K31763K47543r0037
$$ -1454130 -1497011 -1380394 -1050976 -625986 -159757 -181995 -570643 -338880 -91337 -181374
12329a81374l80480Q3089L95925K6872j52236l62871j15656j14934J36586L20205
$$ -181374 -561854 -478765 -82840 -55968 -208204 -571075 -686731 -801665 -665079 -344874
12319c44874M55551K34135l01735k57511N34641N26233j62665n24228k18392J28275
$$ -344874 110677 344812 43077 -214434 320207 846440 683775 159547 -58845 69430
12309F9430k92725m27324k40391K19501Q12102K84441k55058l63010k20449M3848
$$ 69430 -223295 -650619 -891010 -671509 140593 425034 169976 -193034 -413483 -369635
12299c69635j58632j85763j19749K4567M94957N33262L54717J86962k72316n96895
$$ -369635 -528267 -714030 -833779 -809212 -314255 219007 573724 760686 488370 -108525
12289a08525j66397l3383q6587j7902j5818L15713J8947j05987Q055q0734p0583
$$ -108525 -274922 -308305 -394892 -412794 -428612 -112899 -93952 -199939 -191884 -272618 -343201
12278c43201k4368j07035j37845J96143O40491N10555o03484p91913M350K32515
$$ -343201 -367569 -474604 -612449 -416306 224185 734740 131256 -660657 -656307 -423792
12268d23792O734M87189O26253j12861o28390l22976M15418L35483n27949p85951
$$ -423792 -417058 70131 696384 583523 -44867 -367843 47575 383058 -144891 -930842
12258i30842K0776P98405O02504R2115k07581O2595j30610k83138M8955k001k70089
$$ -930842 -910066 -111661 490843 582958 375377 437972 307362 24224 73179 71178 -198911
12247a98911k35835n53222j11724K61312J89821p0122J70629N68587J74537j73826
$$ -198911 -434746 -987968 -1099692 -838380 -648559 -718681 -548052 20535 195072 21246
12237B1246j59036l41976k93436j8617L94539L25571j46042J7446L14889K45719
$$ 21246 -137790 -479766 -773202 -791819 -397280 -71709 -217751 -200305 114584 360303
12227C60303K3441j365l45579l04071k91254l92610j4149J84376L02149K60297
$$ 360303 383744 382379 36800 -267271 -558525 -951135 -965284 -780908 -478759 -218462
12217b18462J11941j26535n33230m1889J71189J53240N70538L01189k6955M00236
$$ -218462 -106521 -233056 -766286 -808175 -636986 -483746 86792 387981 361026 761262
12207G61262J28653m35666j95621N04493L3059m30779n70680k38768n2262m21573
$$ 761262 889915 454249 258628 763121 796180 365401 -205279 -444047 -496309 -917882
12197i17882k62622J89902Q08883Q24452L8193q99466o40152J22230K37239L20112
$$ -917882 -1180504 -990602 -181719 642733 680926 -218540 -858692 -736462 -499223 -179111
12187a79111J49688o4066o8037q1080m51761J88115M84682o5829N436l7627j16298
$$ -179111 -29423 -93489 -161526 -242606 -694367 -506252 -21570 -87399 -81963 -119590 -235888
12176b35888L9962n09847k86526J81061K17631M50468L5158q8187j6163p6225
$$ -235888 -195926 -705773 -992299 -811238 -593607 -143139 -107981 -196168 -212331 -288556
12166b88556q2685J53821J56779P0532k19245j13953P8682L78656O0958l57719
$$ -288556 -371241 -217420 -60641 9891 -209354 -323307 -244625 134031 194989 -162730
12156a62730j64427O1186M74645K77840j99063l77267n73199l40312K86718L26513
$$ -162730 -327157 -265971 208674 486514 287451 -89816 -663015 -1003327 -716609 -390096
12146c90096M6608j4793k01209j21461N11244M42180l09210r66494o65008J65422
$$ -390096 -343488 -358281 -559490 -680951 -169707 272473 -36737 -1003231 -1668239 -1502817
12136a502817O17887N27767M81468L81579J10744j65327k71572k0130Q1839o6783
$$ -1502817 -884930 -357163 124305 505884 616628 451301 179729 159599 241438 174655
12126A74655m18526k25631J22702J87589k10442j58374N22079K09927J25434J37657
$$ 174655 -243871 -469502 -346800 -159211 -369653 -528027 -5948 203979 329413 467070
12116D67070J62293Q9452j47449m12677q69325o88501k10441o9176N49525O4050
$$ 467070 629363 718815 571366 158689 -710636 -1399137 -1609578 -1678754 -1129229 -1065179
12106a065179m91293K4949K49507N12471N66180M04667M01064m73945o72113r6951
$$ -1065179 -1556472 -1531523 -1282016 -769545 -203365 201302 602366 128421 -543692 -640643
12096f40643L47152J65039k35993K0216k04153p4145K63913L81444J0232R5518
$$ -640643 -293491 -128452 -364445 -344229 -548382 -622527 -358614 22830 33062 128580
12086A28580J46081Q4553o6037n35016o27998n0759J44437K09208J51884j51887
$$ 128580 274661 359214 293177 -241839 -869837 -920596 -776159 -566951 -415067 -566954
12076e66954m1996j52186p1956L01860K53720L61099N19602p9584k04566L634
$$ -566954 -608950 -761136 -833092 -531232 -277512 83587 603189 523605 319039 322673
12066C22673n6103m9770l0896j396Q5683j18976j88999n6822J89579O34210L81666
$$ 322673 266570 216800 185904 184508 270191 151215 -37784 -94606 94973 729183 1110849
12055A110849K06489J3594n70251q35344L5760M56294K44779o8617k09058l09402
$$ 1110849 1317338 1330932 760681 -74663 -38903 417391 662170 593553 384495 75093
12045G5093k7406j7663k73465P6119J77039L7741m766J8331o0126p745n9905L31315
$$ 75093 47687 30024 -243441 -167322 9717 47458 42692 61023 897 -6848 -66753 264562
12033B64562L43912l50516j87747j16253j34104k49722n25800M4927N87116O44269
$$ 264562 608474 257958 70211 -46042 -180146 -429868 -955668 -910741 -323625 320644
12023C20644j7079j64743m96178k57623J66307J55274J24602k30433j87970l79844
$$ 320644 303565 138822 -357356 -614979 -448672 -293398 -168796 -399229 -587199 -967043
12013i67043k77204j00994K62209L97204N67882L63778m51697k43091J26488J77849
$$ -967043 -1244247 -1345241 -1083032 -685828 -117946 245832 -205865 -448956 -322468 -144619
12003a44619K12260k7105R9653J90371L1190J51310K93763k16672n2728M90517
$$ -144619 67641 40536 140189 330560 361750 513060 806823 590151 537423 1027940
11993A027940N26408l05735m78301j58447m55362l96816l50041n2426k24755j29543
$$ 1027940 1554348 1248613 770312 611865 156503 -240313 -590354 -642780 -867535 -997078
11983i97078N20532M92335n358k50329K2035M75689m2167q6119L4094J3253K11026
$$ -997078 -476546 15789 10431 -239898 -217863 257826 215659 129540 163634 176887 387913
11972C87913R2249l63338j02216J23419L1119k21743n211J81705j25931p37850
$$ 387913 480162 116824 14608 138027 169146 -52597 -57808 123897 -2034 -739884
11962g39884m81954k58368N4130M70330N48393L98230K72903J1939m41909j46841
$$ -739884 -1221838 -1480206 -1426076 -955746 -407353 -9123 263780 275719 -166190 -313031
11952c13031J85081P5360J59290J20918j48021o58250q1307O16844L68343K29388
$$ -313031 -127950 -52590 106700 227618 79597 -578653 -659960 -43116 325227 554615
11942E54615l06273k77662l42664m75247j97824N0640P932m38438l34226K2907
$$ 554615 248342 -29320 -371984 -847231 -1045055 -994415 -986483 -1424921 -1759147 -1736240
11932a736240L07998P17421N23171j39548J31039J35221l4163j73126k38625J2153
$$ -1736240 -1428242 -710821 -187650 -327198 -196159 -60938 -95101 -268227 -506852 -494699
11922d94699l91712j88710L42862K08643J04736L60949N0236L03252L79738Q9813
$$ -494699 -886411 -1075121 -732259 -523616 -418880 -57931 -7695 295557 675295 765108
11912G65108l65514q13996k28954J26436N2531K02415K32580l03065o76284k71189
$$ 765108 399594 -414402 -643356 -516920 -464389 -261974 -29394 -332459 -1008743 -1279932
11902a279932J67804j8211k1704q8631J4438L87663O41714J49164j35852L81626
$$ -1279932 -1112128 -1130339 -1152043 -1240674 -1226236 -838573 -196859 -47695 -183547 198079
11892A98079L05622m19216m52766n2366l5735K10484M84736K0518m95973j75004
$$ 198079 503701 84485 -368281 -420647 -456382 -245898 238838 259356 -236617 -411621
11882d11621J95925J28215r8735m85047j99596Q7030m5127Q1589N21349N51732
$$ -411621 -215696 -87481 -186216 -671263 -870859 -783829 -828956 -747367 -226018 325714
11872C25714J68967p9448k8398L60531R5404k25072l15147k83135j36252J15411
$$ 325714 494681 415233 386835 747366 842770 617698 302551 19416 -116836 -1425
11862a425J65471o6672n04579m25433m28913K1065J69256k17820K52111K45979
$$ -1425 164046 97374 -407205 -832638 -1261551 -1240486 -1071230 -1289050 -1036939 -790960
11852g90960k10209j62599J78948K51876k45267j26687M33694O51725J44087l69170
$$ -790960 -1001169 -1163768 -984820 -732944 -978211 -1104898 -671204 -19479 124608 -244562
11842b44562K04653K18152m11336j93913J85224K83931L654m82351m78712n9679
$$ -244562 -39909 178243 -233093 -427006 -241782 42149 45803 -436548 -915260 -974939
11832i74939K24940N01776J43917l2511p1520l12029p0961r1481r6752J7408r6945
$$ -974939 -749999 -248223 -104306 -136817 -208337 -520366 -591327 -682808 -779560 -762152 -859097
11821h59097L02776L80990J53159l8314l67414n15005k90521L65860K96764J44028
$$ -859097 -556321 -175331 -22172 -60486 -427900 -942905 -1233426 -867566 -570802 -426774
11811d26774L53654K8933k53445n3828K68846j99351k51312J99608L60001R8372
$$ -426774 -73120 -44187 -297632 -351460 -82614 -281965 -533277 -333669 26332 124704
11801A24704j87390O9725N45182M74833n0691n41297o68793n51798L1908K43764
$$ 124704 -62686 7039 552221 1027054 976363 435066 -233727 -785525 -753617 -509853
11791e09853K77058l2920n7768L16120K78902k5970n2105J5907J71425j31768
$$ -509853 -232795 -265715 -323483 -7363 271539 245569 193464 209371 380796 249028
11781B49028R1555M2552k4322J11498J27221K98121J20879l93957m04774K79052
$$ 249028 340583 383135 358813 470311 597532 895653 1016532 622575 217801 496853
11771D96853K03654m59770o15102r3737K84767K13320J36815j58980n42103k70929
$$ 496853 700507 240737 -374365 -468102 -183335 29985 166800 7820 -534283 -805212
11761h05212L57113L81916K60745Q13M6127J29690L13451M38659k08390m21577
$$ -805212 -448099 -66183 194562 195375 241502 371192 684643 1123302 914912 493335
11751D93335l52537m35501l49184j84989M86020N98167k15105o29658k05793K63217
$$ 493335 140798 -294703 -643887 -828876 -342856 255311 40206 -589452 -795245 -532028
11741e32028r2892k84222Q4709Q9321J11001k29999j69967j08345j40659r444
$$ -532028 -624920 -909142 -824433 -735112 -624111 -854110 -1024077 -1132422 -1273081 -1282525
11731a282525K3457K11673L23338o9243p7816L69099K83858j12685k01673N7590
$$ -1282525 -1259068 -1047395 -724057 -793300 -871116 -502017 -218159 -330844 -532517 -474927
11721d74927j6203M08886N60709J10732k85420r7186k16505p9999j85160m70054
$$ -474927 -491130 -82244 478465 589197 303777 206591 -9914 -89913 -275073 -745127
11711g45127m99224j42940M72840Q88863L08304k50629j61671N3976r4169K14869
$$ -745127 -1244351 -1387291 -914451 -25588 282716 32087 -129584 -75608 -169777 45092
11701D5092J62915l6804J68507R1002k61500j29806m61k68555n5920l5657j11827
$$ 45092 208007 171203 339710 430712 169212 39406 38945 -229610 -285530 -321187 -433014
11690d33014K8481N72394L82835k07955k49420l43744R2398r0378n16787j87574
$$ -433014 -404533 167861 550696 342741 93321 -250423 -158025 -248403 -765190 -952764
11680i52764L35473K09940J09389j07014n02218m35514K43646M91446P6249j93809
$$ -952764 -617291 -407351 -297962 -404976 -907194 -1342708 -1099062 -607616 -531367 -725176
11670g25176j50929K75008J60030k17539j97702P9358K45089P9301j39495p3674
$$ -725176 -876105 -601097 -441067 -658606 -856308 -776950 -531861 -452560 -592055 -665729
11660f65729q8029j44529M14587L31064l78160m48195j66926J4911K73926K12348
$$ -665729 -753758 -898287 -483700 -152636 -530796 -978991 -1145917 -1131006 -857080 -644732
11650f44732M16270N86462N76299P7581m56191q2781Q8753j19790J5099k72138
$$ -644732 -228462 358000 934299 1011880 555689 472908 561661 441871 456970 184832
11640A84832o59205k74513J58813L57327q0810m99972n0180L15024J73659K30155
$$ 184832 -474373 -748886 -590073 -232746 -313556 -813528 -863708 -548684 -375025 -144870
11630a44870j85458l39180K00161J55526J1744j38073J35847J88824k39563k20587
$$ -144870 -330328 -669508 -469347 -313821 -302077 -440150 -304303 -115479 -355042 -575629
11620e75629k53503m7973M44561N11794L93942M39106K80638m32680p55429n31142
$$ -575629 -829132 -877105 -432544 79250 473192 912298 1192936 760256 4827 -526315
11610e26315N07677O26679J02240k68124m22343j10036r0494k49101k7053j34914
$$ -526315 -18638 608041 710281 442157 19814 -90222 -180716 -429817 -456870 -591784
11600e91784K38415N02596j1711Q5200J62430K3724L8558Q730J27571k68766m7378
$$ -591784 -353369 149227 137516 222716 385146 408870 447428 456158 583729 314963 267585
11589B67585J69551j5566l0372J87031P1090n43487k48368k767q2519k41016p1880
$$ 267585 437136 421570 391198 578229 649319 105832 -142536 -145303 -227822 -468838 -540718
11578e40718K5442J88946L09805K78057K43927K0142j15394k21256m53643o07399
$$ -540718 -515276 -326330 -16525 261532 505459 525601 410207 188951 -264692 -872091
11568h72091J96581N34252Q266l34026j54415K87009j8397r3778N9485K83325
$$ -872091 -675510 -141258 -132992 -467018 -621433 -334424 -352821 -446599 -387114 -103789
11558a03789K75862j2680l24378m12302l11464J88447J04767J11250J57816K37513
$$ -103789 172073 159393 -164985 -577287 -888751 -700304 -595537 -484287 -326471 -88958
11548h8958M92066Q2991J33103K69754J45096k41333o38181l5890J6336R0526
$$ -88958 403108 486099 619202 888956 1034052 792719 154538 118648 134984 225510
11538B25510J85185k51787k36248k07204P6726N2090J01708J35816N6221K78066
$$ 225510 410695 158908 -77340 -284544 -207818 -155728 -54020 81796 138017 416083
11528D16083K35514M93118K8335p97111r58008k87341K89147J48939J707J12766
$$ 416083 651597 1144715 1173050 375939 -582069 -869410 -580263 -431324 -429617 -316851
11518c16851j71596j6467O37191K42447k6911m7053k67069k52547J58604L98248
$$ -316851 -488447 -504914 132277 374724 347813 300760 33691 -218856 -60252 337996
11508C37996L28287J48882j84786j16472j93396r4855j30804j21014k43408K7583
$$ 337996 666283 815165 630379 513907 320511 225656 94852 -26162 -269570 -241987
11498b41987L36163l0388l03596l78634l73266K04941P35474M02685J30196m54430
$$ -241987 94176 63788 -239808 -618442 -991708 -786767 -51293 351392 481588 27158
11488B7158j06981J89221l33382l10917j97835j55393J81219K56394M51641j12038
$$ 27158 -79823 109398 -223984 -534901 -732736 -888129 -706910 -450516 1125 -110913
11478a10913k46214L55331O47870K40807n43409n79366j25523L09101M56460M45070
$$ -110913 -357127 -1796 646074 886881 343472 -235894 -361417 -52316 404144 849214
11468H49214M83274J70205m08458l65432K8228N73728j00871m64399J7161N9497
$$ 849214 1332488 1502693 1094235 728803 757031 1330759 1229888 765489 782650 842147
11458H42147J8528K72057j49789n6033j44656n36673m59247p7963N20248M42409
$$ 842147 860675 1132732 982943 926910 782254 245581 -213666 -291629 228619 671028
11448F71028m7104m14264k77818q307K0002j01590k29274m5816J40499L90427
$$ 671028 623924 209660 -68158 -76465 -56463 -158053 -387327 -433143 -292644 97783
11438I7783M60952K65180l3060m83279l73462k77142l31687J58379L59648M79635
$$ 97783 558735 823915 790855 307576 -65886 -343028 -674715 -516336 -156688 322947
11428C22947L81153k41507M6355p7168l56780l26316k81119j42579k98976k05216
$$ 322947 704100 462593 508948 431780 75000 -251316 -532435 -675014 -973990 -1179206
11418a179206K53744M45331M8002l17039R4138K13982J76578J23500J58913R1784
$$ -1179206 -925462 -480131 -432129 -749168 -655030 -441048 -264470 -140970 17943 109727
11408A09727N33547N83772o1110o42984k17703L88635j63439l91514k18704k03370
$$ 109727 643274 1227046 1165936 522952 305249 693884 530445 138931 -79773 -283143
11398b83143O9973K28411O68114O65930K10222J02909j79905k29685m19990l30604
$$ -283143 -213170 15241 683355 1349285 1559507 1662416 1482511 1252826 832836 502232
11388E02232k59329m78151p70489m29650J55599k7909j99482o5027J54883N56621
$$ 502232 242903 -235248 -1005737 -1435387 -1279788 -1307697 -1507179 -1572206 -1417323 -860702
11378h60702L35964K58101J09165j3815j45757j64612M1854j35398M639M1095
$$ -860702 -524738 -266637 -157472 -171287 -317044 -481656 -439802 -575200 -570561 -529466
11368e29466M06570K42935n34458m39179m51272l53794L40706M80306J85339K88933
$$ -529466 -122896 120039 -414419 -853598 -1304870 -1658664 -1317958 -837652 -652313 -363380
11358c63380o8800j37468J63050J32399J13074L82291K54440K9624k98060p6347
$$ -363380 -432180 -569648 -406598 -274199 -161125 221166 475606 505230 207170 130823
11348A30823K62032J85555q1916L28300M34266k1903J09952m5150l46629j17238
$$ 130823 392855 578410 496494 824794 1259060 1237157 1347109 1301959 955330 838092
11338H38092J66100J41074k39529n40054m94678n09465n37206k33724j14973p9918
$$ 838092 1004192 1145266 905737 365683 -128995 -638460 -1175666 -1409390 -1524363 -1604281
11328a604281j0555O10722R19350O46284l30652o88520r3326J25409J56684O8252
$$ -1604281 -1614836 -1004114 -84764 561520 230868 -457652 -550978 -425569 -268885 -200633
11318b00633J91733L31199K67360J55457l26557q62054l28431J60880Q0777J17505
$$ -200633 -8900 322299 589659 745116 418559 -443495 -771926 -611046 -530269 -412764
11308d12764R0819j61212q0247N68140N52042Q256k78807j29776M01819K50265
$$ -412764 -321945 -483157 -563404 4736 556778 565034 286227 156451 558270 808535
11298H08535j61138n51265k62263j512J26403k95194n04710L83191N01849J26413
$$ 808535 647397 96132 -166131 -167643 -41240 -336434 -841144 -457953 43896 170309
11288A70309k38289n01899J48163J64904J87898q2183l17829p7727m2102l7493
$$ 170309 -67980 -569879 -421716 -256812 -68914 -151097 -468926 -546653 -588755 -626248
11278f26248O7027J86752J19635j51993o7572L469M9253M8538R297O096K2100
$$ -626248 -559221 -372469 -252834 -404827 -472399 -468930 -419677 -371139 -361842 -355746 -333646
11267c33646K946m5159O1961L7795o6100K17534J36932m1847l06074k35768m58348
$$ -333646 -330700 -375859 -313898 -276103 -342203 -124669 12263 -29584 -335658 -571426 -1029774
11256a029774m52905J85687N02637J74180M368K13655K3320K1043m9218L52952
$$ -1029774 -1482679 -1296992 -794355 -620175 -615807 -402152 -378832 -357789 -407007 -54055
11246e4055P13799L48201J79319L24388J82187n13469o28901l31103Q287P1081
$$ -54055 659744 1007945 1187264 1511652 1693839 1180370 551469 220366 228653 299734
11236B99734p8253o8808j13849Q0305J61367k21668k81034R2051J46610K99266
$$ 299734 221481 152673 38824 119129 280496 58828 -222206 -130155 16455 315721
11226C15721M23189J0867k94223j07942j50200j63060p8622R5602j68239m84401
$$ 315721 738910 749777 455554 347612 197412 34352 -44270 51332 -116907 -601308
11216f01308m37164j8616j16719j41555L39220n4914q7434L88276O65531L46019
$$ -601308 -1038472 -1057088 -1173807 -1315362 -976142 -1031056 -1118490 -730214 -64683 281336
11206B81336k4319o1533J40688J32479j6224L330j10240n33645n39164l43793
$$ 281336 257017 195484 336172 468651 452427 455757 345517 -188128 -727292 -1071085
11196a071085j35898K70776J013222O42771j70237j56831k08483N7696r6562J64684
$$ -1071085 -1206983 -936207 77015 719786 549549 392718 184235 241931 145369 310053
11186C10053J05586l84006k07905K77596l16229m94088n98794k99239M06718N14476
$$ 310053 415639 31633 -176272 101324 -214905 -708993 -1307787 -1607026 -1200308 -685832
11176f85832j21184j64766k08459k45992n1250P36686N69287K6133k872j5460
$$ -685832 -807016 -971782 -1180241 -1426233 -1477483 -740797 -171510 -145377 -148249 -163709
11166a63709J85358M86309K07732o7508l52210j51334O5835k58264j26544k68860
$$ -163709 21649 507958 715690 648182 295972 144638 210473 -47791 -174335 -443195
11156d43195m09572L0275J58446L8509R6945O2232J48020J18570K59964J58599
$$ -443195 -852767 -822492 -664046 -625537 -528592 -466360 -318340 -199770 60194 218793
11146B18793j64393m55566K16513M95353K87015K60393K37621l52705l33519j48045
$$ 218793 54400 -401166 -184653 310700 597715 858108 1095729 743024 409505 261460
11136B61460R009L37165M230m17781l3268q2451k4261m1218N6968N9997l27261
$$ 261460 270469 607634 611864 194083 160815 78364 54103 12885 69853 129850 -197411
11125a97411N0458O71844M55270L43649j09377j95247L0105m1247l58367p21438
$$ -197411 -146953 524891 980161 1323810 1214433 1019186 1049291 1008044 649677 -71761
11115g1761n85469j2938k19557P8870N33017K37491j44515j20646K37351L4355
$$ -71761 -657230 -670168 -889725 -810855 -277838 -40347 -184862 -305508 -68157 -33802
11105c3802o7466M23384J47068j70856K08863n9413J70704P88266N28733p1260
$$ -33802 -101268 322116 469184 298328 507191 447778 618482 1406748 1935481 1864221
11095A864221l00600n86290m78414m02365m05183k06091J0502k19302n25034k54947
$$ 1864221 1563621 977331 498917 96552 -308631 -514722 -504220 -723522 -1248556 -1503503
11085a503503K04883M91893N09298R9575j40526m61892R3063N78449M82630k58262
$$ -1503503 -1298620 -806727 -297429 -197854 -338380 -800272 -707209 -128760 353870 95608
11075I5608p18663m64406K28377P25887M06843j84101k83693K79291K71455L9394
$$ 95608 -623055 -1087461 -859084 -133197 273646 89545 -194148 85143 356598 395992
11065C95992k31872o26157j18444N01430M45809l04757k97160L31284J31561k26442
$$ 395992 164120 -462037 -580481 -79051 366758 62001 -235159 96125 227686 1244
11055A244m44774n12153J19927J98392m35833l9965O931J21544L54057K2731j26778
$$ 1244 -443530 -955683 -835756 -637364 -1073197 -1113162 -1106231 -984687 -630630 -607899 -734677
11044g34677M0566n9648o5680j54335o11543K56646N73337M37512O17441n2363
$$ -734677 -694111 -753759 -819439 -973774 -1585317 -1328671 -755334 -317822 299619 247256
11034B47256m88229l22626k08859k90850k61714J83629J30548j34215K18792K60509
$$ 247256 -240973 -563599 -772458 -1063308 -1325022 -1141393 -1010845 -1145060 -926268 -665759
11024f65759j00749q038K96368j09963J763M65424J71558o2580k15192m90831
$$ -665759 -766508 -774546 -478178 -588141 -586378 -120954 50604 -11976 -227168 -717999
11014g17999m8269J93822l6647j25180O2078Q5013K31313q4683k54398m70219
$$ -717999 -766268 -572446 -609093 -734273 -672195 -587182 -355869 -440552 -694950 -1165169
11004a165169l14513K07247L13789P0156R8737K11356J0508l35422k33775L46523
$$ -1165169 -1479682 -1272435 -958646 -888490 -789753 -578397 -567889 -903311 -1137086 -790563
10994g90563P54390N48283K02300J98282L67868j50696n91331p27587k12939K81098
$$ -790563 -36173 512110 714410 912692 1280560 1129864 538533 -189054 -401993 -120895
10984a20895O4238k93951l12710N7373J66700P2590l18984J35167J62662O38984
$$ -120895 -56657 -350608 -663318 -605945 -439245 -366655 -685639 -550472 -387810 251174
10974B51174N37233J44586j02483n19911o73096k36026N4298M0385j83899j20208
$$ 251174 788407 932993 830510 310599 -362497 -598523 -544225 -503840 -687739 -807947
10964h07947L89100M22859J47257k27685q8172J49120j27298l47256j44720J08189
$$ -807947 -418847 4012 151269 -76416 -164588 -15468 -142766 -490022 -634742 -526553
10954e26553J45612J6226k44319l44711l06214J44935M24645N14121K75666p9453
$$ -526553 -380941 -364715 -609034 -953745 -1259959 -1115024 -690379 -176258 99408 19955
10944A9955l07963k25946K4849o4116j62943R6300K12939K11585L15374n1249
$$ 19955 -288008 -513954 -489105 -553221 -716164 -619864 -406925 -195340 120034 68785
10934F8785k28303J78019M71289q2236n57456k24987j33087O7332L23322j57030
$$ 68785 -159518 18501 489790 407554 -149902 -374889 -507976 -440644 -117322 -274352
10924b74352m26609m06366J47964L55144P0059j71015K8548j94090L123K21360
$$ -274352 -700961 -1107327 -959363 -604219 -534160 -705175 -676627 -870717 -867594 -646234
10914f46234J32655J00393m8333J20091k48458j50072K65148O36848P29163M12730
$$ -646234 -513579 -413186 -461519 -341428 -589886 -739958 -474810 162038 891201 1303931
10904A303931n35190q71724k04100J84843J76176p0675k24808j93254M3398K27390
$$ 1303931 768741 -102983 -307083 -122240 53936 -16739 -241547 -434801 -391403 -164013
10894a64013p2632n07746m18197k15227J3067L01537K97363M01268J39779K16856
$$ -164013 -236645 -744391 -1162588 -1377815 -1364748 -1063211 -765848 -364580 -224801 -7945
10884g945N58675l7734k09286J91220n2987n38662k86292P8808M13721K6920K5607
$$ -7945 550730 512996 303710 494930 441943 -96719 -383011 -304203 109518 136438 162045
10873A62045o8283j96486o4246n1527j29069M8989k42490l36016K48659K43728
$$ 162045 93762 -102724 -166970 -218497 -347566 -298577 -541067 -877083 -628424 -384696
10863c84696k77868l53183k30715l33390J7398K81487K06918M56302R56293L29719
$$ -384696 -662564 -1015747 -1246462 -1579852 -1562454 -1280967 -1074049 -617747 338546 668265
10853F68265r1434k82507j95048R4808m12341n63456K88428O34663J81804l753
$$ 668265 576831 294324 99276 194084 -218257 -781713 -493285 141378 323182 319429
10843C19429m40780p41077p4359M54918L02072j35418k54271p276K16140K69682
$$ 319429 -121351 -862428 -936787 -481869 -179797 -315215 -569486 -576762 -360622 -90940
10833i0940N94612O23639J59186n37521m52567J9224J84977K22913k90777j41079
$$ -90940 503672 1127311 1286497 748976 296409 315633 500610 723523 432746 291667
10823B91667K53455K63996r7439l16166J8217J3672O8270r6571n5368M90526R8795
$$ 291667 545122 809118 711679 395513 413730 427402 495672 399101 343733 834259 933054
10812I33054m51721l91513l5596M3400J0837K41579l7747j42266J6411n7160j44702
$$ 933054 481333 89820 54224 97624 108461 350040 312293 170027 186438 129278 -15424
10801a5424J78107k37407k90540m9789M64942M50698k00719l95454m62131n90149
$$ -15424 162683 -74724 -365264 -415053 49889 500587 299868 -95586 -557717 -1147866
10791a147866k10559L31014M89899N34545R53433N82319p7449j44093n43598m78726
$$ -1147866 -1358425 -1027411 -537512 -2967 950466 1532785 1455336 1311243 767645 288919
10781B88919r2489J80032J03493L30361K29016k2670k0351J09446n9382m67411
$$ 288919 196430 376462 479955 810316 1039332 1016662 996311 1105757 1046375 578964
10771E78964j75325K54120j81076l40240J91287J83726j99578k15650k60704J15066
$$ 578964 403639 657759 476683 136443 327730 511456 311878 96228 -164476 -49410
10761d9410L39227J03126K17738N05208N54140m614l63810J02561L36424r6856
$$ -49410 289817 392943 610681 1115889 1670029 1665415 1301605 1404166 1740590 1643734
10751A643734m89396J078M42969L98461O31622J059841J028477R44240Q07099
$$ 1643734 1154338 1155416 1598385 1996846 2628468 3688309 4716786 5661026 6468125
10742F468125J91024j09286l16380K86847J242673J262990L43776j110818j757850
$$ 6468125 6659149 6549863 6233483 6520330 7763003 9025993 9369769 8258951 6501101
10733F501101j091865q70778r95806p43578m27971k48707j70549L58149M8480
$$ 6501101 5409236 4538458 3542652 2799074 2371103 2122396 1951847 2309996 2358476
10724B358476k54680l6272j11003k95934j48750O9280k84695l38163J2101L22566
$$ 2358476 2103796 2067524 1956521 1660587 1511837 1581117 1296422 958259 970360 1292926
10714A292926J03108O1947j04835j84898l78254n63866m14410k13639k54957J626
$$ 1292926 1396034 1457981 1353146 1168248 789994 226128 -188282 -401921 -656878 -655252
10704f55252L36035K37374m19756j55133O07616K63998m57660k8674N62921J59314
$$ -655252 -319217 -81843 -501599 -656732 -49116 214882 -242778 -271452 291469 450783
10694D50783j83193J77088j2165m45850l28165k42877P5591M27934K79052L59966
$$ 450783 267590 444678 432513 -13337 -341502 -584379 -508788 -80854 198198 558164
10684E58164M62161O3775k03235l83023k60168l39707j69896l19825L3325L16672
$$ 558164 1020325 1084100 880865 497842 237674 -102033 -271929 -591754 -558429 -241757
10674b41757J1473l3601p8290j2704M94525M78503r4063n99732n97278j35670
$$ -241757 -230284 -263885 -342175 -354879 139646 618149 524086 -75646 -672924 -808594
10664h08594K14400R7128L88498L79005R5472K040k34113k08043j58888N7481
$$ -808594 -594194 -497066 -108568 270437 365909 367949 133836 -74207 -233095 -175614
10654a75614J90747o9331L83146K73967l89394n55944L0461J03143J13611L27100
$$ -175614 15133 -54198 328948 602915 213521 -342423 -311962 -208819 -95208 231892
10644B31892j16836q35160o34769j20894J53077L95058M83609J49679j29834J58600
$$ 231892 115056 -720104 -1354873 -1475767 -1322690 -927632 -444023 -294344 -424178 -265578
10634b65578L45761j43519l40517L59688N85203N3016O2786M12626O2238m06167
$$ -265578 80183 -63336 -403853 -44165 541038 594054 656840 1069466 1131704 725537
10624G25537k03075j5227j90104k78465m36002O518L56224N42024J26822j1098
$$ 725537 522462 507235 317131 38666 -397336 -390818 -34594 507430 634252 623154
10614F23154l8665K10648K96554j85900k64735j1710n5091m65699m38358j25693
$$ 623154 584489 795137 1091691 905791 641056 629346 574255 108556 -329802 -455495
10604d55495n0858P126L22702L09747J88245m54782k67629K61477L90182K00890
$$ -455495 -506353 -499227 -176525 133222 321467 -133315 -400944 -139467 250715 451605
10594D51605L07768K37714m39125q17330p47205l24454j47797j80790K08490N44491
$$ 451605 759373 997087 557962 -259368 -1006573 -1331027 -1478824 -1659614 -1451124 -906633
10584i06633L86752K09067M0847n2806J9058l15474m65589N13922P17948K78150
$$ -906633 -519881 -310814 -269967 -322773 -303715 -619189 -1084778 -570856 147092 425242
10574D25242Q8172K17005L70251L33280q0737q60016l76381P1380l69396k83627
$$ 425242 513414 730419 1100670 1433950 1353213 493197 116816 188196 -181200 -464827
10564d64827j0879j81273j96326Q66N75432N24153j54090k08498j54000j73800
$$ -464827 -475706 -656979 -853305 -852439 -277007 247146 93056 -115442 -269442 -443242
10554d43242j14316J74130J16590O753Q8188l21751m25533k66492j9439O43892
$$ -443242 -557558 -383428 -266838 -260085 -171897 -493648 -919181 -1185673 -1205112 -561220
10544e61220N12086K9349J69k2280Q3532K19809j09905l26282n50286K7345L24433
$$ -561220 -49134 -19785 -19616 -41896 41636 261445 151540 -174742 -725028 -697683 -373250
10533c73250J3343K08894K87057L07343k04137n9257J28392j2220m8331Q6392
$$ -373250 -359907 -151013 136044 443387 239250 179993 308385 296165 247834 334226
10523C34226j36919p2482J58708j48386k87666l52452k47236n93291n05349K81404
$$ 334226 197307 124825 283533 135147 -152519 -504971 -752207 -1345498 -1850847 -1569443
10513a569443N88129J78745l40428j43411K39091k0728L8596M67575N50659K62588
$$ -1569443 -981314 -802569 -1142997 -1286408 -1047317 -1068045 -1029449 -561874 -11215 251373
10503B51373M05346K65634l51141l66902j84271J43227L27431J11697n03037k43510
$$ 251373 656719 922353 571212 204310 20039 163266 490697 602394 99357 -144153
10493a44153L87582M66610J39570R4725j53221m91620n63926k87578l23428l11703
$$ -144153 243429 710039 849609 944334 791113 299493 -264433 -552011 -875439 -1187142
10483a187142m0926J77414K34150j87924q1175m4766L19008J45834J47321N7590
$$ -1187142 -1228068 -1050654 -816504 -1004428 -1085603 -1130369 -811361 -665527 -518206 -460616
10473d60616M8240K52419K85050Q6121j70312m82162j84371K7310M05462L41552
$$ -460616 -412376 -159957 125093 211214 40902 -441260 -625631 -598321 -192859 148693
10463A48693K28820Q3778j22079k40836l6106l45658k61860k40856j455O39469
$$ 148693 377513 461291 339212 98376 62270 -283388 -545248 -786104 -787559 -148090
10453a48090L02565j61696m71908M57649Q72960M08615j38580m0058J04872k4111
$$ -148090 154475 -7221 -479129 -21480 851480 1260095 1121515 1081457 1186329 1162218
10443A162218n28398o81337n36462j61049j74907l54041K13188J12958M76j81384
$$ 1162218 633820 -47517 -583979 -745028 -919935 -1273976 -1060788 -947830 -947354 -1128738
10433a128738k8769N29575N43097L03583K1033m5007M08139K06103m25200o62587
$$ -1128738 -1157507 -627932 -84835 218748 239781 194774 602913 809016 383816 -278771
10423b78771n28233j31743q1119L35652Q90618M71842J1391k69447l80926m39990
$$ -278771 -807004 -938747 -1019866 -684214 206404 678246 689637 420190 39264 -400726
10413d00726m4200J12966j1000j4518o0282r6483o2951K11550M04313J00469k59212
$$ -400726 -444926 -331960 -342960 -357478 -417760 -514243 -577194 -365644 38669 139138 -120074
10402a20074n72671o40211p15783k05247Q4361K22322N01269O58354L26061K08644
$$ -120074 -692745 -1332956 -2048739 -2253986 -2169625 -1947303 -1446034 -787680 -461619 -252975
10392b52975K73862M54142N44654K450M3532K12574l51025j069316r50625l37044
$$ -252975 20887 475029 1019683 1022133 1065665 1278239 927214 -142102 -1092727 -1429771
10382a429771n7268n226K66089M99459M58603J43818l45039n81809j6770L96283
$$ -1429771 -1487039 -1492265 -1226176 -726717 -268114 -124296 -469335 -1051144 -1067914 -671631
10372f71631L05235M24960J05075j65341m32718m12890P2916L68873L93951o3943
$$ -671631 -366396 58564 163639 -1702 -434420 -847310 -774394 -405521 -11570 -75513
10362g5513j84120p388J64893K28220K71393j09054K15368j2555l58728l72710
$$ -75513 -259633 -267021 -102128 126092 397485 288431 503799 491244 132516 -240194
10352b40194l21550l84206J25484K78346K24270O00858N74990L57546Q9620m70600
$$ -240194 -561744 -945950 -820466 -542120 -317850 283008 857998 1215544 1305164 834564
10342H34564n24287m15233l13219j59120P448M07225N64407Q1525k1597k09441
$$ 834564 310277 -104956 -418175 -577295 -569847 -162622 401785 483310 461713 252272
10332B52272k99812l62460j04900q9594k44192J23367N41174L71918j66884k99432
$$ 252272 -47540 -410000 -514900 -604494 -848686 -725319 -184145 187773 20889 -278543
10322b78543J93955O3213j02383K93805j52560l85596m36056l92200l49986q235
$$ -278543 -84588 -21375 -123758 170047 17487 -368109 -804165 -1196365 -1546351 -1554586
10312a554586L5302k16601j90076j44806q5180J17805K09919N77829P20797P14881
$$ -1554586 -1519284 -1735885 -1925961 -2070767 -2155947 -2038142 -1828223 -1250394 -529597 185284
10302A85284K69561Q850j3633k63708k42868j49551l76699j90151J21839J05626
$$ 185284 454845 463695 450062 186354 -56514 -206065 -582764 -772915 -651076 -545450
10292e45450K4679J05630J86422K59310O09824J01631l09804j2290J66008k4J61012
$$ -545450 -520771 -415141 -228719 30591 640415 742046 432242 419952 585960 585936 746948
10281G46948L33312k4870l90690o67596l50945L3732r9110L1937L13192N96737
$$ 746948 1080260 1055390 664700 -2896 -353841 -320109 -419219 -387282 -74090 522647
10271E22647J68121j84432M0522J51684k7248k88316k10542k75612l11977K12011
$$ 522647 690768 506336 546858 698542 671294 382978 172436 -103176 -415153 -203142
10261b03142O2879l53968o6716L8469q4276J77277L04841k98678p42214J48341
$$ -203142 -140263 -494231 -560947 -522478 -606754 -429477 -124636 -423314 -1165528 -1017187
10251a017187O00976K70554R9729n1361L9455K13019K45576j29715k49979j21120
$$ -1017187 -416211 -145657 -45928 -97289 -57834 155185 400761 271046 21067 -100053
10241a00053R8566K21483K70795l06855n79052R9912L40850j2865j4199J53613
$$ -100053 -1487 219996 490791 183936 -395116 -295204 45646 32781 18582 172195
10231A72195j3768m10527j57177K58740K82745L38905N11226M6086n72413n84378
$$ 172195 158427 -252100 -409277 -150537 132208 471113 982339 1028425 456012 -128366
10221a28366p4929j43746m8547M25438M76262J97050o77844m99832m444J5539
$$ -128366 -203295 -347041 -395588 29850 506112 703162 25318 -474514 -478958 -463419
10211d63419k67339J70078O52214J67820l58825k66652l69391p007O16616K44248
$$ -463419 -730758 -560680 91534 259354 -99471 -366123 -735514 -742521 -125905 118343
10201A18343k92337k5636R9201M2154j16515j73971l29400k86729r9097K02126
$$ 118343 -173994 -199630 -100429 -58275 -174790 -348761 -678161 -964890 -1063987 -861861
10191h61861M77118M67159K00199L17612k57714l44475J01945J60219R0400J23269
$$ -861861 -384743 82416 282615 600227 342513 -1962 99983 260202 350602 473871
10181D73871r9344O3518L5233K33302L92275J56855m4273J27904P6188m89382
$$ 473871 374527 438045 473278 706580 1098855 1255710 1211437 1339341 1415529 926147
10171I26147m34390j69039o00509n09680N5516K707K61991L73107M63706K41482
$$ 926147 491757 322718 -277791 -787471 -731955 -729248 -467257 -94150 369556 611038
10161F11038m9236k93075J8420L52382n8930n39788r8431k39106k17101l28187
$$ 611038 561802 268727 287147 639529 580599 40811 -57620 -296726 -513827 -842014
10151h42014l93197M4478l46359m09848K25531K45487M9080K00717O02042K57592
$$ -842014 -1235211 -1190733 -1537092 -1946940 -1721409 -1475922 -1426842 -1226125 -624083 -366491
10141c66491j45942k64876O0522k07838k66884M89144K30988K12295J82916j73059
$$ -366491 -512433 -777309 -716787 -924625 -1191509 -702365 -471377 -259082 -76166 -249225
10131b49225M7546q5335n65506m99395Q4653M61429K65192j10927K85255O46067
$$ -249225 -201679 -287014 -852520 -1351915 -1267262 -805833 -540641 -651568 -366313 279754
10121B79754j0139k12553L0652Q4929k65084l25051L37803O24626K22394j34593
$$ 279754 269615 57062 87714 172643 -92441 -417492 -79689 544937 767331 632738
10111F32738l84723m56967j16802m8345L11296J76886K35658M34586K19457p00432
$$ 632738 248015 -208952 -325754 -374099 -62803 114083 349741 784327 1003784 303352
10101C03352r11317K31624L59055K82566K35802k0049k93448n34179q4766J66143
$$ 303352 -607965 -376341 -17286 265280 501082 481033 187585 -346594 -431360 -265217
10091b65217l35214m02315j72769j64577J73705L08798j31273M8538M24236K73146
$$ -265217 -600431 -1002746 -1175515 -1340092 -1166387 -857589 -988862 -940324 -516088 -242942
10081b42942K18796k00141j39864K8561l7058k95384j74481j5m2590n0195K88561
$$ -242942 -24146 -224287 -364151 -335590 -372648 -668032 -842513 -842528 -885118 -935313 -646752
10070f46752J01077k14808j17760R0770k9660k01538O2880n9708k13836O7132
$$ -646752 -545675 -760483 -878243 -787473 -817133 -1018671 -955791 -1015499 -1229335 -1162203
10060a162203J1868O23572O94075k83136k54326k08882m60045k8753J50073N712
$$ -1162203 -1150335 -526763 167312 -115824 -370150 -579032 -1039077 -1067830 -917757 -912045
10050i12045m0849N41452M17823L3068j51339m66118l27836J0921m5295M4747
$$ -912045 -952894 -411442 6381 39449 -111890 -578008 -905844 -894923 -940218 -895471
$$ [...]
##END NTUPLES=NMR SPECTRUM
##END=
