##TITLE=C13_Ser 5-3-i
 CDCl3,  16900 sc

 1.09.2021
##JCAMPDX= 6.0         $$ Bruker NMR JCAMP-DX V2.0
##DATA TYPE= NMR SPECTRUM
##DATA CLASS= NTUPLES
##ORIGIN= UXNMR, Bruker Analytische Messtechnik GmbH
##OWNER= root
$$ XWIN-NMR		Version 3.5
$$ Thu Sep  2 08:32:14 2021 Russian Standard Time (UT+4h)  she@DPX200
##.OBSERVE FREQUENCY= 50.327896
##.OBSERVE NUCLEUS= ^13C
##.ACQUISITION MODE= SIMULTANEOUS
##.ACQUISITION SCHEME= undefined
##.AVERAGES= 16900
##.DIGITISER RES= 17
##SPECTROMETER/DATA SYSTEM= spect
##.PULSE SEQUENCE= zgpg30
##.SOLVENT NAME= DMF
##.SHIFT REFERENCE= (INTERNAL, DMF, 0, 222.683)
##AUDIT TRAIL= $$ (NUMBER, WHEN, WHO, WHERE, WHAT)
$$ ##TITLE= Audit trail, XWIN-NMR		Version 3.5
$$ ##JCAMPDX= 5.01
$$ ##ORIGIN= Bruker BioSpin GmbH
$$ ##OWNER= she
$$ F:/spectra/data/she/nmr/c13/1/pdata/1/auditp.txt
$$ ##AUDIT TRAIL=  $$ (NUMBER, WHEN, WHO, WHERE, WHAT)
(   1,<2021-09-02 08:31:03.03 +0400>,<she>,<DPX200>,
      <created by zg, POWCHK disabled, PULCHK disabled
       terminated by command 'halt'
       configuration hash MD5:
       00 E9 B6 7A A2 85 ED C7 34 08 36 98 17 FE 4E 26
       data hash MD5: 32K
       3A A9 7E 48 B2 A0 30 9E 10 43 2F 06 F8 81 07 D0>)
(   2,<2021-09-02 08:31:05.79 +0400>,<she>,<DPX200>,
      <Start of raw data processing
       efp BC_mod = 2 LB = 1 FT_mod = 6 PKNL = 1 PHC0 = -337.1768 PHC1 = 33.36238 SI = 32K 
       data hash MD5: 32K
       81 3F B5 6A D5 71 83 78 B5 56 D2 41 08 F9 D1 1E>)
(   3,<2021-09-02 08:31:08.51 +0400>,<she>,<DPX200>,
      <abs ABSG = 5 
       data hash MD5: 32K
       61 FF 55 97 30 30 02 94 11 DC F7 0E 9B C0 B3 03>)
(   4,<2021-09-02 08:31:42.60 +0400>,<she>,<DPX200>,
      <pk PHC0 = 0.6650696 PHC1 = 0 
       data hash MD5: 32K
       9C D1 F1 EA D2 89 8E EB EC F7 2F 52 CE FA 14 8C>)
$$ ##END=
$$ 
$$ hash MD5
$$ E5 E7 D5 7B B6 E8 97 29 F7 32 8D 70 B9 17 87 BF
##$RELAX= 
##$RELAX= 
##$RELAX= 
##$RELAX= 
##$RELAX= 
##$RELAX= 
##$RELAX= 
##$RELAX= 
$$ Bruker specific parameters
$$ --------------------------
##$DU= <F:/spectra>
##$EXPNO= 1
##$NAME= <c13>
##$PROCNO= 1
##$TYPE= <nmr>
##$USER= <she>
##$AMP= (0..31)
100 100 100 100 100 100 100 100 100 100 100 100 100 100 100 100 100 100 
100 100 100 100 100 100 100 100 100 100 100 100 100 100 
##$AQSEQ= 0
##$AQ_mod= 1
##$AUNM= <au_zg>
##$AUTOPOS= <>
##$BF1= 50.322709
##$BF2= 200.13
##$BF3= 50.322709
##$BF4= 500.13
##$BF5= 500.13
##$BF6= 500.13
##$BF7= 500.13
##$BF8= 500.13
##$BYTORDA= 1
##$CFDGTYP= 0
##$CFRGTYP= 5
##$CHEMSTR= <none>
##$CNST= (0..31)
1 1 145 1 1 1 1 1 1 1 1 1 1 1 1 1 1 1 1 1 1 1 1 1 1 1 1 1 1 1 1 1 
##$CPDPRG= <waltz16>
##$CPDPRG1= <>
##$CPDPRG2= <waltz16>
##$CPDPRG3= <>
##$CPDPRG4= <mlev>
##$CPDPRG5= <mlev>
##$CPDPRG6= <mlev>
##$CPDPRG7= <mlev>
##$CPDPRG8= <mlev>
##$CPDPRGB= <>
##$CPDPRGT= <>
##$D= (0..31)
0 2 0.00345 0 0 0 0 0 0 0 0 0.03 2e-05 3e-06 0 0 0 0 0 0 0 0 0 0 0 0 0 
0 0 0 0 0 
##$DATE= 1630499409
##$DBL= (0..7)
120 120 120 120 120 120 120 120 
##$DBP= (0..7)
150 150 150 150 150 150 150 150 
##$DBP07= 0
$$ [...]
##$SUBNAM4= <"">
##$SUBNAM5= <"">
##$SUBNAM6= <"">
##$SUBNAM7= <"">
##$SUBNAM8= <"">
##$SUBNAM9= <"">
##$SW= 239.972175391363
##$SWIBOX= (0..15)
0 1 3 0 0 0 0 0 0 0 0 0 0 0 0 0 
##$SW_h= 12077.2946859903
##$TD= 32768
##$TD0= 1
##$TE= 0
##$TE2= 300
##$TE3= 300
##$TEG= 300
##$TL= (0..7)
120 120 120 120 120 120 120 120 
##$TP= (0..7)
150 150 150 150 150 150 150 150 
##$TP07= 0
##$TPNAME0= <>
##$TPNAME1= <>
##$TPNAME2= <>
##$TPNAME3= <>
##$TPNAME4= <>
##$TPNAME5= <>
##$TPNAME6= <>
##$TPNAME7= <>
##$TPOAL= (0..7)
0.5 0.5 0.5 0.5 0.5 0.5 0.5 0.5 
##$TPOFFS= (0..7)
0 0 0 0 0 0 0 0 
##$TUNHIN= 0
##$TUNHOUT= 0
##$TUNXOUT= 0
##$USERA1= <user>
##$USERA2= <user>
##$USERA3= <user>
##$USERA4= <user>
##$USERA5= <user>
##$V9= 5
##$VALIST= <valist>
##$VCLIST= <CCCCCCCCCCCCCCC>
##$VD= 0
##$VDLIST= <DDDDDDDDDDDDDDD>
##$VPLIST= <PPPPPPPPPPPPPPP>
##$VTLIST= <TTTTTTTTTTTTTTT>
##$WBST= 1024
##$WBSW= 4
##$XGAIN= (0..3)
0 0 0 0 
##$XL= 0
##$YL= 0
##$YMAX_a= 90585612
##$YMIN_a= -23841846
##$ZGOPTNS= <>
##$ZL1= 120
##$ZL2= 120
##$ZL3= 120
##$ZL4= 120
##$ABSF1= 222.6826
##$ABSF2= -17.31421
##$ABSG= 5
##$ABSL= 3
##$ALPHA= 0
##$AQORDER= 0
##$ASSFAC= 0
##$ASSFACI= 0
##$ASSFACX= 0
##$ASSWID= 0
##$AUNMP= <proc_1d>
##$AZFE= 0.1
##$AZFW= 0.5
##$BCFW= 0
##$BC_mod= 2
##$BYTORDP= 0
##$COROFFS= 0
##$CY= -3
##$DATMOD= 1
##$DC= 0
##$DFILT= <>
##$DTYPP= 0
##$F1P= 0
##$F2P= 0
##$FCOR= 0.5
##$FTSIZE= 32768
##$FT_mod= 6
##$GAMMA= 0
##$GB= 0
##$INTBC= 1
##$INTSCL= 4.134877e-10
##$ISEN= 128
##$LB= 1
##$LEV0= 0
##$LPBIN= 0
##$MAXI= 10000
##$MC2= 0
##$MEAN= 0
##$ME_mod= 0
##$MI= 0.1934396
##$NCOEF= 0
##$NC_proc= 2
##$NLEV= 6
##$NOISF1= 120.0001
##$NOISF2= 80.00006
##$NSP= 0
##$NTH_PI= 0
##$NZP= 0
##$OFFSET= 222.6826
##$PC= 1.4
##$PHC0= -336.5117
##$PHC1= 33.36238
##$PH_mod= 1
##$PKNL= yes
##$PPARMOD= 0
##$PSCAL= 0
##$PSIGN= 0
##$REVERSE= no
##$SF= 50.3227286521846
##$SI= 32768
##$SIGF1= 140
##$SIGF2= 120
##$SINO= 11.81781
##$SIOLD= 32768
##$SREGLST= <13C.CDCl3>
##$SSB= 0
##$STSI= 32768
##$STSR= 0
##$SW_p= 12077.2946859903
##$SYMM= 0
##$S_DEV= 0
##$TDeff= 32768
##$TDoff= 0
##$TI= <>
##$TILT= no
##$TM1= 0
##$TM2= 0
##$TOPLEV= 0
##$USERP1= <user>
##$USERP2= <user>
##$USERP3= <user>
##$USERP4= <user>
##$USERP5= <user>
##$WDW= 1
##$XDIM= 32768
##$YMAX_p= 344951946
##$YMIN_p= -2351634
$$ End of Bruker specific parameters
$$ ---------------------------------
##NTUPLES= NMR SPECTRUM
##VAR_NAME=  FREQUENCY,     SPECTRUM/REAL,   SPECTRUM/IMAG
##SYMBOL=    X,             R,               I
##VAR_TYPE=  INDEPENDENT,   DEPENDENT,       DEPENDENT
##VAR_FORM=  AFFN,          ASDF,            ASDF
##VAR_DIM=   32768,         32768,           32768
##UNITS=     HZ,            ARBITRARY UNITS, ARBITRARY UNITS
##FACTOR=    0.368581032318806, 1,           1
##FIRST=     11205.996152421, 0,             0
##LAST=      -871.298533569341, 0,           0
##MIN=       -871.298533569341, -2351634,    0
##MAX=       11205.996152421, 344951946,     0
$$ Real data points
##PAGE= N=1
##DATA TABLE= (X++(R..R)), XYDATA
$$ [...]
15678h99703j90798J22040K11581q5291M2506J25119K88803J76966J06117K6915
15668g5745J26903k76502l38833J36115q922l50510p4932K80925q9590j11540
15658g82631O5671J45862L39440K75166j85226l15543k16045M6176J29397K77858
15648b19875O07426J33032o09019k72650J99775R2061Q1802O03405K49269l10635
15638E54591k62427k25562j55820j66344j8083K36552k4833l50359J06491M39274
15628A33480J80065O6750j99969j93777M713N9349L6491j16807k56344J04411
15618a81638N44907q8447n57302j96567K3087R5283n3588q9355J5385l97066n51201
15607a436502J18561M31065L15877j40674l48322J20052K52293L4752L3796q9341
$$ plain form
15678 -899703 -1090501 -968461 -756880 -842171 -799665 -674546 -385743 -208777 -102660 -75745
15668 -75745 51158 -225344 -564177 -428062 -436984 -787494 -862426 -581501 -671091 -782631
15658 -782631 -716960 -571098 -231658 43508 -141718 -457261 -673306 -627130 -497733 -219875
15648 -219875 387551 520583 -88436 -361086 -161311 -69250 12552 615957 865226 554591
15638 554591 292164 66602 -89218 -255562 -273645 -37093 -61926 -412285 -305794 133480
15628 133480 313545 380295 180326 -13451 -8738 50611 87102 -29705 -286049 -181638
15618 -181638 363269 274822 -282480 -479047 -455960 -360677 -414265 -503620 -488235 -885301 -1436502
15607 -1436502 -1317941 -886876 -570999 -711673 -1059995 -939943 -687650 -652898 -619102 -708443
15597g08443m67430j74542J83968J64861K37752l2537q5424K34855k18220j18021
15587i83181n3615o1612L44874J00658k32731K9505L9135k00304j48530K72944
15577h92857N98157M33224r4521k48455M9694j53317o2250J07742J77733M39971
15567C55121P7072m80637k76727j7574J46600M39546L1788n21459m30940K77231
15557c99979L51872J14953J55634m9190J4889j87157l81679J34390L13558j82686
15547a15395k45306J54042K18966R7190j34003k95807k87787j39701j05819p580
15537h61200J24721O50242N90393O9959K80883Q8561l86682m00887k76654o2662
15527a83326j14043p063j65382k65787J09837M54533K80776L10145Q492l34826
$$ plain form
15597 -708443 -1175873 -1350415 -1166447 -1001586 -763834 -796371 -881795 -646940 -865160 -983181
15587 -983181 -1036796 -1098408 -753534 -652876 -885607 -856102 -816967 -1017271 -1165801 -892857
15577 -892857 -294700 138524 44003 -204452 -154758 -308075 -370325 -262583 -84850 355121
15567 355121 432193 -48444 -325171 -342745 -196145 243401 275189 -246270 -677210 -399979
15557 -399979 -48107 66846 222480 173290 188179 1022 -380657 -246267 67291 -115395
15547 -115395 -360701 -206659 12307 109497 -24506 -320313 -608100 -747801 -853620 -861200
15537 -861200 -736479 -86237 504156 574115 854998 943559 556877 155990 -120664 -183326
15527 -183326 -297369 -304432 -469814 -735601 -625764 -171231 109545 419690 428182 93356
15517I3356k96866k36179L9496J83409J2795N5925J68018o9392k09983j02070
15507c61491k5836n9242l8928J63273K96131L11595J19417j44036n12655l81845
15497f33617L09002J50711l54054p7193J91294k68234k23193J6329J59647L9295
15487f90013J09532N35586N03763j74626k6020j0354l45739k48843p1758q0703
15477d99175k14985J10105J90803n2495j93274j0804J93580R2327m7140j56337
15467e87395q2978l333J05637J98384L6986M14992M29968J39742J11603m55987
15457C07619k58799n9951l54780j33024L23276M88147l2947l16436N5561J69431
15447A88097k3747k41243k9322R6493n1977M7468j71482j09239j07647L3657K23729
$$ plain form
15517 93356 -203510 -439689 -400193 -216784 -203989 -148064 19954 -49438 -259421 -361491
15507 -361491 -387327 -446569 -485497 -322224 -26093 285502 404919 260883 -251772 -633617
15497 -633617 -324615 -173904 -527958 -605151 -413857 -682091 -905284 -888955 -729308 -690013
15487 -690013 -580481 -44895 458868 284242 258222 247868 -97871 -346714 -418472 -499175
15477 -499175 -714160 -604055 -413252 -465747 -659021 -669825 -476245 -383918 -431058 -587395
15467 -587395 -670373 -673706 -568069 -369685 -332699 82293 512261 652003 763606 307619
15457 307619 48820 -11131 -365911 -498935 -175659 312488 279541 -36895 18666 188097
15447 188097 164350 -76893 -106215 -9722 -61699 -14231 -185713 -294952 -402599 -368942 -145213
15436a45213J58072R9093K31347L28659j23496k16347j35523Q3187J40303K40822
15426F60904k40189l63824m34056k63562K58426L89306M24451M0462r4092K15934
15416E93760K5818k61501j96496k15453l69062k61900J70203M00176J63725k7897
15406B1373l42109j51164J41844J50307L7432l3493r1132k0330p228Q184J0627
15395b75689k21367l71503n18372j2200P36054J033872M55952j76339n72621m06806
15385c29019j58051J96034L52418j46715K1106J52353j76289l29629N3268L79275
15375A4751J46644k0357N5982L62879r1052l41006n2948l99939m99869j29362
15365i54277K11993j2607l57737l67584N0174L83870j914j1470L54891L11534
$$ plain form
15436 -145213 12859 111952 343299 671958 548462 332115 196592 279779 420082 660904
15426 660904 420715 56891 -377165 -640727 -382301 7005 431456 471918 377826 593760
15416 593760 619578 358077 161581 -53872 -422934 -684834 -514631 -114455 49270 21373
15406 21373 -320736 -471900 -330056 -179749 -142317 -175810 -266942 -287272 -294500 -286316 -275689
15395 -275689 -497056 -868559 -1386931 -1399131 -663077 370795 826747 650408 77787 -329019
15385 -329019 -487070 -291036 61382 -85333 -64227 88126 -88163 -417792 -364524 14751
15375 14751 161395 141038 197020 559899 468847 127841 74893 -325046 -824915 -954277
15365 -954277 -742284 -754891 -1112628 -1480212 -1430038 -1046168 -1048082 -1059552 -704661 -393127
15355c93127J41564L39027P0607k73612J05897N04522J11685j02517j52916m49134
15345i8004o95733o33387J57836O39690L04033j17014O5227J14959P7779J09216
15335g5398j19058o6413K20891K27898K35349J16414j20763m79791j21285P4625
15325a07531n9553K6024q5828J09428K16668j26946k05949J89887K88392m9818
15315A94774l58401m38687j81919K43856o1894j10733K61419M40580L31752K68937
15305E89684K0655l02530o8420l1685J02375p4903k34063m19290m69724p2274
15295i60175o0956L3235K48997M12530O0596o4853k48444k78253R323K78048K2484
15284e47468M8376n9156K8242L03861j99337l01442j49241o0786k65230J09734
$$ plain form
15355 -393127 -251563 87464 158071 -115541 -9644 494878 606563 504046 351130 -98004
15345 -98004 -793737 -1427124 -1269288 -629598 -325565 -442579 -377352 -262393 -184614 -75398
15335 -75398 -194456 -260869 -39978 187920 423269 539683 418920 -60871 -182156 -107531
15325 -107531 -167084 -141060 -226888 -117460 99208 -27738 -233687 -43800 244592 194774
15315 194774 -163627 -602314 -784233 -540377 -602271 -713004 -451585 -11005 320747 589684
15305 589684 610339 307809 239389 207704 310079 235176 1113 -418177 -887901 -960175
15295 -960175 -1021131 -987896 -738899 -326369 -265773 -330626 -579070 -857323 -848000 -569952 -547468
15284 -547468 -499092 -558248 -530006 -226145 -425482 -726924 -876165 -936951 -1202181 -1092447
15274a092447O37500M52974K46883k07502l93556j98821j84402j94456n3372p2085
15264a059284n6574r202o0635q8597m59975j65334K26919N78341M24284R1393
15254e78664q4673K3169M27317J62132j16603k13062r5325K45293K97952M6970
15244A14506p5116j02880P6117M2801P9399L32903j07463k96156p2783k58392
15234b67064l80725j08998J20767m8516p2685j6026J55191L80005K33439K34015
15224B29403k04510k43976J76490m4771j44624k51655j46628k21483k02903L86883
15214f67774K71843K40722J15417p4266j83681j21488j00078K97376K99034q500
15204F8605P9187R331j79109j68582K2484J95287p9968k21283l03966j62856m554
$$ plain form
15274 -1092447 -454947 -1973 244910 37408 -356148 -554969 -739371 -933827 -987199 -1059284
15264 -1059284 -1115858 -1125060 -1185695 -1274292 -1734267 -1899601 -1672682 -1094341 -670057 -578664
15254 -578664 -663337 -640168 -212851 -50719 -167322 -380384 -475709 -230416 67536 114506
15244 114506 39390 -63490 12627 55428 134827 467730 360267 64111 -8672 -267064
15234 -267064 -647789 -756787 -636020 -684536 -757221 -773247 -618056 -238051 -4612 229403
15224 229403 24893 -219083 -42593 -87364 -231988 -483643 -630271 -851754 -1054657 -667774
15214 -667774 -395931 -155209 -39792 -114058 -297739 -419227 -519305 -221929 77105 68605
15204 68605 147792 157123 -21986 -190568 -168084 27203 -52765 -274048 -578014 -740870 -745424
15193g45424o6456j8535Q3390J97631K60956K11677K62728K64546M2470j17625
15183C75358k37612j58864p4613J49563J05297r9526J75573L374k00015j38298
15173i9763k64912J65365J5210k0030j32618k56825M0126K73323j32303j45937
15163e58364J42482K56189M20438O9758m84779l07941k50345R5083J01144L9842
15153d76493K5578k7768K28612Q7819J33526J71344R3077k81391j32400m44764
15143f22860n63633N7499O16644M47009j23984l01908j49885K17445m8622l37613
15133h09908m85929n6308M15952L73321K50876K16214J09861J61870J99994m4085
15123C31858J06283L49065j8672j92014r4470n02714l65786J08910j03708m63939
$$ plain form
15193 -745424 -811880 -830415 -747025 -549394 -288438 -76761 185967 450513 492983 375358
15183 375358 137746 -21118 -95731 53832 159129 59603 235176 238550 38535 -99763
15173 -99763 -364675 -199310 -184100 -204130 -336748 -593573 -553447 -280124 -412427 -558364
15163 -558364 -415882 -159693 260745 330503 -154276 -462217 -712562 -617479 -516335 -476493
15153 -476493 -450915 -478683 -250071 -162252 -28726 142618 235695 -45696 -178096 -622860
15143 -622860 -1186493 -1128994 -512350 -65341 -189325 -491233 -641118 -423673 -472295 -809908
15133 -809908 -1295837 -1352145 -936193 -562872 -311996 -95782 14079 175949 375943 331858
15123 331858 438141 787206 768534 576520 482050 -20664 -386450 -277540 -381248 -845187
15113h45187k04956J73267N14208N33681j52373o14074l50489J96653M66492K43228
15103c9550l42327o45080k49272K4195J79264J42139n05365l89504J58022K81780
15093a385698K99012J46335L21884K79281J37497J15834K27627L57446j8006m33782
15083D7430j90525L9112K21766K27833J96139K58200J46509m06889m56224n599
15073G7752n979j83811k39907K22355r5169j83229L60913K53278j48223k82838
15063b24858j31013K56303L07469m6625j70288R4900j71437L646N32661M45872
15053H96630P7461m54383l90566j29850k4406L6503K09667K45705O7129J47234
15043F81124P7612o07037k95945K34701J92415k4574k41279j81801l59619l06302
$$ plain form
15113 -845187 -1050143 -876876 -362668 171013 18640 -595434 -945923 -749270 -282778 -39550
15103 -39550 -381877 -1026957 -1276229 -1252034 -1072770 -930631 -1435996 -1825500 -1667478 -1385698
15093 -1385698 -1086686 -940351 -618467 -339186 -201689 -85855 141772 499218 481212 47430
15083 47430 -143095 -103983 117783 345616 541755 799955 946464 539575 83351 77752
15073 77752 71773 -112038 -351945 -129590 -224759 -407988 -47075 206203 57980 -224858
15063 -224858 -355871 -99568 207901 161276 -9012 85888 -85549 -81903 450758 896630
15053 896630 974091 519708 129142 -708 -25114 11389 221056 466761 533890 681124
15043 681124 758736 151699 -144246 90455 282870 258296 17017 -164784 -524403 -830705
15033h30705k03922K19485L4992k65602l32296j65449L7412J60851K19330L21819
15023h04085L63160j23711l98414M39039Q85594M16129k1071J2195k899N7658
15013H23595J6551l82958o51460l50051l11190l70941Q1278J49703j8800J96483
15003h17790L09430k5306k13717j06434K5147J79508K09742J63373j5179o7146
14993c58372J44595J98046K22702J23257j95491j04168j07359l95414j15637M4271
14983e43570J63995R6642K5523J39469L00322J28424J67735K04646Q6534p1031
14973F98689j11165k41559l40943m0843J84972K03422k17054m83096l26897n0686
14963g25160J37337k1458L4038J62055M8014M6516n08864m10122J21055N8839
$$ plain form
15033 -830705 -1034627 -815142 -780150 -1045752 -1378048 -1543497 -1506085 -1345234 -1125904 -804085
15023 -804085 -440925 -564636 -963050 -524011 361583 777712 756641 768836 765937 823595
15013 823595 840146 457188 -194272 -544323 -855513 -1226454 -1145176 -995473 -1014273 -817790
15003 -817790 -508360 -533666 -747383 -853817 -828670 -649162 -439420 -276047 -291226 -358372
14993 -358372 -213777 -15731 206971 330228 134737 30569 -76790 -472204 -587841 -543570
14983 -543570 -379575 -282933 -257410 -117941 182381 310805 478540 683186 769720 698689
14973 698689 587524 345965 5022 -35821 149151 352573 135519 -347577 -674474 -725160
14963 -725160 -587823 -609281 -575243 -413188 -365174 -318658 -827522 -1237644 -1116589 -1057750
14953a057750R4805K93101M71445M31553J88807P4026O0813k13019o25778l67889
14943f49886k5028j1990l6949j36440j48954Q0117K62453M53139L5189k62208
14933d40557k02339l7384J61530O1566Q321J15867j12648k12974j0088Q1029n9485
14922f47162j65751L09335L16199p7920q3585J19756r1303j30644j6602j79893
14912f47570K44321O73606K80810J12413j42683k74034j22677O5752o5305l59905
14902b35272k0483K21404M04871P7646j59991j21175k48931o2090N1603K07647
14892A15229M49968L40671k09924k83187j1231l77581n83806L1947K56258M1915
14882b29741j68697r7485m1554O3569J00384R5081R4676j08544k04313K039J80839
$$ plain form
14953 -1057750 -962945 -669844 -198399 233154 421961 495987 556800 343781 -281997 -649886
14943 -649886 -674914 -686904 -723853 -860293 -1009247 -929130 -666677 -213538 -178349 -440557
14933 -440557 -642896 -680280 -518750 -457184 -448863 -332996 -445644 -658618 -668706 -587677 -647162
14922 -647162 -812913 -503578 -187379 -265299 -348884 -229128 -320431 -451075 -467677 -647570
14912 -647570 -403249 270357 551167 663580 520897 246863 124186 189938 124633 -235272
14902 -235272 -255755 -34351 370520 448166 288175 167000 -81931 -144021 -92418 115229
14892 115229 565197 905868 695944 412757 401526 23945 -559861 -527914 -271656 -229741
14882 -229741 -398438 -495923 -537477 -473908 -373524 -278443 -183767 -292311 -496624 -494585 -313746
14871c13746J08415j55956j08984k19019M1853K88848J06218Q733L38768L09921
14861D05051j44796j60921K1823K8461L50811J58357J12735L61105L8498j91655
14851I79469l54276n60068l95926J13234J82159J4923R1807L7263k43127k66943
14841d01485K55155J89566o8131j95458l329R8374J18946J15266k06932q6902
14831a84930o1668J91196R1602k76236m06810j55386j79579l30764J33414N35111
14821f44050L50808M27422N34847L77407R2520o6580J3782q7097j19004k6265
14811H53790l53571q35886m63067o075J15882N3541K17547K89878j9734j52333
14801c00028j04818J76804L8159Q2924K92975N3041l2384N8394J40898n746J2406
$$ plain form
14871 -313746 -205331 -361287 -470271 -689290 -647437 -358589 -252371 -243638 95130 405051
14861 405051 260255 99334 121157 149618 500429 658786 771521 1132626 1171124 979469
14851 979469 625193 65125 -330801 -217567 -35408 -20485 71322 108585 -134542 -401485
14841 -401485 -146330 43236 -24895 -220353 -223682 -125308 -6362 108904 -98028 -184930
14831 -184930 -246598 -55402 36200 -240036 -646846 -802232 -981811 -1312575 -1179161 -644050
14821 -644050 -293242 134180 669027 1046434 1138954 1072374 1086156 999059 880055 853790
14811 853790 500219 -335667 -798734 -804809 -688927 -635386 -417839 -127961 -147695 -300028
14801 -300028 -404846 -228042 -189883 -106959 186016 239057 206673 265067 405965 400219 412625
14790D12625m57809m49512n09918P7799P0503J03825q590J4245J43525J96905
14780d06402M81316l5800q6444J99752K13417j71212j63153j14432l16089p5155
14770d74202l1949K52459M06395j0350l63118L4764M54313K36992k09571m91221
14760a95488l79953J11605K20169k35077K131O9880L4454P4551K32483K7095l41238
14749c79388k59219j79537k72287N2114K46739J9103o8774J51100K87109O2185
14739c40855j86784p9917J08732J87955l0036K98705M10768J67841j54051N782
14729C88140L2456m67151p57098k2690O57455J84971j74685O9074J66109K66123
14719C42704L10691P4120m89915n95061l40595j39981K31731M71552K17844J22552
$$ plain form
14790 412625 -45184 -494696 -1004614 -926815 -856312 -752487 -761077 -746832 -603307 -406402
14780 -406402 74914 39114 -47330 152422 365839 194627 31474 -82958 -399047 -474202
14770 -474202 -506151 -253692 152703 142353 -220765 -186001 268312 505304 295733 -195488
14760 -195488 -575441 -463836 -243667 -478744 -476613 -406733 -372279 -297728 -65245 -38150 -379388
14749 -379388 -638607 -818144 -1090431 -1038317 -791578 -772475 -841249 -690149 -403040 -340855
14739 -340855 -527639 -607556 -498824 -310869 -340905 -42200 368568 536409 382358 388140
14729 388140 420596 -46555 -803653 -826343 -168888 16083 -158602 -89528 76581 342704
14719 342704 653395 727515 237600 -357461 -698056 -838037 -606306 -134754 83090 205642
14709B05642J98428j72906j81043m2787J4669o1234j69203Q1917J62200p7107
14699d1424J34352K84907J92060k16188k38314P8356o2045P6919m516j10870l24329
14688b31092k99953r9008L8073K35077J44686o7925Q7552L89916K90997n1000
14678D37323j24343k94296o3713K46065j50035k69593l29302l44780k6734L3623
14668h85785J00471M0608m5974j50242k16722N2712L69107L49099N00593M52023
14658E65890q8830n29023m58358l46664k29484L09387L64833L64402R4447o4231
14648a7631J82191l9120n0178J91422J50489k25851k23839j58353j02832Q8989
14638b04713k85775m6570L63153M85315K00883n07476p55403p2078K10234P8831
$$ plain form
14709 205642 404070 231164 50121 7334 22003 -39231 -208434 -126517 35683 -41424
14699 -41424 92928 377835 569895 353707 115393 193749 131704 208623 204107 93237 -231092
14688 -231092 -531045 -630053 -591980 -356903 -212217 -280142 -192590 197326 488323 437323
14678 437323 312980 18684 -45029 201036 51001 -218592 -547894 -892674 -919408 -885785
14668 -885785 -785314 -744706 -790680 -940922 -1157644 -1104932 -735825 -386726 113867 565890
14658 565890 477060 -51963 -510321 -856985 -1086469 -777082 -412249 -47847 46600 -17631
14648 -17631 164560 125440 75262 266684 417173 191322 -32517 -190870 -293702 -204713
14638 -204713 -490488 -537058 -173905 311410 512293 4817 -750586 -822664 -612430 -533599
14628e33599J65217K25600R6238L2634J51311J74252J51608r6802J05817Q4331
14618E56607o7473J34023K99830k97482n18262L9328J33694l2232k74158m58698
14608d84823k55309k7599K50795L55352K95420j20493o7249q3872m76642Q0286
14598e34134M52434j08445k58926L9101J77512Q9125N5719M85212j05731l48917
14588e7050k3357o083K13747j29155l58870j72584O4099N50259N42252J20613
14578G43871k5280k45221o47384J33548P42030M1797n41931k02094K18454k60372
14568d2582j43981Q5985n3264k08278m3369k08753j7302J20051m0056j5125R128
14557e57546j19076M10000M67340L5997k89293j45772L17318j46371o731k58902
$$ plain form
14628 -533599 -368382 -142782 -46544 -13910 137401 311653 463261 366459 472276 556607
14618 556607 489134 623157 922987 625505 107243 146571 280265 248033 -26125 -484823
14608 -484823 -740132 -767731 -516936 -161584 133836 13343 -53906 -137778 -614420 -534134
14598 -534134 -81700 -190145 -449071 -409970 -232458 -143333 -87614 397598 291867 -57050
14588 -57050 -80407 -86490 127257 -1898 -360768 -533352 -469253 81006 623258 743871
14578 743871 718591 473370 -174014 -40466 701564 743361 201430 -664 217790 -42582
14568 -42582 -186563 -100578 -153842 -362120 -405489 -614242 -631544 -511493 -551549 -566674 -557546
14557 -557546 -676622 -266622 200718 236715 -52578 -198350 118968 -27403 -34134 -293036
14547b93036k54337j0765J60691J66737j93633j61671J62367m2793n19929j27429
14537a113798N05231K58675M6468O83745M59725r2437K62006K23209k73934m93146
14527D65744n34288k96195m75882O3644N45355P2886L13501M67509K27128j6160
14517H33242k45954l20810m20826l12748j94958J2113L67126K91475q8256j41652
14507b21248L4700p833o4431l3225J08771M4338j79269j40373K5962o4257q6933
14496e83798l61562P281J71577l32777n40546j97168M51609N73721P9472K25446
14486e06745L54267N9916P6501k31257k92531o3751q4369j58887J96118K76374
14476c74364P7594N4140l8320q8642R1817N2933k81730K4616l3788k16723l2774
$$ plain form
14547 -293036 -547373 -558138 -397447 -230710 -424343 -586014 -423647 -466440 -986369 -1113798
14537 -1113798 -608567 -349892 -303424 380321 840046 747609 1009615 1232824 958890 465744
14527 465744 -68544 -364739 -840621 -776977 -231622 -158736 154765 622274 849402 833242
14517 833242 587288 266478 -154348 -467096 -662054 -649941 -282815 8660 -79596 -221248
14507 -221248 -186548 -194381 -258812 -292037 -183266 -138928 -318197 -458570 -432608 -496865 -583798
14496 -583798 -945360 -938079 -766502 -1099279 -1639825 -1836993 -1385384 -811663 -732191 -506745
14486 -506745 -152478 -92562 -16061 -247318 -539849 -603600 -687969 -846856 -650738 -374364
14476 -374364 -296770 -242630 -280950 -369592 -277775 -224842 -506572 -481956 -515744 -732467 -765241
14465g65241j55762k86421j73970o3129j21696J82134L96594M06056O4153n3668
14455e70950K43655L3245l24134k66909k03892K44364M36504j32002m76446k63190
14445a279755L90139N76929L50831M4440k25337n443K51830K71597J34070j29527
14435C79774J38655K60238J80325q9248j82544k37474m80358l15572j77792q9158
14425f13154N53958N49233p0633j49512Q0628J08415p1029l53590j11526R0632
14415A3422J4924J27907K33872j78403q3541J67666M8137j51484j85474n0933
14405d3907m3448p812l02644l98432m0787Q2353K0131L52889J22150j43926J31809
14394b71624N06662K9787j27977L35941R4761l19360l54683Q8171l43440j93370
$$ plain form
14465 -765241 -921003 -1207424 -1381394 -1444523 -1566219 -1384085 -987491 -581435 -517282 -570950
14455 -570950 -327295 -294050 -618184 -885093 -1088985 -844621 -408117 -540119 -1016565 -1279755
14445 -1279755 -889616 -312687 38144 82584 -142753 -148196 103634 375231 509301 379774
14435 379774 518429 778667 958992 869744 687200 449726 -30632 -346204 -523996 -613154
14425 -613154 -59196 490037 419404 269892 350520 458935 387906 34316 -77210 13422
14415 13422 28346 156253 390125 211722 128181 295847 343984 192500 7026 -43907
14405 -43907 -87355 -95167 -397811 -796243 -837030 -754677 -734546 -381657 -259507 -403433 -271624
14394 -271624 235038 264825 136848 472789 567550 248190 -106493 -18322 -361762 -555132
14384e55132L37471P3239j59333r6633O2126J94770K76783J32763k45526k27973
14374b07445j11698K25749L77514J81153L1612j1267n8202O6581L6250k61990
14364B68257m72157k65549K99388M37997J69733l0408j11665o06788j04927K33054
14354a83065l02411m95942k80457J06892N77755N44608L72208j17440j60816o4373
14344c041k19932j44139k24532n18878j74821n9044K21215M0774Q5104K31885
14334g65409K45391N22246L22722k18117j64694L39684k8285l39176l12147q7812
14324d85597K21080J40254l27984m8678R0392k75265k75627P0197J33657M326
14314g53245K56385J10824r9808j06547n0061p5421L79763L1403n30486j90435
$$ plain form
14384 -555132 -217661 -144422 -303755 -400388 -338262 -143492 133291 266054 20528 -207445
14374 -207445 -319143 -93394 284120 465273 496885 485618 427416 493997 530247 268257
14364 268257 -203900 -469449 -170061 267936 437669 407261 295596 -311192 -416119 -183065
14354 -183065 -485476 -981418 -1261875 -1154983 -577228 -32620 339588 222148 61332 -3041
14344 -3041 -222973 -367112 -591644 -1110522 -1285343 -1344387 -1123172 -1082398 -997294 -765409
14334 -765409 -520018 2228 324950 106833 -57861 281823 253538 -85638 -397785 -485597
14324 -485597 -264517 -124263 -452247 -500925 -410533 -685798 -961425 -891228 -757571 -753245
14314 -753245 -496860 -386036 -485844 -592391 -642452 -717873 -338110 -306707 -837193 -1027628
14304a027628o9921j07577l45835m3762N08232M19394j58005o0733K51479N99818
14294c4538M41001n3001J58029K89745k2367j77492j03632j18553m62604k21647
14284c05059J11888k97085m19194L19556N25837M90981K21599n0422O617N0650
14274F55368j9614j97208n29744R619K24850q1864o8182J39622L04168J15772
14264E52787k05823j86869k25125P969M91746K55492k74545n55006l06834J52472
14254b93736l13206q38098l96777j5411J58657K30123O42156N72571K21665j91165
14244b23221j61876K05055J88974R9049j91107p7595N01877M06330l88748n01724
14234a42986k59979j86783R9208J28527R2625j07338k41921n3078R2713Q1266
$$ plain form
14304 -1027628 -1097549 -1205126 -1550961 -1594723 -1086491 -667097 -825102 -885835 -634356 -34538
14294 -34538 406463 353462 511491 801236 778869 601377 497745 379192 -83412 -305059
14284 -305059 -193171 -490256 -909450 -589894 -64057 426924 648523 598101 604718 655368
14274 655368 635754 438546 -91198 -81579 143271 61407 -6775 132847 437015 552787
14264 552787 346964 160095 -65030 -57061 434685 690177 415632 -139374 -446208 -293736
14254 -293736 -606942 -1445040 -1841817 -1857228 -1698571 -1468448 -826292 -253721 -32056 -223221
14244 -223221 -385097 -180042 8932 107981 -83126 -160721 341156 747486 358738 -142986
14234 -142986 -402965 -589748 -490540 -362013 -269388 -376726 -618647 -671725 -579012 -497746
14224d97746J4572J02476O4814k81405k02861K94274J04793J10683M40925J7682
14214A68207l50630n24144k69175j54819j61336m3964J96195N76934K76950j38318
14204d24100j58676l60354j87758K41863M5251J54729r8651j65753j85867l25819
14194a465135L73422P44128L59325K00563j81584n27686l62612j57169M05633
14185f11115K98920p7028j37507l32784j55285J58190l1195J96702M06253k58484
14175e43333m57429R3960M57397M68269K8709j97044j10625k51217k43583k8934
14165g83830K29317K13756k37360q2073j3156j08100o0003R7965N66749L98950
14155B22215l10190m47692k33823J2822K28752K73467J35248j8576J06415K49151
$$ plain form
14224 -497746 -483174 -380698 -315884 -597289 -800150 -505876 -401083 -290400 150525 168207
14214 168207 -182423 -706567 -975742 -1130561 -1291897 -1335861 -1139666 -562732 -285782 -424100
14204 -424100 -582776 -943130 -1130888 -889025 -843774 -689045 -787696 -953449 -1139316 -1465135
14194 -1465135 -1091713 -347585 11740 212303 30719 -496967 -859579 -1016748 -611115
14185 -611115 -312195 -389223 -526730 -859514 -1014799 -856609 -887804 -691102 -284849 -543333
14175 -543333 -1000762 -906802 -449405 18864 47573 -149471 -260096 -511313 -754896 -783830
14165 -783830 -554513 -340757 -578117 -660190 -673346 -781446 -841449 -743484 -176735 222215
14155 222215 -87975 -535667 -769490 -756668 -527916 -254449 -119201 -137777 -31362 217789
14145B17789K42187K5355m93033n96340R8522J77351p5806n5913J55224K24297
14135h0367R7622j28709K2524J89231m8169l74556o9617J13892r2454j63798m1898
14124e76299r0759n2499K57756L97342R8002k58196o8618L3585K03074j44132
14114b00744l01433m16591n68819l8134O40300N40499K02153j26342l47253k884
14104f19248M47298J29612j21812J39345M89146L91549N4346k59768k60702m64981
14094g5215j11020J02376q383L30281N75312o6487p58283o52704o076j49020p8773
14083h97992K38858j90323k04830K79811L22831J69009J14802J98213J63333L7350
14073B31062j44510j4098K08994q230k32019m6934p3713K49169N59459K6185l81234
$$ plain form
14145 217789 459976 485331 -7702 -604042 -505520 -328169 -403975 -459888 -304664 -80367
14135 -80367 17255 -111454 -88930 100301 52132 -322424 -392041 -278149 -370603 -534401 -576299
14124 -576299 -667058 -719557 -461801 -64459 33543 -224653 -293271 -259686 -56612 -200744
14114 -200744 -502177 -918768 -1487587 -1525721 -885421 -344922 -142769 -269111 -616364 -619248
14104 -619248 -171950 -42338 -164150 -24805 464341 855890 910236 650468 389766 -75215
14094 -75215 -186235 -83859 -92242 238039 813351 746864 -11419 -664123 -670199 -819219 -897992
14083 -897992 -659134 -849457 -1054287 -774476 -451645 -282636 -167834 30379 193712 231062
14073 231062 86552 72454 281448 273218 41199 -5735 -79448 169721 729180 755365 374131
14062C74131l10655n4222J97369K34835P3131k82952l03125R6798L26943J05451
14052D57704k96113o83301m16473K54257K45781M728l07667L13840M79759J36081
14042A88596l40875j41609K66651L12095j6811K0744J26021j14176p4980j98791
14032B6865l90531o96139m20766K93785J66338J5713k3608M6024J49565P8013
14022g54741P285j5816l49832k12915k7711Q7640J72223K60302n697O1103K15710
14011e62449L09644P4508k95697k89381p4491K87287N07777K82775p3439k82786
14001a16252r492J25809j5853J30589M6954j08931k27314j2185r1502j68345R9027
13990c47495K49546J668k9425j54310k64894l39566j45990j52460k87717J74245
$$ plain form
14062 374131 63476 9254 206623 441458 514589 231637 -71488 25310 352253 457704
14052 457704 161591 -521710 -938183 -683926 -438145 -433417 -741084 -427244 52515 188596
14042 188596 -152279 -293888 -27237 284858 268047 288791 414812 300636 225656 26865
14032 26865 -363666 -1059805 -1480571 -1186786 -1020448 -1004735 -1028343 -982319 -832754 -754741
14022 -754741 -747456 -763272 -1113104 -1326019 -1353730 -1266090 -1093867 -833565 -839262 -778159 -562449
14011 -562449 -252805 -178297 -473994 -763375 -837866 -550579 -42802 239973 166534 -116252
14001 -116252 -125744 65 -15788 114801 161755 52824 -174490 -186675 -278177 -446522 -347495
13990 -347495 -97949 -96281 -125706 -280016 -544910 -884476 -1030466 -1182926 -1470643 -1296398
13980a296398L49318J26375J28012J56534K08728J94739m6307r5060P5006J38889
13970f0164j21451j82931J9745J50770R9395r2815J02439J83005P0706j30236
13960C8463j70370m58303m60978j991L10290N36767K44921J91900P0002R0767
13950C91468L3968m14670j15143Q2429l41170n49891k33682k01454k13728J00813
13940a461060K15435L69158L49151J68089k07183l7367j7665k84781j74581J79515
13930i01289K74306L15565J35714O5106j84055l12397N2558K05282J11160j29154
13920c67204l84911j76906J10495K14617K3160j22925J36217K36481j45012l92799
13910h68787L5972K42078k64392l86867K39003J79181j73635k50189J93189M95474
$$ plain form
13980 -1296398 -947080 -820705 -692693 -536159 -327431 -132692 -178999 -274059 -199053 -60164
13970 -60164 -181615 -364546 -344801 -194031 -94636 -187451 -85012 97993 168699 38463
13960 38463 -131907 -590210 -1051188 -1053179 -742889 -206122 38799 230699 300701 391468
13950 391468 425436 10766 -104377 -21948 -363118 -913009 -1146691 -1348145 -1561873 -1461060
13940 -1461060 -1245625 -876467 -527316 -359227 -566410 -603777 -621442 -906223 -1080804 -901289
13930 -901289 -626983 -311418 -175704 -110598 -294653 -607050 -554492 -349210 -238050 -367204
13920 -367204 -752115 -929021 -818526 -603909 -580749 -703674 -567457 -330976 -475988 -868787
13910 -868787 -832815 -590737 -855129 -1241996 -1002993 -823812 -997447 -1247636 -1054447 -558973
13900e58973j2948m35909l80015J23103L75634R1059M4542K28135L32812O8084
13890a24476j30500J6424J48916L7477K8396K69325J01719o44626p13808l10010
13880a321163j70912J30969K56620K22993J15190J09733M41905K61588j69920
13871a22997j9918J30761j6587M4783p0911l64340l81081k44943j03103R8270
13861a050066L47595L17522L15481J61353J52409K77740P365l70303j0816J01463
13851B49743l65630m62892k57373J64831m1990k92034L8271K1860K17979N34797
13841a92438N96728K83436k39216l79043j46522k25680k88196j97146j77672Q3023
13831h82726J85569K86569M97274J34668k11606l80124k61530J02279j1390l30023
$$ plain form
13900 -558973 -571921 -1007830 -1387845 -1264742 -889108 -798049 -753507 -525372 -192560 -124476
13890 -124476 -254976 -238552 -89636 -52159 -23763 245562 347281 -297345 -1011153 -1321163
13880 -1321163 -1492075 -1361106 -1104486 -881493 -766303 -656570 -214665 46923 -122997
13871 -122997 -142915 -12154 -28741 16042 -54869 -419209 -800290 -1045233 -1148336 -1050066
13861 -1050066 -702471 -384949 -69468 91885 244294 522034 529399 159096 148280 249743
13851 249743 -115887 -578779 -836152 -671321 -713311 -1005345 -967074 -945214 -727235 -192438
13841 -192438 404290 687726 448510 69467 -77055 -302735 -590931 -788077 -965749 -882726
13831 -882726 -697157 -410588 86686 221354 9748 -370376 -631906 -529627 -541017 -871040
13821h71040k78863J46761L76378N4041j03482k09456j56195K63501r377k76402
13811a064134K6933K0983k04230j0933J03453J81106j34654j77328k18185k7508
13801a504497L89351L44023o2129m5375R2307N26097K71933j46606l12979k32251
13791f80126K15922L94950M12672r7855m75333k79127R0474N4200O5760L78132
13781G9669j52477k75687P1565j10991n37499r9855k42070j37960p0045J74442
13771a300908M01589R6427J25156k19955n94140M5545K62993q78k1234K39681
13761i65724L02519J74480K27248L28592j3414m46978l21521n32973l23172K43957
13751a326986J19420O6926K70991K63480K67761Q931k31502k6657K10161K73991
$$ plain form
13821 -871040 -1149903 -1003142 -626764 -572723 -676205 -885661 -1041856 -778355 -787732 -1064134
13811 -1064134 -1037201 -1016218 -1220448 -1231381 -1127928 -946822 -1081476 -1258804 -1476989 -1504497
13801 -1504497 -1115146 -771123 -833252 -878627 -786320 -260223 11710 -134896 -447875 -680126
13791 -680126 -464204 -69254 343418 245563 -229770 -508897 -418423 -364223 -298463 79669
13781 79669 -72808 -348495 -276930 -387921 -925420 -1025275 -1267345 -1405305 -1475350 -1300908
13771 -1300908 -899319 -802892 -677736 -897691 -1491831 -1446286 -1183293 -1184171 -1205405 -965724
13761 -965724 -663205 -488725 -261477 67115 53701 -393277 -714798 -1247771 -1570943 -1326986
13751 -1326986 -1207566 -1140640 -869649 -606169 -338408 -329477 -560979 -587636 -377475 -103484
13741a03484J34999j2384k56320k23276L3540R1713j86611k63066k01642L16675
13731f69856N21557R7050L52915L58133j81890k58505M3125M931n2396J86983
13721D02047L71188k55135n95818j51649j23310q1252O9782j44525n92474l84655
13711a485801J65400n8625K44928N28321K15365m8157q4458j77783K60109K48325
13701a92376K29313J03440p2766l6259K91248N09013R0186o27907o46404L149
13691c49363N07334L17084O6017J9743m9431p7558J16705j03096k95087k86019
13681a33671J34989K61192N7550n2218j78626j64781k6743k36644j94587J12968
13671d20571M31463K6554j43332k28395q2715k52598K35272N05252O0501l60059
$$ plain form
13741 -103484 31515 19131 -237189 -460465 -426925 -335212 -521823 -784889 -986531 -669856
13731 -669856 -148299 -51249 301666 659799 477909 219404 262529 267460 215064 402047
13721 402047 773235 518100 -77718 -229367 -352677 -433929 -364147 -508672 -1101146 -1485801
13711 -1485801 -1320401 -1379026 -1134098 -605777 -390412 -438569 -523027 -700810 -440701 -192376
13701 -192376 36937 140377 67611 31352 322600 831613 921799 293892 -352512 -349363
13691 -349363 157971 475055 541072 560815 511384 433826 550531 447435 152348 -133671
13681 -133671 1318 262510 320060 267842 89216 -75565 -102308 -338952 -533539 -420571
13671 -420571 10892 37446 -105886 -334281 -416996 -669594 -434322 70930 131431 -228628
13661b28628l27491L20271P84229M07007l1642m10900n90134l59631m7133K87940
13651a96112M73716K24548j33374L27022M81573q6821j47433k88541l23153k80185
13641E1240k39867j29470O77K40717l43984k91472m0346N2107K85606O60324K64961
13630E10493q9176J38034j29656l84877p67568n76608L30123O88984M51717O0703
13620B32169l35777m88525k37496J42849K56738n6611k99030l8386J66193K4341
13610f33535J56793J60205J69216J31463j58677N3710o3348m42557l43342q5311
13600a055383M04497N42036L17094L4232O4235M18351l4600l16377j78153l26993
13590a31061k78675k15543j52524K50961L54895O5593k35873O4102K48825j9305
$$ plain form
13661 -228628 -556119 -235848 548381 955388 923746 512846 -77288 -436919 -484052 -196112
13651 -196112 277604 502152 368778 695800 1177373 1090552 943119 654578 331425 51240
13641 51240 -188627 -318097 -317420 -76703 -420687 -712159 -752505 -700398 -414792 245532 510493
13630 510493 421317 559351 429695 44818 -722750 -1299358 -969235 -280251 171466 232169
13620 232169 -103608 -592133 -829629 -686780 -430042 -486653 -785683 -824069 -657876 -633535
13610 -633535 -476742 -316537 -147321 -15858 -174535 -120825 -184173 -626730 -970072 -1055383
13600 -1055383 -650886 -108850 208244 242476 306711 725062 690462 374085 195932 -131061
13590 -131061 -409736 -625279 -777803 -526842 -171947 -106354 -342227 -278125 -29300 -48605
13580d8605R6891M67005L63002k4599L7886j32529N4300R2519K5352m8867J63637
13569A045992k9170k95796m04260j29835k42690l30869J43960P4648k58072j21098
13559e47190O9705l730l79596k23608k69921j48894N09462N20711R2106J94594
13549a86361J50200k04644k62004l37671j24677J62045J88571L11511J70154j50281
13539b83157k42921k1289M17014L16018L0856k87244m75178k75628n6215R2042
13529g85702R5207J05966k88686j81830K93727L15528j07222J78531J94417l12769
13519d92833j97269L46026N15480M48894L15650L95157J05208m01920m77753k55729
13509C00911m30806l50613R64J8887j60359l95400J51850M95889J98898M9851
$$ plain form
13580 -48605 48286 515291 878293 853694 891580 759051 813351 905870 931222 882355 1045992
13569 1045992 1016822 721026 316766 186931 -55759 -386628 -242668 -168020 -426092 -547190
13559 -547190 -477485 -481215 -860811 -1084419 -1354340 -1503234 -993772 -473061 -380955 -186361
13549 -186361 -36161 -240805 -502809 -840480 -965157 -803112 -614541 -303030 -132876 -283157
13539 -283157 -526078 -547367 -130353 185665 216521 -70723 -545901 -821529 -877744 -785702
13529 -785702 -690495 -584529 -873215 -1055045 -761318 -445790 -553012 -374481 -180064 -492833
13519 -492833 -690102 -344076 171404 620298 935948 1331105 1436313 1034393 556640 300911
13509 300911 -129895 -480508 -479544 -460657 -621016 -1016416 -864566 -368677 -169779 -119928
13499a19928N5768l5722k54974k73004r1831J2270J22707J23195O619K1456K04913
13488b28531J05651r6081j59473r9940K07259L04639m0297m27576o06041l40850
13478a381240j82921q4258M22332L19100J58805O39102N89956k51897p24328l48155
13468h43504L34140L07020q1768J38908q3229n05629K3028K36755k2729K74715
13458b22293L45842K77664J21792k96138m01645j05292K37023j85113k10782n5469
13448d94411l49427k53790J23136L76568N2521K25088J01889l66256j95426M91925
13438b88183O60331L84843J58041J44146J17263l11371m47970m79435m66465j69907
13428f98707M3594k27999k54346j72417k18852K96394M03914J22636j80268k01251
$$ plain form
13499 -119928 -64160 -99882 -354856 -627860 -719691 -707421 -584714 -461519 -454900 -433444 -228531
13488 -228531 -122880 -218961 -378434 -478374 -271115 33524 -6773 -434349 -1040390 -1381240
13478 -1381240 -1564161 -1648419 -1226087 -906987 -748182 -109080 480876 228979 -495349 -843504
13468 -843504 -509364 -202344 -284112 -145204 -228433 -734062 -711034 -474279 -497008 -222293
13458 -222293 123549 401213 523005 226867 -174778 -280070 -43047 -228160 -438942 -494411
13448 -494411 -843838 -1097628 -974492 -597924 -545403 -320315 -218426 -584682 -780108 -288183
13438 -288183 372148 756991 915032 1059178 1176441 865070 417100 -62335 -528800 -698707
13428 -698707 -655113 -883112 -1137458 -1309875 -1528727 -1232333 -828419 -705783 -886051 -1087302
13418a087302k8630Q7544O2904k8057q7471q2518O7314M43757L23548J4323L6548
13407b78040J25330K30765k84424m06928m9538J91801L36088K58874J25621K06603
13397D56152M2971l77753o78094m3552K43882J9175o2238n7770k72281L2117j33288
13386h30679j99394L81021J56023k9815L53849J62592j12174l8029J43462N5752
13376D2608k72326j17760r5585J29052N80530K82986o18873l37417R5438K52353
13366e8994K21987L6369j25834l3678K53553M5181r0509j89016l76833j3431N9447
13355b71758j0619l55462j09348J37972K81960P6478R3787L37089K48694j79185
13345B49608j47175M28418J10202P4042K9934k01689l14912k67439j21685J76536
$$ plain form
13418 -1087302 -1115932 -1028388 -965484 -993541 -1081012 -1163530 -1096216 -652459 -328911 -314588 -278040
13407 -278040 -152710 78055 -206369 -613297 -662835 -471034 -134946 123928 249549 456152
13397 456152 499123 121370 -556724 -600276 -356394 -337219 -399457 -457227 -729508 -697391 -830679
13386 -830679 -1030073 -649052 -493029 -522844 -168995 -6403 -118577 -156606 -13144 42608
13376 42608 -229718 -347478 -443063 -314011 266519 549505 -69368 -406785 -311347 -58994
13366 -58994 162993 199362 73528 39850 293403 338584 248075 59059 -317774 -331205 -271758
13355 -271758 -282377 -637839 -747187 -609215 -327255 -250777 -156990 180099 428793 249608
13345 249608 102433 530851 641053 715095 745029 543340 228428 -39011 -160696 15840
13335A5840J79830j37790j37843j17299k85600j86316P8183J65729J27306J27502
13325a70458M7567k59482K32886K54495L7163o7868n25312m80302p5508J72461
13315h34358K02103r2473k82343K72851K72406j20547L07525M95335J15634l97003
13305f0870k68810J80695N82161K38324m85903l91949j796L44724K89582j2849
13295D13309k94510j12517J05414k28314j0747m0992k51546j15561k40138O8147
13285g07455J30619N2935L30985K31742K87252J06577j48991l21627m77067j41863
13275f56893J10396j94446k74715o399N8723L40808O11881K34650j84100j05658
13265f5753K92585L763k22310k05233j26209q3542j70243N7593J49906J52206
$$ plain form
13335 15840 195670 57880 -79963 -197262 -482862 -669178 -590995 -425266 -297960 -170458
13325 -170458 -122891 -382373 -149487 105008 142171 74303 -451009 -931311 -1006819 -834358
13315 -834358 -632255 -724728 -1007071 -734220 -461814 -582361 -274836 220499 336133 -60870
13305 -60870 -329680 -148985 433176 671500 185597 -206352 -208148 136576 426158 413309
13295 413309 118799 6282 111696 -116618 -127365 -168357 -419903 -535464 -775602 -707455
13285 -707455 -576836 -523901 -192916 38826 326078 432655 283664 -37963 -515030 -656893
13275 -656893 -546497 -740943 -1015658 -1022057 -963334 -622526 -10645 224005 39905 -65753
13265 -65753 226832 230595 8285 -196948 -323157 -406699 -576942 -519349 -369443 -217237
13255b17237k696J04504J72314J02873l74383k43066R8014R4450n0129j59940
13245d75296O7776J19691k72524l20508M21383L66595k62817l37999j28938Q9579
13235g33058N13916L97387J15732m9888l30490k31829J1367j68870r9894j81399
13225g57026K67892L34181O8192J11038K90998L57736j4647o22320m01746j29814
13215d95516J92123M07249o8519m52087j63331l403k14811j8263L3676K20130
13205e62752M38001K11576L73328J94097m89274j44872j23l26585k21577l86340
13195i14521m34162P3751N88893O11182k82701k92692o0529R2561L35670J52650
13185a29898k23936M1411P1395J54245K36948N3914k62458m33697k72348m4906
$$ plain form
13255 -217237 -219933 -115429 56885 159758 -214625 -457691 -359677 -265227 -315356 -475296
13245 -475296 -407520 -287829 -560353 -880861 -459478 -92883 -355700 -693699 -822637 -733058
13235 -733058 -219142 178245 293977 244089 -86401 -318230 -306863 -475733 -575627 -757026
13225 -757026 -489134 -154953 -86761 24277 315275 673011 658364 36044 -365702 -495516
13215 -495516 -303393 103856 35337 -416750 -580081 -583484 -798295 -816558 -782882 -562752
13205 -562752 -124751 86825 460153 654250 164976 20104 19981 -306604 -528181 -914521
13195 -914521 -1348683 -1274932 -686039 -74857 -357558 -650250 -710779 -618218 -282548 -129898
13185 -129898 -353834 -312423 -241028 -86783 150165 204079 -58379 -492076 -764424 -809330
13175h09330K28034K85624o0989L65390P22648K65646m16824k00615M984k00287
13165A84281L4050J19253j65988l69298j79174N5263M3422j18947j86788J06363
13155d77563R7258K45685L00066K70432j21695k95038j03336J90896L12062O9268
13145D88035N1277j29939k07433r1048O1105k02278k11008P5242J62390N1647
13135D7990K6789J46121J74779J31495k13099l54238l47488k05139p3885K70752
13125c95923J61744k42634K32139L94888m7590l62253m83094r3541L29907J57529
13115c48828Q1571J97596J03547J80760L32764K68761L10517j69511k16912l42380
13105C97885k28002j95487k15677o0948k22218j06498L99919K08810k08502m64168
$$ plain form
13175 -809330 -581296 -295672 -356661 8729 731377 997023 580199 379584 384568 184281
13165 184281 218331 337584 171596 -197702 -376876 -321613 -278191 -397138 -583926 -477563
13155 -477563 -380305 -134620 165446 435878 314183 19145 -84191 106705 418767 488035
13145 488035 539312 409373 201940 110892 171997 -30281 -241289 -166047 -3657 47990
13135 47990 74779 220900 395679 527174 314075 -40163 -387651 -592790 -666675 -395923
13125 -395923 -234179 -476813 -244674 150214 102624 -259629 -742723 -836264 -506357 -348828
13115 -348828 -267257 -69661 33886 214646 547410 816171 1126688 957177 740265 397885
13105 397885 169883 -25604 -241281 -302229 -524447 -630945 -231026 -22216 -230718 -694886
13095f94886J59428M83216J1943K15862M9745m54212l21842J31207J55592J91354
13085g2593K78248L0727k31017m94400m58453L7378K8316j03329K82544J63110
13075e39469K07022L40823L22498K5684m0755J54972j60630k02197J72203K21844
13065E01995Q9357O4413O9987Q8868j19141j88517K18113j0020l47380j89259
13055A78416J78407J85580k27773P6614K32830L42307j61590m96888J43832M27200
13045H78935q0987n88762p47289k78961j24665k66183J11270K65476K08234N1860
13035e71072k37936j34589K91628K06220J7258L41702J45767K24670L67619L16913
13025I68180K36344J52610j56982l24798k05897k18066l7715L87024K43714K5540
$$ plain form
13095 -694886 -535458 -52242 -40299 175563 225308 -228904 -550746 -419539 -263947 -72593
13085 -72593 205655 236382 5365 -489035 -947488 -910110 -881794 -985123 -702579 -539469
13075 -539469 -332447 8376 330874 356558 315803 470775 310145 107948 280151 501995
13065 501995 591352 655765 725752 814620 695479 506962 725075 715055 367675 178416
13055 178416 356823 542403 314630 391244 624074 966381 804791 307903 451735 878935
13045 878935 797948 209186 -538103 -817064 -941729 -1207912 -1096642 -831166 -622932 -571072
13035 -571072 -809008 -943597 -651969 -445749 -428491 -86789 58978 283648 651267 968180
13025 968180 1204524 1357134 1200152 875354 669457 451391 413676 800700 1044414 1069954
13015A069954k79526l14101k24682j00102R9100K56389M05077j24380j39104K7350
13005F75975j76787m40141m92918J21722L4279j17510K45142M13707M13171j8784
12995F57856k45592j1821n243M2103O7678J2772k05045M6770M0122j73146O4310
12984B90764K99266J14745j11024P4425k77437l88339K64280M22574k35828n5350
12974C98076K37116j37989m28529J01844L50980J99539K99183l13508m06772K43559
12964E43499K31011j20841l49925l72506L92715N45419k37316j05328L021o8041
12954D61708j32802j66455M0025l35064R9078L10737P7300K00799o6277o7747
12944D21302j48435m07055m03435L9118N28815K05023j00384K33393M34803J05754
$$ plain form
13015 1069954 790428 476327 251645 151543 250643 507032 912109 787729 648625 675975
13005 675975 499188 59047 -433871 -312149 -277870 -395380 -150238 263469 676640 657856
12995 657856 412264 400443 395200 437303 504981 517753 312708 359478 399600 226454 290764
12984 290764 590030 704775 593751 668176 390739 2400 266680 689254 453426 398076
12974 398076 635192 497203 68674 170518 521498 721037 1020220 706712 299940 543499
12964 543499 774510 653669 303744 -68762 323953 869372 632056 526728 529749 461708
12954 461708 328906 162451 202476 -132588 -33510 277227 354527 555326 489049 421302
12944 421302 272867 -134188 -537623 -498505 30310 235333 134949 368342 803145 908899
12934I08899k66524m64946j89012Q0642K20912N02729N11942K12465J7659J05018
12924A639784J74760J09856J56873l749j69943o25622o75809o6122Q2268J91521
12914H13817L70898K66407L05987j96077n90103k36800j16387n0035o031L81188
12904I42864K27069J27763n8405o34678n47868j19034l3578J07779M61420K27599
12894G00931j21024J27298M00368k51395l83076L7581j54657K38967M10411m8028
12884I57376k14630k34145k25967M9733L98480P74260N18409j02779k69488o07616
12874A043633n82001l69888N98L85826M40703K62558P5295Q9261R3325k12727
12864A226583o37507k23505j15257Q018k14217J87611M00103L41545J02889L5261
$$ plain form
12934 908899 642375 177429 -11583 69059 289971 792700 1304642 1517107 1534766 1639784
12924 1639784 1814544 1924400 2081273 2077524 1907581 1281959 606150 540028 622296 813817
12914 813817 1184715 1451122 1757109 1561032 970929 734129 617742 567707 561676 942864
12904 942864 1169933 1297696 1239291 604613 56745 -62289 -95867 11912 473332 700931
12894 700931 579907 707205 1107573 856178 473102 510683 356026 594993 1005404 957376
12884 957376 742746 508601 282634 332367 730847 1505107 2023516 1920737 1651249 1043633
12874 1043633 461632 91744 92342 478168 918871 1181429 1256724 1345985 1439310 1226583
12864 1226583 589076 365571 250314 258332 44115 231726 631829 973374 1076263 1111524
12854A111524P1421j29248m52776r2491L49752K59211L02871M41087L71380k707
12844B230024J225J33125l10396n53141l53276k80557J35603L21272J97463Q5750
12834A607092j66408m9681j99441j41805R7966K00805N9724l10765J40019K83162
12824A520668J40067o130k01757q737J45413K53690n4274k79437l74015k23464
12814I12024R0679N5938k9623L72751P43092N1307n85832p6881J04007L3025J78724
12803A849211j38751k58400q267j83174j1125L09246L51430J81072n45140j95288
12793A350814J77903N28029K69390j63764k36318r3637N3111K21871M06777j24641
12783B389535l71761o5306K33766J94081K32366J05079J61273L00396J93199k4484
$$ plain form
12854 1111524 1182945 1053697 600921 508430 858182 1117393 1420264 1861351 2232731 2230024
12844 2230024 2231249 2364374 2053978 1500837 1147561 867004 1002607 1323879 1521342 1607092
12834 1607092 1440684 1391003 1191562 1049757 1147723 1348528 1408252 1097487 1237506 1520668
12824 1520668 1660735 1654605 1452848 1444111 1589524 1843214 1788940 1509503 1135488 912024
12814 912024 1002703 1058641 1029018 1401769 2144861 2196168 1610336 1533455 1637462 1670487 1849211
12803 1849211 1710460 1452060 1443793 1260619 1249494 1558740 1910170 2091242 1546102 1350814
12793 1350814 1528717 2056746 2326136 2162372 1926054 1832417 1885528 2107399 2514176 2389535
12783 2389535 2017774 1952468 2186234 2380315 2612681 2717760 2879033 3179429 3372628 3348144
12773C348144m74548k99401o9033j59930K24782O66588N22773O5885k36949j75288
12763C413023J31494K15979K02673r1932J38284K04536j95694P1425j598K8813
12753D117003M12431K79359J12748J97427K36017K78850M48180M16449J32303
12744F630767K76149K88529K91790Q4133J35551M25876L95170N57099N78949J027283
12734A0691296J160605O69694P95561R01390R46841J304972K157536K728088K887641
12725B4243624L285939M003933M892821O050204P140865Q822386J1219943J4240974
12717H3900689J8270285K4080411L1626671M0990374N0817040N2538819L4014102
12710C36238391m723686l9432003n2062946m7770913l7884676k8754584k2126309
$$ plain form
12773 3348144 2873596 2574195 2505162 2345232 2570014 3236602 3759375 3825260 3588311 3413023
12763 3413023 3544517 3760496 3963169 3871237 4009521 4214057 4018363 4089788 4088190 4117003
12753 4117003 4529434 4808793 4921541 5118968 5354985 5633835 6082015 6498464 6630767
12744 6630767 6906916 7195445 7487235 7571368 7706919 8132795 8527965 9085064 9664013 10691296
12734 10691296 11851901 12521595 13317156 14218546 15165387 16470359 18627895 21355983 24243624
12725 24243624 27529563 31533496 36426317 42476521 49617386 58439772 69659715 83900689
12717 83900689 102170974 126251385 157878056 198868430 249685470 302224289 336238391
12710 336238391 331514705 292082702 240019756 192248843 154364167 125609583 103483274
12703A03483274j7343273j3559263j0403993q393317o929689n760734m935981
12696C6157024l680584l007001k810087k471684k141314j856437j813963j294195
12688A7081759j096095j011263r05177p15298l86773l97070n96251p32450q35114
12679A0406268o99150k65475l4091K9293M8936j23652m69864m35091m31553j15576
12669G910045k58586l77384J50247O31539N61586N24001L19941Q6875J94960K68314
12659A0011538O15382P25227M17800P37196J724114K164353K116676J775158M60497
12650B0747941j005808j710994j124955k99293M15238N47204P91579J135692J156045
12641B0652649J379687J808538K751189L894684M780629N219791O164470P775682
$$ plain form
12703 103483274 86140001 72580738 62176745 53783428 46853739 41093005 36157024
12696 36157024 32476440 29469439 26659352 24187668 22046354 20189917 18375954 17081759
12688 17081759 15985664 14974401 14069224 13353926 12967153 12570083 11973832 11241382 10406268
12679 10406268 9707118 9441643 9407552 9436845 9485781 9362129 8892265 8457174 8025621 7910045
12669 7910045 7651459 7274075 7424322 8055861 8617447 9141448 9461389 9548264 9743224 10011538
12659 10011538 10626920 11352147 11769947 12507143 14231257 16395610 18512286 20287444 20747941
12650 20747941 19742133 18031139 16906184 16606891 17022129 17569333 18360912 19496604 20652649
12641 20652649 22032336 23840874 26592063 30486747 35267376 40487167 46651637 54427319
12633E4427319R477865J1741159J4898448J9484432K5497328L3921304M4572575
12626B14020430N3655486N1624785K5651245j7639023m8169197n3495864m5812710
12619A79835152l5563535k6956588k0431726j5578828j2387303j0050534p841351
12612E1025287o280606n901298m962721l808477k877303k343494j885456j780771
12604B1185161j611301j243674j279905j257479j305447r96956p24040r20858
12596A1845501j011214p31854n86493l93307j62487k14823n26199l17740p6801
12587G824583r0667k66950L84417M34556q5244l2305j57679R4442j79524o8434
12577G857195L64575J41593k30400j72505n70354l69494r5064j45118J59699L09025
$$ plain form
12633 54427319 63905184 75646343 90544791 110029223 135526551 169447855 214020430
12626 214020430 267675916 319300701 344951946 327312923 279143726 225647862 179835152
12619 179835152 144271617 117315029 96883303 81304475 68917172 58866638 51025287
12612 51025287 44744681 38843383 33880662 30072185 27194882 24851388 22965932 21185161
12604 21185161 19573860 18330186 17050281 15792802 14487355 13490399 12766359 11845501
12596 11845501 10834287 10102433 9515940 9122633 8960146 8745323 8219124 7901384 7824583
12587 7824583 7733916 7466966 7851383 8285939 8200695 8168390 8010711 8105153 7925629 7857195
12577 7857195 8221770 8363363 8132963 7960458 7390104 7020610 6925546 6780428 6940127 7249152
12567G249152J28275P9335K50004O70050J290190J184923M11733P22487Q43809
12558A2829958R11896J370368J458037J894434K193706K385691L116577L972930
12550C0133597M743443N731835O924227Q429612J0240102J2855356J6095514K1024889
12542A16178575K7377484L6098240M6641655N3258255M4498633J2555589k7306114
12535C09302317m9490203n0706122m2177829l2613506k5005097j9073521j4407270
12528G5828769j1475263r668867q226839o411217n039973m187540l590734k962817
12520B4265519k557447k173394j724820j474084j168685j400087j121328p14097
12512A1931577p60386r28894j035206p76898n49032m64284k95389k50075j25042
$$ plain form
12567 7249152 7377427 7456762 7706766 8376816 9667006 10851929 11263662 11986149 12829958
12558 12829958 13741854 15112222 16570259 18464693 20658399 23044090 26160667 30133597
12550 30133597 34877040 40608875 47533102 55962714 66202816 79058172 95153686 116178575
12542 116178575 143556059 179654299 226295954 279554209 324052842 336608431 309302317
12535 309302317 259812114 209105992 166928163 134314657 109309560 90236039 75828769
12528 75828769 64353506 54684639 46457800 40046583 35006610 30819070 27228336 24265519
12520 24265519 21708072 19534678 17809858 16335774 15167089 13767002 12645674 11931577
12512 11931577 11171191 10242297 9207091 8430193 7881161 7416877 7121488 6871413 6746371
12503F746371k59103o82839o90709l62984j9637k28506l08623l87967m24537j58534
12493C222932j34247l56624l71451R6405L29400J62340l41491m38197j45698j21723
12483A901646J39558J25689n2576j25893q5504j84572m28788l2787L61241j77392
12473A440622q3609k00955k59996j3412J03430J01505R6120J63755J10742L5441
12463A493643l63695k12985p0750o9322K78671J88628j58559l66370M6251R3891
12453H59403L20740M51256K2576j01727j06448J40291K0432k58940j88629k1410
12443A137544j21235K50828J08953p0648l31925j52607Q3367j2865j50355j51528
12433E89529k13954m8444J23389j09065M3400K45312Q3881n9790P748j2458J01011
$$ plain form
12503 6746371 6487268 5804429 5113720 4750736 4731099 4502593 4193970 3806003 3381466 3222932
12493 3222932 3088685 2732061 2360610 2457015 2786415 2948755 2607264 2169067 2023369 1901646
12483 1901646 2041204 2166893 2114317 1988424 1902920 1718348 1289560 1256773 1618014 1440622
12473 1440622 1357013 1156058 896062 882650 986080 1087585 1183705 1347460 1458202 1493643
12463 1493643 1129948 916963 846213 776891 1055562 1244190 1085631 719261 765512 859403
12453 859403 1180143 1631399 1653975 1552248 1445800 1586091 1606523 1347583 1158954 1137544
12443 1137544 1016309 1267137 1376090 1305442 973517 820910 904277 891412 741057 589529
12433 589529 375575 327131 450520 341455 384855 630167 714048 654258 662006 649548 750559
12422G50559j21409m95696l44043N1504r2535J63238N11493J24776j64441Q6489
12412D69935j21048k07426K08018P7173l63082j86337p0616j83285K49759L66942
12402B40033j20097J6367L12695p4421l39334l92652j7988M50436L56269M2253
12392D73561K96562L20686J15469K96389J80396k25388m55993l42132j2538l18013
12382C28999m19626j21265Q4908J53066J92020j31301k56641p4943j54592j83775
12372e83150J70567Q6658N6853n7514R5587M85766O99224K07326k37121k0358
12362I03838k12821j93679j7946r6893j88947P4742L70415J11215PK31478K17707
12351A199116k57955l25602j97190m7371K98976j20857m23635k72276k88145j63357
$$ plain form
12422 750559 629150 133454 -210589 -159085 -251620 -88382 423111 547887 383446 469935
12412 469935 348887 141461 349479 426652 63570 -122767 -193383 -376668 -126909 240033
12402 240033 119936 136303 448998 374577 35243 -357409 -375397 75039 431308 473561
12392 473561 770123 1090809 1206278 1502667 1683063 1457675 1001682 659550 647012 328999
12382 328999 -90627 -211892 -126984 26082 218102 86801 -169840 -244783 -399375 -583150
12372 -583150 -412583 -325925 -269072 -326586 -230999 254767 953991 1161317 924196 903838
12362 903838 691017 497338 479392 382499 193552 268294 638709 749924 749931 981409 1199116
12351 1199116 941161 615559 418369 370998 669974 549117 125482 -146794 -434939 -598296
12341e98296m9286m15191J12279O04099K70690j36920k78205K61645K26158o9734
12331g2761l99391n16850Q1704Q34102Q10599L34244j81817j50443j12989m17891
12321B08507l81347j11482R8693J1492M40993L40533n9329j21661r3154k90948
12311D2297p7299J24296L43346k6531o08593l08531j26238k66154K7174M20803
12301d55430K30885j69659J7966J73026K79206J46424j72511l56930j28772K82715
12291a53080L44628n4183m11987m56380r0006n8936J32108L51227N56323M85618
12281F45332K19260j63088n32394l81003j37055p5537m6831J07651K98263M70086
12271D04684M38366J28815j62803j33411p9991N3228j53347k23990q4695O4684
$$ plain form
12341 -598296 -647582 -1062773 -950494 -346395 -75705 -212625 -490830 -229185 -3027 -72761
12331 -72761 -472152 -989002 -907298 -73196 737403 1071647 889830 739387 626398 208507
12321 208507 -172840 -284322 -185629 -174137 266856 607389 548060 426399 333245 42297
12311 42297 -35002 89294 432640 406109 -202484 -511015 -637253 -903407 -876233 -455430
12301 -455430 -224545 -394204 -376238 -203212 75994 222418 49907 -307023 -435795 -153080
12291 -153080 191548 137365 -274622 -731002 -821008 -879944 -747836 -396609 159714 645332
12281 645332 864592 701504 169110 -211893 -348948 -424485 -471316 -363665 -65402 404684
12271 404684 843050 971865 809062 675651 595660 648888 495541 271551 186856 251540
12261B51540K44094K65177M5195q8096k56966k07944J35994L4777j90309j00070
12251A33392J0021O9157p5989k95330j74234N8378J72182L45732J59612q0092
12241C22829J36497J60882j04818j92455j50713l76748j93221K7518K22338K02887
12231E4996k149k32505n379j67153m35599m9627K60614K77869l9432L74007J76136
12220B11778j63768q4014j29784l77725l4370J90052K1909J04124J06756j82453
12210c37495Q5752J24800j28717j32938K01736J43971J10443p0556J07179J33006
12200B37181k26045l27456m22900J98696O16925J1263k32539N6316K78827r8588
12190I1680k54931l3472K90770J71550L7736o5648j15365K325k09271n29923j61563
$$ plain form
12261 251540 495634 760811 806006 717910 460944 253000 388994 423771 233462 133392
12251 133392 143413 212570 136581 -158749 -332983 -274605 -102423 243309 402921 322829
12241 322829 459326 620208 515390 322935 172222 -204526 -397747 -370229 -147891 54996
12231 54996 52847 -179658 -185037 -352190 -787789 -837416 -576802 -298933 -338365 35642 211778
12220 211778 48010 -36004 -165788 -543513 -577883 -387831 -365922 -261798 -155042 -337495
12210 -337495 -251743 -126943 -255660 -388598 -186862 -42891 67552 -3004 104175 237181
12200 237181 11136 -316320 -739220 -540524 76401 87664 -144875 -88559 190268 91680
12190 91680 -163251 -196723 94047 265597 303333 237685 122320 124645 -84626 -614549 -776112
12179g76112K57611K70772J37761j47461J37513K37332K26488m756l12542k09223
12169a82617M15509L69751R5796K4987K13649J1267j60912m31424k27091J58371
12159B87286M93617K21838m47747k88556M8269K40800J0574M0131K23130J6179
12149H45521l78367n76730o0291J8297l30056J04300K20283J63623l60208l39507
12139f93135K11355M90160M01124L12603J10715k42127j30021j32719m13344l80468
12129d65857k07332l67786k72519K45964N62966K90071J28998P913m6831M4231
12119h0182M4166K18380k51521j96730n6229k89588j00411J9091j15626j47338
12109i55988r1699K92939M27513J79537J75857K57001Q1053o4911O3781J60674
$$ plain form
12179 -776112 -518501 -247729 -109968 -257429 -119916 117416 343904 339148 26606 -182617
12169 -182617 232892 602643 698439 723426 937075 948342 787430 356006 128915 287286
12159 287286 780903 1002741 554994 266438 314707 555507 566081 606212 829342 845521
12149 845521 467154 -109576 -169867 -151570 -481626 -377326 -157043 6580 -353628 -693135
12139 -693135 -481780 8380 409504 722107 832822 590695 460674 327955 -85389 -465857
12129 -465857 -673189 -1040975 -1313494 -1067530 -504564 -214493 -85495 -77582 -124413 -80182
12119 -80182 -36016 182364 -69157 -265887 -322116 -611704 -712115 -693024 -808650 -955988
12109 -955988 -1047687 -754748 -327235 -147698 28159 285160 366213 301302 365083 525757
12099E25757p9127n93337l28223l67647j12625M73451N12010L36041n0361k9650
12089B86289N7573j29744L0239o1096O0190R6881n930l0789K5365O8363o0940
12078C36401k98655q6460j61543j40687r4911J97891K55786J14539N28586M55798
12068A106745j35394l12108J98098L66209p2676l18085l48862n27831k30183K51131
12058b2956J34379j42943k16843J11299K00355O1495Q9843n3196j55313n2275
12048d6155o9287J01899J12513j92286k70022j77097K15569L92841J71401N1482
12038B90858Q1898J48700L5153J41222k02905m92134k8420K82298J02086L7176
12028C95932m5070L5728K17972k47115l16767j82018j26539j40518k88667l09570
$$ plain form
12099 525757 446630 -146707 -474930 -842577 -955202 -481751 30259 366300 315939 286289
12089 286289 343862 214118 244357 183261 243451 340332 334402 303613 328978 397341 336401
12078 336401 37746 -48714 -210257 -350944 -445855 -247964 7822 122361 650947 1106745
12068 1106745 971351 659243 857341 1223550 1150874 832789 483927 -43904 -274087 -22956
12058 -22956 111423 -31520 -248363 -137064 63291 124786 214629 161433 6120 -46155
12048 -46155 -115442 -13543 98970 -93316 -363338 -540435 -324866 67975 239376 290858
12038 290858 372756 521456 556609 697831 494926 2792 -25628 256670 358756 395932
12028 395932 350862 386590 604562 357447 40680 -141338 -267877 -408395 -697062 -1006632
12018a006632j33805J22102j093J48389L29111p9673j0443J63809K10038M2827
12008b15370j29867l70551k61957K51845K59433J32386p4081m57766l21472O6519
11998a120881K99516j22561k2469M87984L87647J26439k13107J03621k41862p08008
11988a023681l68373r1432j48420L52681N25174M84099L05554j05942J35601L2566
11978I7827l76429n69243j47365J29007K54830N71902R1869k49160P9563O3222
11968e3977l00453j32427L45896M37684P7784p1416j25643j14859p4978m7069
11958e9458J1201o1606j46586P2660K37983j5192J59698L11744K15624k28339
11948D97729l83759l51464l67856L0002L36222L51889J46003K0681O5491J66616
$$ plain form
12018 -1006632 -1140437 -1018335 -1019428 -871039 -541928 -621601 -632044 -468235 -258197 -215370
12008 -215370 -345237 -715788 -977745 -725900 -466467 -334081 -408162 -865928 -1187400 -1120881
11998 -1120881 -821365 -943926 -966395 -478411 -90764 35675 -177432 -73811 -315673 -1023681
11988 -1023681 -1392054 -1483486 -1631906 -1279225 -754051 -269952 35602 -70340 65261 97827
11978 97827 -278602 -847845 -995210 -866203 -611373 -39471 52398 -196762 -117199 -53977
11968 -53977 -354430 -486857 -140961 296723 374507 303091 177448 62589 -12389 -59458
11958 -59458 -48257 -109863 -256449 -183789 54194 39002 198700 510444 726068 497729
11948 497729 113970 -237494 -605350 -575348 -239126 112763 258766 279447 344938 511554
11938E11554J62776O8887J27322p8609j65014j89822p8839m11823j54187J33267
11928g4488n4370J77720K90276r0300j87455J05761L2186j7239J43202J63626
11918D88919j33949k98509m84321o55008l89522M8499K55378M59119K82978J81896
11908b44520p1975k86535O1818N37337L96480L0770m64840m98963k48399J73136
11898f15691L20525K95961K79288P6078j1776j56052N0453M14324J42794k02427
11888E93477j63894n5169O7065m1481k09448p0828K5264m027L04122L61815L2488
11877H39384k96041l15790k61873r0042L30580m1551k67427K90971L67833R3209
11867F49253k72197j71709K6950j55876j21018J80035K55282j18340l6941j21043
$$ plain form
11938 511554 674330 743217 870539 791930 626916 437094 358255 -53568 -207755 -74488
11928 -74488 -128858 48862 339138 248838 61383 167144 199330 182091 325293 488919
11918 488919 354970 56461 -427860 -1082868 -1472390 -1423891 -1168513 -709394 -426416 -244520
11908 -244520 -316495 -603030 -541212 -3875 392605 423375 -41465 -540428 -788827 -615691
11898 -615691 -295166 795 280083 356161 344385 188333 238786 653110 795904 593477
11888 593477 429583 374414 441479 399998 190550 119722 144986 140959 445081 806896 839384
11877 839384 543343 227553 -34320 -124362 206218 164667 -102760 188211 556044 649253
11867 649253 377056 205347 232297 76421 -44597 135438 390720 272380 235439 114396
11857A14396k83254J04111l3227P2608j1311j78869K2770L74297K53035k24534
11847B10022l30479q2463L39525J05353j36568J62435j39027k97056l52151j13661
11837f34070J51605R8818l95572R4964M02191K0093j47176q4322K54792K98152
11827E9475r550l31745l19333l20358l16880j32683O1881J41318J98766l0537
11817i99646k34872K40499N48695J63232j37708l26914m38263M037Q2740J35155
11807i63045M62052N7105l17696k22243k94722K03771O22289R6999k34825k3060
11797f13375n5050J88193J55666Q5721K55323J7401J2389K92746n7430k81170
11787D14l91025n80523k72542m9920L06193O51467O47823J69431k84904j67676
$$ plain form
11857 114396 -168858 -64747 -97974 -25366 -36677 -215546 -192776 181521 434556 210022
11847 210022 -120457 -202920 136605 241958 105390 267825 128798 -168258 -520409 -634070
11837 -634070 -482465 -383647 -779219 -684255 -282064 -261971 -409147 -493469 -238677 59475
11827 59475 49925 -281820 -601153 -921511 -1238391 -1371074 -1309193 -1167875 -969109 -999646
11817 -999646 -1234518 -994019 -445324 -282092 -419800 -746714 -1184977 -1180940 -1098200 -963045
11807 -963045 -500993 -443888 -761584 -983827 -1278549 -1074778 -452489 -355490 -590315 -613375
11797 -613375 -668425 -480232 -324566 -238845 16478 33879 46268 339014 281584 414
11787 414 -390611 -971134 -1243676 -1293596 -987403 -335936 311887 481318 196414 28738
11777B8738K24350J37284k30033j0913L82166L03988l2398j53387l4186J6171
11767F31780R1159M37051o0444m39815j37739k91824j77802N578p2152j78452
11757a92660k30822K66402J98284k70763j25540n1901N63983K81192l56000j5292
11747F6883K54690j58148m56778J95042L18698r7892o7377J16480p393j41845
11737B2360k65010k59482K35684J87704L69583K54664n35388m81407k937l17651
11727g91880m39090J24148L18167j78585o0146M41970K04894K70154K18805j62716
11717e4279k76273k1301J08800j25899j28355K61794J07746j00937K43364J85411
11707B00071K3304r6654m01323m83393j71276K60732Q6200k06117o610J75771
$$ plain form
11777 28738 253088 390372 160339 149426 531592 835580 803182 649795 615609 631780
11767 631780 722939 1159990 1099546 659731 521992 230168 52366 57944 -14208 -192660
11757 -192660 -423482 -157080 41204 -229559 -355099 -407000 156983 438175 82175 66883
11747 66883 321573 163425 -293353 -98311 220387 122495 55118 171598 164205 22360
11737 22360 -242650 -502132 -266448 -78744 290839 545503 10115 -471292 -474229 -791880
11727 -791880 -1230970 -1106822 -788655 -967240 -1027386 -585416 -380522 -110368 108437 -54279
11717 -54279 -330552 -351853 -243053 -368952 -497307 -235513 -127767 -228704 14660 200071
11707 200071 223375 126721 -274602 -757995 -929271 -668539 -582339 -788456 -795066 -619295
11697f19295J0888p3543M7158O4489l3882K14674J73354k65692k94135j62491
11687i38475K77059M08604K66947j07401p8095k34068l11500l53922N8782N29636
11677d82433K49677K1590k1635J32211K73967l5085o7015p6053Q4834Q9692J89630
11666C59380k66495N5560K08366K3217K13740m8664k1146K4866l40096m82258
11656b73530j72697q853j42455k08203J91018J99645N5240P0729K8712l9691J47377
11645a52708K13361K30664Q3448j00128k71926k93401l92700P4867J57797l66217
11635h16943l979M63726M6411J97077N42132K04206j07011l25498j50998K43322
11625B92445J63049j91698k39844J96100M57990J90992l3091l65121k4743J51609
$$ plain form
11697 -619295 -608407 -681950 -634792 -570303 -604185 -389511 -216157 -481849 -775984 -938475
11687 -938475 -661416 -252812 14135 -93266 -171361 -405429 -716929 -1070851 -1012069 -482433
11677 -482433 -232756 -211166 -232801 -100590 173377 138292 71277 -4776 80058 169750 359380
11666 359380 92885 148445 356811 380028 593768 545104 523958 548824 208728 -273530
11656 -273530 -446227 -455080 -597535 -805738 -614720 -415075 -359835 -289106 -260394 -300085 -152708
11645 -152708 60653 291317 374765 274637 2711 -290690 -683390 -608523 -450726 -816943
11635 -816943 -820922 -357196 -310785 -113708 428424 632630 525619 200121 49123 292445
11625 292445 455494 263796 23952 220052 678042 869034 835943 470822 446079 597688
11615E97688l00143m53126k38835L9142l8797J10056j39840m9929J39775q4146
11605d18155j00864L7411J46334N6967k19716r3242k394j38171j80408N0992O4425
11594g96821k24866j53443n6700j455J19519K39751O4826L19708K40143J01724
11584a47614k06155l31343q3442J81832R8021P6463K9958k704j63300j78827J3633
11573g13478L82688L17807K66247K82119O9194J52285K25008N3370l82467k88594
11563C64179j36975l49332q4527j1528l54981j97729R5615n531N575J26573j18996
11552f67657q5752Q0161j25556k19988n4770J11327j08592J00399L90306j64323
11542g44445j62384P3038O5996J22322j08012j36933L29445M39557R9610m53692
$$ plain form
11615 597688 297545 -155581 -394416 -355274 -394071 -284015 -423855 -473784 -334009 -418155
11605 -418155 -519019 -481608 -335274 -278307 -498023 -591265 -593659 -731830 -912238 -861246 -796821
11594 -796821 -1021687 -1175130 -1231830 -1233285 -1113766 -874015 -809189 -489481 -249338 -147614
11584 -147614 -353769 -685112 -768554 -586722 -488701 -412238 -382280 -384984 -548284 -727111 -713478
11573 -713478 -330790 -12983 253264 535383 604577 756862 981870 1035240 652773 364179
11563 364179 227204 -122128 -206655 -218183 -573164 -770893 -675278 -680809 -675234 -548661 -667657
11552 -667657 -753409 -673248 -798804 -1018792 -1073562 -962235 -1070827 -970428 -580122 -744445
11542 -744445 -906829 -833791 -767795 -645473 -753485 -890418 -560973 -121416 -21806 -475498
11532d75498l52705l4787j30158J45250K54465K96062K67168k73647j44781q328
11522d56959j00884J01729L60544L61325k01229k30806j9483q2570J8153l35027
11512e85207j11008N64501R9408n39535m02436J2306J89351J61566J14832k47866
11502g44088r3500K87850M74581K66226j28820j31520j64729m0850K84754J32524
11492A42428o1983N1657O4799k56393n5311L46344K88882K8046j91334n1718K41117
11481E46534o8901k81499l40314j39230j058j26356j30557m50249n01177J87O09723
11470h82897M41225j20390q4503K34268J44297O8524j55624q3123K30807J94677
11460a2739n7399p9325l45768l25200j28111k3656L67118L98238L18150K07095
$$ plain form
11532 -475498 -828203 -862990 -993148 -847898 -593433 -297371 -30203 -303850 -448631 -456959
11522 -456959 -557843 -456114 -95570 265755 64526 -166280 -185763 -268333 -250180 -585207
11512 -585207 -696215 -131714 -32306 -571841 -974277 -961971 -772620 -611054 -496222 -744088
11502 -744088 -837588 -549738 -75157 191069 62249 -69271 -234000 -274850 9904 142428
11492 142428 80445 132102 196901 -59492 -114803 231541 520423 548469 357135 305417 546534
11481 546534 477633 196134 -144180 -283410 -284468 -410824 -541381 -991630 -1492807 -1492620 -882897
11470 -882897 -441672 -562062 -646565 -412297 -268000 -199476 -355100 -438223 -207416 -12739
11460 -12739 -70138 -149463 -495231 -820431 -948542 -972198 -605080 -206842 111308 318403
11450C18403p5330l74017n05145J59464N20520N24973L30511j90136k35212K4595
11440D98626K97777J02623j08597j37665j20361j04502K8557m5095k90881o7907
11430E2575J81135O3604K5375J21090K2135k4855K23292J22856r1147l19737j51931
11419B24392k11837J75676K92268j18392n96587m47536K1513N86839M12246k11480
11409A27102l68918K9971L22663Q7691l7756m44353n75594o0367K81968M64483
11399a73110L79170K04689n0275P7315K6220k05369l08281j79360j16783k22955
11389e68739N8442k4612L01713M14229l8935m1664q2810J33959R3491o1408j90574
11378f908k70847j62129j40548r6538m9822J83201k17085R2973N99359M05394
$$ plain form
11450 318403 243073 -130944 -636089 -476625 43895 568868 899379 709243 474031 498626
11440 498626 796403 899026 790429 652764 532403 427901 456458 411363 120482 52575
11430 52575 233710 297314 322689 443779 465914 441059 664351 787207 696060 376323 224392
11419 224392 12555 188231 480499 362107 -234480 -682016 -660503 -73664 338582 127102
11409 127102 -241816 -211845 110818 198509 160753 -283600 -859194 -919561 -637593 -173110
11399 -173110 206060 410749 360474 437789 464009 258640 -49641 -229001 -345784 -568739
11389 -568739 -510297 -534909 -233196 181033 142098 100434 17624 151583 245074 183666 -6908
11378 -6908 -277755 -439884 -580432 -676970 -726792 -543591 -760676 -667703 -68344 337050
11368C37050P8728q1216k02164k34860N9819j34435J49563L83386J55148n3613
11358D57406p7180K93938j37224n80800n33876q8072o0500l5752k32407k8227
11348a022694L04655j4410j49299j23563L28714L48140j6599o83K42681R6926
11338f132k829k4944j42319j07131j27558m3818K34058J80536k62517l37523l06815
11327i46992m8981M23001P26982M17461j24987Q100k2149k68700n37320m57203
11317h30788k09864K33478L60091J78652J90576J38601j11875j94521k57212k15359
11307g18221o5032o4125M17975N74263K3421l63479j39411k36419m99073j24069
11297a194170J63172l6047R0578J67963K6490m4065K34520L22880M7947K22593
$$ plain form
11368 337050 415778 334562 132398 -102462 -42643 -177078 -27515 355871 511019 457406
11358 457406 380226 674164 536940 -43860 -577736 -665808 -726308 -762060 -994467 -1022694
11348 -1022694 -718039 -732449 -881748 -1005311 -676597 -328457 -345056 -345739 -103058 -6132
11338 -6132 -8961 -33905 -176224 -283355 -410913 -454731 -220673 -40137 -302654 -640177 -946992
11327 -946992 -995973 -572972 154010 571471 446484 454584 432435 163735 -373585 -830788
11317 -830788 -1040652 -807174 -447083 -268431 -77855 60746 -51129 -245650 -502862 -718221
11307 -718221 -783253 -847378 -429403 144860 168281 -195198 -334609 -571028 -1070101 -1194170
11297 -1194170 -1030998 -1067045 -976467 -808504 -782014 -826079 -591559 -268679 -220732 1861
11287A861K43817j34539j91545k17899j65947j60026K22631L85103K22965j82041
11277B4380m51392p0490K36614L60018K26979j60510j71552j1907K8368J37962
11267A48470P01j6607R5682k55018n09009j30760J83093K46885N82072N79005
11257I24514j10209o16057p68229n36681J16942L57146J15404J52862N7634j03259
11247d09933l11711J34605K94590k33356j10283l22380k30722J47899N35816K97138
11237b08337o0451l21821k21975K06479j57193k56203j19249J94011K38444L7798
11227f68497J24170p4306K07684N34945K96833M8039L0305l95651l08244q0632
11217b85354R3639M99452j21592o08704o1164J65667j80388M2141K56390k03592
$$ plain form
11287 1861 245678 111139 -80406 -298305 -464252 -624278 -401647 -16544 206421 24380
11277 24380 -427012 -497502 -260888 99130 326109 165599 -5953 -17860 10508 148470
11267 148470 149171 132564 228246 -26772 -535781 -666541 -483448 -236563 345509 924514
11257 924514 814305 198248 -569981 -1106662 -989720 -632574 -517170 -364308 -306674 -409933
11247 -409933 -721644 -587039 -292449 -525805 -636088 -958468 -1189190 -1041291 -505475 -208337
11237 -208337 -268788 -590609 -812584 -606105 -763298 -1019501 -1138750 -944739 -706295 -668497
11227 -668497 -544327 -618633 -410949 123996 420829 468868 499173 103522 -204722 -285354
11217 -285354 -191715 307737 186145 -422559 -483723 -318056 -498444 -456303 -199913 -403505
11207d03505l46725k48168m121M2919K22267M91692k05093m21821r3828K1080
11197i45303K38100M56243J41761m59K01825M2131j05027K74693K4498n30545
11187b02083n24717k91408N39213O47581R3033k59163k71960J06641J7742l3881
11177a79002J89178O9071l48123k69912r7793J20648J85889j94871n63128n94135
11167a682178l1012L79184J63757j4951P8693L94729K73739L19888J01502j93830
11157b10479O6401L59855K87989l3944l32545k86970k24018j63401j38225j81399
11147h56736l26088P623K80897k25003m6826M10657K34160j19919k48910p5078
11137i65223O0850K75413K80206P3643J59042J40398J4513k62015o7158N4400
$$ plain form
11207 -403505 -750230 -998398 -1002519 -959600 -737333 -245641 -450734 -872555 -966383 -945303
11197 -945303 -707203 -250960 -109199 -109658 92167 134298 29271 303964 328462 -202083
11187 -202083 -726800 -1018208 -478995 168586 261619 2456 -269504 -162863 -145121 -179002
11177 -179002 10176 79247 -268876 -538788 -636581 -515933 -330044 -524915 -1088043 -1682178
11167 -1682178 -1713190 -1334006 -1170249 -1185200 -1106507 -711778 -438039 -118151 -16649 -210479
11157 -210479 -144078 215777 503766 469822 137277 -149693 -373711 -537112 -675337 -856736
11147 -856736 -1182824 -1175201 -894304 -1119307 -1166133 -755476 -521316 -641235 -890145 -965223
11137 -965223 -904373 -628960 -348754 -275111 -116069 24329 38842 -223173 -290331 -235931
11127b35931p2200k46148k37412l35338Q0500K09251j77657N8611M67631K61870
11117b26823l99571n85016j75406K69403K70651M2918k20156j25406J10010K32945
11107h06451L13704L6941J37705J29105K08339J62326r4731j75732O2917K387
11097b3490l50280n3273K35960K77973K04033j62423l60880j96627m1190K49565
11087b20632L6916n4012l06232m40190K00400M87250L60552j7977L1448j73360
11077i5837j2522P0706n4710J65641M37966N56870j50243m08288l39737o64222
11067d94376o52649J06236M28119K26153L56905M70014J67663j51098k55579r6757
11057A04631J88825r0863k27465j15850J4595J38645M42118K40734J13007j75612
$$ plain form
11127 -235931 -308131 -554279 -791691 -1127029 -1046529 -837278 -1014935 -956324 -488693 -226823
11117 -226823 -626394 -1211410 -1386816 -1117413 -846762 -803844 -1024000 -1149406 -1039396 -806451
11107 -806451 -492747 -455806 -318101 -188996 19343 181669 86938 -88794 -25877 -23490
11097 -23490 -373770 -427043 -191083 86890 290923 128500 -232380 -429007 -470197 -220632
11087 -220632 -183716 -237728 -543960 -984150 -783750 -296500 64052 46075 77523 -95837
11077 -95837 -108359 -37653 -92363 73278 511244 1068114 917871 509583 169846 -494376
11067 -494376 -1147025 -1040789 -612670 -386517 -29612 440402 608065 456967 201388 104631
11057 104631 293456 202593 -24872 -140722 -126127 12518 454636 695370 808377 632765
11047F32765j80021m69256n16552J82875k84520l73145N6379R2520R6855q0376
11037h42476J37697L81389q125j32127n2772K6367J70906K78415q8957k86440
11027d16123j11943K00456N39316N16778k6805l58906l96806L4499L34502J33641
11017D48609J76942k17424k91125J91189L83632K43685L21958n1689m10939m52834
11007C42004J71899N47160j63913n21652k31248r9518j25835O6674J69365j24631
10997C0305j41903L18689M03120P1255L54881R0506m71900o92500n90500m19524
10987a047571p0461L89204L36150J42175P2924l7088k47486j79227j84797k46082
10977a072259k37204L52086L75882K17811J48399J82858J29682K70809n7012r2315
$$ plain form
11047 632765 452744 -16512 -533064 -350189 -634709 -1007854 -951475 -858955 -762100 -842476
11037 -842476 -704779 -323390 -331515 -463642 -516414 -490047 -319141 -40726 -129683 -416123
11027 -416123 -528066 -327610 211706 728484 701679 342773 -54033 -19534 314968 448609
11017 448609 625551 408127 117002 308191 691823 935508 1257466 1205777 794838 342004
11007 342004 513903 1061063 897150 375498 144250 44732 -81103 -14429 154936 30305
10997 30305 -111598 207091 610211 681466 1036347 1126853 654953 -37547 -628047 -1047571
10987 -1047571 -1118032 -728828 -392678 -250503 -177579 -214667 -462153 -641380 -826177 -1072259
10977 -1072259 -1309463 -957377 -581495 -363684 -215285 -32427 97255 368064 311052 218737
10967B18737J31821J71505k95935n23447k13135J62347l4549l10601l791J18080
10957e78968N5720k47277k76371k38854R5140J89211N8851K08361K98583J47454
10947b88150k46630l79462k80199J10885L21796L53831M27503K23839K3230J41950
10937D08593R2856p7144k67672l52107l26291J58265L31041m1459R7007J87373
10927B10462k95377l67501j44091L3551j4315j19841J3363K84452Q4669O5129
10917b49499J21606J19639L20497j73147l86868j62314q6757n0108j90596M7846
10907f89701l7315j41546p0411P8268N13919N75276k8860m01078l99029j70406
10897g70883J03175J08541P5855n86645p45700j00512K13496m7111P2996K76696
$$ plain form
10967 218737 350558 522063 226128 -297319 -510454 -348107 -382656 -693257 -697048 -578968
10957 -578968 -523248 -770525 -1046896 -1285750 -1190610 -1001399 -942548 -734187 -435604 -288150
10947 -288150 -534780 -914242 -1194441 -1083556 -761760 -407929 19574 243413 266643 408593
10937 408593 501449 424305 156633 -195474 -521765 -363500 -32459 -73918 23089 210462
10927 210462 -84915 -452416 -596507 -562956 -577271 -697112 -683749 -399297 -314628 -249499
10917 -249499 -127893 -8254 312243 139096 -247772 -410086 -496843 -546951 -737547 -689701
10907 -689701 -727016 -868562 -938973 -860705 -346786 228490 199630 -201448 -600477 -770883
10897 -770883 -667708 -559167 -483312 -1069957 -1815657 -1916169 -1702673 -1749784 -1676788 -1400092
10887a400092L06431O02656M10869l8304J57728L2605j44915k57862O4985K89905
10877B4006j24720k55992P4710K37355P1903M4120P9477K57874J38498j39635
10867D07596K892M4773l94723n07601l44213l6173J98580O69475j75606j40422
10857b75422K55328n9410k51959j02893M6290J84871K22106N24364R6647j88145
10847D51777L8871k15363R6880K67558j14729k97672O8848J34195n17111o90762
10837g77508N353J58795Q2369P2797p8404L93762N67054k61568m64388k12796
10827e14534L3706Q1011n5431j99864n62923J5847P19194M86349P8204n41569
10817d60010k30339J98223P0297J88111L25347j5974k29805m24409l16421l01898
$$ plain form
10887 -1400092 -1093661 -491005 -80136 -118440 39288 71893 -73022 -330884 -265899 24006
10877 24006 -100714 -356706 -281996 -44641 27262 71382 150859 408733 547231 407596
10867 407596 410488 455261 60538 -447063 -791276 -827449 -628869 40606 -135000 -275422
10857 -275422 -20094 -79504 -331463 -434356 -388066 -203195 18911 543275 639922 451777
10847 451777 490648 275285 372165 639723 524994 227322 296170 430365 -86746 -777508
10837 -777508 -772155 -613360 -530991 -458194 -536598 -142836 424218 162650 -301738 -514534
10827 -514534 -480828 -399817 -455248 -655112 -1218035 -1202188 -482994 3355 81559 -460010
10817 -460010 -690349 -492126 -421829 -233718 91629 75655 -154150 -578559 -894980 -1196878
10807a196878n2692K03311J31979N01614L62029j93362j63622K44914R5230n69306
10797f36783l31629P9209L03950K27059j17357J31276L05434k65160j70553K32538
10787b42016M62400j49632p06704l88687j58584M55581L18076o3391K82944N80541
10777C90528K23110k46827k36431j44423k77515n69382k96309Q5280L15698M43172
10767c13099J41543Q3903K76549j7443k96310r6614K13356j98812m73533j88453
10757h68913p8852K17727J27804k36670k9386M39840K74772j01271j41472J23804
10747b72617K75989L54873L67640M5296k31612j20845l6379l9553L24287M29630
10737A096709J23686l94206l96945P4004k34925l41082R3089J12885L26956M9151
$$ plain form
10807 -1196878 -1249570 -1046259 -914280 -412666 -50637 -243999 -407621 -162707 -67477 -636783
10797 -636783 -968412 -889203 -585253 -358194 -475551 -344275 -38841 -304001 -474554 -242016
10787 -242016 220384 70752 -635952 -1024639 -1183223 -727642 -409566 -472957 -190013 390528
10777 390528 613638 366811 130380 -14043 -291558 -860940 -1157249 -1071969 -756271 -313099
10767 -313099 -171556 -87653 188896 171453 -124857 -221471 -8115 -206927 -680460 -868913
10757 -868913 -947765 -730038 -602234 -838904 -868290 -428450 -153678 -254949 -396421 -272617
10747 -272617 3372 358245 725885 771181 539569 418724 382345 342792 667079 1096709
10737 1096709 1220395 826189 429244 503248 268323 -72759 20330 133215 460171 509322
10727E09322j78624K8756Q6589L6235k1344l16159l16990j11081K80645N72828
10717E70177J66650N958L5999k47558j51096J91685N9677j03465N7082J03614
10707F88723J48344l03651n98496m77976n01161o11505j09154M78049R0003o8204
10697a265028L25012L38743M07144K55135Q1774j75738p9806k00378o0212L20498
10687e2856K68398J15910p6199J08415P6598l11071m38575m9570J83663J85050
10677I763l0427L0514K04311k25094l95148K1114J62441M4133j65826j34397k10521
10666f89137J07475K23690r0872Q0507L05924L02053J09549j18642L5923m8060
10656B18410l44394J7141J8683j49597l85502l93998J3847J81852J49338J26891
$$ plain form
10727 509322 330698 359454 446043 482278 460934 144775 -172215 -283296 -2651 570177
10717 570177 736827 742785 778784 531226 380130 571815 631492 528027 585109 688723
10707 688723 837067 533416 -65080 -543056 -1044217 -1655722 -1764876 -1286827 -1196824 -1265028
10697 -1265028 -940016 -601273 -194129 61006 142780 -32958 -112764 -313142 -373354 -52856
10687 -52856 215542 331452 255253 363668 440266 129195 -309380 -358950 -175287 9763
10677 9763 -20664 9850 214161 -10933 -406081 -384967 -222526 -178393 -344219 -478616 -689137
10666 -689137 -581662 -357972 -448844 -368337 -62413 239640 349189 230547 266470 218410
10656 218410 -125984 -108843 -90160 -239757 -625259 -1019257 -1005410 -823558 -674220 -547329
10646e47329j68180m7970N4571K63232K42036K295J18468j6730J41762L38339
10636C80494J49606k97744k83402L962K1529j28727j57850k66092j10237J43258
10626e45203M3911K0512j9566N0791m3085j542J61307P5875R3765M17109L44922
10615E98796j49951k10184K11197l6251k20184l81429m36490j22258J98892J45556
10605d02306j87541O949P3656Q8127J7393K16537J77890n3095k30342j17024K31377
10594a78379L39378k6329j48605k59057j20507K8225j09030K119L36711L09558
10584A74084J61914J07519k14537k92593m25604m38431k59717J26171N21703N35288
10574d203K31367J53689K09966R9097O7155l15906m52872k38712l42002K96012
$$ plain form
10646 -547329 -715509 -763479 -708908 -445676 -203640 -201345 -82877 -99607 42155 380494
10636 380494 530100 232356 -51046 -47084 -25555 -154282 -312132 -578224 -688461 -545203
10626 -545203 -501292 -480780 -500346 -449555 -492640 -494182 -332875 -257000 -163235 253874 598796
10615 598796 448845 238661 449858 413607 193423 -188006 -624496 -746754 -547862 -402306
10605 -402306 -589847 -582898 -509242 -421115 -403722 -187185 -9295 -62390 -292732 -409756 -178379
10594 -178379 160999 134670 -13935 -272992 -393499 -365274 -474304 -472185 -135474 174084
10584 174084 335998 443517 228980 -63613 -489217 -927648 -1187365 -1061194 -539491 -4203
10574 -4203 227164 380853 590819 689916 757071 441165 -11707 -250419 -592421 -296409
10564b96409R48110K63479o43688p27452l02858M2167J18190Q9728k87322K3414
10554g72641L63604k26246n6308L84205J57264J42736M95679M66944r4821o14744
10544B45672m30334k93662j29530K45331J60134n5954J62637Q2256K06906p3696
10534A19760k76670N6721K55698m3443k87015l49536m66684l3462L05101L3495
10524f86035k5820K63136L66960J89252k34994j10662J7976j82026k86379j79582
10514h68174K13338L52186J98310K84854L41117L72320M292l66093m36348m12754
10504c16952O7178M71857N29837K84702j45165l18578l94892j81929R3725J74173
10494B63956l18183k2181J59966o1377q8478J59325K57204K06461K52833l8382
$$ plain form
10564 -296409 651701 915180 271492 -455960 -758818 -716651 -598461 -508733 -796055 -772641
10554 -772641 -409037 -635283 -691591 -307386 -150122 -7386 488293 955237 860416 245672
10544 245672 -184662 -478324 -607854 -362523 -202389 -258343 -95706 -13450 193456 119760
10534 119760 -156910 -100189 155509 112066 -174949 -524485 -991169 -1024631 -719530 -686035
10524 -686035 -711855 -448719 -81759 107493 -127501 -238163 -220187 -402213 -688592 -868174
10514 -868174 -654836 -302650 -104340 180514 521631 893951 898243 532150 95802 -316952
10504 -316952 -249774 222083 751920 1036622 891457 572879 177987 -3942 89783 263956
10494 263956 -54227 -76408 83558 22181 -66297 93028 350232 556693 809526 771144
10484G71144n23287n37763j80567k78341m01606K01704K45278J04084j39817j18706
10474h57877R6478j59349K07145J61662J40654L41432j8680k85597J46400J43249
10464h4483j46164J29517M04748J93311p8346k74119l14523j85692N5653J19977
10454a80121J14678P1431K10321J66645K84127m7942N4100K29220r8403l24369
10444D79687j04662j8496j84943j84226k31557o4764J03308O6996J68427j00334
10434g0564j30896J11973L38169J00886n4386j25229k62836j53959o3863k11592
10424e22297k72185k35434O5206q2589j02555L26052K51778j78643J77498K82906
10414b90263J38677R4914j42949j68203K85082L5195r3231J52456N5976k08604
$$ plain form
10484 771144 247857 -289906 -470473 -748814 -1150420 -948716 -703438 -599354 -739171 -857877
10474 -857877 -761399 -920748 -713603 -551941 -411287 -69855 -88535 -374132 -227732 -84483
10464 -84483 -230647 -101130 303618 496929 418583 144464 -170059 -355751 -300098 -180121
10454 -180121 -65443 5988 216309 382954 667081 619139 673239 902459 804056 479687
10444 479687 375025 356529 171586 -12640 -244197 -308961 -205653 -138657 29770 -70564
10434 -70564 -201460 -89487 248682 349568 295182 169953 -92883 -246842 -310705 -522297
10424 -522297 -794482 -1029916 -964710 -1047299 -1149854 -823802 -572024 -750667 -573169 -290263
10414 -290263 -151586 -56672 -199621 -367824 -82742 -47547 -140778 11678 67654 -140950
10404a40950J06828J11230p9728K78142n6725j96835K31537L41874K45434m259
10394H36548j57306p7927n32590l93244n3896k77597k56602J96034K47479K30112
10384b38989M1218l68579q8339N0414k74273n5494J68521K37516J08692P5218
10374c44095L28618L32270m6658l54735j11322q5077L9908L02849J76245k51819
10364a3816m32094l35241j9826N99078J70832N8298M5177j12041j01061M9038
10354i1656k9001l19440l41492j39919j39520K27920P72778M80572J56577J43252
10344G20071k33667m67885k13004K83179L05778K69871K45654k18376m08437r7450
10334A85734J04117l174L9804p1131k87009O7441K08687k43338j45767L51940
$$ plain form
10404 -140950 -34122 77108 -2620 275522 218797 21962 253499 595373 840807 836548
10394 836548 679242 601315 68725 -324519 -378415 -656012 -912614 -716580 -469101 -238989
10384 -238989 -197771 -566350 -654689 -604275 -878548 -934042 -765521 -528005 -419313 -344095
10374 -344095 -15477 316793 270135 -84600 -195922 -280999 -241091 61758 238003 -13816
10364 -13816 -445910 -781151 -800977 -201899 -31067 27231 72408 -39633 -140694 -91656
10354 -91656 -120657 -440097 -781589 -921508 -1061028 -833108 -60330 420242 576819 720071
10344 720071 486404 18519 -194485 88694 394472 664343 909997 691621 283184 185734
10334 185734 289851 286677 326481 255350 -31659 35782 244469 1131 -144636 207304
10324B07304K66864J30206K52172m4892k85707j72729J08510J19232p1848j90153
10314C18959n5996r928r5468R5319J2669p2141k3409k59194K005K10558k1316
10303A02058L921J13424K65993J95202o5397j42912j05108J20613J38602J62560
10293G88956O4725j10436q2823n0329J63861K12668K24938p4337k93770j5658
10283H27795p7401l0989J78389L03479L64410J01792J39156N08127Q77950P63158
10273C955866j2773k47332j50428k97142J44487O36554O73656J71680J57338M19494
10263E451400P43205P14970K89327K48207L35423N1647k33746k19295l38468o77928
10253F364742k42309k6385j15806l86639o23625n19997l97219l36979j37600j13951
$$ plain form
10324 207304 474168 604374 856546 811654 525947 353218 461728 580960 509112 318959
10314 318959 262963 253035 157567 252886 265555 193414 170005 -89189 -87184 123374 102058
10303 102058 105979 219403 485396 680598 615201 472289 367181 487794 626396 788956
10293 788956 853681 743245 660422 610093 773954 986622 1211560 1137223 843453 827795
10283 827795 750394 719405 897794 1201273 1565683 1667475 1806631 2314758 3192708 3955866
10273 3955866 3943093 3695761 3545333 3248191 3392678 4029232 4702888 4874568 5031906 5451400
10263 5451400 6194605 6909575 7198902 7447109 7782532 7834179 7600433 7381138 7042670 6364742
10253 6364742 6122433 6096048 5980242 5593603 4969978 4449981 4052762 3715783 3578183 3464232
10243C464232j99159k33978k72107l17189m47393J11063O30669N5812m26054m46215
10233A919681l70451k62685l53068j39354n6950J4128K18927L17424P0656j44949
10223A213359M5125k73585q2317J83228K30128P6263j6168j27993n9967k12565
10213I75508n7959M2840O312j96405m13892n39324m52055J72862J73710N04460
10203B16057K28047k59771q9675j67644k24302K61399K49892o112L19715o0741
10193D66865k01317L7352J84247j00012j88474J03728J06510J8630k36597j8934
10183A71998J352k37136j67124M0430L59647L60733M27945J7037k32326q9725
10173F52831p5428j37501j94116l14712O6416K18558J28842j74153n51438j78240
$$ plain form
10243 3464232 3265073 3031095 2758988 2441799 1994406 2105469 2736138 2791950 2365896 1919681
10233 1919681 1549230 1286545 933477 794123 737173 751301 970228 1287652 1358308 1213359
10223 1213359 1258484 984899 902582 1085810 1315938 1392201 1376033 1248040 1188073 975508
10213 975508 917549 960389 966701 770296 356404 -182920 -634975 -462113 -288403 216057
10203 216057 444104 184333 94658 -72986 -297288 -35889 214003 207891 527606 466865
10193 466865 265548 302900 487147 387135 198661 302389 408899 427529 190932 171998
10183 171998 173350 -63786 -230910 -190480 169167 529900 957845 974882 742556 652831
10173 652831 577403 439902 245786 -68926 -2510 216048 344890 170737 -380701 -558941
10163e58941j76320j55484j31666J48153K79759N35478K04928r9763R1079R1793
10153B29016k29499o6965j41294p6568K20826K94987L67394J09496j52864l96799
10143A57730n88432j26667K33165K42209j01303k65719j63488k63561J1502k7283
10133h91847j99099K20953r2127r0219J23407J45783l26737p7004M49602K38642
10123d98646K10604L08653O5537k51292j58823P3766j92605P3775M07910M03811
10113D42690K88006l42861m95771l56842n16578k99617K50165O9553k39099l7059
10103a237413J652J39125K99436J5641J24592J14907m4845m3132P4198Q3633J78138
10092b94068J12105j09256J84585M34364M66421K53830m12091p88988k07343M62783
$$ plain form
10163 -558941 -735261 -890745 -1022411 -874258 -594499 -59021 145907 46144 137223 229016
10153 229016 -483 -67448 -208742 -285310 -64484 230503 597897 707393 554529 157730
10143 157730 -430702 -557369 -324204 -81995 -183298 -449017 -612505 -876066 -864564 -891847
10133 -891847 -1090946 -869993 -962120 -1052339 -928932 -783149 -1109886 -1186890 -737288 -498646
10123 -498646 -288042 20611 86148 -165144 -323967 -250201 -442806 -369031 38879 442690
10113 442690 730696 387835 -107936 -464778 -981356 -1280973 -1030808 -961255 -1200354 -1237413
10103 -1237413 -1235761 -1096636 -797200 -781559 -656967 -542060 -586905 -630037 -555839 -472206 -294068
10092 -294068 -181963 -291219 -106634 327730 794151 1047981 635890 -153098 -360441 102342
10082A02342J87899j55046j89379j66009j85565K80708J99500j75716O7670j85027
10072b18623j84267j31866l62353J16196M26403N47881L16338L46097l34815o32442
10062a11451m94772l25596j91174M23937P41576L10588k68016j3762J21781j01772
10052I1339p4132Q2199J20894j11555k37568k23482J6131K35391J41403j90730
10042a50110m80313j04975J52655J61271K51311p89k67256k66576o6584j62340
10032i33706L06780L92971L5024j43417R0200N61710N11097L6310k38004p33092
10022a14127n30734l26121j87759O5516K81701K47715R1443q5041J76343J62478
10012b18586J51733j10952k64809J77873K26361K46105J06598j4287m9950k12407
$$ plain form
10082 102342 290241 135195 -54184 -220193 -405758 -125050 74450 -101266 -33596 -218623
10072 -218623 -402890 -534756 -897109 -780913 -354510 193371 509709 855806 520991 -111451
10062 -111451 -606223 -931819 -1122993 -699056 42520 353108 85092 71330 193111 91339
10052 91339 17207 99406 220300 108745 -128823 -352305 -336174 -100783 40620 -150110
10042 -150110 -630423 -735398 -582743 -421472 -170161 -170950 -438206 -704782 -771366 -933706
10032 -933706 -626926 -233955 -198931 -342348 -252148 309562 820659 856969 618965 -114127
10022 -114127 -644861 -970982 -1158741 -1093225 -811524 -563809 -472366 -557407 -381064 -218586
10012 -218586 -66853 -177805 -442614 -264741 -38380 207725 314323 300036 250086 37679
10002C7679l92310m54564o4974J59624J92598J29604K91261L5270o8668k20752
9992c55232l52258j48158J03592M66738M09915j56316l34219o3893K24830J64175
9982d0826j79180m9037J62012O5198n8123m17879m12116J32197j16604m04580
9972a318938P327N03686N37269p345j32451J5477K39182J26649k83923n17177
9962h30244m74469J34410N71684N24599K18216R4708J80845q1806l59998j52216
9952a74271q7927Q2467k85338n45342q7758P1290L45274J95792J19301J04507
9942b62005j9512O6939j56131k21112J59801J20509k50775m29877k22388J01542
9932a113009L01104J92850M929j43694k46839J34597R3935k38628m65985R9398
$$ plain form
10002 37679 -354631 -809195 -874169 -714545 -521947 -392343 -101082 -65812 -134480 -355232
9992 -355232 -707490 -855648 -752056 -285318 124597 -31719 -365938 -429831 -205001 -40826
9982 -40826 -220006 -269043 -107031 -41833 -99956 -517835 -929951 -797754 -914358 -1318938
9972 -1318938 -1311611 -807925 -270656 -278001 -410452 -394975 -155793 -29144 -313067 -830244
9962 -830244 -1304713 -1170303 -598619 -74020 144196 238904 419749 337943 -22055 -174271
9952 -174271 -262198 -179731 -465069 -1010411 -1098169 -1026879 -681605 -485813 -366512 -262005
9942 -262005 -281517 -214578 -370709 -591821 -432020 -311511 -562286 -992163 -1214551 -1113009
9932 -1113009 -811905 -619055 -614126 -757820 -1004659 -870062 -776127 -1014755 -1480740 -1381342
9922a381342P71551O66572J61087k7551Q2022o5163j09150j34457p6989J69336
9912E5916j84445L1492K29114K86758Q3938m35862o69365j99250J01416R9922
9902f00366K80508R1450J36509j1517J53330L81590L60187l23054r55056n08897
9892i95316K15044L59932k3034l70417r9902K75281J63075k35559l18927Q1604
9882i48219L42818L9737l6037J04681j06798j33582M11255N59499K02789j57348
9872B78795P2307R0617J7577K29820K2038j37724k46711j62624j60711k1869n5680
9861g4165k83108j55016j4413J3525R943j45157k90701K01982J78607k32656j04588
9850h95747N50001M29385P1828K16161M1372k59248j81031J14954K47808n8207
$$ plain form
9922 -1381342 -609791 56781 217868 190317 272339 207176 98026 -36431 -113420 55916
9912 55916 -128529 -97037 132077 418835 502773 66911 -602454 -801704 -700288 -600366
9902 -600366 -319858 -228408 -91899 -103416 49914 431504 791691 468637 -486419 -995316
9892 -995316 -780272 -420340 -443374 -813791 -913693 -638412 -475337 -710896 -1029823 -948219
9882 -948219 -605401 -565664 -601701 -497020 -603818 -737400 -326145 233354 436143 278795
9872 278795 351102 441719 459296 689116 711154 573430 326719 164095 3384 -18485 -74165
9861 -74165 -357273 -512289 -526702 -513177 -503234 -648391 -939092 -737110 -558503 -791159 -895747
9850 -895747 -345746 83639 155467 371628 413000 153752 -27279 87675 335483 277276
9840B77276n58358j35059K17474K40155J2126l55650r7759K07179K90334J14728
9830B12446k01303k73981L6731J99171M37174L57204J27157l17867m53276n5772
9820F7684j36720k54833j26265J32537L12219M39010q6877l77557k36311n0806
9810c17919l2528K00930K06393K62658M16232J51812q9956l06406k48823j33862
9800A08531m1632K2302j58498l12905j09351p062l33314j45130K65042N35896
9790a76121R0984r4538J8430K57050J76280p1867m8643p5363k071k22589j09644
9779b58092J8943J78757P945o7832N7776R5367P9963q1235k31707K17860M34825
$$ plain form
9840 277276 -281082 -416141 -198667 41488 53614 -302036 -399795 -192616 97718 212446
9830 212446 11143 -262838 -226107 -26936 410238 767442 894599 576732 123456 67684
9820 67684 -69036 -323869 -450134 -317597 -5378 433632 346755 -30802 -267113 -317919
9810 -317919 -350447 -149517 56876 319534 735766 887578 797622 491216 242393 108531
9800 108531 66899 89201 -69297 -382202 -491553 -498615 -831929 -977059 -712017 -176121
9790 -176121 -85137 -179675 -161245 95805 272085 200218 151575 76212 74141 -148448 -258092
9779 -258092 -239149 -60392 -52447 -120279 -62503 32864 112827 31592 -200115 17745 452570
$$ [...]
##END NTUPLES=NMR SPECTRUM
##END=
