##TITLE=C13_Ser 3514-NEA
 CDCl3, 22200 sc

 13.2.2024
##JCAMPDX= 6.0         $$ Bruker NMR JCAMP-DX V2.0
##DATA TYPE= NMR SPECTRUM
##DATA CLASS= NTUPLES
##ORIGIN= UXNMR, Bruker Analytische Messtechnik GmbH
##OWNER= root
$$ XWIN-NMR		Version 3.5
$$ Wed Feb 14 13:24:49 2024 Russian Standard Time (UT+4h)  she@DPX200
##.OBSERVE FREQUENCY= 50.327896
##.OBSERVE NUCLEUS= ^13C
##.ACQUISITION MODE= SIMULTANEOUS
##.ACQUISITION SCHEME= undefined
##.AVERAGES= 22001
##.DIGITISER RES= 17
##SPECTROMETER/DATA SYSTEM= spect
##.PULSE SEQUENCE= zgpg30
##.SOLVENT NAME= CDCl3
##.SHIFT REFERENCE= (INTERNAL, CDCl3, 0, 222.646)
##AUDIT TRAIL= $$ (NUMBER, WHEN, WHO, WHERE, WHAT)
$$ ##TITLE= Audit trail, XWIN-NMR		Version 3.5
$$ ##JCAMPDX= 5.01
$$ ##ORIGIN= Bruker BioSpin GmbH
$$ ##OWNER= she
$$ F:/spectra/data/she/nmr/c13/1/pdata/1/auditp.txt
$$ ##AUDIT TRAIL=  $$ (NUMBER, WHEN, WHO, WHERE, WHAT)
(   1,<2024-02-14 13:21:31.57 +0400>,<she>,<DPX200>,
      <created by zg, POWCHK disabled, PULCHK disabled
       terminated by command 'halt'
       configuration hash MD5:
       00 E9 B6 7A A2 85 ED C7 34 08 36 98 17 FE 4E 26
       data hash MD5: 32K
       18 E2 E8 00 30 A0 B8 74 03 B2 11 D6 3A FA 35 27>)
(   2,<2024-02-14 13:21:36.87 +0400>,<she>,<DPX200>,
      <Start of raw data processing
       efp BC_mod = 2 LB = 2 FT_mod = 6 PKNL = 1 PHC0 = -371.7924 PHC1 = 26.81886 SI = 32K 
       data hash MD5: 32K
       9D 56 90 65 6E 6A 1B 51 A3 91 E6 E4 63 90 3D CC>)
(   3,<2024-02-14 13:21:39.84 +0400>,<she>,<DPX200>,
      <abs ABSG = 5 
       data hash MD5: 32K
       B6 34 11 A7 A3 0D BA C5 46 CE 77 5F 67 3E 53 DD>)
(   4,<2024-02-14 13:22:31.48 +0400>,<she>,<DPX200>,
      <abs ABSG = 5 
       data hash MD5: 32K
       D3 46 A9 33 19 63 F9 36 59 8D 0D D9 D4 D1 DE FC>)
(   5,<2024-02-14 13:22:43.06 +0400>,<she>,<DPX200>,
      <pk PHC0 = -22.43303 PHC1 = 0 
       data hash MD5: 32K
       0E BF 5E 06 06 78 CF 02 81 E3 6B AE 72 6B AE 4E>)
(   6,<2024-02-14 13:23:19.35 +0400>,<she>,<DPX200>,
      <pk PHC0 = 15.30621 PHC1 = 2.8 
       data hash MD5: 32K
       B1 6C BE 57 5B FF A7 ED 72 68 64 29 86 F8 74 2C>)
(   7,<2024-02-14 13:23:23.14 +0400>,<she>,<DPX200>,
      <abs ABSG = 5 
       data hash MD5: 32K
       83 BB 5A 79 6B BE 8D 04 F2 46 FD 74 9B 37 A5 A1>)
$$ ##END=
$$ 
$$ hash MD5
$$ 54 81 8B B9 FE 8D 7E E1 C5 AC FF D7 3F AB 73 8B
##$RELAX= 
##$RELAX= 
##$RELAX= 
##$RELAX= 
##$RELAX= 
##$RELAX= 
##$RELAX= 
##$RELAX= 
$$ Bruker specific parameters
$$ --------------------------
##$DU= <F:/spectra>
##$EXPNO= 1
##$NAME= <c13>
##$PROCNO= 1
##$TYPE= <nmr>
##$USER= <she>
##$AMP= (0..31)
100 100 100 100 100 100 100 100 100 100 100 100 100 100 100 100 100 100 
100 100 100 100 100 100 100 100 100 100 100 100 100 100 
##$AQSEQ= 0
##$AQ_mod= 1
##$AUNM= <au_zg>
##$AUTOPOS= <>
##$BF1= 50.322709
##$BF2= 200.13
##$BF3= 50.322709
##$BF4= 500.13
##$BF5= 500.13
##$BF6= 500.13
##$BF7= 500.13
##$BF8= 500.13
##$BYTORDA= 1
##$CFDGTYP= 0
##$CFRGTYP= 5
##$CHEMSTR= <none>
$$ [...]
##$SUBNAM4= <"">
##$SUBNAM5= <"">
##$SUBNAM6= <"">
##$SUBNAM7= <"">
##$SUBNAM8= <"">
##$SUBNAM9= <"">
##$SW= 239.972175391363
##$SWIBOX= (0..15)
0 1 3 0 0 0 0 0 0 0 0 0 0 0 0 0 
##$SW_h= 12077.2946859903
##$TD= 32768
##$TD0= 1
##$TE= 0
##$TE2= 300
##$TE3= 300
##$TEG= 300
##$TL= (0..7)
120 120 120 120 120 120 120 120 
##$TP= (0..7)
150 150 150 150 150 150 150 150 
##$TP07= 0
##$TPNAME0= <>
##$TPNAME1= <>
##$TPNAME2= <>
##$TPNAME3= <>
##$TPNAME4= <>
##$TPNAME5= <>
##$TPNAME6= <>
##$TPNAME7= <>
##$TPOAL= (0..7)
0.5 0.5 0.5 0.5 0.5 0.5 0.5 0.5 
##$TPOFFS= (0..7)
0 0 0 0 0 0 0 0 
##$TUNHIN= 0
##$TUNHOUT= 0
##$TUNXOUT= 0
##$USERA1= <user>
##$USERA2= <user>
##$USERA3= <user>
##$USERA4= <user>
##$USERA5= <user>
##$V9= 5
##$VALIST= <valist>
##$VCLIST= <CCCCCCCCCCCCCCC>
##$VD= 0
##$VDLIST= <DDDDDDDDDDDDDDD>
##$VPLIST= <PPPPPPPPPPPPPPP>
##$VTLIST= <TTTTTTTTTTTTTTT>
##$WBST= 1024
##$WBSW= 4
##$XGAIN= (0..3)
0 0 0 0 
##$XL= 0
##$YL= 0
##$YMAX_a= 123590452
##$YMIN_a= -104012852
##$ZGOPTNS= <>
##$ZL1= 120
##$ZL2= 120
##$ZL3= 120
##$ZL4= 120
##$ABSF1= 222.7558
##$ABSF2= -17.24104
##$ABSG= 5
##$ABSL= 3
##$ALPHA= 0
##$AQORDER= 0
##$ASSFAC= 0
##$ASSFACI= 0
##$ASSFACX= 0
##$ASSWID= 0
##$AUNMP= <proc_1d>
##$AZFE= 0.1
##$AZFW= 0.5
##$BCFW= 0
##$BC_mod= 2
##$BYTORDP= 0
##$COROFFS= 0
##$CY= -3
##$DATMOD= 1
##$DC= 0
##$DFILT= <>
##$DTYPP= 0
##$F1P= 0
##$F2P= 0
##$FCOR= 0.5
##$FTSIZE= 32768
##$FT_mod= 6
##$GAMMA= 0
##$GB= 0
##$INTBC= 1
##$INTSCL= 4.134877e-10
##$ISEN= 128
##$LB= 2
##$LEV0= 0
##$LPBIN= 0
##$MAXI= 10000
##$MC2= 0
##$MEAN= 0
##$ME_mod= 0
##$MI= 0.1934396
##$NCOEF= 0
##$NC_proc= 1
##$NLEV= 6
##$NOISF1= 120.0001
##$NOISF2= 80.00006
##$NSP= 0
##$NTH_PI= 0
##$NZP= 0
##$OFFSET= 222.646
##$PC= 1.4
##$PHC0= -378.9192
##$PHC1= 29.61886
##$PH_mod= 1
##$PKNL= yes
##$PPARMOD= 0
##$PSCAL= 0
##$PSIGN= 0
##$REVERSE= no
##$SF= 50.3227304925793
##$SI= 32768
##$SIGF1= 140
##$SIGF2= 120
##$SINO= 11.81781
##$SIOLD= 32768
##$SREGLST= <13C.CDCl3>
##$SSB= 0
##$STSI= 32768
##$STSR= 0
##$SW_p= 12077.2946859903
##$SYMM= 0
##$S_DEV= 0
##$TDeff= 32768
##$TDoff= 0
##$TI= <>
##$TILT= no
##$TM1= 0
##$TM2= 0
##$TOPLEV= 0
##$USERP1= <user>
##$USERP2= <user>
##$USERP3= <user>
##$USERP4= <user>
##$USERP5= <user>
##$WDW= 1
##$XDIM= 32768
##$YMAX_p= 545528331
##$YMIN_p= -5846644
$$ End of Bruker specific parameters
$$ ---------------------------------
##NTUPLES= NMR SPECTRUM
##VAR_NAME=  FREQUENCY,     SPECTRUM/REAL,   SPECTRUM/IMAG
##SYMBOL=    X,             R,               I
##VAR_TYPE=  INDEPENDENT,   DEPENDENT,       DEPENDENT
##VAR_FORM=  AFFN,          ASDF,            ASDF
##VAR_DIM=   32768,         32768,           32768
##UNITS=     HZ,            ARBITRARY UNITS, ARBITRARY UNITS
##FACTOR=    0.368581032318806, 1,           1
##FIRST=     11204.1544566776, 0,            0
##LAST=      -873.140229312654, 0,           0
##MIN=       -873.140229312654, -5846644,    0
##MAX=       11204.1544566776, 545528331,    0
$$ Real data points
##PAGE= N=1
##DATA TABLE= (X++(R..R)), XYDATA
$$ [...]
15708g47184J11519J8187m2262M503J04782K02079K67199L19664L12100K46557
$$ -747184 -635665 -617478 -659740 -655237 -550455 -348376 -81177 238487 550587 797144
15698G97144J91202R0143k3620m0238l028M1494p217k19664l13759j82498R597
$$ 797144 988346 1078489 1054869 1014631 1011603 1053097 1045880 826216 512457 329959 339556
15687C39556J47475J79647K01950J80182O1568j18851j64838J728K58034M08079
$$ 339556 487031 666678 868628 1048810 1110378 991527 826689 828417 1086451 1494530
15677A494530K85041j5745j95720j66153j79847l32750m12855k76129n1944j6288
$$ 1494530 1779571 1763826 1568106 1401953 1222106 889356 476501 200372 148428 132140
15667A32140j65548k46806j39154R3440K51246K90564L47400L91179L60207K61028
$$ 132140 -33408 -280214 -419368 -325928 -74682 215882 563282 954461 1314668 1575696
15657A575696J34340J7892j39179k86536k94151j55123q6023j91988k74918k20885
$$ 1575696 1710036 1727928 1588749 1302213 1008062 852939 766916 574928 300010 79125
15647G9125m5445J41996J29776j35601k95159j57654L2484J35329K11901K75465
$$ 79125 33680 175676 305452 169851 -125308 -282962 -250478 -115149 96752 372217
15637C72217L98620M62338L26324O1653k41916m41158n12683m88602l07572m1173
$$ 372217 770837 1233175 1559499 1621152 1379236 938078 425395 -63207 -370779 -411952
15627d11952J07577J23190J07180J63727K93462L89086L67218L05812K31855M0996
$$ -411952 -304375 -181185 -74005 89722 383184 772270 1139488 1445300 1677155 1718151
15617A718151j49560j99596k11596l86338n67583m94163l32212k12000j37565
$$ 1718151 1568591 1368995 1157399 771061 203478 -290685 -622897 -834897 -972462
15608i72462p6188O4323K56562M32806M16441K27489J22183P9677j4348n6659
$$ -972462 -1048650 -984327 -727765 -294959 121482 348971 471154 550831 536483 479824
15598D79824O355L0181l4665N037K23318K76649K3975k24323k31177j39420j07338
$$ 479824 486179 516360 481695 486732 710050 986699 1010674 786351 555174 415754 308416
15587C08416l6067L6787l145q9838j33968k21877k70751j13232J06040K18599
$$ 308416 272349 309136 305991 216153 82185 -139692 -410443 -523675 -417635 -199036
15577a99036J71051J414j33093p3419Q7243J28564K7242n2077o6325j10110j48046
$$ -199036 -27985 -26571 -159664 -233083 -145840 -17276 9966 -42111 -108436 -218546 -366592
15566c66592j33773j4764K14527L71205L40849J04545j63825k97594l27457l21160
$$ -366592 -500365 -515129 -300602 70603 411452 515997 352172 54578 -272879 -594039
15556e94039k53488j07728O7773J80859J36750n984q5170n6932n5316l9809L5329
$$ -594039 -847527 -955255 -887482 -706623 -569873 -575857 -661027 -717959 -773275 -813084 -777755
15545g77755P3717L9224J6491O1062J00579Q4587K0892m7433m8752M6826J24864
$$ -777755 -704038 -664814 -648323 -587261 -486682 -402095 -381203 -428636 -477388 -430562 -305698
15534c05698J63639K00458K11205J81756J82429J30454k9272j07986N2151K53613
$$ -305698 -142059 58399 269604 451360 633789 764243 734971 626985 679136 932749
15524I32749K71200J69557P0762l4101j47906j49710q1840j18449l23007n46503
$$ 932749 1203949 1373506 1444268 1410167 1262261 1112551 1030711 912262 589255 42752
15514D2752n88255n00223l19251R2695N10844O39884N98463M87967L07420J21446
$$ 42752 -545503 -1045726 -1364977 -1272282 -761438 -121554 476909 964876 1272296 1393742
15504A393742K0543n1157k31931m94895o87858o14632l17141L5252L45356M65342
$$ 1393742 1414285 1363128 1131197 636302 -51556 -666188 -983329 -948077 -602721 -137379
15494a37379L26876J12698J7016j6774j01063j81908k70027l80827m01215k89531
$$ -137379 189497 302195 319211 302437 201374 19466 -250561 -631388 -1032603 -1322134
15484a322134j74031j19545k2974O0677M8686J371k6808K0799J55668K58352K28539
$$ -1322134 -1496165 -1615710 -1638684 -1578007 -1529321 -1527950 -1554758 -1533959 -1378291 -1119939 -891400
15473h91400J11686J0938M6028K32536L39087K64029K12421K02387J08967K5385
$$ -891400 -779714 -768776 -722748 -490212 -151125 112904 325325 527712 636679 662064
15463F62064k5285r7051o1126Q6168J54724M4220k41735n15399m89136k24603
$$ 662064 636779 539728 478602 564770 719494 763714 521979 6580 -482556 -707159
15453g07159L7391J47101J77852K23997K10290J92456K12918K52996K25541J15136
$$ -707159 -669768 -522667 -344815 -120818 89472 281928 494846 747842 973383 1088519
15443A088519L4015n9679j57014k17037k44997k84728k51515p5625J63489K56608
$$ 1088519 1122534 1062855 905841 688804 443807 159079 -92436 -168061 -4572 252036
15433B52036J74704O0429l7648m4878p2925k17677m13346m95858l62637j47228
$$ 252036 426740 487169 449521 404643 331718 114041 -299305 -795163 -1157800 -1305028
15423a305028O1388J11903N5329J29878K08101R3684j76150l66437l11570j37190
$$ -1305028 -1243640 -1131737 -1076408 -946530 -738429 -644745 -820895 -1187332 -1498902 -1636092
15413a636092p1449p7683M4260L18943O05054O88202N80117M92233L71896J60953
$$ -1636092 -1707541 -1785224 -1740964 -1422021 -816967 -128765 451352 943585 1315481 1476434
15403A476434n6369o9885J13761J15468n3669j88275j87644p4572l9534l7201
$$ 1476434 1420065 1350180 1463941 1579409 1525740 1337465 1149821 1075249 1035715 998514
15393I98514Q5520K50062L41342K56996o6193l94259n33074n18703m51385m24981
$$ 998514 1084034 1334096 1675438 1932434 1866241 1471982 938908 420205 -31180 -456161
15383d56161l83509k94146k44713j93523m9935J49510L14575L78235L12570J62072
$$ -456161 -839670 -1133816 -1378529 -1572052 -1621987 -1472477 -1157902 -779667 -467097 -305025
15373c05025o116j46859j55153l4793O8181J45657J11942J2752m5537p9489j40683
$$ -305025 -311141 -458000 -613153 -647946 -579765 -434108 -322166 -309414 -354951 -434440 -575123
15362e75123k69017l47766k08667J6957O9350K3787Q2864K26054K71014J88260
$$ -575123 -844140 -1191906 -1400573 -1383616 -1314266 -1290479 -1207615 -981561 -710547 -522287
15352e22287O3958o657L1901J23421J87677J81595Q3609n8565j33351q3697R6980
$$ -522287 -458329 -464986 -433085 -309664 -121987 59608 143217 84652 -48699 -132396 -35416
15341c5416L16275L66801K10054J8687r2192j03137j04311k25878l84862l57344
$$ -35416 280859 647660 857714 876401 784209 681072 576761 350883 -33979 -391323
15331c91323k48349k16259j94067j47548q0985J3392J86971L73718L80080J75300
$$ -391323 -639672 -855931 -1049998 -1197546 -1278531 -1265139 -1078168 -704450 -324370 -149070
15321a49070m8481j06392j4643O6057J8424q7959r7554J4336P1021K2422l0382
$$ -149070 -197551 -303943 -318586 -252529 -234105 -322064 -419618 -405282 -334261 -311839 -342221
15310c42221m9133N9545K29680J93677P5874N5743K7132p8898j02172l2233j19613
$$ -342221 -391354 -331809 -102129 91548 167422 223165 250297 171399 69227 36994 -82619
15299h2619k38752j05696J53705K15809J39555J43218J75533P5900r3157j99228
$$ -82619 -321371 -427067 -273362 -57553 82002 225220 400753 476653 383496 184268
15289A84268k36751k47816k70970k52510r8619J36081K99227K41862O939j75337
$$ 184268 -52483 -300299 -571269 -823779 -922398 -786317 -487090 -245228 -238289 -413626
15279d13626k28474k09584j30162r1018k9496J02069J82701J98215J80826J84227
$$ -413626 -642100 -851684 -981846 -1072864 -1102360 -1000291 -817590 -619375 -438549 -254322
15269b54322J94898J50397M1296p8599p5964L9902J67774J76838L6213j57693
$$ -254322 -59424 90973 132269 53670 -22294 17608 185382 362220 398433 240740
15259B40740k05813q8454J5896O6880P06j03189r2193m1536j277P9336J84574
$$ 240740 34927 -53527 -37631 29249 29955 -73234 -165427 -206963 -208240 -128904 55670
15248E5670K16989J51195J09910J30456J71777K59887L27779K50708R2094q2180
$$ 55670 272659 423854 533764 664220 835997 1095884 1423663 1674371 1766465 1684285
15238A684285j91185k10026k57685l06318k18141r1239o1281j28544j45330J8770
$$ 1684285 1493100 1283074 1025389 719071 500930 409691 348410 219866 74536 93306
15228I3306J69419P5112j76688l11471l87558m58634l57399o6963K19409L55619
$$ 93306 262725 337837 161149 -150322 -537880 -996514 -1353913 -1420876 -1201467 -845848
15218h45848K61104N1957M833J36062J56369j3093j95518l20859l59107k87002
$$ -845848 -584744 -532787 -527954 -391892 -235523 -248616 -444134 -764993 -1124100 -1411102
15208a411102j87532j17906m8050Q2088K39782M06794N55810N53911L75622P7968
$$ -1411102 -1598634 -1716540 -1764590 -1682502 -1442720 -1035926 -480116 73795 449417 527385
15198E27385k34634k76799k6464J60121Q9029N861M0932o1830k86755m56786m44230
$$ 527385 292751 15952 -10512 149609 238638 244499 285431 223601 -63154 -519940 -964170
15187i64170k07594k429M8259J48575L44762M54869K95446O8645j9980j17706
$$ -964170 -1171764 -1174193 -1125934 -977359 -632597 -177728 117718 186363 166383 48677
15177D8677k13290j72944j06509p4753k3804J02035K30975K70249K62384K63992
$$ 48677 -164613 -337557 -444066 -518819 -542623 -440588 -209613 60636 323020 587012
15167E87012L14661L18530K63433J36314o2818k24541l89860m83882m07401k53616
$$ 587012 901673 1220203 1483636 1619950 1557132 1332591 942731 458849 51448 -202168
15157b02168j56817r8795L8842J92084K14769J62576K07636K48346J64485n1783
$$ -202168 -358985 -457780 -418938 -226854 -12085 150491 358127 606473 770958 719175
15147G19175k78644m12913m91677m72340l72537k16773m6245J01007J88048K04217
$$ 719175 440531 27618 -464059 -936399 -1308936 -1525709 -1571954 -1470947 -1282899 -1078682
15137a078682K51672L04789L29756L06107K20258J80830J73546J97499L20465
$$ -1078682 -827010 -522221 -192465 113642 333900 514730 688276 885775 1206240
15128A206240L54346K32523J55727J96345J86583L177k04223l71707m57728m34092
$$ 1206240 1560586 1793109 1948836 2145181 2331764 2334941 2130718 1759011 1301283 867191
15118H67191l50613k38083j05374m5590k1549Q534K2324P2932R3811L7604k2114
$$ 867191 516578 278495 173121 127531 105982 114516 136840 209772 303583 341187 319073
15107C19073j16650l35781m46794k78084q2471r8285k22926k45937j20434R5712
$$ 319073 202423 -133358 -580152 -858236 -940707 -1038992 -1261918 -1507855 -1628289 -1532577
15097a532577K77526L28618L67255L82293L18699K06446L2425j37785k65119l33121
$$ -1532577 -1255051 -926433 -559178 -176885 141814 348260 380685 242900 -22219 -355340
15087c55340k13091J12399L73557M07280K53229O9989j0784p2908j69569k56035
$$ -355340 -568431 -456032 -82475 324805 578034 648023 637239 564331 394762 138727
15077A38727l31202l12314j72580K1761J96565K73372L13017L77542L92842K72903
$$ 138727 -192475 -504789 -677369 -655608 -459043 -185671 127346 504888 897730 1170633
15067A170633M6612k31661m11879l96708j98085Q2820K59603J95534J5810n9567
$$ 1170633 1217245 985584 573705 176997 -21088 61732 321335 516869 532679 473112
15057D73112m7135r0183j15994p7735r0862o0223J2794R2199J30439N0941N975
$$ 473112 425977 335794 219800 142065 51203 -9020 3774 95973 226412 277353 283328
15046B83328L1508L0345P0699J22712J32537P7184L9522O3384M3216m0041q2797
$$ 283328 314836 345181 415880 538592 671129 748313 787835 851219 894435 854394 771597
15035G71597o8851o1274p5321j03556j11150j06286r1635l5348Q2241J69460N8402
$$ 771597 702746 641472 566151 462595 351445 245159 153524 118176 200417 369877 428279
15024D28279k10774l09220r1037N7922r7395k35483j13742Q7086J08896m7339
$$ 428279 217505 -91715 -182752 -124830 -222225 -457708 -571450 -484364 -375468 -422807
15014d22807j46052n0331J06551J73143J79999J98855K83806L15402J40487R200
$$ -422807 -568859 -619190 -512639 -339496 -159497 39358 323164 638566 779053 788253
15004G88253Q3979J55196O9681o5380j07767r5432l1198J8J192L0318O1186R8498
$$ 788253 872232 1027428 1097109 1031729 923962 828530 797332 797350 798542 828860 890046 988544
14992I88544J22023J09423P0559m0914j50593j44367o2537l6306j27083k12413
$$ 988544 1110567 1219990 1290549 1249635 1099042 954675 892138 855832 728749 516336
14982E16336k13479j98727j56995m1470J82560L12158K01773N6974p1054k42084
$$ 516336 302857 104130 -52865 -94335 88225 400383 602156 659130 588076 345992
14972C45992l96085m26108l04213l3360K37365K76129O6712j30271j31595m5911
$$ 345992 -50093 -476201 -780414 -813774 -576409 -300280 -233568 -363839 -495434 -541345
14962e41345R3745K03824K20748K65376K22778J7412j47103j43960k2066J01324
$$ -541345 -447600 -243776 -23028 242348 465126 482538 335435 191475 169409 270733
14952B70733P8978j8108o2999j33957j73022n8907J10906K26946L21256M15845
$$ 270733 349711 331603 268604 134647 -38375 -97282 13624 240570 561826 977671
14942I77671M04861L70193L32597J53660p7101j90388j36628j6342M8546q560
$$ 977671 1382532 1752725 2085322 2238982 2161881 1971493 1834865 1818523 1867069 1858509
14932A858509j50768k51427m00263m69091l08261j07053n3132o2373j1263N8863
$$ 1858509 1707741 1456314 1056051 586960 278699 171646 118514 56141 44878 103741
14922A03741P4317O0545N6586R4821K39112L28330J67242j46100l63818m69598
$$ 103741 178058 238603 295189 390010 629122 957452 1124694 978594 614776 145178
14912A45178m94701l35626q2132J65007K66756O4350k21542k43245q843J18163
$$ 145178 -349523 -685149 -767281 -602274 -335518 -271168 -492710 -735955 -744798 -626635
14902f26635m3128k89797l52101j72092N7054J68091J31009K8740l0828Q9586
$$ -626635 -669763 -959560 -1311661 -1483753 -1426699 -1258608 -1127599 -1098859 -1129687 -1040101
14892a040101L04472L70190L18133L05102K65415K07891K20201K00646R0199l9823
$$ -1040101 -735629 -365439 -47306 257796 523211 731102 951303 1151949 1242148 1202325
14882A202325k43730m05808m41354m06521k35555O8528K91376K81447J47628N0869
$$ 1202325 958595 552787 111433 -295088 -530643 -462115 -170739 110708 258336 309205
14872C09205J32277K19049J26243l0603q1396N010J33453J52261K2922j56910
$$ 309205 441482 660531 786774 756171 674775 679785 813238 965499 988421 831511
14862H31511k55454j99612m6481J34784K61487K53622N9346j66324j91148m1990
$$ 831511 576057 376445 329964 464748 726235 979857 1039203 872879 681731 639741
14852F39741Q6761O0038j09479l06560m24007l81463k57198j27094k0031P3090
$$ 639741 726502 786540 677061 370501 -53506 -434969 -692167 -819261 -839292 -766202
14842g66202J62859K06732J83094R3633l2883j33514j26662j6376J60801K99893
$$ -766202 -603343 -396611 -213517 -119884 -152767 -286281 -412943 -429319 -268518 31375
14832C1375K71759J64159O2344j17872k15956j46365m8016k7835j1808Q3630J97173
$$ 31375 303134 467293 529637 411765 195809 49444 1428 -26407 -38215 45415 242588
14821B42588K67486K28366J29111R8840O9574o2158j29962r0325j40186k25675
$$ 242588 510074 738440 867551 966391 1035965 973807 843845 753520 613334 387659
14811C87659j72095p813K0800j36346k86316l14146k23109m7739J23794K14414
$$ 387659 215564 207751 228551 92205 -194111 -508257 -731366 -779105 -655311 -440897
14801d40897K18918K34097K62176J78646O9151N5794P7358M2269j5969q285j0255
$$ -440897 -221979 12118 274294 452940 522091 577885 655243 697512 681543 673258 663003
14790F63003l5602N7892K14805K76404K31592P8482o7121j79585l27356l62815
$$ 663003 627401 685293 900098 1176502 1408094 1486576 1419455 1239870 912514 549699
14780E49699k05883j05692j48824j17043l535K2434J0408L9529P8131L2649l7381
$$ 549699 343816 238124 89300 -27743 -31278 -8844 1564 41093 119224 151873 114492
14769A14492k3488K524K9925Q2184R6197M9095M3683J04575J51492J40856J927
$$ 114492 91004 93528 123453 205637 301834 350929 394612 499187 650679 791535 793462
14758G93462j98961k82819k30983j01579Q0586K37384K86706J70161q8656k16993
$$ 793462 594501 311682 80699 -20880 59706 297090 583796 753957 665301 448308
14748D48308j00934J72074M49829N82738N29496L24547J82509J98254J22302j21261
$$ 448308 347374 519448 969277 1552015 2081511 2406058 2588567 2786821 2909123 2787862
14738B787862l26228m06439l72764k76212j78977k08374l37793l59423k33199
$$ 2787862 2461634 2055195 1682431 1406219 1227242 1018868 681075 321652 88453
14729H8453k9893K39395M33836M39287L23200J95338J14690J7465o1395o3507
$$ 88453 58560 297955 731791 1171078 1494278 1689616 1804306 1821771 1760376 1696869
14719A696869r2102j05615o3927j17609k62063k31843o7953N5487J20648J2305
$$ 1696869 1604767 1499152 1435225 1317616 1055553 823710 755757 811244 931892 944197
14709I44197k76490l84694k11965J4042K86539N37714N41505L22693J20202J8707
$$ 944197 667707 283013 71048 85090 371629 909343 1450848 1773541 1893743 1912450
14699A912450J3312N9436J45770J94542J90806L40168O03440P83386R31366J137199
$$ 1912450 1925762 1985198 2130968 2325510 2516316 2856484 3459924 4243310 5174676 6311875
14689F311875J368153J532348J674708J938139K343474K777099L209609L746715
$$ 6311875 7680028 9212376 10887084 12825223 15168697 17945796 21155405 24902120
14681B4902120M426248N122479N470662M476107J318864k879275n701961o332091
$$ 24902120 29328368 34450847 39921509 44397616 45716480 42837205 37135244 30803153
14673C0803153n790663m966726m157076l446953k790116k157147j503411r31887
$$ 30803153 25012490 20045764 15888688 12441735 9651619 7494472 5991061 5059174
14665E059174o04437n25349m73667k42798N8783J09948m2463k13436m11010m58627
$$ 5059174 4454737 3929388 3455721 3212923 3271706 3381654 3339191 3125755 2714745 2256118
14655B256118l41977k58297k82226l16928k85886k18574j24454J2084M5687n9047
$$ 2256118 1914141 1655844 1373618 1056690 770804 552230 427776 439860 485547 426500
14645D26500j52177j65528m0823J87207L08735K77015K80040L83716M26817K80551
$$ 426500 274323 108795 67972 255179 563914 840929 1120969 1504685 1931502 2212053
14635B212053l7886m16308o71455o95462m98400k95717j69242n2776Q2496K02703
$$ 2212053 2174167 1757859 1086404 390942 -107458 -403175 -572417 -625193 -542697 -339994
14625c39994K30331J37770P7720J19206J14433M5365P124j0651L3219K14093L55263
$$ -339994 -109663 28107 105827 225033 339466 384831 391955 381304 414523 628616 983879
14614I83879K85882J22343m9575q2158J02606L11112L39805J43819p2175j21283
$$ 983879 1269761 1392104 1342529 1260371 1362977 1674089 2013894 2157713 2085538 1964255
14604A964255n535O1870K7222m646p7508k44242l79637l73556k58095j81549j75641
$$ 1964255 1958720 2020590 2047812 2043166 1965658 1721416 1341779 968223 710128 528579 352938
14593C52938j43030q5167p0896j25160j88507j01646P0585J13566P8853P2715
$$ 352938 209908 124741 53845 -71315 -259822 -361468 -290883 -177317 -98464 -25749
14583b5749J05002J08572O7465k6380j64948k94840k77757p5887P2660k1582j07328
$$ -25749 79253 187825 255290 228910 63962 -230878 -508635 -584522 -511862 -533444 -640772
14572f40772M2532K37144L11466K57101J21989K4850r2622k63698k93490j50617
$$ -640772 -598240 -361096 -49630 207471 329460 354310 261688 -2010 -295500 -446117
14562d46117J9899J09341P9742J1894J3392M2897K1591N9935K07092K58996J12850
$$ -446117 -426218 -316877 -237135 -225241 -211849 -168952 -147361 -87426 119666 378662 491512
14551D91512q6833j68433j05266m8922n7127m4486l1079l9612r0686j45839j38245
$$ 491512 404679 236246 130980 82058 24931 -19555 -50634 -90246 -180932 -326771 -465016
14540d65016r0043k1894q455j18293k60811k76356j39799n4467p4686j16281m9682
$$ -465016 -555059 -576953 -585408 -703701 -964512 -1240868 -1380667 -1435134 -1509820 -1626101 -1675783
14529a675783K14663M07181M13908M97482N53239L92953J93153P6467o278r7431
$$ -1675783 -1461120 -1053939 -640031 -142549 410690 803643 996796 1073263 1066985 969554
14519I69554k42068l17927l03202l01497k32594j35439k7547J04669J69082J91605
$$ 969554 727486 409559 106357 -195140 -427734 -563173 -590720 -486051 -316969 -125364
14509a25364K14649J92183J30041M5672q8274k01595j71582l6673J04095K90592
$$ -125364 89285 281468 411509 457181 368907 167312 -4270 -40943 63152 353744
14499C53744M07261L06808Q9500q9216k42860k55676q7769j0596r179N4621O2202
$$ 353744 761005 1067813 1157313 1068097 825237 569561 481792 471196 462017 516638 578840
14488E78840K9819M6732q211o9077K9365J52741K17040L07596L38543J72388p6470
$$ 578840 608659 655391 647180 578103 607468 760209 977249 1284845 1623388 1795776 1719306
14477A719306j84480j46547m5867O3833M3000o1048n5268m362k505o3105j67403
$$ 1719306 1534826 1388279 1342412 1406245 1449245 1388197 1332929 1328567 1326062 1262957 1095554
14466A095554k33895j23076j7193r0475j86222j41185K4121J54615J54541m1674
$$ 1095554 861659 738583 721390 630915 444693 303508 327629 482244 636785 595111
14456E95111l37543m46148k64083k5723P4751J86235L62696M75914M87756L30038
$$ 595111 257568 -188580 -452663 -478386 -403635 -217400 145296 621210 1108966 1439004
14446A439004Q7151q3583k27024l40944l35184k58469j46600L198P9951P9618
$$ 1439004 1526155 1442572 1215548 874604 539420 280951 134351 137549 217500 297118
14436B97118Q5588J4898j29803j85052q6957P7444J83225J74987J10167R745j19547
$$ 297118 382706 397604 267801 82749 -4208 73236 256461 431448 541615 551360 431813
14425D31813k30849k33581j50231r4139k8154P9760R7976J3562q7518l4500K01515
$$ 431813 200964 -32617 -182848 -276987 -305141 -225381 -127405 -113843 -201361 -235861 -34346
14414c4346M25882M20322K51519O1199j88679l32697k84726j63344N202Q3650
$$ -34346 391536 811858 1063377 1124576 935897 603200 318474 155130 160332 243982
14404B43982M8409K8059K7600L0665J21967K65564L22661K98863K52809K16035
$$ 243982 292391 320450 348050 378715 500682 766246 1088907 1387770 1640579 1856614
14394A856614J85969J58565M7800j84375m01197n25164n19641m46252l70079k58126
$$ 1856614 2042583 2201148 2248948 2064573 1663376 1138212 618571 172319 -197760 -455886
14384d55886j47944q3788o5426m7066k453O1719P0064M21n494J12295J17060m0445
$$ -455886 -603830 -687618 -753044 -800110 -802563 -740844 -670780 -670359 -675853 -563558 -446498 -486943
14372d86943j27680j63318j08729K9312J4933p0722J91J39792K31069K13535J06632
$$ -486943 -614623 -777941 -886670 -857358 -842425 -913147 -912956 -773164 -542095 -328560 -221928
14361b21928M9108O9773J61140K36405K59401K78269K69852J56397r5322l91575
$$ -221928 -172820 -103047 58093 294498 553899 832168 1102020 1258417 1163095 771520
14351G71520n70079o27306n54818l13200r9301k6181M7958J64300J97568J90323
$$ 771520 201441 -425865 -980683 -1293883 -1393184 -1419365 -1371407 -1207107 -1009539 -819216
14341h19216K65057L50882K78122P0630j05242j73548j57663j56262j05667m1714
$$ -819216 -554159 -203277 74845 145475 40233 -133315 -290978 -447240 -552907 -594621
14331e94621o5478n6666p3881j53921j80583j01332l7301j9231J6242J40540L76005
$$ -594621 -660099 -716765 -790646 -944567 -1125150 -1226482 -1263783 -1283014 -1266772 -1126232 -750227
14320g50227N41975N00764K76139j2323j88317k09102k54182k48582j2858K63141
$$ -750227 -208252 292512 568651 556328 368011 158909 -95273 -343855 -356713 -93572
14310i3572K18108k7815j35565j06476j11393q0237Q9205K69169K65831K25555
$$ -93572 124536 96721 -38844 -145320 -256713 -336950 -247745 21424 287255 512810
14300E12810K24764J14355p5257k08014k56959k71483l29388l63214k82681j67400
$$ 512810 737574 851929 776672 568658 311699 40216 -289172 -652386 -935067 -1102467
14290a102467q3752m6532K2246Q0748J31148J39677R8718M1238q6064k59847m13821
$$ -1102467 -1186219 -1232751 -1210505 -1129757 -998609 -858932 -760214 -718976 -805040 -1064887 -1478708
14279a478708m42886l94789l43235j05526K86104O36869P63743N60901K19974
$$ -1478708 -1921594 -2316383 -2659618 -2765144 -2479040 -1842171 -1078428 -517527 -297553
14270b97553j18692m03557m14169j45855J4177m2064n1450j471n7731l3182J17711
$$ -297553 -416245 -819802 -1233971 -1379826 -1365649 -1407713 -1459163 -1460634 -1518365 -1551547 -1433836
14259a433836K48351L20243L96557M68401M10637K54773J54077P4765l8934j58513
$$ -1433836 -1185485 -865242 -468685 -284 410353 665126 819203 893968 855034 696521
14249F96521j65349l7096M8068P3878J34372J88526J61364J49065J10323q2948
$$ 696521 531172 494076 542144 616022 750394 938920 1100284 1249349 1359672 1276724
14239A276724l27415m28491m27220m66120n30326m52267j29017K34984M11005
$$ 1276724 949309 520818 93598 -372522 -902848 -1355115 -1484132 -1249148 -838143
14230h38143M77307N06334M34061L24038K51295J48094j5405j65444j65635l0204
$$ -838143 -360836 145498 579559 903597 1154892 1302986 1287581 1122137 956502 926298
14220I26298Q4316J41149P8383k3667p6091j49534k12180k34310k92720l72160
$$ 926298 1010614 1151763 1230146 1206479 1130388 980854 768674 534364 241644 -130516
14210a30516l16123k46420k26275j72954q9729K061J94671M43848M80890K92411
$$ -130516 -446639 -693059 -919334 -1092288 -1182017 -1179956 -985285 -541437 -60547 231864
14200B31864J47210Q9155j5265r5702j58655k88449l93701l27819j67903j19719
$$ 231864 379074 468229 452964 357262 198607 -89842 -483543 -811362 -979265 -1098984
14190a098984r1387j8289M2316Q2051L4731p4215j11261m8899O563N3283L9329
$$ -1098984 -1190371 -1208660 -1166344 -1084293 -1049562 -1123777 -1235038 -1283937 -1277374 -1224091 -1184762
14179a184762j48182k77391j46766N7572J81989J56055l1321j42292j29829l9089
$$ -1184762 -1332944 -1610335 -1757101 -1699529 -1517540 -1361485 -1392806 -1535098 -1664927 -1704016
14169a704016R8514J38781P1576m299m4533j43736k81337k72017l0531J85865
$$ -1704016 -1605502 -1466721 -1395145 -1399444 -1443977 -1587713 -1869050 -2141067 -2171598 -1985733
14159a985733L19379M02778M20851L85073K87432J89407J09001L1773K4280M1961
$$ -1985733 -1666354 -1263576 -842725 -457652 -170220 19187 128188 159961 184241 226202
14149B26202J8221p102O3142J59994R3105j6914j5570Q303r6798j99124j05234
$$ 226202 244423 237321 300463 460457 553562 536648 521078 529381 432583 233459 128225
14138A28225P6455K26416K97078K46044J79795J21664r6j14559k07958l74556
$$ 128225 204680 431096 728174 974218 1154013 1275677 1275581 1161022 953064 578508
14128E78508n14321m87356l32930p0713J65204J73455Q6558J30150K51366L11990
$$ 578508 64187 -423169 -756099 -826812 -661608 -488153 -401595 -271445 -20079 291911
14118B91911L00400J63188m8918q2092N9619P3521j27851l14846l68718l69217
$$ 291911 592311 755499 706581 624489 684108 757629 629778 314932 -53786 -423003
14108d23003l05327o1528J68007K24924J60776j7561j42652j34507o7373Q7473
$$ -423003 -728330 -789858 -621851 -396927 -236151 -253712 -396364 -530871 -598244 -510771
14098e10771K19848J29824o5596j43300r7813o522J00808J49986R3581l0158k08802
$$ -510771 -290923 -161099 -226695 -369995 -467808 -474330 -373522 -223536 -129955 -160113 -368915
14087c68915k66088j61569o8640j8768n9046n7063J21381L12473K82946N7929
$$ -368915 -635003 -796572 -865212 -883980 -943026 -1000089 -878708 -566235 -283289 -225360
14077b25360r7170m3665N4327R4506J05057J46455K74365L12714K07941J44221
$$ -225360 -322530 -366195 -311868 -217362 -112305 34150 308515 621229 829170 973391
14067I73391J66293O3746j83016l27364l23097k45779p5425J22760K06280K02743
$$ 973391 1139684 1203430 1020414 693050 369953 124174 48749 171509 377789 580532
14057E80532J96435K01596K37388K37749O3044j64325k66113k35555j26134R43
$$ 580532 776967 978563 1215951 1453700 1516744 1352419 1086306 850751 724617 725560
14047G25560Q9226Q7219n3929l28584n35127m99503k78085j7180J96034L22899
$$ 725560 814786 902005 848076 519492 -15635 -515138 -793223 -810403 -614369 -291470
14037b91470K87996Q1178j19540j69582r0256m0349j15331j29094l204R2624O3075
$$ -291470 -3474 77704 -41836 -211418 -301674 -342023 -457354 -586448 -589652 -497028 -433953
14026d33953l1275j66946k50587p8743K30635M04366L31872O9783j27659r8207
$$ -433953 -465228 -632174 -882761 -961504 -730869 -326503 5369 75152 -52507 -150714
14016a50714M2522Q7353K9496Q578Q5073J50665J96789L21079L92647K51347K8264
$$ -150714 -108192 -20839 8657 17235 102308 252973 449762 770841 1163488 1414835 1443099
14005A443099j28711j15025R3659K59069J65316p7627j59412q9264m2170k0563
$$ 1443099 1314388 1199363 1293022 1552091 1717407 1639780 1480368 1391104 1348934 1328371
13995A328371r5190k48797l10369k09290l7328K2508q9383j61062j08059j06019
$$ 1328371 1233181 984384 674015 464725 427397 449905 360522 199460 91401 -14618
13985a4618r5085R733N7488K7715q387L73Q1625J61793R2057r5448j98498j60851
$$ -14618 -109703 -99970 -42482 -14767 -23154 -22781 58844 220637 312694 217246 18748 -142103
13973a42103j32366j51305j08773q3025j66808k45652j45975P1956K35757K70724
$$ -142103 -274469 -425774 -534547 -617572 -784380 -1030032 -1176007 -1104051 -868294 -597570
13963e97570J73939P9401J07061J54285J11037R7193J32129J52724J01638n6466
$$ -597570 -423631 -344230 -237169 -82884 28153 125346 257475 410199 511837 455371
13953D55371j86357j90086q3484N3182J18392R0592n0250j94849j20171J68073
$$ 455371 269014 78928 -4556 48626 167018 257610 207360 12511 -107660 60413
13943F0413L76935L61460K50510K11943K06283J03228o207q8306k44439l66139
$$ 60413 437348 798808 1049318 1261261 1467544 1570772 1564565 1476259 1231820 865681
13933H65681k70813j02719j03529j81870j77123j66439k26752k56647j44596O8698
$$ 865681 594868 492149 388620 206750 29627 -136812 -363564 -620211 -764807 -696109
13923f96109K60586L35429L12501K57927J89466O8317j34715l56967l32025q0798
$$ -696109 -435523 -100094 212407 470334 659800 728117 593402 236435 -95590 -176388
13913a76388J38398J94796J11826Q755q6009j34393k11734k97553j70342O5778
$$ -176388 -37990 156806 268632 277387 191378 56985 -154749 -452302 -622644 -556866
13903e56866J40548K6782j24155j77187j13764n1848m7463k2674O2247J85922
$$ -556866 -416318 -389536 -513691 -690878 -804642 -856490 -903953 -926627 -864380 -678458
13893f78458L00856L32095K77143R7234j38279k54066j85031P5187L11752K60191
$$ -678458 -377602 -45507 231636 328870 190591 -63475 -248506 -173319 138433 398624
13883C98624p2016k76105k18926k15897k99637l00255k22435j47580l9764Q9403
$$ 398624 326608 50503 -168423 -384320 -683957 -984212 -1206647 -1354227 -1393991 -1304588
13873a304588K32247L88244M26016K59512J7130l7010J48470K74862J33188p9157
$$ -1304588 -1072341 -684097 -258081 1431 18561 -18449 130021 404883 538071 458914
13863D58914j54787j21206n4339Q761J6704o8737j47211j46886j11218k4012J03801
$$ 458914 304127 182921 128582 137343 154047 85310 -61901 -208787 -320005 -344017 -240216
13852b40216K20997K69001J47920j44865l76863l35009m4421J92990J70487o337
$$ -240216 -19219 249782 397702 252837 -124026 -459035 -503456 -310466 -139979 -146316
13842a46316j70730j93502l1752K79252M98073N04211L44724J30942q779m5305
$$ -146316 -317046 -510548 -542300 -263048 235025 739236 1083960 1214902 1206123 1160818
13832A160818q5968k51127l51005k03276J2314M1841l3468r6736j20097q8661
$$ 1160818 1074850 823723 472718 269442 281756 323597 290129 193393 73296 -15365
13822a5365M740J21759J96105K52903K51555P4314j84870l33177k19301J14595
$$ -15365 -10625 111134 307239 560142 811697 886011 701141 367964 148663 263258
13812B63258L71398L88061J40430j95838l81491m81333n82736m99459k80299j29372
$$ 263258 634656 1022717 1163147 967309 585818 104485 -478251 -977710 -1258009 -1387381
13802a387381l1566J02368K95835M60584M98404L57615J20407p3923j77420j86051
$$ -1387381 -1418947 -1316579 -1020744 -560160 -61756 295859 416266 342343 164923 -21128
13792b1128j71821p8703P6266J80595K15477J67477M9858o7228l0632J83348K84534
$$ -21128 -192949 -271652 -195386 -14791 200686 368163 418021 350793 320161 503509 788043
13781G88043J50916K7276q9491k32603k94160k55187j33370j7061j4014j53757
$$ 788043 938959 966235 876744 644141 349981 94794 -38576 -55637 -69651 -223408
13771b23408k17675n5409J03389J63469J73495Q4114q8292j94146j29077J12253
$$ -223408 -441083 -496492 -393103 -229634 -56139 27975 -60317 -254463 -383540 -271287
13761b71287L73195M79538N20852N72330M41520O8298k53052l58569m50158n31240
$$ -271287 101908 581446 1102298 1674628 2116148 2184446 1931394 1572825 1122667 591427
13751E91427m74250l61744k35368j06646N6954J86675J44249k6527l3136J88379
$$ 591427 117177 -244567 -479935 -586581 -529627 -342952 -198703 -225230 -258366 -69987
13741f9987L33501K62760R7731n8950r7594p0060j94462m20477n09375l43163
$$ -69987 263514 526274 624005 565055 467461 397401 202939 -217538 -726913 -1070076
13731a070076M0767M29956N41749L89958J75991n7687j44191j30199j90647k39981
$$ -1070076 -1029309 -599353 -57604 332354 508345 450658 306467 176268 -14379 -254360
13721b54360k65271k32116q9783R2309K20324L04762L21794K01913j644k31243
$$ -254360 -519631 -751747 -841530 -749221 -528897 -224135 97659 299572 297928 66685
13711F6685m06354l46588P0665N06690O00580M34931K09999J12000J18306K6701
$$ 66685 -339669 -686257 -615592 -108902 491678 926609 1136608 1248608 1366914 1393615
13701A393615q7712o6074p4928k15476l20359k80570j56117l8087M7927P7498
$$ 1393615 1305903 1239829 1164901 949425 629066 348496 192379 154292 202219 279717
13691B79717L946p7370j12325j50377j68013r3836O6885K54535L67164K94550
$$ 279717 283663 206293 93968 -56409 -224422 -318258 -251373 3162 370326 664876
13681F64876R0065r4784j71833j17008q3577j69266k86875k86717j79665l2599
$$ 664876 754941 660157 488324 371316 287739 118473 -168402 -455119 -634784 -667383
13671f67383R0668J10232P9224P9973N7483l5246p7607n6142o2701j19819j99067
$$ -667383 -576715 -466483 -387259 -307286 -249803 -285049 -362656 -418798 -481499 -601318 -800385
13660h00385j72663M061J41499J21081L4079J0016N3771J10305J09185Q0419l5817
$$ -800385 -973048 -968987 -827488 -706407 -672328 -662312 -608541 -498236 -389051 -308632 -344449
13649c44449j48785j84524k10946j55948l3131R9540J50063J72817K34747K76920
$$ -344449 -493234 -677758 -888704 -1044652 -1077783 -978243 -828180 -655363 -420616 -143696
13639a43696K00144k8930k03229j76480n6791L1844Q9940R2887R5523J80312K46234
$$ -143696 56448 27518 -175711 -352191 -408982 -377138 -287198 -194311 -98788 81524 327758
13628C27758J82203J6869j76559l76008n81659o42902m65764j86140k9595N4921
$$ 327758 509961 526830 350271 -25737 -607396 -1250298 -1716062 -1902202 -1931797 -1876876
13618a876876J88715K23975J11751N2971J23239K08800K12371J60946J95585K54839
$$ -1876876 -1688161 -1464186 -1352435 -1299464 -1176225 -967425 -755054 -594108 -398523 -143684
13608a43684J57893M0358N293j11526k87425l65705k77254j04789P5515J66197
$$ -143684 14209 54567 59860 -51666 -339091 -704796 -982050 -1086839 -1011324 -845127
13598h45127J21060Q3728J33310J25763M7540J2429Q6253J95925K44893J47953
$$ -845127 -724067 -640339 -507029 -381266 -333726 -321297 -235044 -39119 205774 353727
13588C53727j315p2352l3948O1226O1609R251J43148L15396K91196J73443J18623
$$ 353727 352412 280060 246112 307338 368947 378198 521346 836742 1127938 1301381 1420004
13577A420004P7018o2082k60818l32151k06569o5104J3163J40751K94901K68378
$$ 1420004 1497022 1434940 1174122 841971 635402 570298 583461 724212 1019113 1287491
13567A287491Q3374j28857l08711k84813j01326J3812J27592K61737K86620K15720
$$ 1287491 1370865 1242008 933297 648484 547158 560970 688562 950299 1236919 1452639
13557A452639R4666j6048K6981K01106K92384J77964Q362j07898j40962j81258
$$ 1452639 1547305 1531257 1558238 1759344 2051728 2229692 2238054 2130156 1989194 1807936
13547A807936k29928j25624O5790J33249K0210j65508l63072m71030l67716j17761
$$ 1807936 1578008 1452384 1518174 1651423 1671633 1506125 1143053 672023 304307 186546
13537A86546N0380j4767j93296j98451k2477N8201N6623J03883O2947J3885P2257
$$ 186546 236926 222159 28863 -169588 -192065 -133864 -77241 26642 89589 103474 175731
13526A75731M9642j36276l58309m60388m31221k79826n7411J30648K47224K37505
$$ 175731 225373 89097 -269212 -729600 -1160821 -1440647 -1498058 -1367410 -1120186 -882681
13516h82681M1441k13641l17854k37585p4028J01713J94751J57395J33926K66235
$$ -882681 -841240 -1054881 -1372735 -1610320 -1684348 -1582635 -1387884 -1230489 -1096563 -830328
13506h30328M80296N24914K71914j77280m67306l20757K5503K45008L59755L84194
$$ -830328 -350032 174882 446796 269516 -197790 -518547 -493044 -248036 111719 495913
13496D95913K46779L7234j05967j47113p5617m0665k10566m47206m86058k97891
$$ 495913 742692 779926 673959 526846 451229 410564 199998 -247208 -733266 -1031157
13486a031157j45473m8819J31386K88571K44320R8965N2083J47901K38119J66661
$$ -1031157 -1176630 -1225449 -1094063 -805492 -561172 -462207 -410124 -262223 -24104 142557
13476A42557J28807J12322J7271k0931O492k9713q6923o6152n9622q6564n3491
$$ 142557 271364 383686 400957 380026 386518 356805 269882 203730 144108 57544 4053
13465D053l4012l5418N7275K18931K83919J32670j26837l56704m17096k85490
$$ 4053 -29959 -65377 -8102 210829 494748 627418 500581 143877 -273219 -558709
13455e58709j28212p2066o5883J8179J54435K89208L39814K12970k6392j17734
$$ -558709 -686921 -758987 -824870 -806691 -652256 -363048 -23234 189736 163344 45610
13445D5610O5702K77487L04433J56963m4458j62956j73778j81816j09379N6084
$$ 45610 111312 388799 693232 850195 805737 642781 469003 287187 177808 233892
13435B33892J57470J72229J84393K43164L11571K50076P9496m5050j39030k58002
$$ 233892 391362 563591 747984 991148 1302719 1552795 1632291 1587241 1448211 1190209
13425A190209k99698j82149n8941J2185J31270K34347K42229K62633L98273M81507
$$ 1190209 890511 708362 649421 661606 792876 1027223 1269452 1532085 1930358 2411865
13415B411865M40916L30035J17791j70236l20742l10916l27644l69684l83004
$$ 2411865 2852781 3182816 3300607 3130371 2809629 2498713 2171069 1801385 1418381
13406A418381m31024l87209k03367j62523l10303l94476l82401l05995n4367K84643
$$ 1418381 987357 600148 396781 234258 -76045 -470521 -852922 -1158917 -1213284 -928641
13396i28641L80170K35393J01535N4662M8257O4682J05636J32948J03136Q330
$$ -928641 -548471 -313078 -211543 -156881 -108624 -43942 61694 194642 297778 306108
13386C06108q2034j52438j15602J2942P4484M533j68770l24628l50015k79596
$$ 306108 224074 71636 -43966 -31024 43460 47993 -120777 -445405 -795420 -1075016
13376a075016j09976R5447K38909L54273L94187K75859Q7719J4710R2463J86134
$$ -1075016 -1184992 -1089545 -850636 -496363 -102176 173683 261402 276112 368575 554709
13366E54709J68529J07475L4810j19860k00956j26354K2059J58121J64862J8413
$$ 554709 723238 830713 865523 745663 544707 418353 440412 598533 763395 781808
13356G81808j72057l17463l16318j70496j9228P7945R9455R6431P4257k993n6645
$$ 781808 609751 292288 -24030 -194526 -213754 -135809 -36354 60077 134334 131341 74696
13345G4696m2383j16228k00805q3107P3686J64495K62397L45569K78381J11385
$$ 74696 32313 -83915 -284720 -367827 -294141 -129646 132751 478320 756701 868086
13335H68086O3790J57105K52229L18764L35178J94089p6599l70602n45877n15991
$$ 868086 931876 1088981 1341210 1659974 1995152 2189241 2112642 1742040 1196163 680172
13325F80172m17677l34065j58767L3336L5500j27602l00220l37891k88324j99729
$$ 680172 262495 -71570 -230337 -197001 -161501 -289103 -589323 -927214 -1215538 -1415267
13315a415267j40930j04008K1191J40115J44431J58943J88952J75584K08354K65269
$$ -1415267 -1556197 -1660205 -1639014 -1498899 -1354468 -1195525 -1006573 -830989 -622635 -357366
13305c57366K82400K99100L46510L15600K07185J17152M0020m7851q1820p9432
$$ -357366 -74966 224134 570644 886244 1093429 1210581 1250601 1202750 1120930 1041498
13295A041498m5701P5645J74476J67375J04125k4201j33374p6045L3812K9023
$$ 1041498 995797 1071442 1245918 1413293 1517418 1493217 1359843 1283798 1317610 1346633
13285A346633j831p4622j85356j85113p6132K9782J7622o3153j34065j42565j16822
$$ 1346633 1344802 1270180 1084824 899711 823579 853361 870983 807830 673765 531200 414378
13274D14378l3254J42667L08852L83380L15813J22518o5161n0829J27192J85711
$$ 414378 381124 523791 832643 1216023 1531836 1654354 1589193 1538364 1665556 1851267
13264A851267N9467p0242p0538r1480k51093m37421m93350l79661k18107j16929
$$ 1851267 1910734 1840492 1769954 1678474 1427381 989960 496610 116949 -101158 -218087
13254b18087J9810K50729M05248L88361J68721o1216j07506J7928L06303N23063
$$ -218087 -198277 52452 457700 846061 1014782 953566 846060 863988 1170291 1693354
13244A693354M62485J75078j79577l33819k27965j05094j59052k42449k40576
$$ 1693354 2155839 2330917 2151340 1817521 1589556 1484462 1325410 1082961 842385
13235H42385j07871J52840L47409L43250K19537J27317L1432m6473k2321l7455
$$ 842385 734514 887354 1234763 1578013 1797550 1924867 1956299 1909826 1887505 1850050
13225A850050m9888J26663L37146K86976p1520m82185o45596m96915k17553N8695
$$ 1850050 1800162 1926825 2263971 2550947 2479427 1997242 1351646 854731 637178 695873
13215F95873J99538K37122L28600M38761M40418L78350L07446J82171R6386P3263
$$ 695873 895411 1132533 1461133 1899894 2340312 2718662 3026108 3208279 3304665 3377928
13205C377928O1319M3134l0429j14139o6133M437M5164J12095Q5963q8453k26530
$$ 3377928 3439247 3482381 3451952 3337813 3271680 3276117 3321281 3433376 3519339 3430886 3204356
13194C204356k14471j54459r0134j2505R0978N1660j91262m18914m80986m39763
$$ 3204356 2989885 2835426 2745292 2732787 2823765 2875425 2684163 2265249 1784263 1344500
13184A344500l62178k77572j38382J6895J03517K05029J49890j01213k72078j88216
$$ 1344500 982322 704750 566368 583263 686780 891809 1041699 940486 668408 480192
13174D80192J05801M44272O19879O16956M72805K45587R3058N6386K2345j21068
$$ 480192 585993 1030265 1650144 2267100 2739905 2985492 3078550 3134936 3157281 3036213
13164C036213k18041j92477j51542o0162P7077J73536J76151R8870M5209P5284
$$ 3036213 2818172 2625695 2474153 2413991 2491068 2664604 2840755 2939625 2984834 3060118
13154C060118J86742K64607K33231J25784l7603j99805k10724o5751N3487J28795
$$ 3060118 3246860 3511467 3744698 3870482 3832879 3633074 3422350 3356599 3410086 3538881
13144C538881J33449J2804m5756Q8844K72042L29185K53351J77459J49131J12111
$$ 3538881 3672330 3685134 3639378 3728222 4000264 4329449 4582800 4760259 4909390 5021501
13134E021501L0339k1893q005M5533M8077q6601k65968l50032j96499P9144J77589
$$ 5021501 5051840 5029947 5021942 5067475 5115552 5028951 4762983 4412951 4216452 4295596 4473185
13123D473185P3442k1110k0736j5919J0599O0241M0915q7899j57222m0418P8215
$$ 4473185 4546627 4525517 4504781 4488862 4499461 4559702 4600617 4512718 4355496 4315078 4393293
13112D393293J7959j05589j50008m7976J19351K46367K41304P3617p2171j09052
$$ 4393293 4411252 4305663 4155655 4107679 4227030 4473397 4714701 4788318 4716147 4607095
13102D607095j20340j52150j38033m7044n317K2327J92716L37040K94303K22975
$$ 4607095 4486755 4334605 4196572 4149528 4144211 4166538 4359254 4696294 4990597 5213572
13092E213572J75778j9585k19612j97218L1506K34302K35943J59052N1138j05328
$$ 5213572 5389350 5369765 5150153 4952935 4984441 5218743 5454686 5613738 5664876 5559548
13082E559548j57356j47387j58493j08661M6504J96178K89084M06353N23343N88703
$$ 5559548 5402192 5254805 5096312 4987651 5034155 5230333 5519417 5925770 6449113 7037816
13072G037816N71573L74469J90238J10061N0923L3303L3926R5867J22923n5596
$$ 7037816 7609389 7983858 8174096 8284157 8335080 8368383 8402309 8498176 8621099 8565503
13062H565503k57286k29926J4346K34734K72133J60386N8678P7490J30293K08474
$$ 8565503 8308217 8078291 8092637 8327371 8599504 8759890 8818568 8896058 9026351 9234825
13052I234825K36159P2518k69157n98569n56626j64076J72134K99385K73078J72255
$$ 9234825 9470984 9543502 9274345 8675776 8119150 7955074 8127208 8426593 8699671 8871926
13042H871926J97604K92674K48462J68363J47364J36252J82043K23254J54940
$$ 8871926 9069530 9362204 9610666 9779029 9926393 10062645 10244688 10467942 10622882
13033A0622882R2647K06508L53343K97433J60010R4756J48413L30328N07416M26356
$$ 10622882 10715529 10922037 11275380 11572813 11732823 11827579 11975992 12306320 12813736 13240092
13023A3240092K46279K88654N00874O46545O26680M60090L09495J91695R6158
$$ 13240092 13486371 13775025 14275899 14922444 15549124 16009214 16318709 16510404 16606562
13014A6606562J79017L40968M08455M46380N79556P46139Q95851J074469J161477
$$ 16606562 16785579 17126547 17535002 17981382 18560938 19307077 20202928 21277397 22438874
13005B2438874J177561J344158J674120J934238J970641J955525K118422K463028
$$ 22438874 23616435 24960593 26634713 28568951 30539592 32495117 34613539 37076567
12997C7076567K918118L303479L601755M067590M707100N446474O257728P158259
$$ 37076567 39994685 43298164 46899919 50967509 55674609 61121083 67378811 74537070
12989G4537070Q089002R108975J0409043J2040087J4057396J6617127J9707789
$$ 74537070 82626072 91735047 102144090 114184177 128241573 144858700 164566489
12982A64566489K3257032K7493912L2598135L8542867M5225552N1904859N6360403
$$ 164566489 187823521 215317433 247915568 286458435 331683987 383588846 439949249
12975D39949249N4081367L9316688J0420886k4392106n1353663o3169669o2413303
$$ 439949249 494030616 533347304 543768190 519376084 468022421 404852752 342439449
12968C42439449n5178288m6029688l7319552l0097502k4447293j9858381j6050685
$$ 342439449 287261161 241231473 203911921 173814419 149367126 129508745 113458060
12961A13458060j3069211j0811121r004183p581209o455214n490927m629759l907384
$$ 113458060 100388849 89577728 80573545 72992336 66537122 61046195 56416436 52509052
12953E2509052l454439l213043k970941k662035k328470k084361j925963j743562
$$ 52509052 49054613 45841570 42870629 40208594 37880124 35795763 33869800 32126238
12945C2126238j476457j117571q01374o95288p45155p10196m66712k02834j16526
$$ 32126238 30649781 29532210 28730836 28035548 27290393 26580197 26113485 25910651 25794125
12936B5794125j12166j08785j25172q9494j647J71463L81942N00096N50845N76368
$$ 25794125 25681959 25573174 25448002 25358508 25356861 25528324 25910266 26410362 26961207 27537575
12926B7537575O85938Q73660R91107J113488J379829J729168K067082K426208
$$ 27537575 28223513 29097173 30088280 31201768 32581597 34310765 36377847 38804055
12918C8804055K751642K947801K903306K498154J808697J063944N66347M99026
$$ 38804055 41555697 44503498 47406804 49904958 51713655 52777599 53343946 53842972
12910E3842972Q15994J427346K141677K901784L796820M710284N598791O594460
$$ 53842972 54658966 56086312 58227989 61129773 64926593 69636877 75235668 81830128
12902H1830128P803195R254513J0928690J2808765J4893479J7242145K0115303
$$ 81830128 89633323 98887836 109816526 122625291 137518770 154760915 174876218
12895A74876218K3829981K8489734L4010441M0326510M7344806N4042578N7453441
$$ 174876218 198706199 227195933 261206374 301532884 348877690 402920268 460373709
12888D60373709N2298178L2856444k16600l5262933n8389273o5446268o1427674
$$ 460373709 512671887 545528331 545311731 510048798 451659525 386213257 324785583
12881C24785583n2754443m3471807l5295768k8453467k2854539j8430159j5069771
$$ 324785583 272031140 228559333 193263565 164810098 141955559 123525400 108455629
12874A08455629j2512317j0478977q809560p403178o287418n472455m832959m321915
$$ 108455629 95943312 85464335 76654775 69251597 62964179 57491724 52658765 48336850
12866D8336850l835383l301777k760257k311079k017364j889520j794834j609978
$$ 48336850 44501467 41199690 38439433 36128354 34110990 32221470 30426636 28816658
12858B8816658j426161j202080q62048m82052k99012m01062n44084n74398n07850
$$ 28816658 27390497 26188417 25326369 24844317 24545305 24144243 23600159 23025761 22517911
12849B2517911l83746k86646k68114k10210k9103J80700J80259K9520N0255K51661
$$ 22517911 22134165 21847519 21579405 21369195 21340092 21520792 21701051 21730571 21780826 22032487
12839B2032487M50732N27279M10961K62507L02663M93552O93124R05816J083975
$$ 22032487 22483219 23010498 23421459 23683966 23986629 24480181 25173305 26079121 27163096
12830B7163096J083080J165072J510397J827157J979766K112942K330315K697422
$$ 27163096 28246176 29411248 30921645 32748802 34728568 36841510 39171825 41869247
12822D1869247L229895L863281M552976N329812O192000O985136P644112Q457913
$$ 41869247 45099142 48962423 53515399 58845211 65037211 72022347 79666459 88124372
12814H8124372R660306J1178239J2954639J5056276J7780829K1289552K5493087
$$ 88124372 97784678 108962917 121917556 136973832 154754661 176044213 201537300
12807B01537300L0411930L6127326M2578862M9277389N4793156N5826024M6674238
$$ 201537300 231949230 268076556 310655418 359932807 414725963 470551987 517226225
12800E17226225K2844241j1497846m3109166o0817481o3887805n8303445m9632000
$$ 517226225 540070466 528572620 485463454 424645973 360758168 302454723 252822723
12793B52822723m0785992l2999944k6620940k1594875j7650391j4583690j2169708
$$ 252822723 212036731 179036787 152415847 130820972 113170581 98586891 86417183
12786H6417183j0229276q698247p408248o349604n467682m566283l633190k903415
$$ 86417183 76187907 67489660 60081412 53731808 48264126 43697843 40064653 37161238
12778C7161238k574664k501718k414772k231738k088405j901560j609666j401141
$$ 37161238 34586574 32084856 29670084 27438346 25349941 23448381 21838715 20437574
12770B0437574j313128j230774j127265j050309r28617q25146q28164q48743p99491
$$ 20437574 19124446 17893672 16766407 15716098 14787481 13962335 13134171 12285428 11485937
12761A1485937p03039o25187o12997o54933o54834n88559n11680m54681m22263
$$ 11485937 10782898 10157711 9544714 8889781 8234947 7646388 7134708 6680027 6257764
12752F257764l96526l54561k70230k30654k55819k26829q5790J09068J11784k8347
$$ 6257764 5861238 5506677 5236447 5005793 4749974 4523145 4437355 4546423 4658207 4629860
12742D629860j12882j24086j00752j35642j33666K1948J22625J0812j97493k12250
$$ 4629860 4516978 4392892 4292140 4156498 4022832 4044780 4167405 4178217 3980724 3768474
12732C768474n9563K3585P895o1763r2362j37932k82583l81655l47845k14241
$$ 3768474 3708911 3732496 3740391 3678628 3586266 3448334 3165751 2784096 2436251 2222010
12722B222010r3567j34030l19192m39703l83610j85632K3935J55318J86763R2511
$$ 2222010 2128443 1994413 1675221 1235518 851908 666276 690211 845529 1032292 1124803
12712A124803j9436l3419K4533J50892K78689K98742J87248K6001q8109j70307
$$ 1124803 1105367 1071948 1096481 1247373 1526062 1824804 2012052 2038053 1949944 1779637
12702A779637j69966j3118K24666K67190k7016m29196o32138m95846j48511J50469
$$ 1779637 1609671 1596553 1821219 2088409 2061393 1632197 1000059 504213 355702 506171
12692E06171L21925L78229K97076K00716J59379q633j94681k12486k58082l87311
$$ 506171 828096 1206325 1503401 1704117 1863496 1854863 1660182 1447696 1189614 802303
12682H02303k83156L6397K15384J62162M6778n399J3291O5195L0527j3234L562
$$ 802303 519147 555544 770928 933090 979868 974469 987760 1052955 1083482 1070248 1073810
12671A073810J6194K8372M2163P2085J22057M6471j81207k84026j49497K9531
$$ 1073810 1090004 1118376 1160539 1232624 1354681 1401152 1219945 935919 786422 815953
12661H15953n516j52931k9604K83020M60600L53221N4831p1309J10013L27257
$$ 815953 810437 657506 627902 910922 1371522 1724743 1779574 1708265 1818278 2145535
12651B145535M20866M64222M85730L82406J03234k22954l78330m29297m67346
$$ 2145535 2566401 3030623 3516353 3898759 4001993 3779039 3400709 2971412 2504066
12642B504066l61287j54038m0641j60600l41804l93297l12372k45646k20369j32535
$$ 2504066 2142779 1988741 1948100 1787500 1445696 1052399 740027 494381 274012 141477
12632A41477o4398j00751j99675k47643j55518j605J33244K40760K68244K47304
$$ 141477 77079 -23672 -223347 -470990 -626508 -628113 -494869 -254109 14135 261439
12622B61439J88604P0412J5833M2037J06345J18212m8828k67876l07532j97095
$$ 261439 450043 520455 536288 578325 684670 802882 754054 486178 178646 -18449
12612a8449n9337N4778J10667J37775Q2321q2212k29790k96745k44855p1353J39287
$$ -18449 -77786 -23008 87659 225434 307755 225543 -4247 -300992 -545847 -617200 -477913
12601d77913K92389L36019K65216Q4368p8960j1688K11944K85434K00326N9714
$$ -477913 -185524 150495 415711 500079 421119 409431 621375 906809 1107135 1166849
12591A166849j05017j72285j27544R55J10460J07691Q1883j8237k06053l84484
$$ 1166849 1061832 889547 762003 762958 873418 981109 1062992 1044755 838702 454218
12581D54218l97850j87944n488n1117k05912l03957l00258j12181J75552K91344
$$ 454218 56368 -131576 -137064 -188181 -394093 -698050 -998308 -1110489 -934937 -643593
12571f43593K48260K11307J09237P7610J89859K10592J13055K1349j32798l69879
$$ -643593 -395333 -184026 -74789 2821 192680 403272 516327 537676 404878 34999
12561C4999n31345m35485j67041O5063J63280J12593N0641J78840L75124M08476
$$ 34999 -496346 -931831 -1098872 -1033809 -870529 -757936 -707295 -528455 -153331 255145
12551B55145L17754J99367P0185o0755r0985j16778k41505k17111m4388P0667
$$ 255145 572899 772266 842451 781696 690711 573933 332428 115317 70929 141596
12541A41596Q4958k5044k08741l26862l41093k34104n1671R7064J77142J99355
$$ 141596 226554 201510 -7231 -334093 -675186 -909290 -960961 -863897 -686755 -487400
12531d87400J89261J52287P7966l2770j72603l04419l17974j46043M1455J63691
$$ -487400 -298139 -145852 -67886 -100656 -273259 -577678 -895652 -1041695 -1000240 -836549
12521h36549L07250L44378J98836P5193o6526j95106j35671q965O3246N4523j0929
$$ -836549 -529299 -184921 13915 89108 22582 -172524 -308195 -317160 -253914 -199391 -210320
12510b10320l1536l1912j24699j85102j89474k49216l47394k62560o3910L5743
$$ -210320 -241856 -273768 -398467 -583569 -773043 -1022259 -1369653 -1632213 -1696123 -1660380
12500a660380j263j1676J39434L94410M88925L16688J69977J23331m5389l25335
$$ -1660380 -1661643 -1673319 -1533885 -1139475 -650550 -333862 -163885 -40554 -85943 -411278
12490d11278m52995l14812q408K40257K18907L9341K5166J84546L48217M07136
$$ -411278 -864273 -1179085 -1187493 -947236 -728329 -688988 -663822 -479276 -131059 276077
12480B76077K32553n3801j62712j12626q1663m3364m8911j23799j87403k49006
$$ 276077 508630 454829 292117 179491 97828 54464 5553 -118246 -305649 -554655
12470e54655k66918k01864j33239n9495Q0211J86514K20808K57688K62227J83777
$$ -554655 -821573 -1023437 -1156676 -1216171 -1135960 -949446 -728638 -470950 -208723 -24946
12460b4946J15982J2163j35080k01299j32000j1086N0692Q289q1693q7311n8796
$$ -24946 91036 103199 -31881 -233180 -365180 -376266 -325574 -317285 -398978 -486289 -545085
12449e45085m9654m9921l2753J12433L01817K67784L4652j87682j84362J0208
$$ -545085 -594739 -644660 -677413 -564980 -263163 4621 39273 -148409 -332771 -322563
12439c22563J80724J82440K2655j32957k43719k29503o2030P7984M9143r4100
$$ -322563 -141839 40601 63256 -69701 -313420 -542923 -604953 -526969 -477826 -571926
12429e71926j06003L4751J44162J84039J95403L08272M46236M40723L08334Q2218
$$ -571926 -677929 -643178 -499016 -314977 -119574 188698 634934 1075657 1383991 1466209
12419A466209j64336k75351j78650n5664o9542j62800k71936k84536j95553j30721
$$ 1466209 1301873 1026522 847872 792208 722666 559866 287930 3394 -192159 -322880
12409c22880k6019J90395K89327J13042o4467p3794o437K7147n434r9025j74985
$$ -322880 -348899 -158504 130823 243865 179398 105604 99167 126314 120880 21855 -153130
12398a53130j29546l4802l7546p6560q7641j50235k06573j33730O7049K62600
$$ -153130 -282676 -317478 -355024 -431584 -519225 -669460 -876033 -1009763 -942714 -680114
12388f80114L42807K81451J21681k4647p170P2542J02250J43364J28876J3781
$$ -680114 -337307 -55856 65825 41178 34008 106550 208800 352164 481040 494821
12378D94821o0620j33912k27640j88512l5180J36326K64002L30600L19996K65053
$$ 494821 434201 300289 72649 -115863 -151043 -14717 249285 579885 899881 1164934
12368A164934K29707J47961O120l7064Q6215K31662J92713J99k50385m05417l26522
$$ 1164934 1394641 1542602 1548722 1511658 1597873 1829535 2022248 2022447 1772062 1366645 1040123
12357A040123j65893j42185j39519L9588K67045K76613M4454j60320k33506k73465
$$ 1040123 874230 732045 592526 632114 899159 1175772 1220226 1059906 826400 552935
12347E52935l06079k60066j54714j28861j68777j02760R5980K59850K82176K43975
$$ 552935 246856 -13210 -167924 -296785 -465562 -568322 -472342 -212492 69684 313659
12337C13659J89149P2232Q1507K93556M12717L17795J77941J13858J06388J31252
$$ 313659 502808 575040 656547 950103 1362820 1680615 1858556 1972414 2078802 2210054
12327B210054J39388R4357N28q0731j01881j34857k35907l58658l24144j35216
$$ 2210054 2349442 2443799 2444327 2363596 2261715 2126858 1890951 1532293 1208149 1072933
12317A072933O8118J86116J58280L4714n4658j10083k34175m13890m88486l80725
$$ 1072933 1141051 1327167 1485447 1520161 1465503 1355420 1121245 707355 218869 -161856
12307a61856j25666J10920K75937M30597L58081N9821j43146m1632K89477N78333
$$ -161856 -287522 -176602 99335 529932 888013 947834 804688 763056 1052533 1630866
12297A630866P10076Q52119J000415J107679J113362J046486J033265J046345
$$ 1630866 2340942 3193061 4193476 5301155 6414517 7461003 8494268 9540613
12289I540613J094315J248894J550205J951616K499900L203228M013528M937655
$$ 9540613 10634928 11883822 13434027 15385643 17885543 21088771 25102299 30039954
12281C0039954N976434O980593P150127M938463l36301o007360q625433q193748
$$ 30039954 36016388 42996981 50147108 55085571 54749270 48741910 40116477 31922729
12273C1922729o566751m895924l571652k651753k161351j959042j676262j236518
$$ 31922729 25355978 20460054 16888402 14236649 12075298 10116256 8439994 7203476
12265G203476q81973o80508n30913n06375o06632o16176n60168n32796m71422
$$ 7203476 6321503 5640995 5110082 4603707 3997075 3380899 2820731 2287935 1816513
12256A816513l29846j91974j18217J2735J98651L21808L16049J69575j00596l39405
$$ 1816513 1486667 1294693 1176476 1189211 1387862 1709670 2025719 2195294 2094698 1755293
12246A755293l19190j77480k01869l22281l64894k91867j31809k7873r075P1076
$$ 1755293 1436103 1258623 1056754 734473 369579 77712 -54097 -81970 -91045 -19969
12236a9969J50496J52090O6652n5251j09683j16016j07106K870J17377J30049
$$ -19969 130527 282617 349269 294018 184335 68319 -38787 -35917 81460 211509
12226B11509L2444r8031j41722j07870j13203k25045k80560j80003L5891K83617
$$ 211509 243953 145922 4200 -103670 -216873 -441918 -722478 -902481 -866590 -582973
12216e82973K54729q3378l56661l83570j95065J6504J02705J08991K10366L96309
$$ -582973 -328244 -411622 -768283 -1151853 -1346918 -1330414 -1227709 -1118718 -908352 -512043
12206e12043M43413K71416Q4574p9630k00437j37555L2536J39897J90924K09182
$$ -512043 -68630 202786 287360 207730 7293 -130262 -97726 42171 233095 442277
12196D42277K17281J98462N5110j52854k89894k54565j08889l159O6679M8248
$$ 442277 659558 858020 913130 760276 470382 215817 106928 103769 170448 218696
12186B18696r0946k55575k99586j43074J03545K42913L03362K79209R2419o4733
$$ 218696 127750 -127825 -427411 -570485 -466940 -224027 79335 358544 450963 386230
12176C86230n1082N8808J97953L27750L09527Q0930j66300k22972j51919j52924
$$ 386230 335148 393956 591909 919659 1229186 1310116 1143816 920844 768925 616001
12166F16001k61966l65148l87383l08372k07126j45867o1037L2244J21663J81758
$$ 616001 354035 -11113 -398496 -706868 -913994 -1059861 -1120898 -1088654 -966991 -785233
12156g85233J91734J74270J48378J20865R3308O7792L1336J1220m2146q9230o8892
$$ -785233 -593499 -419229 -270851 -149986 -56678 11114 42450 53670 11524 -77706 -146598
12145a46598J6395J21602J42880J20232J62764K75981L38493J90570m1813j26481
$$ -146598 -130203 -8601 134279 254511 417275 693256 1031749 1222319 1180506 1054025
12135A054025j62772k28739k27398j76691j30920j37667l10529n17203m37758
$$ 1054025 891253 662514 435116 258425 127505 -10162 -320691 -837894 -1275652
12126a275652p3794J39945K0984j39242j74873j42657o7895J05792L07880L45082
$$ -1275652 -1349446 -1209501 -1188517 -1327759 -1502632 -1645289 -1713184 -1607392 -1299512 -954430
12116i54430K26644J13867R8738M9794l3621l8607o4140j26506j74937k95125
$$ -954430 -727786 -613919 -515181 -465387 -499008 -537615 -601755 -728261 -903198 -1198323
12106a198323m43627l47493M1443N05265O84835M35972J19574K6472n2911j85557
$$ -1198323 -1641950 -1989443 -1948000 -1442735 -757900 -321928 -202354 -175882 -228793 -414350
12096d14350j68992K5681J21359J37014K68618L80526M14564L32277J36633Q9863
$$ -414350 -583342 -557661 -436302 -299288 -30670 349856 764420 1096697 1233330 1323193
12086A323193K29922L08152K61549J26867q1740j11615L0709j2647j61463j43568
$$ 1323193 1553115 1861267 2122816 2249683 2167943 2056328 2087037 2074390 1912927 1769359
12076A769359j36466k76615l79650l94658l66722k51027j17534m0601r705K7057
$$ 1769359 1632893 1356278 976628 581970 215248 -35779 -153313 -193914 -203619 -176562
12066a76562M6880m8224j28198j08195R993J33497J19607O836q1905q6051n1424
$$ -176562 -129682 -177906 -306104 -414299 -404306 -270809 -151202 -144366 -226271 -312322 -363746
12055c63746K59J07849J87879J12076J5324O26m7859k02712l27970k34845N4020
$$ -363746 -363487 -255638 -67759 44317 59641 60267 12408 -190304 -518274 -753119 -699099
12044f99099L13578L36418J68098L8114Q0746K27506L23910K37314R6640J30558
$$ -699099 -385521 -49103 118995 157109 237855 465361 789271 1026585 1123225 1253783
12034A253783K55593K75527Q5680k08791m32571m34545k42683o9363Q959L1150
$$ 1253783 1509376 1784903 1870583 1661792 1229221 794676 551993 482630 491589 522739
12024E22739J08627K52509L18968K01640o1797l28900n15832n79912m40900k25006
$$ 522739 631366 883875 1202843 1404483 1342686 1013786 497954 -81958 -522858 -747864
12014g47864q2494Q1519L15761M35402L45423K59135K61589K99061K61547N5590
$$ -747864 -830358 -748839 -433078 2324 347747 606882 868471 1167532 1429079 1484669
12004A484669j88102k52424j26610O8673J89722Q3733j34665l22618m91861o07927
$$ 1484669 1296567 1044143 917533 986206 1175928 1259661 1124996 802378 310517 -297410
11994b97410n28296k76195l2981J19265K00827K32902K08685P1758j13369k04540
$$ -297410 -825706 -1101901 -1134882 -1015617 -814790 -581888 -373203 -301445 -414814 -619354
11984f19354k33018j94178o4883O2435Q5935L585o0924r2714q1486k8041L8698
$$ -619354 -852372 -1046550 -1111433 -1048998 -963063 -959478 -1020402 -1113116 -1194602 -1222643 -1183945
11973a183945J45903K01167J80065J55725J89708K71640K19625J37413L15035
$$ -1183945 -1038042 -836875 -656810 -501085 -311377 -39737 179888 317301 632336
11964F32336O28721O76401L79056k2766l03837m17768m29308l29566j04489J12672
$$ 632336 1261057 1937458 2316514 2293748 1989911 1572143 1142835 813269 708780 821452
11954H21452J85930J41553J7639r4351j60617k16196j64858o0818P838n6677j87809
$$ 821452 1007382 1148935 1166574 1072223 911606 695410 530552 469734 477572 420895 233086
11943B33086j76577j12323j13838k0314K04325L32407K84480J93492R8685n5651
$$ 233086 56509 -55814 -169652 -189966 14359 346766 631246 824738 923423 867772
11933H67772j80102k69846k66162j89236j40180r4143l5978j2378l4666q0987
$$ 867772 687670 417824 151662 -37574 -177754 -271897 -307875 -320253 -354919 -435906
11923d35906m9563P9704K03648K54512K42736J90371J0547j77328k18610j46491
$$ -435906 -485469 -405765 -202117 52395 295131 485502 496049 318721 100111 -46380
11913d6380r8493j19731j31775j30957p4894R068O463L4499J69435K71704L20593
$$ -46380 -144873 -264604 -396379 -527336 -602230 -593162 -586699 -552200 -382765 -111061 209532
11902B09532L58795K33466n5079k17182k20916k12732j80784j11358Q052Q6593
$$ 209532 568327 801793 746714 529532 308616 95884 -84900 -196258 -188206 -101613
11892a01613J18937K22059L29750L36274J39216j58139k74665k29739k01165k21370
$$ -101613 17324 239383 569133 905407 1044623 886484 611819 382080 180915 -40455
11882d0455k26086j45515J0336Q7136J12720J99355K15580Q1483q2715k23462
$$ -40455 -266541 -412056 -401720 -314584 -201864 -2509 213071 294554 211839 -11623
11872a1623l04154k08743K6335K41880L25570J52747j50946k85058k59205j94745
$$ -11623 -315777 -524520 -498185 -256305 69265 222012 71066 -213992 -473197 -667942
11862f67942q4943J6564l2921j74003j85522l5826J5481j34806k95872k48221
$$ -667942 -752885 -736321 -769242 -943245 -1128767 -1164593 -1149112 -1283918 -1579790 -1828011
11852a828011J2275K63637L34454K58179K03629K48310L45653L76069L01981K58575
$$ -1828011 -1815736 -1552099 -1217645 -959466 -755837 -507527 -161874 214195 516176 774751
11842G74751K57557K54797J85709M7198J8375K4913o6795j31552m0348Q7401J1360
$$ 774751 1032308 1287105 1472814 1520012 1538387 1563300 1496505 1364953 1324605 1412006 1423366
11831A423366k13468k81454k05719k14490k92739l33127l60835l67132k50940
$$ 1423366 1209898 928444 722725 508235 215496 -117631 -478466 -845598 -1096538
11822a096538k0644J90402K95995L04677K43870K27394K34613K96327L20508J35216
$$ -1096538 -1117182 -926780 -630785 -326108 -82238 145156 379769 676096 996604 1131820
11812A131820o9449j13468j4469N4466m7727j44728j59422j70111j17801o2233
$$ 1131820 1062371 948903 934434 988900 941173 796445 637023 466912 349111 286878
11802B86878j85288l48084k70859N9165L45181L06993J79094Q5063k9895r7387
$$ 286878 101590 -246494 -517353 -458188 -113007 193986 373080 458143 428248 330861
11792C30861j50156k20579k18532j59199j14592n4568m8107n8163k549J41269
$$ 330861 180705 -39874 -258406 -417605 -532197 -586765 -634872 -693035 -695584 -554315
11782e54315K70059K58808J88277P7277m1081q9024j24303j81188k28585l06026
$$ -554315 -284256 -25448 162829 240106 199025 110001 -14302 -195490 -424075 -730101
11772g30101m07068n23995n64606m34039j89815K329J22008K85381M80193N61626
$$ -730101 -1137169 -1661164 -2225770 -2659809 -2849624 -2847295 -2725287 -2439906 -1959713 -1398087
11762a398087M24317J30660j55625k70885k02022j15557j18509k50450m64116
$$ -1398087 -973770 -843110 -998735 -1269620 -1471642 -1587199 -1705708 -1956158 -2420274
11753b420274p06262r06673q56487m00834j30456k70745j54913M22839Q99785
$$ -2420274 -3126536 -4033209 -4889696 -5290530 -5420986 -5691731 -5846644 -5423805 -4524020
11744d524020Q82681P53595P89383R86616Q18737K61065r1232j56340j76453j22317
$$ -4524020 -3641339 -2887744 -2098361 -1111745 -293008 -31943 -123175 -279515 -455968 -578285
11734e78285J07137L65214N63094P01811O15854K83380L6684l505k4982q5999
$$ -578285 -471148 -105934 457160 1158971 1774825 2058205 2094889 2091384 2066402 1980403
11724A980403m0406R0996P3838r9950k66156m26433m99488l69609k08859r7909
$$ 1980403 1939997 2030993 2104831 2004881 1738725 1312292 812804 443195 234336 136427
11714A36427M2129J84776K16074J41597K0468q8367j12472J4873J54515J71383
$$ 136427 178556 363332 579406 721003 741471 653104 540632 555505 710020 881403
11704H81403J69313K27805L32230K88459J12996J0222l6962r2198k31135m58333
$$ 881403 1050716 1278521 1610751 1899210 2012206 2022428 1985466 1893268 1662133 1203800
11694A203800n12628k66353J455P0804L6788N0242P7025R047j61186l25269l71375
$$ 1203800 691172 424819 426274 497078 533866 584108 661133 670180 508994 183725 -187650
11683a87650k81233j54165n2531O3815J79076K25488J19276l4250o2645O3617
$$ -187650 -468883 -623048 -675579 -611764 -432688 -207200 -87924 -122174 -184819 -121202
11673a21202K09513R4024j76604k35207j23505o1740p6579j71805k85410k70549
$$ -121202 88311 182335 5731 -229476 -352981 -414721 -491300 -663105 -948515 -1219064
11663a219064r0961J62866L24965L41791K68697J56853P4521J05295K23965K20083
$$ -1219064 -1310025 -1147159 -822194 -480403 -211706 -54853 19668 124963 348928 569011
11653E69011L0677j25188k19312k66811j96406o3559j7499L205N7916J24797J49845
$$ 569011 599688 474500 255188 -11623 -208029 -271588 -289087 -285882 -227966 -103169 46676
11642D6676L1658j20163j84649j41707p1161p4274p3492R6938K81546K44142N6528
$$ 46676 78334 -41829 -226478 -368185 -439346 -513620 -587112 -490174 -208628 35514 92042
11631I2042j06647j91799j41898j0678k4929j79960k14843j00691J8205J6929
$$ 92042 -14605 -206404 -348302 -358980 -383909 -563869 -778712 -879403 -861198 -844269
11621h44269r4885j31379n1924l6502k6045J06597J85172J15835k2827j47520
$$ -844269 -939154 -1070533 -1122457 -1158959 -1185004 -1078407 -893235 -777400 -800227 -947747
11611i47747j72964j30316j05809j39680k05278j71682K3479J73900R7131o4417
$$ -947747 -1120711 -1251027 -1356836 -1496516 -1701794 -1873476 -1849997 -1676097 -1578966 -1643383
11601a643383p1506N9613J99581K71778K43212K04971K25960K88547L03497J83498
$$ -1643383 -1714889 -1655276 -1455695 -1183917 -940705 -735734 -509774 -221227 82270 265768
11591B65768l5733j08873M4188J70809O2222p0577l1781O8827J32451J50105J24178
$$ 265768 230035 121162 165350 336159 398381 327804 296023 364850 497301 647406 771584
11580G71584J4156j73198k60965k46441k51950k33768j15533P6039K42443K93641
$$ 771584 785740 612542 351577 105136 -146814 -380582 -496115 -420076 -177633 116008
11570A16008K10151Q7775K3867K3264J31003K69989K36196L2215j03401r5244
$$ 116008 326159 413934 437801 461065 592068 862057 1098253 1130468 1027067 931823
11560I31823q9815j78189l53283m97631n49097m88242k91325K0572L06212L73898
$$ 931823 842008 663819 310536 -187095 -736192 -1224434 -1515759 -1495187 -1188975 -815077
11550h15077K19813K0491l1655L2705J79894K94875K19237J4542p0401k2696m1223
$$ -815077 -595264 -574773 -606428 -573723 -393829 -98954 120283 134825 64424 41728 505
11539E05j49483j93848k47279k33063Q409K09314K83248K08369p5352l78656m39896
$$ 505 -148978 -342826 -590105 -823168 -814759 -605445 -322197 -113828 -189180 -567836 -1007732
11528a007732k77053l823K76474L60791J96014j7927m7351M8734J41912J97843
$$ -1007732 -1284785 -1288608 -1012134 -651343 -455329 -473256 -520607 -471873 -329961 -132118
11518a32118J33241j1782o7031K8776R4114K7379p7920k10117l52159l19643k15000
$$ -132118 1123 -10659 -77690 -48914 45200 72579 -5341 -215458 -567617 -887260 -1102260
11507a102260j22429J36490L85540L83234J05969j22561o7567R9682J11153m6195
$$ -1102260 -1224689 -1088199 -702659 -319425 -213456 -336017 -403584 -303902 -192749 -238944
11497b38944o8554L0236O2669o564j05079j68949j74757q2974O000L5506M3862
$$ -238944 -307498 -277262 -214593 -221157 -326236 -495185 -669942 -752916 -746916 -711410 -667548
11486f67548O4803K089n9364j1481L3204P681l6824k22996m40650m23792k73967
$$ -667548 -602745 -600656 -660020 -671501 -638297 -630616 -667440 -890436 -1331086 -1754878 -2028845
11475b028845o8517J71706L69844M21574L26346K56986J98183J00349j11100l46424
$$ -2028845 -2097362 -1925656 -1555812 -1134238 -807892 -550906 -352723 -252374 -363474 -709898
11465g09898l27531k5611K05844J53709R9744J36054P1938q0630j65039j78107
$$ -709898 -1037429 -1063040 -857196 -703487 -603743 -467689 -395751 -476381 -641420 -819527
11455h19527k67449l61025k28849j72336j70385K7798K65630K63059n8001l01686
$$ -819527 -1086976 -1448001 -1676850 -1849186 -2019571 -1991773 -1726143 -1463084 -1521085 -1822771
11445a822771j47109J42629K40177K70094L92505L93285L14981J01267j02199
$$ -1822771 -1969880 -1827251 -1587074 -1316980 -924475 -531190 -216209 -114942 -217141
11436b17141O4711K63405K33838J06842m2712j44912j80123k37385j77761L1132
$$ -217141 -152430 110975 344813 451655 408943 264031 83908 -153477 -331238 -300106
11426c00106J31831O5596p281N1691J11052N9440k8110j21065j23780n8020M377
$$ -300106 -168275 -102679 -109960 -58269 52783 112223 84113 -36952 -160732 -218752 -214375
11415b14375K6056M4919J26996J66338J27731L6016j40846l14642l19531r4048
$$ -214375 -188319 -143400 -16404 149934 277665 313681 172835 -141807 -461338 -555386
11405e55386J99889L23394K63685J12190j7198m4659j7564j3881q9655k72936
$$ -555386 -355497 -32103 231582 343772 326574 281915 264351 250470 160815 -112121
11395a12121m60924m33057j13910K91413M39649K43193l9817k35358k93085j50031
$$ -112121 -573045 -1006102 -1120012 -828599 -388950 -145757 -185574 -420932 -714017 -864048
11385h64048J64889M16890M54442M05855L21665R5064j76808k43090j48872j19135
$$ -864048 -699159 -282269 172173 578028 899693 994757 817949 574859 425987 306852
11375C06852j71173j49166m2993L4710J3812p3687m0118M7385Q7313J02550O1634
$$ 306852 135679 -13487 -56480 -21770 -7958 -81645 -121763 -74378 12935 115485 177119
11364A77119m2180j81291l08485l43212k57912j73782j14162k0908N5470M0212
$$ 177119 134939 -46352 -354837 -698049 -955961 -1129743 -1243905 -1264813 -1209343 -1169131
11354a169131k4797m8604j8282J50988M04064M70605K76149R6196J27969J59727
$$ -1169131 -1193928 -1242532 -1260814 -1109826 -705762 -235157 40992 137188 265157 424884
11344D24884k0187k16875k51576j76497l8711R8497J31481J62266K24148K33962
$$ 424884 404697 187822 -63754 -240251 -278962 -180465 -48984 113282 337430 571392
11334E71392J77734J01534J10978J43349K7158j45085k39538l22570l75628l98819
$$ 571392 749126 850660 961638 1104987 1132145 987060 747522 424952 49324 -349495
11324c49495l96274k47940j7036K05803K15422L7773Q3679L64527N60798N73621
$$ -349495 -745769 -993709 -1010745 -804942 -589520 -551747 -468068 -103541 457257 1030878
11314A030878M55412K09563k8045j10725r2895j27659k36421l86557m49250m02879
$$ 1030878 1486290 1695853 1667808 1557083 1464188 1336529 1100108 713551 264301 -138578
11304a38578l97882m16715l49258k39971r6744N0264J53485K25787K27108J71923
$$ -138578 -536460 -953175 -1302433 -1542404 -1639148 -1588884 -1435399 -1209612 -982504 -810581
11294h10581J18064O9720J2321R205J15952J79704J15277k9317j15624j23158
$$ -810581 -692517 -622797 -610476 -601271 -485319 -305615 -190338 -219655 -335279 -458437
11284d58437j56477j62165o9913J5937J5874L6551P7463j0563r1577m091J08873
$$ -458437 -614914 -777079 -846992 -831055 -815181 -778630 -701167 -711730 -803307 -807398 -698525
11273f98525O4547q4737r1632P6515J78739J65153J56520J24661J2385j54896
$$ -698525 -633978 -718715 -810347 -733832 -555093 -389940 -233420 -108759 -96374 -251270
11263b51270j92335o3823J02800J87700J02107j41503l06178k74777k15508j87896
$$ -251270 -443605 -507428 -404628 -216928 -114821 -256324 -562502 -837279 -1052787 -1240683
11253a240683j70458j77647r4460P3409J63407K54311M07954M06325K79178J86592
$$ -1240683 -1411141 -1588788 -1683248 -1609839 -1446432 -1192121 -784167 -377842 -98664 87928
11243H7928J56829J65412J50393J33187J48842J40614O1460l1876j49840k49176
$$ 87928 244757 410169 560562 693749 842591 983205 1044665 1012789 862949 613773
11233F13773k75249k77496k64678k10145m5530J61388K14333J16290N4800P5538
$$ 613773 338524 61028 -203650 -413795 -459325 -297937 -83604 32686 87486 163024
11223A63024M7385m309K3231O3557N2958o693J5921J52325J49561q486j50907
$$ 163024 210409 206100 229331 292888 345846 339153 355074 507399 656960 648474 497567
11212D97567k11941j39191M526L4307m70l0776k7985L8799M0773k1777m4375k6369
$$ 497567 285626 146435 150961 185268 184798 154022 126037 164836 205609 183832 139457 113088
11200A13088N737m2351r7116j08571j30465j01590K7220J00584k2768k11329j98964
$$ 113088 118825 76474 -20642 -129213 -259678 -361268 -334048 -233464 -256232 -467561 -666525
11189f66525p0748j2573K0763J01749K01305L20858M22679L60175J77006j6306
$$ -666525 -737273 -749846 -729083 -627334 -426029 -105171 317508 677683 854689 838383
11179H38383j26968j81222j65689r2185n9570j32144k79827m01436m10459k03553
$$ 838383 711415 530193 364504 272319 212749 80605 -199222 -600658 -1011117 -1214670
11169a214670J54174M23930M47177K55084R05j36347q6313O8918K10756J94699
$$ -1214670 -1060496 -636566 -189389 65695 66600 -69747 -156060 -87142 123614 318313
11159C18313Q0570N3325L6503p7491j57156j50658p1226J06211K38550K33379
$$ 318313 398883 452208 488711 411220 254064 103406 32180 138391 376941 610320
11149F10320Q6605j13625k42760k50097k60686l07197k09152j7126K0949n1658
$$ 610320 696925 583300 340540 90443 -170243 -477440 -686592 -703718 -682769 -734427
11139g34427k6502M5929J50348K01827P4838l0934M8108J43638J05424j4836j12458
$$ -734427 -760929 -715000 -564652 -362825 -287987 -318921 -270813 -127175 -21751 -36587 -149045
11128a49045j21506n7031K6751N7644N5074M5970L1153N827m857p6145j30246
$$ -149045 -270551 -327582 -300831 -243187 -188113 -142143 -110990 -105163 -110020 -186165 -316411
11117c16411l5197N4587Q5923J61346K29500J43798j5842l9105M3476J17086J19416
$$ -316411 -351608 -297021 -211098 -49752 179748 323546 307704 268599 312075 429161 548577
11106E48577J30724J52096O1831o9455q0896M4063Q7578p7094k64944k27015p6314
$$ 548577 679301 831397 893228 823773 742877 786940 874518 797424 532480 305465 229151
11095B29151k2067J6618J40385K17760J56475M2931m7018J5821J66121K97086
$$ 229151 207084 223702 364087 581847 738322 781253 734235 750056 916177 1213263
11085A213263L50472K96882K01605J36103j8985k86538m52488m36159l68717k99541
$$ 1213263 1563735 1860617 2062222 2198325 2179340 1892802 1440314 1004155 635438 335897
11075C35897k04057q5075O9567J92663K04375J50983J20668O7011l1766n3222
$$ 335897 131840 46765 116332 308995 513370 664353 785021 852032 820266 767044
11065G67044j35562m28628o75281o74886m24211j10608J27243K36928J61526l9064
$$ 767044 631482 202854 -472427 -1147313 -1571524 -1682132 -1554889 -1317961 -1156435 -1195499
11055a195499j68967p5213J47008K60367J79609J37267L22658M20670K95238J89126
$$ -1195499 -1364466 -1439679 -1292671 -1032304 -852695 -715428 -392770 27900 323138 512264
11045E12264N6565j42423k09686j18556m6378o3287j72652l05389k78691j12581
$$ 512264 568829 426406 216720 98164 51786 -11501 -184153 -489542 -768233 -880814
11035h80814R572l2111r9431j52101k78419l24011j63658R3710L04413L75425
$$ -880814 -871242 -903353 -1002784 -1154885 -1433304 -1757315 -1920973 -1827263 -1522850 -1147425
11025a147425L20573K56971K28819J82075M4139j84725l13591k31087m2754N6035
$$ -1147425 -826852 -569881 -341062 -158987 -114848 -299573 -613164 -844251 -887005 -830970
11015h30970O3316M7450o8938k74737l91612l01171j52973q7073N982J14032J72915
$$ -830970 -767654 -720204 -789142 -1063879 -1455491 -1756662 -1909635 -1996708 -1990726 -1876694 -1703779
11004a703779J98035K22128K71616L44188L51807K40578P1640j667P7483K01748
$$ -1703779 -1505744 -1283616 -1012000 -667812 -316005 -75427 -3787 -5454 72029 273777
10994B73777K23054O9775j97659m20504m17403j77878Q2742J57543J11904K14358
$$ 273777 496831 566606 368947 -51557 -468960 -646838 -564096 -406553 -294649 -80291
10984h0291M08511N17160L81504L0658k23934l15996l32992k47954j12239Q1168
$$ -80291 328220 845380 1226884 1257542 1033608 717612 384620 136666 24427 105595
10974A05595K14866R9542j53082k58318k02705j37735j5013L1086j37436k98439
$$ 105595 320461 420003 266921 8603 -194102 -331837 -346850 -315764 -453200 -751639
10964g51639k47894j00792M9128J69990Q7644j32143k09935j05773M7418J61531
$$ -751639 -999533 -1100325 -1051197 -881207 -793563 -925706 -1135641 -1241414 -1193996 -1032465
10954a032465R0468j01813r3629J59453M23251M73407L28480J02234p7324j94425
$$ -1032465 -941997 -1043810 -1137439 -977986 -554735 -81328 247152 349386 272062 77637
10944G7637j89361m5950P0835P3081O3200J00955J32562J38541J78720K78355
$$ 77637 -111724 -157674 -86839 -13758 49442 150397 282959 421500 600220 878575
10934H78575L09920J26204j00684j28585L4523K25076J88313j05315m02910n22265
$$ 878575 1188495 1314699 1214015 1085430 1119953 1345029 1533342 1428027 1025117 502852
10924E02852m82224k82312N4173L44459M39289L62982K57414K05637Q6687j87063
$$ 502852 20628 -261684 -207511 136948 576237 939219 1196633 1402270 1488957 1301894
10914A301894l48208k84119k36086k61741k83720j93060k2935L7019J6616m5229
$$ 1301894 953686 669567 433481 171740 -111980 -305040 -327975 -290956 -274340 -319569
10904c19569j25005j59846j49701m7710K3120n7062j12623n3061M2519J39892
$$ -319569 -444574 -604420 -754121 -801831 -778711 -835773 -948396 -1001457 -958938 -819046
10894h19046K83374M62867N89246N56514L79976J53214k6194j25537k18346l13065
$$ -819046 -535672 -72805 516441 1072955 1452931 1606145 1579951 1454414 1236068 923003
10884I23003k85452j55270r4202j40799j72768j22387L8431K15729K67908J56253
$$ 923003 637551 482281 388079 247280 74512 -47875 -9444 206285 474193 630446
10874F30446o8317k84479m36008n08474m93576m12138k38501J8743K11136J97187
$$ 630446 562129 277650 -158358 -666832 -1160408 -1572546 -1811047 -1792304 -1581168 -1383981
10864a383981J00869Q5915J69745L30394L97863K58692N4620j22750k83521k70041
$$ -1383981 -1283112 -1197197 -1027452 -697058 -299195 -40503 14117 -108633 -392154 -662195
10854f62195j15652l66J12620J41318R3636N9160Q3266K09635L28709L59979L11402
$$ -662195 -777847 -778213 -665593 -524275 -430639 -371479 -288213 -78578 250131 610110 921512
10843I21512K30118J64939J35108N9897q2488k84911o05995p63772m73087n7732
$$ 921512 1151630 1316569 1451677 1511574 1429086 1144175 538180 -225592 -698679 -756411
10833g56411J53508J60086J03308N7873K1508l626l3947J3759J37291J49229O1528
$$ -756411 -602903 -442817 -339509 -281636 -260128 -263754 -297701 -283942 -146651 2578 64106
10822F4106L8928L3006m5706j77447k65215k88465k51638j39637j6220q937m7371
$$ 64106 103034 136040 90334 -87113 -352328 -640793 -892431 -1032068 -1048288 -1057225 -1104596
10811a104596M8636K40558K96091K00431J56477J42483P7119k5750q8144j31562
$$ -1104596 -1055960 -815402 -519311 -318880 -162403 -19920 57199 31449 -56695 -188257
10801a88257k21448j89126j4252J51462K24141K43170J11898k38761n29310n72719
$$ -188257 -409705 -598831 -613083 -461621 -237480 5690 117588 -121173 -650483 -1223202
10791a223202l73644m0631K10294L14673L69955L73724L17586K15470J52983J34354
$$ -1223202 -1596846 -1637477 -1427183 -1112510 -742555 -368831 -51245 164225 317208 451562
10781D51562R5568M3807l1687l9894J04982J78404Q5954J0367l8459j38065k67307
$$ 451562 547130 590937 559250 519356 624338 802742 888696 899063 860604 722539 455232
10770D55232l48521l75764l63169k27766o970J02882k3837j88501k29527j60598
$$ 455232 106711 -269053 -632222 -859988 -866958 -764076 -787913 -976414 -1205941 -1366539
10760a366539K959J91224L14578L70253K63334O9352J30727L85444N00011L72490
$$ -1366539 -1363580 -1172356 -857778 -487525 -224191 -154839 -24112 361332 861343 1233833
10750A233833J19759j08198k48447k91826k60608j86764p5831O0946J31707J60906
$$ 1233833 1353592 1245394 996947 705121 444513 257749 181918 242864 374571 535477
10740E35477P0486j14628j40822n5804o1269j66762k51286k20086j40221m4450
$$ 535477 605963 491335 350513 294709 233440 66678 -184608 -404694 -544915 -589365
10730e89365O5150J61069K34015J70711K6857L2509J76954K99310K79389Q6053
$$ -589365 -524215 -363146 -129131 41580 68437 100946 277900 577210 856599 942652
10720I42652j26562j44648J1999M7132o2733j03704r4993p4894L7550J84178K85302
$$ 942652 816090 671442 683441 730573 667840 564136 469143 394249 431799 615977 901279
10709I01279K95571J46009r7817k40941k91438m54551n83713l23798R3992K69768
$$ 901279 1196850 1342859 1245042 1004101 712663 258112 -325601 -649399 -555407 -285639
10699b85639J20669j69386k37762j29029j00629j26430o9739P2211K07844K79785
$$ -285639 -164970 -334356 -572118 -701147 -801776 -928206 -997945 -925734 -717890 -438105
10689d38105K63287J86176L5277j10248r9223n6287n3878J6595Q8837N0760q5876
$$ -438105 -174818 11358 46635 -63613 -162836 -219123 -273001 -256406 -167569 -116809 -202685
10678b02685k45041l04668k05564m8752N9762J10127J08906J16476K33277L89277
$$ -202685 -447726 -752394 -957958 -1006710 -946948 -836821 -727915 -611439 -378162 11115
10668A1115M73867M38894K41377o219j35400j64335k43788l45003l38642k46719
$$ 11115 484982 923876 1165253 1159034 1023634 859299 615511 270508 -68134 -314853
10658c14853j37848p1921P681J08198J28026K23599M27866M86212L29522J03436
$$ -314853 -452701 -524622 -516941 -408743 -280717 -57118 370748 856960 1186482 1289918
10648A289918j39890k33627j03155p1116k33492m06382l91057k39025j55396j60384
$$ 1289918 1150028 916401 813246 742130 508638 102256 -288801 -527826 -683222 -843606
10638h43606j28387m5139m380R108K33208M94899M40621J77510m4138j20348p5268
$$ -843606 -971993 -1017132 -1021512 -1012404 -779196 -284297 156324 333834 289696 169348 94080
10627I4080L0858J24401J13671k661o6392l792M8152n3838j94886k42059k10244
$$ 94080 124938 249339 363010 360349 293957 290165 338317 284479 89593 -152466 -362710
10616c62710j46315r728J46364J37378l4492k47525l65163k95417k7394K00030
$$ -362710 -509025 -518753 -372389 -235011 -269503 -517028 -882191 -1177608 -1205002 -1004972
10606a004972J89055R6767J04177J15060P9270L4230J0236J8415L2791k4427p2864
$$ -1004972 -815917 -719150 -614973 -499913 -420643 -386413 -376177 -357762 -324971 -349398 -422262
10595d22262J2404J75857L05078L08829K39893N1957j96293k75253j97216j72185
$$ -422262 -409858 -234001 71077 379906 619799 671756 475463 200210 2994 -169191
10585a69191k09546j96974j49408j20297j39522j27185q2845q5352j44496j57307
$$ -169191 -378737 -575711 -725119 -845416 -984938 -1112123 -1194968 -1280320 -1424816 -1582123
10575a582123l786J13238R6655Q0913K09347L87183L26338M004k43223k85769
$$ -1582123 -1585909 -1472671 -1376016 -1295103 -1085756 -698573 -372235 -368231 -611454 -897223
10565h97223k11251m7284J10990J97171J77554J14165Q6482Q1461N0554n6486
$$ -897223 -1108474 -1155758 -1044768 -847597 -670043 -555878 -469396 -387935 -337381 -393867
10555c93867k23394l63022m01550l64213k39328K6180L06459M42120M53088L80324
$$ -393867 -617261 -980283 -1381833 -1746046 -1985374 -1959194 -1652735 -1210615 -757527 -377203
10545c77203J25142j43999j67101m3690J43070K93984K50956J01754n9821j96964
$$ -377203 -252061 -396060 -563161 -606851 -463781 -169797 81159 182913 123092 -73872
10535g3872k56296j85721J9108K65674K88045J00323l5092j52522k38456j39044
$$ -73872 -330168 -515889 -496781 -231107 56938 157261 122169 -30353 -268809 -407853
10525d07853k271j4753o2470J4768J37420J05867P651K243j3408j00598j22137
$$ -407853 -410124 -424877 -487347 -472579 -335159 -229292 -221641 -219398 -232806 -333404 -455541
10514d55541o8477l4206k9538m3942j04225j45932p2480J00764K43585K24563
$$ -455541 -524018 -558224 -587762 -631704 -735929 -881861 -954341 -853577 -609992 -385429
10504c85429L7951j47966j58853J1449K52203M23490L78378J60942N281q5656
$$ -385429 -347478 -495444 -654297 -642848 -390645 32845 411223 572165 577446 491790
10494D91790j87379k58681k65881j65630m8217J5262R9336N2720j53358k22413
$$ 491790 304411 45730 -220151 -385781 -433998 -418736 -319400 -266680 -420038 -642451
10484f42451n1996R4503P9063M3800M0864J46651K43139K04736J25174P4804L7011
$$ -642451 -694447 -599944 -520881 -477081 -436217 -289566 -46427 158309 283483 358287 395298
10473C95298K0596J31502K87721K69882J64624J61008K33713K70113J70591O128
$$ 395298 415894 547396 835117 1104999 1269623 1430631 1664344 1934457 2105048 2111176
10463B111176r6653j52813k23287k03143m3501L4019j1954j13888l18432l80028
$$ 2111176 2014523 1861710 1638423 1435280 1391779 1425798 1413844 1299956 981524 601496
10453F01496k13977n0939R1363J69253J2473j88006k12667k00614k06656k21455
$$ 601496 387519 336580 427943 597196 609669 421663 208996 8382 -198274 -419729
10443d19729k81226l10973k76843k09047j82326j58475J4167K17789K32903J59583
$$ -419729 -700955 -1011928 -1288771 -1497818 -1680144 -1838619 -1824452 -1606663 -1373760 -1214177
10433a214177J94950K04030N4717j49102k01095j14729l6925K5219J25909K43114
$$ -1214177 -1019227 -815197 -760480 -909582 -1110677 -1225406 -1262331 -1237112 -1111203 -868089
10423h68089K51088Q9857K8363J96941L80988L70750J99866N185j51769j53278
$$ -868089 -617001 -527144 -498781 -301840 79148 449898 649764 654949 503180 349902
10413C49902M6223K06803R5329k38533m53294m31566k81743j25807M4043K36516
$$ 349902 396125 602928 698257 459724 6430 -425136 -706879 -832686 -788643 -552127
10403e52127L21809K91600K21131K15546J24727j44713l65636m31033k91124q3322
$$ -552127 -230318 61282 282413 497959 622686 477973 112337 -318696 -609820 -693142
10393f93142O0448J64370J05555k0441q472O3699J15889O8370o1783j69968j77834
$$ -693142 -632694 -468324 -362769 -383210 -391682 -327983 -212094 -143724 -205507 -375475 -553309
10382e53309l3517J44652K04971M8428p6053l1595O1655J13879R2348P9901N5875
$$ -553309 -586826 -442174 -237203 -188775 -264828 -296423 -234768 -120889 -28541 51360 107235
10371A07235o5024k67946l23882j21055J14759J67040N6696M906R8896K40284
$$ 107235 42211 -225735 -549617 -670672 -555913 -388873 -332177 -327271 -228375 11909
10361A1909L03641K22926N4851o5573j04418r9238j28784j10858j16706k62910
$$ 11909 315550 538476 593327 527754 423336 324098 195314 84456 -32250 -295160
10351b95160m11712l57707j49634k4425L158O5192J96701L07590L41917K49973
$$ -295160 -706872 -1064579 -1214213 -1238638 -1235480 -1170288 -973587 -665997 -324080 -74107
10341g4107P2600l5446m1362P1779J95610J33926j1984j08510j80784k31593k14366
$$ -74107 -1507 -36953 -78315 -6536 189074 323000 311016 202506 21722 -209871 -424237
10330d24237q7666J2418j447L2331K06492L87942L82736K16870J65967K36162
$$ -424237 -511903 -499485 -500932 -468601 -262109 125833 508569 725439 891406 1127568
10320A127568K11790p888k40448k56582j79999j45439j26206j78890k60817k27280
$$ 1127568 1339358 1331470 1091022 834440 654441 509002 382796 203906 -56911 -284191
10310b84191j02277m1752q7277j38260j72136j61127p2672L5983J11996J92387
$$ -284191 -386468 -428220 -515497 -653757 -825893 -987020 -1059692 -1023709 -911713 -719326
10300g19326L02869L27801K53531J53206K2898j51540k54236j96819m3661J07591
$$ -719326 -416457 -88656 164875 318081 340979 189439 -64797 -261616 -305277 -197686
10290a97686K29625K74111J64900l1358l7153J21633J70416Q0175m2305m2437
$$ -197686 31939 306050 470950 439592 402439 524072 694488 774663 732358 689921
10280F89921J0167n8511k40161l96572l09739l9187P5141j4336q6062o5171J5909
$$ 689921 700088 641577 401416 4844 -304895 -344082 -268941 -283277 -369339 -434510 -418601
10269d18601q074j49120k34291k70374l01187k95250k49652k11437j34769j1389
$$ -418601 -426675 -575795 -810086 -1080460 -1381647 -1676897 -1926549 -2137986 -2272755 -2284144
10259b284144J31423K58622L33733L16516K48828K16460L08598M21125L77152
$$ -2284144 -2152721 -1894099 -1560366 -1243850 -995022 -778562 -469964 -48839 328313
10250C28313K36283J90657J78918J09887P1696J61760K30462J97433R0056q8374
$$ 328313 564596 755253 934171 1044058 1115754 1277514 1507976 1705409 1795465 1707091
10240A707091k45551k14814q241J31937J57555M4689k12202m72065n15213l60656
$$ 1707091 1461540 1246726 1238485 1370422 1527977 1572666 1360464 888399 373186 12530
10230A2530j96375M216L27820N09139K97399j28880m54488m76648j16316K65876
$$ 12530 -183845 -179629 148191 657330 954729 825849 371361 -105287 -221603 44273
10220D4273K58507j3620k46695l37308k38107O4631L33561L64851J97970j5242
$$ 44273 302780 289160 42465 -294843 -532950 -468319 -134758 230093 428063 412821
10210D12821j55909j58338o0333k070J675J5493J21172L15352M63806M61747L04791
$$ 412821 256912 98574 38241 36171 37846 53339 174511 489863 953669 1415416 1720207
10199A720207J70981Q8229o863k2546J5135L962j24387l34077m82745l88834j94805
$$ 1720207 1891188 1979417 1972554 1950008 1965143 1969105 1844718 1510641 1027896 639062 444257
10188D44257j85952l17692m15061l28266k9753L09597M86266M05741J55060q242
$$ 444257 258305 -59387 -474448 -802714 -832467 -522870 -36604 369137 524197 515955
10178E15955l0220n616l218r1399k52086l05356j34730N1578J09552J66439K02912
$$ 515955 485735 480119 476901 385502 133416 -171940 -306670 -255092 -145540 20899 223811
10167B23811K11875K01881J27685j1064j52460k85759l75361l37176k33412j43898
$$ 223811 435686 637567 765252 754188 601728 315969 -59392 -396568 -629980 -773878
10157g73878p5646N1849K42391M02816M04161K29118j6352k62814m14045l68219
$$ -773878 -849524 -797675 -555284 -152468 251693 480811 464459 201645 -212400 -580619
10147e80619j73907n2110j02681k12618j93781n8605Q1647J63623K06496J59316
$$ -580619 -754526 -806636 -909317 -1121935 -1315716 -1374321 -1292674 -1129051 -922555 -763239
10137g63239M4527J9958L4828k7100j03433j32999j71122l00298m56048m37695
$$ -763239 -718712 -698754 -663926 -691026 -794459 -927458 -1098580 -1398878 -1854926 -2292621
10127b292621j69205R5801K13138L11373M11310L93933K43319J42699J61144P3720
$$ -2292621 -2461826 -2366025 -2152887 -1841514 -1430204 -1036271 -792952 -650253 -489109 -415389
10117d15389q8494r4738j9086M0817J03757J74273K93195L85532L08246K02757
$$ -415389 -503883 -598621 -617707 -576890 -473133 -298860 -5665 379867 688113 890870
10107H90870Q5765j15580k96237l80486l73578k66223j87096k45349k30152q5779
$$ 890870 976635 861055 564818 184332 -189246 -455469 -642565 -887914 -1118066 -1203845
10097a203845m6404j18064j79840j99147q1614J46059K42880Q4975j90686k75833
$$ -1203845 -1250249 -1368313 -1548153 -1747300 -1828914 -1682855 -1439975 -1355000 -1545686 -1821519
10087a821519m6501J92542J90522J5006o9962J52928N27438O72861N34407L34862
$$ -1821519 -1868020 -1675478 -1484956 -1469950 -1539912 -1386984 -859546 -186685 347722 682584
10077F82584J98370M8916p4894r7435m3813J26621K41291J14449j53266k99956
$$ 682584 880954 929870 854976 757541 713728 840349 1081640 1196089 1042823 742867
10067G42867l10482l40888l68685k67885J3029L35327M70496L55108R3518o6351
$$ 742867 432385 91497 -277188 -545073 -532044 -196717 273779 628887 722405 656054
10057F56054o1686O326J17922J91332J18854j475m8357Q2983J79784M2717j37392
$$ 656054 594368 600694 718616 909948 1028802 1027327 978970 1061953 1241737 1284454 1147062
10046A147062k04373j52102j53919k97200m30098l82339k74137k47062k04834
$$ 1147062 942689 790587 636668 339468 -90630 -472969 -747106 -994168 -1199002
10037a199002m3375J21639K30256L93471N57501N24678K87969R4255N0463j5045
$$ -1199002 -1242377 -1120738 -890482 -497011 60490 585168 873137 967392 1017855 1002810
10027A002810j58041j70291l9343M9097J5610L2908J98996L25287K96556J71286
$$ 1002810 844769 674478 635135 684232 699842 732750 931746 1257033 1553589 1724875
10017A724875J0728k34290n00931n19219l46931j90356o2776Q6420J72668J43043
$$ 1724875 1735603 1501313 1000382 481163 134232 -56124 -118900 -32480 140188 283231
10007B83231Q3958K6032N7928K24840L38873K43191J6478j78825k79975l96540
$$ 283231 367189 393221 451149 675989 1014862 1258053 1274531 1095706 815731 419191
9997D19191n40384n35483l85508k42915j39422j13833j15157L7338K16956K57807
$$ 419191 -121193 -656676 -1042184 -1285099 -1424521 -1538354 -1653511 -1616173 -1399217 -1141410
9987a141410K00716J69609J77562J51500J26206J21964J48054K14754K47238K45810
$$ -1141410 -940694 -771085 -593523 -442023 -315817 -193853 -45799 168955 416193 662003
9977F62003K16531J14386j0722j20071k00631k53711j99168l7009O5169j8390
$$ 662003 878534 992920 982198 862127 661496 407785 208617 171608 236777 218387
9967B18387j45488j37311m5190J35599L17481M01241K92363M8976j41216j52779
$$ 218387 72899 -64412 -109602 25997 343478 744719 1037082 1086058 944842 792063
9957G92063r7782j71255j49920J06474L49423L60989J85811M3734M8700L9994
$$ 792063 694281 523026 373106 479580 829003 1189992 1375803 1419537 1468237 1508231
9947A508231q142q2035k04815k59805j83685j35218j95541k13274p9794R2342
$$ 1508231 1500089 1418054 1213239 953434 769749 634531 438990 225716 145922 238264
9937B38264J76396K01536J35813p2196k23580j40949O5009J85950J62748K5404
$$ 238264 414660 616196 752009 679813 456233 315284 380293 566243 728991 754395
9927G54395o2545l6535l0616q8385k38471l25917k54126k21360k42540j73971
$$ 754395 691850 655315 624699 536314 297843 -28074 -282200 -503560 -746100 -920071
9917i20071m0965P0149J36639K23991L04400L00705K35216K12310K06772M5392
$$ -920071 -961036 -890887 -754248 -530257 -225857 74848 310064 522374 729146 774538
9907G74538j81465l50562m46435m41472m27882l52570j55016k1230m5459p4348
$$ 774538 593073 242511 -203924 -645396 -1073278 -1425848 -1580864 -1602094 -1647553 -1721901
9897a721901k216O0190M7201M0605Q1041Q5444J31580K96350M44331N41848N10457
$$ -1721901 -1724117 -1663927 -1616726 -1576121 -1495080 -1409636 -1278056 -981706 -537375 4473 514930
9886E14930K97508Q2101l2811j03952n4630M3976Q398n7598o9934r5460j64469
$$ 514930 812438 894539 861728 757776 703146 747122 755520 697922 627988 532528 368059
9875C68059k47720l43530m21470l45318j86107j12381L624K19793M23704N16915
$$ 368059 120339 -223191 -644661 -989979 -1176086 -1288467 -1284843 -1065050 -641346 -124431
9865a24431M50579K56116O7528q2869k32272l13341k37124q4063O917K8674M4497
$$ -124431 326148 582264 649792 566923 334651 21310 -215814 -299877 -292960 -264286 -219789
9854b19789R7119J33699J21409J55517J92994J81930R6669p4984k45338l49648
$$ -219789 -122670 11029 132438 287955 480949 662879 759548 684564 439226 89578
9844H9578l24954k32287k20159j86871p2836j7540p9800j58974o5121J37826K88380
$$ 89578 -235376 -467663 -687822 -874693 -947529 -965069 -1044869 -1203843 -1268964 -1131138 -842758
$$ [...]
##END NTUPLES=NMR SPECTRUM
##END=
