##TITLE=C13_Ser 3514-EA
 CDCl3, 2230000sc

 10.9.2024
##JCAMPDX= 6.0         $$ Bruker NMR JCAMP-DX V2.0
##DATA TYPE= NMR SPECTRUM
##DATA CLASS= NTUPLES
##ORIGIN= UXNMR, Bruker Analytische Messtechnik GmbH
##OWNER= root
$$ XWIN-NMR		Version 3.5
$$ Wed Sep 11 13:41:25 2024 Russian Standard Time (UT+4h)  she@DPX200
##.OBSERVE FREQUENCY= 50.327896
##.OBSERVE NUCLEUS= ^13C
##.ACQUISITION MODE= SIMULTANEOUS
##.ACQUISITION SCHEME= undefined
##.AVERAGES= 18320
##.DIGITISER RES= 17
##SPECTROMETER/DATA SYSTEM= spect
##.PULSE SEQUENCE= zgpg30
##.SOLVENT NAME= DMSO
##.SHIFT REFERENCE= (INTERNAL, DMSO, 0, 222.565)
##AUDIT TRAIL= $$ (NUMBER, WHEN, WHO, WHERE, WHAT)
$$ ##TITLE= Audit trail, XWIN-NMR		Version 3.5
$$ ##JCAMPDX= 5.01
$$ ##ORIGIN= Bruker BioSpin GmbH
$$ ##OWNER= she
$$ F:/spectra/data/she/nmr/c13/1/pdata/1/auditp.txt
$$ ##AUDIT TRAIL=  $$ (NUMBER, WHEN, WHO, WHERE, WHAT)
(   1,<2024-09-11 10:01:47.50 +0400>,<she>,<DPX200>,
      <created by zg, POWCHK disabled, PULCHK disabled
       terminated by command 'halt'
       configuration hash MD5:
       00 E9 B6 7A A2 85 ED C7 34 08 36 98 17 FE 4E 26
       data hash MD5: 32K
       FF E7 02 29 C5 09 43 2A DB D1 95 AE 9B 3D 3B A5>)
(   2,<2024-09-11 10:01:49.43 +0400>,<she>,<DPX200>,
      <Start of raw data processing
       efp BC_mod = 2 LB = 2 FT_mod = 6 PKNL = 1 PHC0 = -533.1912 PHC1 = 22.58854 SI = 32K 
       data hash MD5: 32K
       7D 39 61 2D AA 3A DA 78 BC EA AD FD 4A 13 13 8E>)
(   3,<2024-09-11 10:01:52.60 +0400>,<she>,<DPX200>,
      <apk 
       data hash MD5: 32K
       C1 1D 28 64 9A 04 DD EF AD F7 27 96 D1 13 21 BB>)
(   4,<2024-09-11 10:01:55.39 +0400>,<she>,<DPX200>,
      <abs n ABSG = 5 
       data hash MD5: 32K
       4C F3 5D 79 4C A3 A0 1F 7D 45 C7 52 AA 3D 65 61>)
(   5,<2024-09-11 13:38:42.12 +0400>,<she>,<DPX200>,
      <abs ABSG = 5 
       data hash MD5: 32K
       BA 65 6E 6D 74 24 9D DF 28 65 10 EE F4 E0 13 72>)
(   6,<2024-09-11 13:39:05.32 +0400>,<she>,<DPX200>,
      <pk PHC0 = 3.192497 PHC1 = -4.000001 
       data hash MD5: 32K
       92 CF 59 8D 21 CF 13 81 7C C0 AE 01 A0 F1 BF 52>)
(   7,<2024-09-11 13:39:09.79 +0400>,<she>,<DPX200>,
      <abs ABSG = 5 
       data hash MD5: 32K
       00 6F 81 F7 92 56 FF 6D B0 F4 99 57 1E 38 B3 AA>)
(   8,<2024-09-11 13:39:57.95 +0400>,<she>,<DPX200>,
      <pk PHC0 = -0.8327715 PHC1 = -1.200013 
       data hash MD5: 32K
       88 70 25 A0 02 14 2F FB F0 78 99 52 CB CC AD 5E>)
(   9,<2024-09-11 13:40:01.68 +0400>,<she>,<DPX200>,
      <abs ABSG = 5 
       data hash MD5: 32K
       8B 45 68 12 25 72 3B 18 1B A7 22 E9 CA F6 C1 87>)
$$ ##END=
$$ 
$$ hash MD5
$$ 19 28 39 25 C3 C7 91 0E A9 37 2A D0 57 B9 FD 71
##$RELAX= 
##$RELAX= 
##$RELAX= 
##$RELAX= 
##$RELAX= 
##$RELAX= 
##$RELAX= 
##$RELAX= 
$$ Bruker specific parameters
$$ --------------------------
##$DU= <F:/spectra>
##$EXPNO= 1
##$NAME= <c13>
##$PROCNO= 1
##$TYPE= <nmr>
##$USER= <she>
##$AMP= (0..31)
$$ [...]
##$SUBNAM4= <"">
##$SUBNAM5= <"">
##$SUBNAM6= <"">
##$SUBNAM7= <"">
##$SUBNAM8= <"">
##$SUBNAM9= <"">
##$SW= 239.972175391363
##$SWIBOX= (0..15)
0 1 3 0 0 0 0 0 0 0 0 0 0 0 0 0 
##$SW_h= 12077.2946859903
##$TD= 32768
##$TD0= 1
##$TE= 0
##$TE2= 300
##$TE3= 300
##$TEG= 300
##$TL= (0..7)
120 120 120 120 120 120 120 120 
##$TP= (0..7)
150 150 150 150 150 150 150 150 
##$TP07= 0
##$TPNAME0= <>
##$TPNAME1= <>
##$TPNAME2= <>
##$TPNAME3= <>
##$TPNAME4= <>
##$TPNAME5= <>
##$TPNAME6= <>
##$TPNAME7= <>
##$TPOAL= (0..7)
0.5 0.5 0.5 0.5 0.5 0.5 0.5 0.5 
##$TPOFFS= (0..7)
0 0 0 0 0 0 0 0 
##$TUNHIN= 0
##$TUNHOUT= 0
##$TUNXOUT= 0
##$USERA1= <user>
##$USERA2= <user>
##$USERA3= <user>
##$USERA4= <user>
##$USERA5= <user>
##$V9= 5
##$VALIST= <valist>
##$VCLIST= <CCCCCCCCCCCCCCC>
##$VD= 0
##$VDLIST= <DDDDDDDDDDDDDDD>
##$VPLIST= <PPPPPPPPPPPPPPP>
##$VTLIST= <TTTTTTTTTTTTTTT>
##$WBST= 1024
##$WBSW= 4
##$XGAIN= (0..3)
0 0 0 0 
##$XL= 0
##$YL= 0
##$YMAX_a= 111626907
##$YMIN_a= -84491376
##$ZGOPTNS= <>
##$ZL1= 120
##$ZL2= 120
##$ZL3= 120
##$ZL4= 120
##$ABSF1= 222.5654
##$ABSF2= -17.4314
##$ABSG= 5
##$ABSL= 3
##$ALPHA= 0
##$AQORDER= 0
##$ASSFAC= 0
##$ASSFACI= 0
##$ASSFACX= 0
##$ASSWID= 0
##$AUNMP= <proc_1d>
##$AZFE= 0.1
##$AZFW= 0.5
##$BCFW= 0
##$BC_mod= 2
##$BYTORDP= 0
##$COROFFS= 0
##$CY= -3
##$DATMOD= 1
##$DC= 0
##$DFILT= <>
##$DTYPP= 0
##$F1P= 0
##$F2P= 0
##$FCOR= 0.5
##$FTSIZE= 32768
##$FT_mod= 6
##$GAMMA= 0
##$GB= 0
##$INTBC= 1
##$INTSCL= 4.134877e-10
##$ISEN= 128
##$LB= 2
##$LEV0= 0
##$LPBIN= 0
##$MAXI= 10000
##$MC2= 0
##$MEAN= 0
##$ME_mod= 0
##$MI= 0.1934396
##$NCOEF= 0
##$NC_proc= 1
##$NLEV= 6
##$NOISF1= 120.0001
##$NOISF2= 80.00006
##$NSP= 0
##$NTH_PI= 0
##$NZP= 0
##$OFFSET= 222.5654
##$PC= 1.4
##$PHC0= -519.8005
##$PHC1= 10.96005
##$PH_mod= 1
##$PKNL= yes
##$PPARMOD= 0
##$PSCAL= 0
##$PSIGN= 0
##$REVERSE= no
##$SF= 50.3227345484362
##$SI= 32768
##$SIGF1= 140
##$SIGF2= 120
##$SINO= 11.81781
##$SIOLD= 32768
##$SREGLST= <13C.CDCl3>
##$SSB= 0
##$STSI= 32768
##$STSR= 0
##$SW_p= 12077.2946859903
##$SYMM= 0
##$S_DEV= 0
##$TDeff= 32768
##$TDoff= 0
##$TI= <>
##$TILT= no
##$TM1= 0
##$TM2= 0
##$TOPLEV= 0
##$USERP1= <user>
##$USERP2= <user>
##$USERP3= <user>
##$USERP4= <user>
##$USERP5= <user>
##$WDW= 1
##$XDIM= 32768
##$YMAX_p= 381307686
##$YMIN_p= -14398707
$$ End of Bruker specific parameters
$$ ---------------------------------
##NTUPLES= NMR SPECTRUM
##VAR_NAME=  FREQUENCY,     SPECTRUM/REAL,   SPECTRUM/IMAG
##SYMBOL=    X,             R,               I
##VAR_TYPE=  INDEPENDENT,   DEPENDENT,       DEPENDENT
##VAR_FORM=  AFFN,          ASDF,            ASDF
##VAR_DIM=   32768,         32768,           32768
##UNITS=     HZ,            ARBITRARY UNITS, ARBITRARY UNITS
##FACTOR=    0.368581032318806, 1,           1
##FIRST=     11200.0995020947, 0,            0
##LAST=      -877.195183895579, 0,           0
##MIN=       -877.195183895579, -14398707,   0
##MAX=       11200.0995020947, 381307686,    0
$$ Real data points
##PAGE= N=1
##DATA TABLE= (X++(R..R)), XYDATA
$$ [...]
15925a242470j76641j72062J03380M19784M70646L87196K92166J12627j06690
15916H7936k30187k24586j68102k2591J75549K71717K02522M6297j82398m22045
15906d65888m48552k50042k3532J78110L82132M56807L27683J11189j40809k53835
15896a26737k68330l21313k69263j39333j25152k15266k57502j77202j34853j75804
15886b210755j10617J50975L96366L67160K02059K2933j48722j58681O5729L20333
15876a103220M10495L44763J79420l061r2475k3986J80476K39768K6650k29299
15866g0469k74852j51350P500J31953R5981n0591j72480k78139k57271p1418J04919
15855i86217J33166J29584J85250K40339K23040R4222n4982j76460k08325j01831
$$ y = [-1242470, -1419111, -1591173, -1487793, -1068009, -597363, -210167, 81999, 194626, 87936, -142251, -366837, -534939, -557530, -381981, -110264, 92258, 138555, -43843, -465888, -914440, -1164482, -1188014, -1009904, -627772, -170965, 156718, 267907, 127098, -126737, -395067, -716380, -985643, -1124976, -1250128, -1465394, -1722896, -1900098, -2034951, -2210755, -2321372, -2170397, -1774031, -1406871, -1204812, -1181879, -1330601, -1489282, -1423553, -1103220, -692725, -347962, -168542, -171603, -264078, -288064, -107588, 132180, 158830, -70469, -345321, -496671, -489171, -357218, -261237, -311828, -484308, -762447, -1019718, -1091136, -986217, -853051, -723467, -538217, -297878, -74838, 19384, -35598, -212058, -420383, -522214]
15845e22214r691P552R5000K20621K18965J47473J82149J61434l2659j88986k55625
15834B4019k52324j01344R2598J44296L0660j89971k94362j50605M4874J46978
15824e05181K40400L44576L38969K53949J80112M4808j48442k14948j70631j54575
15814B09037k18178k91362k80866j77812j20428l0906Q0152Q6695O3514P3486
15804f06668M2813N7533J17023m576k69824m17043l26177q912K73909K52259Q1110
15793h08553P3973J80718K11110P3427j59387k82940k05850n8056R1622K82760
15783f01176M17697M43636L55744K28422J83876J71855Q3328r828m3616q9256
15773A140682j60588j88654j48227m6157M0130o8921k62282k82200k07462j72161
$$ y = [-522214, -531905, -524353, -429353, -208732, 10233, 157706, 339855, 501289, 468630, 279644, 24019, -228305, -329649, -237051, -92755, -62095, -252066, -546428, -697033, -652159, -505181, -264781, 79795, 418764, 672713, 852825, 897633, 749191, 534243, 363612, 209037, -9141, -300503, -581369, -759181, -879609, -910515, -830363, -743668, -680154, -606668, -563855, -506322, -389299, -393875, -663699, -1080742, -1406919, -1415831, -1141922, -889663, -808553, -734580, -553862, -342752, -269325, -428712, -711652, -917502, -975558, -883936, -601176, -183479, 260157, 615901, 844323, 1028199, 1200054, 1283382, 1273554, 1229938, 1140682, 980094, 791440, 643213, 597056, 637186, 568265, 305983, 23783, -183679, -355840]
15763c55840j37473j14408j85409k55076j83412N262J22335P3263L5518Q6026
15753i09214J70634L05077L79136L21193K34942J67799J29359J07009L8869q1786
15743H63018k91248m07706k56850q9617r6242j85712k93853m08645m78508m85574
15733b130937m45445k45594N9092K59567K89793K71563K86178L09271J78904k9138
15723a196746j46014k37300l03909k28209j20891j40906j63437k0790K32340M45506
15713a880356N01577M54135L95219J82841o3921r6544o557K0137k913O5156J25613
15702c05613J13179J34284K26625K87401K41375J03756r6459j80252q2719J0273
15692D51850L8782N2083L4344j849K1441J07989O0488k1183r7468k64939l48013
$$ y = [-355840, -493313, -607721, -793130, -1048206, -1231618, -1226356, -1104021, -1030758, -995240, -909214, -738580, -433503, -54367, 266826, 501768, 669567, 798926, 905935, 944804, 863018, 571770, 164064, -92786, -182403, -278645, -464357, -758210, -1166855, -1645363, -2130937, -2576382, -2821976, -2762884, -2503317, -2213524, -1941961, -1655783, -1346512, -1167608, -1196746, -1342760, -1580060, -1883969, -2112178, -2233069, -2373975, -2537412, -2558202, -2325862, -1880356, -1378779, -924644, -529425, -346584, -410505, -507049, -513606, -493469, -496382, -431226, -305613, -192434, -58150, 168475, 455876, 697251, 801007, 704548, 524296, 441577, 451850, 490632, 542715, 577059, 575210, 596651, 704640, 765128, 743945, 646477, 381538, 33525]
15681C3525k25117j23228j08732p5989m6829J8163J31356K14821J47651m6070
15671h0449j98620j96643j07784j29284k46532k48039n9689J21134J95303K85443
15661f65160L70568K40497m5612k75961m50043n19089m01117j57542R4139K46458
15651a562862L13839K84694J57588R4491O0869o9234j42947n5464J14879K94380
15641e09767M30972M88609L97804K25984L1949r8381q7713n8860n8432j25086
15631F37079k12978k87710k18761n1536r3460k60650k56039j57587j53329k13272
15621a268243j58051l1519P5469J72160K31230K35466K70746L09791K47999J15093
15611B00141l2901j17589p2758Q3012K09695K15315J13755m9452j95376j84006
$$ y = [33525, -191592, -314820, -423552, -499541, -546370, -528207, -396851, -182030, -34379, -80449, -279069, -475712, -583496, -712780, -959312, -1207351, -1267040, -1145906, -950603, -665160, -294592, -54095, -99707, -375668, -825711, -1344800, -1745917, -1903459, -1809320, -1562862, -1249023, -964329, -806741, -712250, -651381, -720615, -863562, -919026, -804147, -509767, -78795, 409814, 807618, 1033602, 1065551, 967170, 879457, 820597, 762165, 637079, 424101, 136391, -82370, -133906, -227366, -488016, -744055, -901642, -1054971, -1268243, -1426294, -1457813, -1382344, -1210184, -978954, -743488, -472742, -162951, 85048, 200141, 167240, 49651, -23107, 59905, 269600, 484915, 598670, 549218, 353842, 169836]
15601A69836o6513l1163q0700N320J84976K92662L11720K65036R8259j36113k57939
15590G55381k21313j16147j15349j67649j67452j12116K6643J93774K45095J56607
15580D77474k2401j94728l22861m18428l38942j47386k44Q4376J72056K27062
15570d84022J31472q6507k39699j09610J75664L23417L19423K18342K2595j92996
15560G8079k76556j35168J8915l2994j59860j44312O5572K78399K75512J15687
15550H3274j4369o0746k2864Q8072K54672L88859L79963K53947J44303j853j32570
15539A360688j03617j09298j92145k16207j87357j08727m5607m9027n9451p2831
15529B16421j35605j83639j22525j3449L6014J4104k2763n5477q9220k8173R8623
$$ y = [169836, 103323, 72160, -8540, -3220, 181756, 474418, 786138, 1051174, 1149433, 1013320, 755381, 534068, 417921, 302572, 134923, -32529, -144645, -118002, 75772, 320867, 477474, 455073, 260345, -62516, -480944, -819886, -967272, -967516, -883140, -711084, -484022, -352550, -439057, -678756, -788366, -612702, -289285, 30138, 248480, 271075, 78079, -198477, -333645, -314730, -347724, -507584, -651896, -586324, -307925, -32413, 83274, 68905, 8159, -14705, 73367, 328039, 716898, 1096861, 1350808, 1495111, 1493258, 1360688, 1257071, 1147773, 955628, 739421, 552064, 443337, 397730, 348703, 289252, 216421, 80816, -102823, -225348, -238797, -202783, -188679, -211442, -266919, -356139, -384312, -285689]
15518b85689J40411j7174k59876l14962j51048J12198M08990M99927K58093l5412
15508C55458j58242r2028Q932l3073j37314j68932j88328k41827k00180n2549
15498i08083m4738j39918r1389K7810M7012k5530r5407q4917K7821J59060L11922
15487h16357M38993M15931L08157K72647J82002o7463k95210l14889j52769m0757
15477f9715o3556j36118j89747j35277o8444N4164K86940L89329K84845J35922
15467D88343N5300M0215N6774M3339K5073L4812J8356N8735K51183M59205L98885
15456A930220N5161k15000k55009j98031q5363N9485K26433L71810L12635P8178
15446B280519K4756K09740L59685M18251M24979M24706M52596M78142L95625J9124
$$ y = [-285689, -145278, -162452, -422328, -737290, -888338, -776140, -367150, 132777, 390870, 355458, 197216, 105188, 114120, 81047, -56267, -225199, -413527, -655354, -855534, -908083, -952821, -1092739, -1184128, -1156318, -1109306, -1134836, -1230243, -1315160, -1287339, -1128279, -816357, -377364, 38567, 346724, 619371, 801373, 733910, 438700, 123811, -28958, -69715, -133271, -269389, -459136, -594413, -662857, -608693, -321753, 67576, 352421, 488343, 543643, 583858, 640632, 683971, 709044, 743856, 762212, 820947, 1072130, 1531335, 1930220, 1985381, 1770381, 1515372, 1317341, 1231978, 1291463, 1517896, 1889706, 2202341, 2280519, 2305275, 2515015, 2874700, 3292951, 3717930, 4142636, 4595232, 5073374, 5468999, 5488123]
15436E488123n88158j051547j116604p86369m29232k68406j72705j35238k04775
15427G35089l07851l49087k56822n3646J54064K47301R3721j37489j74539p9503
15417a28762M2165J55690L02378L76782K51800P4810p0721k33821l63392l80071
15407B6858k37842M9271K61353K61255J66892Q2843K0206q186r6863k06980k46926
15396G1881k26486k20847j96993j8498J19031M8258j07040k52254l48614k02946
15386a334508J54098M50569N18683L69119J88632J25505J14380M2626j24755k63597
15376B40752k25705o5588P5107J53780J41965M1374j48991k41799r1311K30720
15366A10304M56113M33510L53709K61917P7394j89745l71105m49693m34628k74680
$$ y = [5488123, 4899965, 3848418, 2731814, 1945445, 1516213, 1247807, 1075102, 939864, 735089, 427238, 78151, -178671, -232317, -78253, 169048, 262769, 125280, -49259, -128762, -86597, 69093, 371471, 748253, 1000053, 1074863, 1004142, 770321, 406929, 26858, -210984, -161713, 99640, 360895, 527787, 610630, 630836, 622650, 525787, 318807, 71881, -154605, -375452, -572445, -590943, -471912, -423654, -530694, -782948, -1131562, -1334508, -1180410, -729841, -211158, 157961, 346593, 472098, 586478, 629104, 504349, 240752, 15047, -50541, 24566, 178346, 320311, 361685, 212694, -29105, -120416, 110304, 566417, 999927, 1353636, 1615553, 1692947, 1503202, 1132097, 682404, 247776, -26904]
15356b6904j34130r3087j3619K97p3140L0403K60567L18135J49168k5694m3514
15345C48482N5461J50382J04815m0449j30418k31334l79441m19732k70319k3611
15335h36164R0381L0265q695P0527J15266L0745m0433m6764Q440J03220J81363
15324c01849J60588L4219j00998q0989N0622J05371O8350M2273J66079K30084
15314C73750J14872L7058j5818m8859j09833k15688k16462j06946n872L4376j2675
15303a72097q7198O9400L10590K88983J21241l8032j72486j34342J1159R0508
15293B87726J10785J85955K61925J66529k9619j13349j6655Q1679R9431J30223
15283A164630J46003K5348j60869k46534k00838n8692M7116M3943p5427k22797
$$ y = [-26904, -161034, -254121, -267740, -267443, -340583, -310180, -49613, 268522, 417690, 391996, 348482, 403943, 554325, 659140, 618691, 488273, 256939, -122502, -542234, -812553, -836164, -745783, -715518, -724213, -653686, -538420, -507675, -548108, -594872, -586432, -483212, -301849, -141261, -107042, -208040, -289029, -238407, -133036, -64686, -22413, 143666, 373750, 488622, 525680, 509862, 461003, 351170, 135482, -80980, -187926, -193798, -159422, -172097, -259295, -189895, 120695, 409678, 530919, 492887, 320401, 186059, 197218, 287726, 398511, 584466, 846391, 1012920, 983301, 869952, 853297, 934976, 1034407, 1164630, 1310633, 1335981, 1175112, 928578, 727740, 669048, 716164, 760107, 684680, 461883]
15273D61883l30265m36604n10489m46388k35505J5442K36116K49203N3400j10474
15263a053681r1325N5969J67278J56377J01445Q3853J34580J49713J38697J40120
15253a6974M4158r6963j18110p1431p7245m2900O4495N4179o5736q4433j8809
15242d29769m5900k16847k69071j26481J6845N2281q4915j99296n8577K10756
15232a150974L59972K76813P3555K2578J34676J95898J05906Q2763J59430L9722
15222C00339j80580k31563j07121J5924Q4021J64475K71191L67465K83997j2209
15212I55939k79594l04493j47894l7816q6686k50925k50125k3010J33533P3383
15202b17688l6128m696N5317j8506j81828k34005n8812K16392L08064J99212N7862
$$ y = [461883, 131618, -304986, -815475, -1261863, -1497368, -1481926, -1245810, -996607, -943207, -1053681, -1145006, -1089037, -921759, -765382, -663937, -580084, -445504, -295791, -157094, -16974, 27184, -69779, -187889, -259320, -336565, -379465, -314970, -260791, -326527, -410960, -429769, -475669, -692516, -961587, -1088068, -1071223, -1018942, -1103857, -1303153, -1361730, -1150974, -791002, -514189, -440634, -418056, -283380, -87482, 18424, 101187, 260617, 300339, 119759, -111804, -218925, -203001, -118980, 45495, 316686, 684151, 968148, 955939, 676345, 371852, 223958, 186142, 99456, -151469, -401594, -424604, -291071, -217688, -253816, -258512, -203195, -221701, -403529, -637534, -696346, -479954, -171890, 27322, 85184]
15191H5184j13576k38680l33034m02103l35793k88469k87751j83636J3625K45902
15181a838331L57656L48304L14556K39863J66212J19002J26894J25025j7464j86661
15171b44944j48504J29145L44690K49100R1844J58981K42258J36454r8129k52685
15161F08210k65966k98858k96367j19500J43939L13645L09905J46723N121M2284
15151E89136K08965L38374K59037k4777k77462l33687k85371k74498k28363r3918
15141a22564j7906j39758m05213m53835j79128J18982J49048O1829N2149P9927
15131h56469R7580N9751j7332k01895m08356l71357j32585P7810K70785M33032
15121a049036M69800M55543M67104L67143J27433l4692j6886R7031J46594N6821
$$ y = [85184, -28392, -267072, -600106, -1002209, -1338002, -1626471, -1914222, -2097858, -2084233, -1838331, -1480675, -1132371, -817815, -577952, -411740, -292738, -165844, -40819, -58283, -244944, -393448, -264303, 80387, 329487, 421331, 580312, 822570, 959024, 860895, 608210, 342244, 43386, -252981, -372481, -228542, 85103, 395008, 541731, 546852, 589136, 798101, 1136475, 1395512, 1370735, 1093273, 759586, 474215, 199717, -28646, -122564, -140470, -280228, -685441, -1139276, -1318404, -1199422, -1050374, -988545, -936396, -856469, -758889, -699138, -716470, -918365, -1326721, -1698078, -1830663, -1752853, -1482068, -1049036, -579236, -123693, 343411, 710554, 837987, 803295, 786409, 883440, 1030034, 1086855]
15111A086855j01169k34988l35510l78128k42451k6371Q3064Q5374K9515m8953
15101h2762r0659k6475P0003J19526J37394J56141K36548K75289J56502o4456
15091H87051k24449j44461J56116M28962M50367K34038J1271k6399L0828J7763
15081A821087j06292l06532m24842l45300l29875n23092o32586n04668j99811
15072a551911K33648N46857N29056K58115r5729l57330l97250k92118j42096j6812
15062a285570J26550K40857J97243J14271N3657J1895k0067n6092j00542j43793
15052h61591j46563p7089K2044J13441K13150L21592M24490N15559N10748L92346
15042A428127K58491N3848j48063j39344k3328l9359j76788l62059m91598m20772
$$ y = [1086855, 985686, 750698, 415188, 37060, -205391, -231762, -148698, -63324, -33809, -82762, -173421, -199896, -129893, -10367, 127027, 283168, 519716, 795005, 951507, 887051, 662602, 518141, 674257, 1103219, 1553586, 1787624, 1798895, 1772496, 1803324, 1821087, 1714795, 1408263, 983421, 638121, 308246, -214846, -847432, -1352100, -1551911, -1318263, -771406, -242350, 15765, -79964, -437294, -834544, -1126662, -1268758, -1285570, -1159020, -918163, -720920, -606649, -552992, -541097, -561164, -617256, -717798, -861591, -1008154, -1085243, -1063199, -949758, -736608, -415016, 9474, 525033, 1035781, 1428127, 1686618, 1740466, 1592403, 1453059, 1429731, 1390372, 1213584, 851525, 359927, -60845]
15032f0845k51326j93021k99600l85445k54066K4471K45159L21624L10037K63685
15022b79327J91173J14742R8962Q8935J1620q6067j63976j78177j22243L3438
15012b90920K59095M00631L76684K54469O5316j81849l97696m35491k92397j27966
15002c70124n8080m4877n7540o2367r1901k22865k40993m7960J32612J27901L7689
14991h98505m0536n9951L2446J24387J66770J57822K5285j22561j73682j77027
14981i65552k15495k01342m8139J29807K72087K71993R0024j06032k43841l80934
14971a397424l52928j31661R5799K35682K53136J37506n7780k01171k40361j44385
14961a803587N6689J21337R6271J16593J55806K12163K42138J71951R9394J93248
$$ y = [-60845, -312171, -505192, -804792, -1190237, -1444303, -1419832, -1174673, -853049, -543012, -279327, -88154, 26588, 125550, 214485, 226105, 140038, -23938, -202115, -324358, -290920, -31825, 368806, 745490, 999959, 1065275, 883426, 485730, 50239, -242158, -370124, -428204, -473081, -530621, -592988, -684889, -907754, -1148747, -1196707, -1064095, -936194, -898505, -939041, -998992, -966546, -842159, -675389, -517567, -492282, -614843, -788525, -965552, -1181047, -1382389, -1430528, -1300721, -1028634, -756641, -666617, -772649, -1016490, -1397424, -1750352, -1882013, -1786214, -1550532, -1297396, -1159890, -1217670, -1418841, -1659202, -1803587, -1746898, -1625561, -1529290, -1412697, -1256891, -1044728, -802590, -630639, -531245, -337997]
14951c37997L28830L71182L87362L97223L30949K04097M8534j52490l81358n24630
14941F71702n07767k65922j01056j69415j50684L6286J33447N7776o5437j10541
14931d71611j20456r7562R179J11108J07493J0187p4459p7909K797J82404L29609
14920h9220L45844K30311L4163j36216k07123j85881j48301j21709q5902K6018
14910c38016J69704J41267k6103j83040k02762l471J54997M1203j70206k91075
14900g07502l36593l68473l64169j60951K79931N91938N28914K59757J2406n0258
14890c15000m0297r7563n7391J44190J87527M5127q5260j97976k42327j57418
14880h16388m414O5762L6099N338j4046L7626J83161K43983J13550m6915j42464
$$ y = [-337997, -9167, 362015, 749377, 1146600, 1477549, 1681646, 1730180, 1577690, 1196332, 671702, 163935, -101987, -203043, -372458, -523142, -486856, -353409, -295633, -361070, -471611, -592067, -689629, -680450, -569342, -461849, -451662, -526121, -604030, -601233, -418829, -89220, 256624, 486935, 521098, 384882, 177759, -8122, -156423, -278132, -364034, -338016, -168312, -27045, -53148, -236188, -438950, -442421, -287424, -246221, -416427, -707502, -1044095, -1412568, -1776737, -1937688, -1657757, -1065819, -536905, -277148, -264742, -315000, -355297, -452860, -510251, -366061, -178534, -133407, -218667, -416643, -658970, -816388, -820802, -755040, -718941, -713603, -727649, -690023, -506862, -262879, -149329, -196244, -338708]
14869c38708j32251j2318M7862M2271J47017K52407J67261j5998j66478j45662
14859a54597N7057J94370J37086L0845N2043Q5339k1449j75153j97059j25063
14849a16581j03104j22777r8225r7734m5830J15119J97292P1558m1355O5710K22514
14838D6587K50633J92555J68368J62602R9415k7712j32569j99276k46754k16002
14828I7847j74347k34085k86067j94343j06371q8099m2872L7809R9268J23972
14818g67288J23310J16265N0936p1844j78241j66060n5025M1462M6455l34J1512
14807h48852P6703J33788J03750L9850N7205O5738P090j7591O6166J47039J28851
14796d0263O3805m1702k12898l11480k60151j83232j32015r4391o5840K6711Q4419
$$ y = [-338708, -470959, -483277, -435415, -393144, -246127, 6280, 173541, 157543, -8935, -154597, -97540, 96830, 233916, 264761, 316804, 402143, 380694, 205541, 8482, -116581, -219685, -342462, -440687, -538421, -584251, -469132, -271840, -200282, -241637, -175927, 46587, 297220, 489775, 658143, 820745, 920160, 892448, 759879, 560603, 313849, 97847, -76500, -310585, -596652, -790995, -897366, -985465, -1028337, -990528, -891260, -767288, -643978, -527713, -476777, -548621, -726862, -892922, -947947, -906485, -860030, -860364, -848852, -772149, -638361, -534611, -494761, -437556, -371818, -364728, -382319, -316153, -169114, -40263, 23542, -18160, -231058, -542538, -802689, -985921, -1117936, -1212327, -1278167, -1251456, -1167037]
14785a167037M8025j5478j13882j18458N1941K75079L20413J79499K9669q4146
14775e94375k43076k74820j64791j03025k2481P7985R8935J14312J70625J90163
14765g50548J78524J68639J50779J42172J27530J80202K57742J48955r8687k69770
14755B35538k70457j00341O3644M7436j33512l26954l87643l29422j74490O8652
14745a307549K16011J98116J48288R1296M1662L9194M7478J9614j2466P5336J98008
14734b45012J95667J31312M9016m1486o8933j04339j50620q8871K8792Q2488l4649
14723b46635k36996k65137l1912K43428K56067J46327J31251J76465J34791k9971
14713B77678k09212l33085l02313j9792L06456M03873K64513L2798j05643j11253
$$ y = [-1167037, -1119012, -1134490, -1248372, -1366830, -1314889, -1039810, -719397, -539898, -510229, -594375, -837451, -1112271, -1277062, -1380087, -1402568, -1324583, -1225648, -1111336, -940711, -750548, -572024, -403385, -252606, -110434, 17096, 197298, 455040, 603995, 505308, 235538, -34919, -135260, -71616, -24180, -157692, -484646, -872289, -1201711, -1376201, -1307549, -1091538, -893422, -745134, -653838, -612176, -572982, -525504, -505890, -518356, -443020, -245012, -49345, 81967, 130983, 89497, 20564, -83775, -234395, -323266, -294474, -211986, -246635, -483631, -748768, -780680, -537252, -281185, -134858, -3607, 172858, 307649, 277678, 68466, -264619, -566932, -586724, -280268, 123605, 388118, 420916, 315273, 204020]
14703B04020n9977k8118l6648q4872j17957j24285j35045j21500p2789R672J36238
14692d31261K25743K15294J02234P2629K39214L00914R6648q6865n7207K8314
14682G05657M7544N999q5120k03637l03737k66523j41561k02946l14527k79652
14672a038503j85838q2517k4004N7186J58145J27442Q1371J81823L68617N05457
14662A49179M31411J49460p0875q7693k5873j8804n5139k9838p2996k24951j63593
14651a9712K36336N46318N60202M69885L71859L10134J84232m6833k04301k11106
14641B197014q4696P4650J46275N5109j25647k12352k45400k87871k97592l47154
14631H72336m07418l80841k22999N5387K34196K69796K46755J70313M0060m3622
$$ y = [204020, 144043, 115925, 79277, -5595, -123552, -247837, -382882, -504382, -577171, -567499, -431261, -205518, 9776, 112010, 184639, 423853, 724767, 821415, 734550, 677343, 705657, 753201, 759200, 674080, 470443, 166706, -99817, -241378, -444324, -758851, -1038503, -1224341, -1306858, -1330862, -1273676, -1115531, -988089, -906718, -724895, -356278, 149179, 580590, 730050, 659175, 571482, 545609, 526805, 471666, 441828, 368832, 143881, -19712, 216624, 762942, 1323144, 1793029, 2164888, 2475022, 2659254, 2612421, 2408120, 2197014, 2112318, 2186968, 2333243, 2388352, 2262705, 2050353, 1804953, 1517082, 1219490, 872336, 464918, 84077, -138922, -83535, 150661, 420457, 667212, 837525, 877585, 833963]
14621H33963o473P4327Q1845m7081j74747j91527j14679l0025o9415j78895j41917
14610C5376Q2824K83268L53300L34297K48294J19458n7195k41458k81120j72617
14600G04427j88510l56582l60827j87730m0066m5989j51646j82024j62104k12699
14590a183750l18719k62484K0636K70351K76533K30317L09212L63408K53341O5273
14580B4118m7707o186J64268L25806L31970K38047J39601J6688j59419k54637
14570G72549r3192J74226K60956J82935P2975j35516m10753n02663k95639L4338
14560F0216K18940J75680L9262M5219J28811Q4405m1639j83215m01135o10308
14550d83764o00712l36655o5642J2236O9428K31763L08903K54459K25109K62228
$$ y = [833963, 827490, 901817, 983662, 936581, 761834, 570307, 455628, 425603, 356188, 177293, 35376, 118200, 401468, 754768, 1089065, 1337359, 1456817, 1399622, 1158164, 877044, 704427, 515917, 159335, -201492, -389222, -429288, -475277, -626923, -808947, -971051, -1183750, -1502469, -1764953, -1744317, -1473966, -1197433, -967116, -657904, -294496, -41155, 24118, -23589, -29775, 134493, 460299, 792269, 1030316, 1169917, 1186605, 1027186, 772549, 679357, 853583, 1114539, 1297474, 1370449, 1234933, 824180, 321517, 25878, 60216, 279156, 454836, 494098, 539317, 668128, 752533, 710894, 527679, 126544, -483764, -1084476, -1421131, -1486773, -1474537, -1405109, -1173346, -864443, -609984, -384875, -122647]
14540a22647K40947R7584j20733k82123k34058n2586N7867R1562J75492L18373
14530A69678M15389L64464L18840L54854K58095J1238j45937p5813J65166L37638
14520B173612L61591L54214L04857J64897J13732K07580K83148L48051L69556
14511D681238L84733N16656P80621R73946J067745J212927J235468Q94869K83586
14502A2031789l28684p97788j038356j076273j056911r99818q43254p27473p32088
14493D431144p08981n89041n04211m65657m04530l23230j98766m7029K7297L0075
14483A247071l5242j06239j00117j21729k58150l91263l24049r0219j2287j71731
14473c63955l48130l21316j16886J03523K41646K82068L03932L91472M59617M12653
$$ y = [-122647, 118300, 215884, 95151, -186972, -421030, -473616, -415749, -324187, -148695, 169678, 585067, 949531, 1268371, 1623225, 1881320, 1892558, 1746621, 1670808, 1835974, 2173612, 2535203, 2889417, 3194274, 3359171, 3472903, 3680483, 3963631, 4311682, 4681238, 5065971, 5582627, 6363248, 7337194, 8404939, 9617866, 10853334, 11748203, 12031789, 11703105, 10905317, 9866961, 8790688, 7733777, 6733959, 5890705, 5163232, 4431144, 3722163, 3133122, 2628911, 2163254, 1758724, 1435494, 1236728, 1189699, 1216996, 1247071, 1211829, 1105590, 1005473, 883744, 625594, 234331, -89718, -179937, -192224, -363955, -712085, -1033401, -1150287, -1046764, -805118, -523050, -219118, 172354, 631971, 1044624]
14463A044624K44636k092k44620l40114k26545n0317J7142k6799n0364p4732m3820
14452B46999R232q4872k14950k43777j87751j10047J5N4366k675o6674o0268r1332
14440g51734j69728p0805J94091M39320N41014N00190L55994J56703K8517Q8130
14430A311692K19313K12982N1746j62507l40727m94687n95292n45023l66333j38640
14420h47476k2672m2385k7038K4154k6647j37404j04496L7427J20002J77342K76370
14409e72823K93431J51552m5652j50524l7907J39848K05715J36682O5633L51k01424
14398a5118l80484l90668l65972l16163l6694L02968L86805K20871p825r0664
14388f92944l1341L5266J05017J60510R7178j32191l29797k63902j27666r2282
$$ y = [1044624, 1289260, 1287168, 1042548, 702434, 475889, 425572, 442714, 415915, 365551, 290819, 246999, 256231, 171359, -43591, -287368, -475119, -585166, -585151, -530785, -533460, -600134, -660402, -751734, -921462, -992267, -798176, -358856, 182158, 682348, 1038342, 1195045, 1223562, 1311692, 1531005, 1743987, 1795733, 1633226, 1292499, 797812, 202520, -342503, -708836, -847476, -870148, -912533, -939571, -915417, -942064, -1079468, -1183964, -1146537, -1026535, -849193, -572823, -279392, -127840, -173492, -324016, -361923, -222075, -16360, 120322, 185955, 186306, -15118, -395602, -786270, -1152242, -1468405, -1505099, -1202131, -815326, -594455, -602280, -692944, -724285, -689019, -584002, -423492, -326314, -458505, -788302, -1052204, -1179870, -1272152]
14378a272152l0250L7024L0840L7773J18555K00177K19012J94771J30271O0061
14368b73918J26248K41033K05023O2753j24532k82127k28044N398J42019J23792
14358b355J0631j32616k45859l43358m24761m12124l42950k75883j19368J08705
14348b179938K47152K37986K13359K18501J69830M0325q1407l7842J01219J21211
14338i49604R8178J72337K15374J18719J5711l6343M5063J72114K02823K22518
14328B76890J63509l4349k13907l04863l25284j44137J46723K08199N2920j05170
14318b79469j98144k93158l29954j91243k2917J35819L40401M50747L70897K44006
14308B26985J42328K81q8319j0685J02083J37801J44821J30122Q7628L1102K4993
$$ y = [-1272152, -1302402, -1265378, -1234538, -1196765, -1078210, -878033, -659021, -464250, -333979, -273918, -147670, 93363, 298386, 361139, 236607, -45520, -273564, -268166, -126147, -2355, 8276, -124340, -370199, -713557, -1138318, -1550442, -1893392, -2169275, -2288643, -2179938, -1932786, -1694800, -1481441, -1262940, -1093110, -1052785, -1134192, -1172034, -1070815, -949604, -851426, -679089, -463715, -344996, -329285, -365628, -320565, -148451, 54372, 276890, 440399, 406050, 192143, -112720, -438004, -582141, -435418, -227219, -174299, -279469, -477613, -770771, -1100725, -1291968, -1314885, -1179066, -838665, -387918, -17021, 226985, 369313, 369594, 281275, 270590, 372673, 510474, 655295, 785417, 873045, 904147, 929140]
14297I29140R1771P3213j19251l18608k76556n3138J63621K82898K48086J67926
14287A189102J19077K9677o2548j08087j49286j64166r4222R7977K92570L01833
14277A451927J10765j61067l30204l49398l62053l87949k54551L0369J80430K06755
14267A35024K19795J10226J5152J54080M23314N27386L50378M1774k71325m81726
14257A224078m26679k13773l4721Q918p1030j21643p0918m3962j13903j64086
14247b7719j25269j29248j56351K3844K70162K03699j5929j73616l73261m78166
14237i81854l30030n2867J54120K86841L05149K03980J03138N5289J22494K94957
14227A61217L59070J83596n251n6059r0893k38523l39830k81736j87396j18619
$$ y = [929140, 1020911, 1094124, 974873, 656265, 379709, 326571, 490192, 773090, 1021176, 1189102, 1308179, 1337856, 1275308, 1167221, 1017935, 853769, 759547, 857524, 1150094, 1451927, 1562692, 1401625, 1071421, 722023, 359970, -27979, -282530, -252161, -71731, 135024, 354819, 465045, 480197, 634277, 1057591, 1584977, 1935355, 1977129, 1705804, 1224078, 797399, 583626, 548905, 557823, 486793, 365150, 294232, 250270, 136367, -27719, -152988, -282236, -438587, -414743, -144581, 59118, 43189, -130427, -503688, -981854, -1311884, -1364751, -1210631, -923790, -618641, -414661, -311523, -256234, -133740, 161217, 520287, 703883, 698632, 642573, 551680, 313157, -26673, -308409, -495805, -614424]
14217f14424R0297L06779K96771J81447P8552k694l566K4457r851j04091j58132
14206H5545j29269l1418N0373o2794k59975l01274k30420j97531j81506o3799
14196a322068M7619k644o4482L8461J48634J59831J99668K27475K52123L49628
14186C4245L72404K04359k1651j51755j50067j12791j17430k17823l72363m41259
14176i74131l80295j44465J92561L41262K12622J6129j67377l13427l37316j69844
14166a724281N0052K02457L10616L15870K82801K78057K14336J11713m869j79221
14156a42469k99699k55767q5213J21024K68754L13486L18461L21930K73657K07116
14146A041280J68306P1606m9654q8778l8555P92p4075k30180m02277m82558m12485
$$ y = [-614424, -524127, -217348, 79423, 260870, 339422, 336728, 333162, 357619, 347768, 243677, 85545, -43724, -75142, -24769, -87563, -347538, -648812, -879232, -1076763, -1258269, -1322068, -1274449, -1277093, -1341575, -1303114, -1154480, -994649, -794981, -567506, -315383, 34245, 406649, 611008, 589357, 437602, 287535, 174744, 57314, -160509, -532872, -974131, -1354426, -1498891, -1306330, -965068, -752446, -736317, -903694, -1217121, -1554437, -1724281, -1674229, -1471772, -1161156, -845286, -562485, -284428, -70092, 41621, 36752, -142469, -442168, -697935, -783148, -662124, -393370, -79884, 238577, 560507, 834164, 1041280, 1209586, 1281192, 1231538, 1142760, 1104205, 1104997, 1030922, 800742, 398465, -84093, -496578]
14135d96578l26534k65853j69703p2909j7354M8713P5988M0384j37471l69029
14125a690346l35336J6281L65896M15642K99240K34057J72951L6902j34759j54842
14115g74314k2542K4547K3677O5635m587o0933L0976J21259R3985K8208O5818
14104d08271J30556J19020M7688j7711K4866P1802k8067j92308k40806p4470J99387
14093c68314L01692K57706J59745P0703O1687K4178j05680j43122N5067K69226
14083E82888L09342J98833J56507J57589l4958l20794m91790n16222m15559j31411
14073e05575J65542K98344K86986K03278R4472n5810j85596k11676j55317o1127
14063a26479k9025m1388l880J33791K31515J56259L9506m8725j21135k07467k81568
$$ y = [-496578, -823112, -1088965, -1258668, -1331577, -1348931, -1300218, -1224230, -1183846, -1321317, -1690346, -2025682, -2009401, -1643505, -1227863, -928623, -694566, -521615, -484713, -619472, -774314, -796856, -772309, -748632, -682997, -687584, -748517, -717541, -596282, -502297, -474089, -408271, -277715, -158695, -111007, -128718, -103852, -32050, -60117, -252425, -493231, -567701, -368314, -66622, 191084, 350829, 421532, 483219, 507397, 401717, 258595, 313662, 582888, 892230, 1091063, 1247570, 1405159, 1370201, 1049407, 557617, 41395, -374164, -505575, -340033, -41689, 245297, 448575, 543047, 487237, 301641, 89965, -65352, -126479, -155504, -196892, -200772, -66981, 164534, 320793, 360299, 311574, 190439, -17028, -298596]
14052b98596l00572l84065n15214m37812k17537k6222R3596P1465J0603n3074
14042b057428l8918J60302L34906L54435M03982M50421K70924m9241k35327j98187
14032f04131m0767O6598Q5449J86953L11505L11901L07063K56351N7120p7392
14022H60650r8685j25734j55642j39539r9637m4120O6764K89978M92289M32266
14012A478590J82880q6759k47666k54802k11195p1351J30985J67002l9248k29091
14002H19345j18139R1806J15080K4577o2451j11449j25487j25216j03622r9197
13992C05247r3938o3359l1988J1024J2387m1717p5564J2615J32712J56881J09884
13981D34184J405o5062K2040J64168J84488L5540j97003k77153j67722p2236p0888
$$ y = [-298596, -599168, -983233, -1498447, -1936259, -2153796, -2180018, -2086422, -2014957, -2004354, -2057428, -2096346, -1936044, -1601138, -1246703, -842721, -392300, -121376, -170617, -405944, -604131, -644898, -578300, -492851, -305898, 5607, 317508, 624571, 880922, 938042, 860650, 761965, 636231, 480589, 341050, 241413, 197293, 264057, 554035, 1046324, 1478590, 1661470, 1574711, 1327045, 1072243, 861048, 789697, 920682, 1087684, 1048436, 819345, 701206, 793012, 908092, 932669, 870218, 758769, 633282, 508066, 404444, 305247, 211309, 147950, 115962, 126986, 139373, 97656, 22092, 34707, 167419, 324300, 434184, 435589, 370527, 392567, 556735, 741223, 776763, 579760, 302607, 134885, 62649, -8239]
13970h239p433J54990K23691J40220j0472j48351k22304j74595j70070l00376
13960e22939l54638j92439P2063K97087L53579K41479J39296J93415K62582K52076
13950G41561J42940q6882k27719j81753m0872Q4798M6717n9478q4655k836N9009
13939C90830L5844j5758p4009p9957p7617o3422k3429o2593j38709j49110q5028
13928c42958J4856K1352J4410J44088K51412K54874J34954j58680m05107l97301
13918d68100j81046R655K2046m0987p338O2607J29675J02418l7833j66015j93787
13907g68705j21672J7947J85167K58540K12470O2333j13169j81900j06754m7740
13897f03483j03527j61317r5357P8636K11089K42407K48529J57983m2652k03451
$$ y = [-8239, -15672, 139318, 363009, 503229, 492757, 344406, 122102, -52493, -222563, -522939, -877577, -1070016, -997953, -700866, -347287, -105808, 33488, 226903, 489485, 741561, 884501, 797619, 569900, 388147, 347275, 432073, 478790, 419312, 334657, 331821, 390830, 426674, 410916, 336907, 256950, 179333, 115911, 92482, 29889, -108820, -257930, -342958, -328102, -306750, -292340, -148252, 103160, 358034, 492988, 334308, -70799, -468100, -649146, -639491, -617445, -658432, -665770, -603163, -473488, -371070, -408903, -574918, -768705, -890377, -872430, -687263, -428723, -216253, -153920, -267089, -448989, -555743, -603483, -707010, -868327, -963684, -885048, -673959, -431552, -183023, -25040, -67692, -271143]
13887b71143k67673k62764j56118r9882j70546j49091Q4245L14193L41711K55060
13877c82008K19361K35735K27909J56537K5152j18160k42408l42175l21867j35340
13867f77264J37343L65607L55203J27278j8776j9097m3722l684J73171K55845
13857F51904J09288r3238j94746k42085k39187j58101M9436K42662K17823O0237
13847D03993j00504j21668R429O2003l9026j77259k15725o9277J17601J25189
13837e244m385m4695N5069J57926J43707Q0400k1363j33890j06820l1847q5850
13826C008k02012k95146l16633k32491j50921j09184k5870L4694m0197j50592
13816a485344j51963j16833p1475P896N1271R3856P4803j1491L73J04839O7375
$$ y = [-271143, -538816, -801580, -957698, -1057580, -1228126, -1377217, -1292972, -978779, -637068, -382008, -162647, 73088, 300997, 457534, 482686, 364526, 122118, -220057, -541924, -677264, -539921, -174314, 180889, 308167, 289391, 270294, 226572, 222888, 396059, 651904, 761192, 667954, 473208, 231123, -8064, -166165, -116729, 125933, 343756, 403993, 303489, 181821, 191250, 253253, 214227, 36968, -178757, -248034, -130433, -5244, -9629, -54324, 745, 158671, 302378, 382778, 361415, 227525, 120705, 88858, 3008, -199004, -494150, -810783, -1043274, -1194195, -1303379, -1329249, -1294555, -1334752, -1485344, -1637307, -1754140, -1825615, -1817719, -1766448, -1672592, -1597789, -1609280, -1608907, -1504068, -1436693]
13805a436693j44133k66141j72536O283O3353M0161J41423L10164L55624K37923
13795h64572P3007N0439J49602J78352K05799L30939L43201K04507P8007l5225
13785G14056j04247q6052r883O5204J31466J73300J24232j056j53568k37850j76076
13774D39526j08673k12320k87368j13447J81421L12835K45197J04920l7479j47412
13764C77200j79562j39118r8692j00423j23421k04319l23488l29851k67457k01247
13754a590378q2116O2672J79152K30235K00792K01787K84022L15138K58069J22699
13744A82072j59597l06805j19767J19822J89273J13945Q1984J25670O1542r2001
13734A96138k10427l02632l24543k06636m1388m3817j60247j55796M351J20293
$$ y = [-1436693, -1580826, -1846967, -2019503, -2013220, -1949867, -1909706, -1768283, -1458119, -1102495, -864572, -791565, -741126, -591524, -413172, -207373, 123566, 466767, 671274, 749281, 714056, 609809, 523757, 513874, 579078, 710544, 883844, 1008076, 1007020, 853452, 615602, 439526, 330853, 118533, -168835, -282282, -100861, 211974, 457171, 562091, 524612, 377200, 197638, 58520, -40172, -140595, -264016, -468335, -791823, -1121674, -1389131, -1590378, -1672494, -1609822, -1430670, -1200435, -999643, -797856, -513834, -198696, 59373, 182072, 22475, -284330, -404097, -284275, -95002, 18943, 100927, 226597, 288139, 196138, -14289, -316921, -641464, -848100, -889488, -933305, -1093552, -1249348, -1244997, -1124704]
13724a124704O9056L345O6761K40950L83410M12538L31812J77115J06849J02628
13714G69760j5435k82829m50513l70602j99338r9380j28473j65821n6040K10063
13704g88608N12335O18417M83138K48564N6976j6256k6628k135P2605R5015L4013
13693A287436k2809P602O9496P1010Q1437P0486o2211j89747k16003j79315j03080
13682H14302l430n2245k11947k58830j67535o0546n595l7164j21095k736K74194
13671A67373L92692K64378J0230j72489j02449J09514K41847J24096j64476l93534
13661D77182m68302l73918k25881j47828j34036j24166n7193P1064J15193L7881
13651h30004l3641l0304P1522K94252N22999M78091J76746j37858l41325m02732
$$ y = [-1124704, -1055648, -1052303, -985542, -744592, -361182, 51356, 383168, 560283, 667132, 769760, 754325, 471496, 20983, -349619, -548957, -648337, -776810, -942631, -998671, -788608, -276273, 342144, 825282, 1073846, 1130822, 1114566, 1087938, 1085803, 1158408, 1253423, 1287436, 1264627, 1272229, 1341725, 1412735, 1494172, 1564658, 1502447, 1312700, 1096697, 917382, 814302, 810872, 758627, 546680, 287850, 120315, 59769, 54174, 17010, -104085, -106821, 167373, 560065, 824443, 834673, 662184, 559735, 669249, 911096, 1035192, 870716, 477182, 8880, -365038, -590919, -738747, -872783, -996949, -1054142, -983078, -867885, -830004, -863645, -893949, -822427, -528175, -5176, 472915, 649661, 511803, 170478, -232254]
13641b32254l12549j57422l0061N7442P9769n629k22263l57419k74563q1485J37729
13630a398705K86006L12103K34752P2274m2515j08006k30428l83807l50269j95599
13620a804194j52739r3107J71186M45812M17346J37966j16422o0943J45209K11244
13610f98642J91334J31763M1289l4759r2037j77664j80439k3998J10070M8534
13600f84549m3467L1598J86212L03740L47734M08882N03737M25095Q8119k29892
13590A337209l15839l68252m75307n55783n01646j78408J68424K94998L94799
13581a99805N48189N02406J70703j15152j62641j43195j13743o2384q0J5537o4762
13570C75073j42089j30303j16046j41480r2221k103O7192J30600Q5150J3051P9893
$$ y = [-232254, -544803, -702225, -732286, -674844, -595075, -600704, -822967, -1180386, -1454949, -1536434, -1398705, -1112699, -800596, -565844, -493570, -536085, -644091, -874519, -1258326, -1608595, -1804194, -1956933, -2050040, -1878854, -1433042, -1015696, -877730, -994152, -1055095, -909886, -698642, -507308, -375545, -334256, -369015, -461052, -638716, -819155, -843153, -733083, -684549, -728016, -696418, -510206, -206466, 141268, 550150, 1053887, 1478982, 1567101, 1337209, 1021370, 653118, 177811, -377972, -879618, -1058026, -889602, -594604, -199805, 348384, 850790, 1021493, 906341, 743700, 600505, 486762, 424378, 424298, 439835, 375073, 232984, 102681, -13365, -154845, -247066, -249169, -181977, -51377, 33773, 46824, 126717]
13559A26717K17691K90766K52341K6740k42748k74344j08779n3594j07713j44627
13549a7550j37224o8264O7759J48664N9212j37461k64023l19272m67368n15254
13539a650781k94873M9181L19552L68114K82925K49089K58880K69231K24882J56197
13529B32397L3842j63212j79565J3146J64040K59957L66793L65831J87268n8368
13519A222129k30075l09353k97494k18118j51546j81886k46852k30434l0101K77539
13509c96191L94353K49779M1690l8545R0178K47239L23384K72813J22734M191
13499A311625p2673j73729l11754l16028j13437Q5012J53837J30518N3524o6476
13489F80419k22794k86660j45400K4451o1512k85670l51661k42066j14945l7408
$$ y = [126717, 344408, 635174, 887515, 914255, 671507, 397163, 288384, 234790, 127077, -17550, -154774, -223038, -155279, -6615, 52597, -84864, -348887, -668159, -1135527, -1650781, -1945654, -1896473, -1576921, -1208807, -925882, -676793, -417913, -148682, 76200, 232397, 266239, 103027, -76538, -63392, 100648, 360605, 727398, 1093229, 1280497, 1222129, 992054, 682701, 385207, 167089, 15543, -166343, -413195, -643629, -673730, -396191, -1838, 247941, 289631, 251086, 341264, 588503, 911887, 1184700, 1307434, 1311625, 1238952, 1065223, 753469, 437441, 324004, 409016, 562853, 693371, 746895, 680419, 457625, 170965, 25565, 50016, -11496, -297166, -648827, -890893, -1005838, -1043246]
13479a043246M3813J42601K95213L36311J65796K537j25916k45129j22872J67051
13469c83841K74694K12572J70025J36042l9783j98601j73982j48230j20821O003
13459b65922J45184J83702J66335O2253j03532j84456q0208M2928j5229j49029
13449a97974k40435j99168J7881L18665N65017O60147N46061K56377p2875k90514
13439A363182l51269k73601j21702l0964k2240j8428q7441k05572k14508j5593
13429B1864J66826Q8819n8437j33340j75755q7955j2611O836P7395J45234J50365
13418A89241J24411N8427p2484j20401J7591J80826J30044n7618j68590k40639
13408D0808k49237j23473J31150L60620L65669K40636J94137J74741R5929J014
$$ y = [-1043246, -999433, -856832, -561619, -225308, -59512, -56975, -182891, -428020, -550892, -383841, -109147, 103425, 273450, 409492, 369709, 171108, -2874, -151104, -271925, -265922, -120738, 62964, 229299, 291552, 188020, 3564, -76644, -33716, -48945, -197974, -438409, -637577, -619696, -301031, 263986, 924133, 1470194, 1726571, 1653696, 1363182, 1011913, 738312, 616610, 585646, 563406, 544978, 457537, 251965, 37457, 21864, 188690, 277509, 219072, 85732, -90023, -177978, -190589, -183753, -106358, 38876, 189241, 313652, 372079, 299595, 179194, 196785, 377611, 507655, 450037, 281447, 40808, -208429, -331902, -200752, 159868, 525537, 766173, 960310, 1135051, 1230980, 1231994]
13398A231994j67812l16624l16108k58499l07912l31879k06695j41681j47273
13389i62489j43297j10014L2112K48450L82445L48436K51359J18351j5805M0864
13379A90412K18760L14373K17456J06025J17582J51848J86740R6328j06688k38308
13369A254528k50399j78469j57900k18839j69167q8673j35393o7634J51516K19253
13359C58823P4204k8817K201K8566m1160p6999m4370p9099j70079k45690k53144
13348d75564j16703Q8701J85468K40656K76427K39897J67371J29287J62959K42592
13338A141091K78568J56527o0043k09862k25331j41049p5637q7047j90839k74261
13328C12117k21802j50926j34272j04310m0708O7727J36267P4438P3261K19257
$$ y = [1231994, 1064182, 747558, 431450, 172951, -134961, -466840, -673535, -815216, -962489, -1105786, -1215800, -1183688, -935238, -552793, -204357, 47002, 165353, 149548, 190412, 409172, 723545, 941001, 1047026, 1164608, 1316456, 1503196, 1599524, 1492836, 1254528, 1004129, 825660, 667760, 448921, 279754, 191081, 55688, -11946, 139570, 358823, 433027, 404210, 406411, 434977, 393817, 316818, 272448, 193349, 23270, -222420, -475564, -592267, -503566, -318098, -77442, 198985, 438882, 606253, 735540, 898499, 1141091, 1419659, 1576186, 1516143, 1306281, 1080950, 939901, 864264, 777217, 586378, 312117, 90315, -60611, -194883, -299193, -339901, -272174, -135907, -61469, 11792, 231049]
13318B31049K93166K08594O6411p0163m9779J27014K28652K15344J40486R0145
13308A480919J08275R3983K4051m4499n5390n3420p994J37028K21465J12530O269
13297B023217Q252m0784j51146j54212P979K15451K26939N9025o3354n0151j643
13286B079573j8023r320P6017J27713k0767k57015l42697l28949k66089k36384
13276H04059l45343m05669k62460j4935J77967J82340N2691l4626K4J27989J94094
13265D76131J50883J30975J38477Q6739k7369q1827j9409O7228J42970J81484
13255A246282J91871J78298J61405J08794L7012r51j9582O425L7878K26j26418
13244A821240k81058m08817l88241j67050J3895l6496j14717n4929L1739M1957
$$ y = [231049, 524215, 732809, 799220, 729057, 679278, 806292, 1034944, 1250288, 1390774, 1480919, 1589194, 1683177, 1707228, 1662729, 1607339, 1553919, 1545925, 1682953, 1904418, 2016948, 2023217, 2031469, 1990685, 1839539, 1685327, 1693306, 1908757, 2135696, 2194721, 2131367, 2081216, 2079573, 2061550, 2052230, 2128247, 2255960, 2235193, 1978178, 1635481, 1306532, 1040443, 804059, 458716, 53047, -209413, -224348, -46381, 135959, 188650, 154024, 154048, 282037, 476131, 627014, 757989, 896466, 983205, 955836, 874009, 854600, 921828, 1064798, 1246282, 1438153, 1616451, 1777856, 1886650, 1923662, 1922711, 1903129, 1909554, 1947432, 1947658, 1821240, 1540182, 1131365, 743124, 576074, 589969, 553473, 438756, 383827, 415566, 457523]
13234D57523j4692M676R4798J57763K78942L60726K46462N8213q3261j42370j21344
13223A297436p7848j00160j07471m1229P2706K24004L01496K05869K2398j41851
13213A655350k76407l57959k56995m7180R7939P3039j6081o5346j53333j97526
13203D55501j24680M941R9814J33924J76802K52520K75366K46762J17047j55963
13193A482034l35305k46783n8310N9026R9975J37699J85565K44274J71402l9802
13183A699775j73798j33685J5433K39616M18738L37823J22323l9356r2087p8659
13173B316123j20649j52409o6110R2691K27210K93885K88611J32532o6142j57709
13163B788033p0571R4411K41028L17319K81411J83475m586j58999j79727j56015
$$ y = [457523, 442831, 447507, 542305, 700068, 979010, 1339736, 1586198, 1644411, 1561150, 1418780, 1297436, 1219588, 1119428, 1011957, 970728, 1043434, 1267438, 1568934, 1774803, 1797201, 1655350, 1378943, 1020984, 763989, 716809, 814748, 887787, 871706, 806360, 653027, 455501, 330821, 335762, 435576, 569500, 746302, 998822, 1274188, 1520950, 1637997, 1482034, 1146729, 899946, 841636, 900662, 1000637, 1138336, 1323901, 1568175, 1739577, 1699775, 1525977, 1392292, 1407725, 1647341, 2066079, 2403902, 2526225, 2486869, 2394782, 2316123, 2195474, 2043065, 1976955, 2069646, 2296856, 2590741, 2879352, 3011884, 2945742, 2788033, 2717462, 2811873, 3052901, 3370220, 3651631, 3835106, 3830520, 3671521, 3491794, 3335779]
13153C335779k04887l20046l82428l62705l21521l06686k22493o0727Q9448K12301
13143A456035J99257O8173m1780r3109Q320J24142P0656J192O3856R0443r2030
13132A855155l07257l42505k82858j59307j9309J18015L19082N28141O26050N87607
13122B922814N13674L64313J26229Q318P1998J34708O2812j81077l83165l22844
13112C317780r0667J30138O1858k08162l21455k46491j93877j84523j62167j87759
13102A914675j78364n5028J25894L10469M30011M01034J60092j13228j31387K5195
13092B889363R5991J15200J83087K46619K71758K70981K33577R8086l4708k6163
13082D343791Q7784J00610j3365j19710j83537k53462k36053r3419K1276P9193
$$ y = [3335779, 3130892, 2810846, 2428418, 2065713, 1744192, 1437506, 1215013, 1154286, 1243734, 1456035, 1655292, 1723465, 1681685, 1588576, 1596896, 1721038, 1791694, 1792886, 1856742, 1947185, 1855155, 1547898, 1205393, 922535, 763228, 743919, 861934, 1181016, 1709157, 2335207, 2922814, 3436488, 3800801, 3927030, 3935348, 4007346, 4142054, 4204866, 4023789, 3640624, 3317780, 3227113, 3357251, 3419109, 3210947, 2889492, 2643001, 2449124, 2264601, 2102434, 1914675, 1736311, 1681283, 1807177, 2117646, 2547657, 2948691, 3108783, 2995555, 2864168, 2889363, 2985354, 3100554, 3283641, 3530260, 3802018, 4072999, 4306576, 4404662, 4369954, 4343791, 4431575, 4532185, 4518820, 4399110, 4215573, 3962111, 3726058, 3632639, 3653915, 3733108]
13072C733108J92745L97347N40603N17665L98561J63627j29514k09820l9194R8176
13062E663304J04307J02874M2826o0337m1863K4951N0836J42060K40905K73608
13052F543471L27796L73020L67874L35832K82525K29727K65221L73156L41453
13043I440075J53204m1222j21062p5881K3313J31666J82905J72050J42935K46548
13033A0254531M22254M34343L10925J59798R8144K01158L40189M07408L94566
13024A3023316L92276M72291N38715M71266L17568K86607M19124N43164N72332
13015A7036659O46383Q12815J024180J174077J111831R77060R39956J060877J289917
13006B6073755J526602J651884J670113J675622J877096K340425K793144L092299
$$ y = [3733108, 3925853, 4323200, 4863803, 5381468, 5780029, 5943656, 5814142, 5604322, 5565128, 5663304, 5767611, 5870485, 5913311, 5852974, 5811111, 5836062, 5886898, 6028958, 6269863, 6543471, 6871267, 7244287, 7612161, 7947993, 8230518, 8460245, 8725466, 9098622, 9440075, 9593279, 9552057, 9430995, 9355114, 9378427, 9510093, 9692998, 9865048, 10007983, 10254531, 10676785, 11111128, 11422053, 11581851, 11679995, 11881153, 12221342, 12628750, 13023316, 13415592, 13887883, 14426598, 14897864, 15215432, 15502039, 15921163, 16464327, 17036659, 17683042, 18495857, 19520037, 20694114, 21805945, 22783005, 23722961, 24783838, 26073755, 27600357, 29252241, 30922354, 32597976, 34475072, 36815497, 39608641, 42700940]
12998D2700940L355926L663664M035508M404231M700088N112952N821727O566695
12990H0361731P134064P739059Q492814R518060J0935903J2696310J4890555J7596473
12982A69364969K0869756K4761876K9024053L2838392L4888565L3037532K4545057
12975C69330200Q459300j1427786k8128536l7080942l8604291l5604863l0849364
12968A96093718k6051586k1852655j8329155j5427302j3018628j0986362r206013
12961H1222017p618626o338621n427258m733610m097895l540650l124893k898334
12953D3442130k764507k574987k277747j938442j686404j537108j471866j304804
12945B7886265r92734p97151p13305o35984n47275m20711k12456J0568J23224
$$ y = [42700940, 46056866, 49720530, 53756038, 58160269, 62860357, 67973309, 73795036, 80361731, 87495795, 95234854, 103727668, 113245728, 124181631, 136877941, 151768496, 169364969, 190234725, 214996601, 244020654, 276859046, 311747611, 344785143, 369330200, 377789500, 366361714, 338233178, 301152236, 262547945, 226943082, 196093718, 170042132, 148189477, 129860322, 114433020, 101414392, 90428030, 81222017, 73603391, 67264770, 61837512, 57103902, 53006007, 49465357, 46340464, 43442130, 40677623, 38102636, 35824889, 33886447, 32200043, 30662935, 29191069, 27886265, 26893531, 26096380, 25383075, 24747091, 24199816, 23779105, 23566649, 23577217, 23700441]
12936B3700441J44290J64638K07284K44071L35216N16553O51249P22319Q87015
12927B7573076J077851J094796J107457J267234J531923J862811K225444K578960
12919D0319552K841476K834333K426359J879676J449163J230044J231751J450587
12911E5662941J844219K325662K859576L475820M213410M919500N526651O142155
12903H6969934O870532P814461Q958371J0106331J1287585J2836168J5059288
12896A59902670J8018514K1484196K5411293K9777030L3755566L5533907L2391349
12889C56274525K1624458L408703j7011265l2354117l9265611l9291744l5587279
12882B17797670l0637212k5705576k1240752j7468669j4485075j2066345j0053092
$$ y = [23700441, 23844731, 24009369, 24216653, 24460724, 24795940, 25312493, 25963742, 26686061, 27573076, 28650927, 29745723, 30853180, 32120414, 33652337, 35515148, 37740592, 40319552, 43161028, 45995361, 48421720, 50301396, 51750559, 52980603, 54212354, 55662941, 57507160, 59832822, 62692398, 66168218, 70381628, 75301128, 80827779, 86969934, 93840466, 101654927, 110613298, 120719629, 132007214, 144843382, 159902670, 177921184, 199405380, 224816673, 254593703, 288349269, 323883176, 356274525, 377898983, 381307686, 364296421, 331942304, 292676693, 253384949, 217797670, 187160458, 161454882, 140214130, 122745461, 108260386, 96194041, 86140949]
12875H6140949q514755p355238o367022n475704m695081m020846l436067k953698
12867D3322538k542341k313271k252819k110360j904115j800082j717926j553224
12859B7128400j351070j084279q42465q42809r24149q68356o65349l29458k7856
12850B0192609J02959J63566K80414M80324O15243O26595O19025O08979N29575
12841B4219289L80032L70842N25672O50596P39910R19556J111344J180731J151116
12832C1249088J020745R69926J261631J733914K069616K262265K476226K728442
12824D5771853K994768L299132L684698M148980M667118N186438N769204O530991
12816H2053182P455328Q436286R445085J0661417J2261405J4248295J6568750
$$ y = [86140949, 77626194, 70270956, 63903934, 58428230, 53733149, 49712303, 46276236, 43322538, 40780197, 38466926, 36214107, 34103747, 32199632, 30399550, 28681624, 27128400, 25777330, 24693051, 23850586, 23007777, 22083628, 21215272, 20549923, 20220465, 20192609, 20295568, 20459134, 20739548, 21219872, 21835115, 22461710, 23080735, 23689714, 24219289, 24599321, 24970163, 25495835, 26146431, 26886341, 27805897, 28917241, 30097972, 31249088, 32269833, 33239759, 34501390, 36235304, 38304920, 40567185, 43043411, 45771853, 48766621, 52065753, 55750451, 59899431, 64566549, 69752987, 75522191, 82053182, 89508510, 97944796, 107389881, 118051298, 130312703, 144560998, 161129748]
12809A61129748J9271630K2442632K6185871L0298182L3753843L4424244K9343903
12802C56850053J6409062k696854k1791720l4560960l9239385l8075893l4076578
12795B02817725k9195579k4441417k0217064j6593475j3636444j1409402r724760
12788G7599584q359684p201252o172075n281221m621618m216318l837313l405775
12780C4504328l081662k828563k522111k214627j936798j681573j425056j188304
12772A7625634j040346r14862q49614q13594p62850o79892n64512n44393n57907
12763A0897664n52660n30951m48651m57770o63343q59960p85515o04174m08234
12754E586406j41748M8137O6034n1976k05699l41702l67165k79741j92010j64018
$$ y = [161129748, 180401378, 202844010, 229029881, 259328063, 293081906, 327506150, 356850053, 373259115, 370562261, 348770541, 314209581, 274970196, 236894303, 202817725, 173622146, 149180729, 128963665, 112370190, 98733746, 87324344, 77599584, 69239900, 62038648, 55866573, 50585352, 45963734, 41747416, 37910103, 34504328, 31422666, 28594103, 26071992, 23857365, 21920567, 20238994, 18813938, 17625634, 16585288, 15670426, 14820812, 14007218, 13244368, 12564476, 11999964, 11455571, 10897664, 10345004, 9814053, 9365402, 8907632, 8244289, 7384329, 6598814, 5994640, 5586406, 5444658, 5492795, 5558829, 5506853, 5301154, 4959452, 4592287, 4312546, 4120536, 3956518]
12744C956518k13232k35630j22549m0266p6817q5498k869J7493j09453k90178
12734B797519l31268k42600j52033j68369k36198j77981J7023K40669L87185L86444
12724B520391K80836J84902R3234J0967n8163j04330j74283l07207m34197m92351
12714A519799m54698m24427m15048l82858k47772p0136P0719K35248L38589L05692
12704D75108K16735J17069j5117k14232l68249l05365p8865J72350L79942L76203
12694G55579J54219m1957j54459j91548k11711k91472k99949k08061j69483j58547
12684h17389r5364K658L1732L4380Q7519O2721j50794l65857l27653p0927J81674
12673a427300K54985K41675K96354M28407M70964L85352K69106J36565K4181j10003
$$ y = [3956518, 3743286, 3507656, 3385107, 3344841, 3268024, 3182526, 3179657, 3197150, 3087697, 2797519, 2466251, 2223651, 2071618, 1903249, 1667051, 1489070, 1506093, 1746762, 2133947, 2520391, 2801227, 2986129, 3079363, 3090330, 3032167, 2927837, 2753554, 2446347, 2012150, 1519799, 1065101, 640674, 225626, -157232, -405004, -475140, -404421, -169173, 169416, 475108, 691843, 808912, 793795, 579563, 211314, -94051, -172916, -566, 379376, 755579, 909798, 867841, 713382, 521834, 310123, 18651, -281298, -489359, -658842, -817389, -912753, -910095, -878363, -843983, -756464, -693743, -844537, -1210394, -1538047, -1608974, -1427300, -1172315, -930640, -634286, -205879, 265085, 650437, 919543, 1056108, 1080289, 970286]
12663I70286j43446J200J20147R2432k343n0402N994K2319j15129k61904l05634
12652C33520k86220k39348j73224j01812o3794r8364j71446k18992k19611j51783
12642a391074j3467P2806K0145m8997m1218Q1176K34550K27453J15582L6301n4131
12631g60874p9891P4201R3395o7071j32605j32600r9211N553Q3518J32210J48940
12620g34435J48964J95114K94397L00285J91800J43018P9050k2290r8416j95614
12610C01873l32532m61939m62263l53133l10228k63748j75600n9561Q3052J92737
12600a841342K67032L30729L19167J45159K2788P5784J96337K74740K77733K25746
12590B93873R6341q6958k68978k95788k34518k12529k01795k66901l04465k34316
$$ y = [970286, 826840, 828040, 948187, 1040619, 1038276, 987874, 993868, 1016187, 901058, 639154, 333520, 47300, -192048, -365272, -467084, -530878, -629242, -800688, -1019680, -1239291, -1391074, -1404541, -1331735, -1311590, -1360587, -1401805, -1320629, -1086079, -858626, -743044, -706743, -760874, -840765, -766564, -673169, -740240, -872845, -1005445, -1104656, -1099103, -1015585, -883375, -734435, -585471, -390357, -95960, 204325, 396125, 539143, 618193, 595903, 497487, 301873, -30659, -492598, -954861, -1307994, -1618222, -1881970, -2057570, -2117131, -2034079, -1841342, -1574310, -1243581, -924414, -779255, -756467, -680683, -484346, -209606, 68127, 293873, 390214, 303256, 34278, -261510, -496028, -708557, -910352, -1177253, -1481718, -1716034]
12580a716034j18235n4457j23633j97295j72837j32067j01458j05598p6519L4743
12570b763390P8775J73475L82307M95968M18185J54902p1733j54937j15856M11
12560a401893P5088J57858K61830K73832K29620K34931K46390K34519K17356J86734
12550G16265J63171J08332J2574l2176J7699O4704J2023q2508q0232p6893j87978
12539F34981k73053k84378k97749k44105j77213k27446k12779o046K05983J73047
12529g08758o9606k23380j88427p7601N0512J12497j0365j02409R074J52572J67990
12518h87901N3731m445P3087J13316J36450J97890K15965J01723j56979l78846
12508e36009l10105k9227J56560K19053J74990p308j74409j64975o6892N8280
$$ y = [-1716034, -1834269, -1888726, -2012359, -2209654, -2382491, -2514558, -2616016, -2721614, -2798133, -2763390, -2684615, -2511140, -2128833, -1632865, -1214680, -1059778, -1131511, -1286448, -1402304, -1401893, -1326805, -1168947, -907117, -633285, -403665, -168734, 77656, 312175, 529531, 716265, 879436, 987768, 1000342, 968166, 985865, 1050569, 1062592, 980084, 899852, 822959, 634981, 361928, 77550, -220199, -464304, -641517, -868963, -1081742, -1087788, -881805, -708758, -778364, -1001744, -1190171, -1267772, -1217260, -1104763, -1115128, -1217537, -1208463, -1055891, -887901, -834170, -838615, -765528, -652212, -515762, -317872, -101907, -184, -157163, -536009, -846114, -875341, -718781, -499728, -324738, -332046, -506455, -671430, -738322, -680042]
12498f80042K17978L38562L49535J84572r2247l24764l62051j61925J16591L18316
12488i5475L45696K55953K04283J72446J6257j39358k13099l30878m84897m53437
12478g22509j48248J17462Q2552o4095j25466p3057K6827M8509R571O3247J72950
12467f12257J35830J0747o5188j54836k71296m04967l82080r6925K51656L52936
12457a236380K61848K25573K37393J86347N273j81493j43239O6464K38048K12036
12447a28130L4515j19683k86541l73756k39036m3474J36599L63358N45039N63930
12437D52821L90978K03210J40018J82570K66410J73667k02728m95509m34727k18088
12427D58622q8726n1926p1585p8629j0869Q0187J0979j56695j96584j69854r7060
$$ y = [-680042, -462064, -123502, 226033, 410605, 318358, -6406, -368457, -530382, -413791, -95475, 250221, 506174, 710457, 882903, 899160, 759802, 546703, 215825, -269072, -722509, -870757, -753295, -670743, -734838, -860304, -933361, -906534, -858025, -848454, -785207, -612257, -476427, -465680, -530868, -685704, -957000, -1361967, -1744047, -1840972, -1589316, -1236380, -974532, -748959, -511566, -325219, -319946, -501439, -644678, -578214, -340166, -128130, -93615, -213298, -499839, -873595, -1112631, -1156105, -1019506, -656148, -111109, 452821, 843799, 1047009, 1187027, 1369597, 1636007, 1809674, 1606946, 1111437, 676710, 458622, 369896, 317970, 246385, 167756, 156887, 237074, 248053, 91358, -105226, -275080, -372140]
12416c72140O7410K20973J79452n904j47229j60867j60587j82053m0200K00113
12406d01032K52560J6549k73352l49811j92121n2724k9177m8851j00539n2668
12396a231166P4092J84765K66938K68400J66190K7600l2048R0845K43054K01083
12386B59753K6818j12027j01019l4802q9808j02721p450M1103k4665r0145l8587
12375b73550N4069O8980K3102k1777l8349o0095j60023k40661j54530k7465K4936
12364h05363p891r2744l1246J92738K86327J19588m0729r2058j33855r7339O4138
12353f38434J85679J43663l1357j72041j73659J0313K14842K51551J82081Q4036
12343E6674k875j3314M834l5579j07753j21320j28427k49431l82019l65978k47809
$$ y = [-372140, -304730, -83757, 95695, 89791, -57438, -218305, -378892, -560945, -601145, -401032, -148472, -131923, -405275, -755086, -947207, -999931, -1029108, -1077959, -1178498, -1231166, -1157074, -972309, -705371, -436971, -270781, -243181, -275229, -184384, 58670, 259753, 286571, 174544, 73525, 38723, -51085, -153806, -161256, -120153, -144818, -234963, -273550, -219481, -150501, -127399, -149176, -187525, -247620, -407643, -648304, -802834, -830299, -805363, -813254, -905998, -937244, -744506, -458179, -338591, -379320, -471378, -605233, -702572, -638434, -452755, -309092, -340449, -512490, -686149, -675836, -460994, -209443, -27362, 56674, 53799, 40485, 45319, 9740, -98013, -219333, -347760, -597191, -979210, -1345188, -1592997]
12332a592997j51682j9213J47673K61216K46721J87364J61923Q6564M0299J52016
12322d80116L04883L62320K99936J58693P5478K2379j57761l73273l96304k10452
12312c94217O8539K73060L22868K72736J95091J22624L6227o4877j30663j15520
12302E85868J5189J97050K99117K09352j4303k18398l16101l75317m91744m70081
12292e79368j91473N2453R0925L7145K180J7673O3586Q3403N3916J8782l2741
12281c83519j32416j53077j8887O3953M0603K8310L9679J02037J72605J29752
12271a10960J1311j8343J7225O62p3260r6428N6681K60032K32357Q3876L8526
12260D01679P7990O545j26987j40577M9539L03291M64298N14545M31887K19325
$$ y = [-1592997, -1744679, -1763892, -1616219, -1355003, -1108282, -920918, -758995, -672431, -632132, -480116, -175233, 187087, 487023, 645716, 721194, 743573, 585812, 212539, -183765, -394217, -325678, -52618, 270250, 542986, 738077, 860701, 896928, 832051, 701388, 585868, 601057, 798107, 1097224, 1306576, 1292273, 1073875, 757774, 382457, -109287, -579368, -770841, -718388, -627463, -590318, -588138, -570465, -506879, -423476, -369560, -350778, -383519, -515935, -669012, -687899, -623946, -583343, -555033, -515354, -413317, -240712, -110960, -99649, -117992, -100767, -100105, -173365, -269793, -213112, 46920, 279277, 363153, 401679, 479669, 486214, 359227, 218650, 268189, 571480, 1035778, 1550323, 1982210, 2201535]
12250B201535L6590k1431q3133j47172j42494j41941j15032p9766j90538l34094
12240I82524l52374k84988k72744l08047k75258k07308p7335J11146K14183J61872
12230c08329K9911j15082k03477j22753j9916l7444j161L3919K5079J34571K70796
12219c13886J90291p9700k68046k39260m1255J58446J79660J1595r6877q7449
12209e86481j22375j70499j29381q762R5914Q1181N2877Oj33426k09399j68745
12198a299090k1871K05135K90467J13895j25883j88640m6088J29864K42190K62104
12188d37917K36170J49459n2969k17747k06070q1780M2178P2587L2762L6927J07413
12177c18987J45318Q2364J7721M9374J73581K50617J70174P0339Q4296K5836j01485
$$ y = [2201535, 2238125, 2216694, 2133561, 1986389, 1843895, 1701954, 1586922, 1507156, 1316618, 982524, 630150, 345162, 72418, -235629, -510887, -718195, -795530, -684384, -470201, -308329, -278418, -393500, -596977, -719730, -739646, -777090, -778251, -744332, -719253, -584682, -313886, -123595, -203295, -471341, -710601, -751856, -593410, -413750, -402155, -499032, -586481, -708856, -879355, -1008736, -1017498, -921584, -840403, -787526, -787520, -920946, -1130345, -1299090, -1320961, -1115826, -825359, -711464, -837347, -1025987, -1072075, -942211, -700021, -437917, -201747, -52288, -105257, -323004, -529074, -610854, -568676, -496089, -463327, -426400, -318987, -173669, -91305, -73584, -24210, 149371, 399988, 570162, 640501, 724797, 750633, 649148]
12166F49148j50963k46984l54122l37362k83323k05772j00779K262N2969J40514
12156h34412K48314L04710L00857J58338k03004n75359n81089l13906j62198r9010
12146a756759O3972K00891K12517J51609J15594J20181Q9679P0998R3046R8154
12136e40118N7643n1883p6981k1957P3141K07318K24380J14967j37975m35051
12126e86516n76161l96903p4328J85052M00617M59386L97167L09370R1431k62514
12116e3399m59805l23501k6907K18863L01868L03991L22024K26251j6693j95614
12106B97078k82562k15698j0112J63016K34454J80589N8967p2250j69914k20826
12096c7258k18737j82648j83735j74965l9266J43663J38540j3732q7077l1423
$$ y = [649148, 498185, 251201, -102921, -440283, -723606, -929378, -1030157, -1027895, -974926, -834412, -586098, -281388, 19469, 177807, -25197, -600556, -1181645, -1495551, -1657749, -1756759, -1692787, -1491896, -1279379, -1127770, -1012176, -891995, -802316, -731318, -638272, -540118, -482475, -534358, -611339, -633296, -560155, -352837, -128457, -13490, -151465, -586516, -1162677, -1559580, -1633908, -1448856, -1048239, -588853, -191686, 117684, 209115, -53399, -513204, -836705, -863612, -644749, -342881, -38890, 283134, 509385, 492692, 297078, 14516, -201182, -211294, -48278, 186176, 366765, 425732, 353482, 183568, -37258, -255995, -438643, -622378, -797343, -836609, -692946, -554406, -568138, -655215, -686638]
12086f86638N1772J20494J57418N4735j08131j45965j02204n1839K6013J33444
12076e50901J82328r389k88750l45147k18809m6255Q4030K05337L48640L91367
12066b47549L01135K11125J39120R1863M1771j05197k83422k55619o1413k6554
12056a94740j69902k72180k16519j68615j58730m5954J18098K33038K70106J62831
12046d42567K992j1407M3071J19655K58731L13911K42377J01309j0693j06912
12036E10467j48051m2414P4006J93003K92754K83990K30501K21219K05221O5987
12026A886683j56010k97829l56416m63710n35636m74154k70008p061J47533R3254
12016d33354l7194r3403k8761Q8185O6248j17046k31916j56329l833O3667P3953
$$ y = [-686638, -634866, -514372, -356954, -302219, -410350, -556315, -658519, -710358, -684345, -550901, -368573, -377962, -666712, -1011859, -1230668, -1276923, -1192893, -987556, -638916, -247549, 53586, 264711, 403831, 495694, 537465, 432268, 148846, -106773, -168186, -194740, -364642, -636822, -853341, -1021956, -1180686, -1226640, -1108542, -875504, -605398, -442567, -439575, -450982, -407911, -288256, -29525, 284386, 526763, 628072, 617379, 510467, 362416, 320002, 394008, 587011, 879765, 1163755, 1394256, 1615475, 1820696, 1886683, 1730673, 1432844, 1076428, 612718, 77082, -397072, -667080, -674141, -526608, -433354, -470548, -563951, -592712, -504527, -438279, -555325, -787241, -943570, -947403, -883736, -809783]
12005h09783K6240o7201r2955k3365O4942N0087p7586j91218k34942j94438l4755
11994a584974J60970K69413K55634J33049o8149j96759j66288n2111R5406K22763
11984i31046L00136K42705J1497k56735l82017l58631k07173L309J10553J00197
11974a367205J49583K91591L43323K89826J87393R3536L6749L7026J1062j54400
11964h1516l96507n73004n28204l25088j26173K8225J62070K18526J10933l2878
11954a543616l9688N7885J31443J51486K04333K04742J92820K61803K85864K18199
11944A25271J33821N8749o1559k04642k41881k21635k43253k15616j11726l62
11934i82833J25573K75401M06610M74371L60396P8047j99715l52349l32268k04825
$$ y = [-809783, -783543, -850744, -943699, -967064, -902122, -852035, -929621, -1120839, -1355781, -1550219, -1584974, -1424004, -1154591, -898957, -765908, -834057, -1030816, -1197104, -1249215, -1153809, -931046, -630910, -388205, -376708, -633443, -1015460, -1374091, -1581264, -1577955, -1467402, -1367205, -1217622, -926031, -582708, -292882, -105489, -11953, 24796, 61822, 72884, -81516, -478023, -1051027, -1579231, -1904319, -2030492, -2002267, -1840197, -1621671, -1510738, -1543616, -1583304, -1525419, -1393976, -1242490, -1038157, -833415, -640595, -378792, -92928, 125271, 259092, 317841, 256282, 51640, -190241, -411876, -655129, -870745, -982471, -982833, -857260, -581859, -175249, 299122, 659518, 737565, 537850, 185501, -146767, -351592]
11924c51592o2049N5201J10644J67443K36938L22791L35119K28223O3095r7925
11914A007888k16347k86092k42106p7321Q9894J65316Q6039j17983k26249m4108
11904A38931K14722L53408L39344Q7096j95479l54694m33590m12783l00905j22931
11894f86881M7730K28303L38996K63154K9399k65784m98579m89384k73009r6622
11884a402677q7609j39374m3516Q9533R5231M8163O9966J58799K42473K04879
11874g64132L8240j41181k15797j79705q7747L4978J54944J77813J43238K35105
11864f04244M38729N42147M04619K19113R0280j17448l60928m59319l94189k93207
11854e34447k35351k44853l04997l49642l09166j74768M166J56793K39035L60829
$$ y = [-351592, -413641, -358440, -247796, -80353, 156585, 479376, 814495, 1042718, 1105813, 1007888, 791541, 505449, 263343, 186022, 275916, 441232, 527271, 409288, 183039, 138931, 353653, 707061, 1046405, 1133501, 938022, 583328, 149738, -263045, -563950, -686881, -639151, -410848, -71852, 191302, 220701, -45083, -543662, -1033046, -1306055, -1402677, -1490286, -1629660, -1673176, -1583643, -1488412, -1440249, -1370283, -1211484, -969011, -764132, -725892, -867073, -1082870, -1262575, -1350322, -1315344, -1160400, -982587, -839349, -604244, -165515, 376632, 781251, 1000364, 1090644, 973196, 612268, 152949, -241240, -534447, -769798, -1014651, -1319648, -1669290, -1978456, -2153224, -2149058, -1992265, -1753230, -1392401]
11844a392401N00800M52971K55520J00454N4334L2464m6647r6946m2891O1025
11834a21317J21009Q1270n5341j41952r9797K7186J81289K09500O4443q8697j06994
11823G0599m1456j9290q7486j93755k27825q5872J60454L34606K81711J39349
11813C31035P2578n5822l28987m67177k63534k2171J7761M0543J32911J71825
11803c71038R8171n146l2360N040N9841J43363K08130J71732P155k23916l75426
11792c14454l57780k12353k6760K9254j10532k28760j44663P0440K37936K19705
11782h37967J52713K15418L07799K20677K8430j9263Q276n9719j22333j35959
11772b41928j61943j96095k35363j85848q0238J33553L15325J08395j24916K202
$$ y = [-1392401, -891601, -438630, -183110, -82656, -28322, 4142, -42505, -139451, -182342, -121317, -308, 80962, 25621, -116331, -216128, -188942, -7653, 201847, 266290, 177593, 70599, 29143, 9853, -77633, -271388, -499213, -585085, -424631, -90025, 191686, 331035, 403613, 347791, 18804, -448373, -711907, -734078, -716317, -675774, -542863, -371038, -272867, -278013, -310373, -305333, -245492, -102129, 106001, 277733, 284888, 60972, -314454, -672234, -884587, -911347, -882093, -992625, -1221385, -1366048, -1295608, -1057672, -837967, -685254, -469836, -162037, 58640, 87070, 67807, 76083, 16364, -105969, -241928, -403871, -599966, -835329, -1021177, -1101415, -967862, -652537, -544142, -669058, -666856]
11762f66856J81197J95061J42926Q3309n7928j50383K3072J99524J34287O1414
11752A45623J47529K54183K57365K38917K34413K01644J51815R1339K0995j08338
11742A635485k51680k90934j90589Q895J79032K56198K38628J25613n9293j94493
11732A456862j46694q4487j34545j88157j56308o0992l0055j22516k68941k68355
11722d188p7860J62526K37258J1795k34911k57523j27868M0191R5234m9726k65745
11711d70817m03795m09947k50996j32259q4098K3530J54542K56282L46594L26005
11701f44959J55817N2052k0882j81447l26479l14965l06832l43526j80552J04689
11691b007084K97350L08384K07522J30694O0584J22o8111k15195l05469j78490
$$ y = [-666856, -485659, -290598, -147672, -64363, -122291, -272674, -249602, -50078, 84209, 145623, 293152, 547335, 804700, 1043617, 1278030, 1479674, 1631489, 1722828, 1743823, 1635485, 1383805, 1092871, 902282, 911177, 1090209, 1346407, 1585035, 1710648, 1651355, 1456862, 1310168, 1225681, 1091136, 902979, 746671, 685679, 655624, 533108, 264167, -4188, -82048, 80478, 317736, 329531, 94620, -162903, -290771, -250580, -155346, -205072, -470817, -874612, -1284559, -1535555, -1667814, -1751912, -1728382, -1573840, -1317558, -970964, -644959, -489142, -437090, -457972, -639419, -965898, -1280863, -1587695, -1931221, -2111773, -2007084, -1709734, -1401350, -1193828, -1063134, -1002550, -1002428, -1070539, -1285734, -1591203, -1769693]
11681a769693J37845M32357N47962L75680M6208q1556R8276M31818N44409M21870
11671A185176L55939M25994L89132Q822m91930p85712p12797l94513l7260J19396
11661F2247l8932k06436k33719j97309j16121M9895K71543L36611K50445K35578
11651D13802K43897K41503K31103J22688l1876j01430j29568j82915j53869k3866
11641F29469P7755J09012N1577p7467k35283k73745j35069o3031j60769j87858
11631b65409j01369p7420L5097K05770K39342J90842Q8136j00347k58676k19988
11621b64022r2303k3776M5143N6163m0534o5401J2714k702j30562k31831k24287
11610i61398j77274n3604J20989J71074J38615K05951M05889N67376M86220J50445
$$ y = [-1769693, -1631848, -1199491, -651529, -275849, -229641, -311197, -212921, 218897, 763306, 1185176, 1541115, 1967109, 2356241, 2365063, 1873133, 1087421, 374624, -19889, -57149, 62247, 23315, -183121, -416840, -614149, -730270, -680375, -408832, -72221, 178224, 413802, 657699, 899202, 1130305, 1252993, 1221117, 1119687, 990119, 807204, 653335, 629469, 707224, 816236, 867813, 790346, 555063, 281318, 146249, 83218, -77551, -265409, -366778, -444198, -409101, -203331, 36011, 226853, 314989, 214642, -44034, -264022, -356325, -380101, -334958, -278795, -319329, -384730, -372016, -374718, -505280, -737111, -961398, -1138672, -1192276, -1071287, -900213, -761598, -555647, -149758, 417618, 903838, 1054283]
11600A054283j89392l57537l47877k55798q2826P2639M2757r4673j69733j16552
11590d44709n2427r3180k17999k59803j09026Q7258J20254L8436R9173J75819
11580f56204O9748j19080j88442r8945p44P2444J04411O2525j3622m5939k114
11569h15962N2392N4592l9219q0681l9363j0472J03517K55168K66855J93324J36973
11558G7124O1301n2685j46658j55664l2254J15385K14921K25074R6061j00169
11548C02436l35884m16309k45485l7666R697L3049Q1554P1493K7950M5267R8187
11537c65711J3016o8298n2156o349Q7572J68174J57171J03394J20151J73488J34752
11526D65204k5655j92647k62456k35384j49112r483J53252K17488J62718P1714
$$ y = [1054283, 864891, 507354, 159477, -96321, -179147, -106508, -63751, -158424, -328157, -444709, -497136, -590316, -808315, -1068118, -1177144, -1089886, -969632, -931196, -832023, -656204, -586456, -705536, -893978, -992923, -993667, -921223, -816812, -754287, -767909, -813848, -815962, -763570, -708978, -748197, -828878, -868241, -878713, -775196, -520028, -253173, -59849, 77124, 138425, 85740, -60918, -216582, -248836, -133451, 81470, 306544, 402605, 302436, -33448, -449757, -695242, -732908, -723211, -690162, -608608, -537115, -509165, -463898, -365711, -352695, -420993, -473149, -479498, -391926, -223752, -66581, 36813, 156964, 330452, 465204, 439549, 246902, -15554, -250938, -400050, -409533, -256281, -38793, 123925, 195639]
11516A95639l6824n5111J31253K90440K52798J05907n9798j37232j88940k61729
11506B36403k71122j81475n8176m5905p5627K9591L45425O00251M82492J28143
11496A190000j56803k71770l19322k31457k0111J08107J44383Q9025m8553j02179
11486C81320j52232k65961k68133n5815J56267K19812K18616K05374J49004Q5464
11476F73716K6040r8241k56097l84537l92002k46051k5107J93750L20041K58952
11466G0464J02540Q1557J50043J23001m6352k45694k83285j75631J1549J56157
11456e5651J12092p5741j46153Q316J72492K40590K24807J87971R3618j51504
11446F10837l49392k89535p6578L7527l3923r7014o7803k3026N5019J61281K10215
$$ y = [195639, 158815, 103704, 234957, 525397, 778195, 884102, 824304, 687072, 498132, 236403, -34719, -216194, -274370, -320275, -395902, -366311, -20886, 579365, 1061857, 1190000, 1033197, 761427, 442105, 210648, 190537, 298644, 443027, 532052, 483499, 381320, 229088, -36873, -305006, -360821, -204554, 15258, 233874, 439248, 588252, 673716, 699756, 601515, 345418, -39119, -431121, -677172, -702279, -508529, -188488, 70464, 173004, 254561, 404604, 527605, 481253, 235559, -47726, -223357, -211808, -55651, 56441, -19300, -165453, -157137, 15355, 255945, 480752, 668723, 762341, 610837, 261445, -28090, -104668, -67141, -101064, -198078, -265881, -288907, -233888, -72607, 137608]
11435A37608J47831L1877J5541Q3405J8994j68625k66962j94909J214J40640J60906
11424A07520J22784O9018Q263k5406K8643J56077K20891K02125M8512k02790l06814
11413D28823k66250j76210j2641J27246O7971j37360l17918m03767k80038m2226
11403a012370M3302l0207j65938k32234j92876m4444J38906K36994L08868L01422
11393f48577Q5665j70687j91310o34J20396J57709L00474M06986K53470L6285
11383C49777o7839j73242k97903l29767j14159J97181K26222N8606J09489K90905
11373B49270L26788K50797J13753m0861n6135P8934J22653J03392J84521K28906
11363A562018Q1891j22355j09599J64489M47302O08876O44186N15676J57974k80844
$$ y = [137608, 285439, 317316, 332857, 416262, 435256, 266631, -331, -195240, -194026, -53386, 107520, 230304, 299322, 307585, 282179, 310822, 466899, 687790, 889915, 938427, 735637, 428823, 162573, -13637, -26278, 100968, 168939, 31579, -286339, -690106, -970144, -1012370, -969068, -999275, -1165213, -1397447, -1590323, -1634767, -1495861, -1258867, -949999, -648577, -562912, -733599, -924909, -925543, -805147, -647438, -346964, 60022, 313492, 349777, 281938, 108696, -189207, -518974, -633133, -435952, -209730, -151124, -41635, 249270, 576058, 826855, 940608, 899747, 843612, 922546, 1045199, 1148591, 1333112, 1562018, 1643909, 1521554, 1411955, 1576444, 2023746, 2632622, 3276808, 3792484, 3950458, 3669614]
11353C669614n23639n07523m18090l86459l27241k75108l40703m36203m11123
11344D3525k58421j26258j15978j17534o3033J2725K6504p0434j66629j11101
11334i46634p947J6841J06061K51674K83364J48582L1801P8547K04369K57508
11324D24166J41702j27282m15131m89348l69415k37187p9798L8610N3519K8131
11314a032033L5983Q5490J54619J81884J24078M772j45062k30245k19097j98788
11304a238399j85000j58600J3340K74910L65896K92526K16043J60313Q7987K4767
11294a46217r805L1618J51185K30358K47339K72419J92301J8138n56J12295J11654
11283A210729j4644j43402k68057l55870k95590r7343O3293O1913n1119j57779
$$ y = [3669614, 3145975, 2638452, 2220362, 1833903, 1506662, 1231554, 890851, 454648, 43525, -214896, -341154, -457132, -574666, -637699, -624974, -598470, -668904, -835533, -946634, -954581, -937740, -831679, -580005, -296641, -148059, -116258, -37711, 166658, 424166, 565868, 438586, 23455, -465893, -835308, -1072495, -1152293, -1113683, -1060164, -1032033, -996050, -910560, -755941, -574057, -449979, -445207, -590269, -820514, -1039611, -1238399, -1423399, -1581999, -1568659, -1293749, -927853, -635327, -419284, -258971, -170984, -146217, -156022, -124404, 26781, 257139, 504478, 776897, 969198, 987336, 986780, 1099075, 1210729, 1196085, 1052683, 784626, 428756, 133166, 35823, 99116, 161029, 109910, -47869]
11273d7869k41955k83288k33962r3070J04571K03858J37556P7553O0492j390n8141
11262c75645p9672j63023k12561j45655m3795P0915J90153K47511J98597J7321
11252b95854j94429k66485k01019j28041j25057j22202q0122K3360J68114K31621
11242i90114K07060J82004J14882p4682l11308l51344j85615m2727l1006k8680
11232a511530L2130R0844J90995L12078L66883L54582K71276J19955n0992j43988
11222C2233k01642k87711k71388q4127R8783K38106L84512M05490J83359j34554
11212C63061l19543k94940j67909j4808Q7632J35339K03011K43130K50551K20722
11202G06246J24610J01268J94167J55868j9288j01175k2088J28618J36054r9896
$$ y = [-47869, -289824, -573112, -807074, -900144, -795573, -591715, -454159, -376606, -316114, -317504, -375645, -455317, -618340, -830901, -976556, -1020351, -949436, -759283, -511772, -313175, -295854, -490283, -756768, -957787, -1085828, -1210885, -1333087, -1413209, -1389849, -1221735, -990114, -783054, -601050, -486168, -560850, -872158, -1223502, -1409117, -1451844, -1482850, -1511530, -1479400, -1388556, -1197561, -885483, -518600, -164018, 107258, 227213, 176221, 32233, -169409, -457120, -728508, -812635, -713852, -475746, -91234, 314256, 497615, 363061, 43518, -251422, -419331, -434139, -346507, -211168, -8157, 234973, 485524, 706246, 830856, 932124, 1126291, 1282159, 1262871, 1161696, 1139608, 1268226, 1404280, 1304384]
11192A304384k25951r7694j1500o3920K765J92606K28676P4623n934J19774L70980
11181A888809N14686M55631L30748K01757J94210M57493Q35848J006053R49958
11172F835193Q50957Q04784Q84477J249576J920547K674544L296540L580073K988120
11163B5084811J015086j650591l411490l735479l339628k854367k449234j972959
11155F686149j477876j100703q03347n25672l06238k18376k50000l13258l38033
11146A352646l52170k78660q9804Q7521J88234J95109Q6783q0030k36134k86771
11136E86724j98359j29958j29254n5172J05168K90633M07627L97959K59649Q3831
11126A618848M19O8544J20042p868j75658k22333k03690k78990l69878l34384
$$ y = [1304384, 1078433, 980739, 969239, 905319, 908084, 1100690, 1329366, 1403989, 1398055, 1517829, 1888809, 2403495, 2859126, 3189874, 3391631, 3585841, 4043334, 4879182, 5885235, 6835193, 7686150, 8490934, 9375411, 10624987, 12545534, 15220078, 18516618, 22096691, 25084811, 26099897, 24449306, 21037816, 17302337, 13962709, 11108342, 8659108, 6686149, 5208273, 4107570, 3304223, 2778551, 2472313, 2253937, 2003937, 1690679, 1352646, 1000476, 721816, 632012, 719533, 907767, 1102876, 1189659, 1109629, 873495, 586724, 388365, 258407, 129153, 73981, 179149, 469782, 877409, 1275368, 1535017, 1618848, 1619267, 1687811, 1807853, 1799985, 1624327, 1401994, 1198304, 919314, 549436, 215052]
11116B15052k29689j30831o8977r2976k35153l94829m30205l42141j49110R4781
11106a764078K34253K64113J96675M4585q4919p2663O4767J00189n7765j71425
11096a246268q9669k8326j40946k75082j74995J03533K66259K97804L18720L07321
11086f61649K48008J28949R345l6854k4965p758L6046O8389l4187j41510r8071
11075e14257l5097j07119j90484j55382p2410M4726J88244L70265L94284J80079
11065A02849n7533k09117k30003j49364j46741k84903k99083j2757L53100M40326
11055d93226J89503j49110l13952j72714J99741M54272L77534J65974J20654K69731
11045F48407M07990M11224K51980M808j95434k50774j51517m4094j40273l63158
$$ y = [215052, -14637, -145468, -214445, -307421, -542574, -937403, -1367608, -1709749, -1858859, -1764078, -1529825, -1265712, -1069037, -1024452, -1109371, -1182034, -1117267, -1017078, -1074843, -1246268, -1335937, -1364263, -1505209, -1780291, -1955286, -1851753, -1585494, -1287690, -968970, -661649, -413641, -284692, -275347, -312201, -337166, -344924, -308878, -240489, -274676, -416186, -514257, -549354, -656473, -846957, -1002339, -1074749, -1030023, -841779, -471514, -77230, 102849, 45316, -163801, -393804, -543168, -689909, -974812, -1273895, -1286652, -933552, -493226, -303723, -452833, -766785, -939499, -739758, -285486, 92048, 258022, 378676, 648407, 1056397, 1467621, 1719601, 1724409, 1528975, 1278201, 1126684, 1082590, 942317, 579159]
11035E79159m32286k84796m9283J26931Q4214o2237r0581n9642o1909r3115q6962
11024d30507o9118k7662N2731J02493M1278r4229j50755q3275m3951k2340J1191
11013g14144o7764j74310m6507J56437K11447K24722K23145J74636R5566N674
11003H8902r3188j76862k02546k30430j96194j2140J28664R7835L9836O9227P3746
10992d13150m8791j77836k05194j10544L5839Q3258J3813m1668j7003l874O665
10981h78485N8009J97992L88712L83471K16416J830j84127k74460k18293q1402
10971c90337p579P9165J62884J17116J7374k5349k0830N5221J13455O2730n99
10960A63251L5722K24874L86051L11926K2288k94849l81132j44365J74176K40665
$$ y = [579159, 146873, -137923, -187206, -60275, 23939, -38298, -128879, -188521, -250430, -343545, -430507, -499625, -527287, -474556, -372063, -330785, -425014, -575769, -659044, -702995, -725335, -714144, -781908, -956218, -1002725, -846288, -634841, -410119, -186974, -12338, 83228, 88902, -4286, -181148, -383694, -614124, -810318, -822458, -693794, -595959, -556123, -486896, -413150, -461941, -639777, -844971, -955515, -919676, -836418, -822605, -864273, -881276, -885150, -878485, -820476, -622484, -233772, 149699, 366115, 367945, 183818, -90642, -308935, -390337, -397916, -318751, -155867, -38751, -21377, -46726, -67556, -12335, 101120, 163850, 163251, 198973, 423847, 809898, 1121824, 1144112, 849263, 468131, 323766, 497942, 738607]
10950G38607J63648J98563K15980M400k96491l34496j26943l7736j68509k76470
10940H0553k25763n8983J24736K15101J46951L6322m1061j07705j10615K6286
10930H5822J81560J14852j53610m00540m03703j48877J42539M02229N84011N43092
10920I47375K99826P8858K7943P608j7223P0033L16968N28595N54055M18249J44955
10909C377242j30767j52610O3313K18131J69422L5609l1845L1032K34531M37999
10899D252057N22893M82274L60795K60906K72749M46380P42767J070875J360709
10890I772405J465259J331397J113295Q98533O18679J20536n55845j142248j526775
10881A2095236j660279j555534j403729j150748q34984o09913m88536m57801m32188
$$ y = [738607, 902255, 1100818, 1316798, 1321198, 1024707, 690211, 563268, 525532, 357023, 80553, -145210, -204193, -79457, 135644, 282595, 318917, 277856, 170151, 59536, 85822, 267382, 382234, 228624, -171916, -575619, -724496, -581957, -179728, 404283, 947375, 1247201, 1326059, 1354002, 1361610, 1344387, 1414420, 1731388, 2259983, 2814038, 3232287, 3377242, 3246475, 3093865, 3157178, 3375309, 3544731, 3580340, 3548495, 3579527, 3814058, 4252057, 4774950, 5257224, 5618019, 5878925, 6151674, 6598054, 7340821, 8411696, 9772405, 11237664, 12569061, 13682356, 14580889, 15199568, 15320104, 14764259, 13622011, 12095236, 10434957, 8879423, 7475694, 6324946, 5489962, 4880049, 4391513, 3933712, 3501524]
10872C501524l79338l35369l31677l75943l82336k72931j16842n2808p2354j4853
10862A167073K10110M19857M11160J83975j70928m52322l78498j13336M5594J57842
10852A480527K15851J58286M0987r4850k00513k10912j36793L1662J98779K30091
10842A713115J91895J98861K41675K99661L57498L83707K71587j325k78079m73949
10832B904646n73890n42559l76234j75594m2563K3100J7602m0484q579J05420
10822A290865J22896k5943k03909k66109j91163p3199J01779K28437K74215L55971
10812A613840L86927L13874K25398J71956N5583j14986j66026j14093n6810M8000
10802B363663J20755R0487k5402j56614j58419o5782m4130r2425o2514O7199J13444
$$ y = [3501524, 3122186, 2786817, 2455140, 2079197, 1696861, 1423930, 1307088, 1254280, 1181926, 1167073, 1377183, 1797040, 2208200, 2392175, 2221247, 1768925, 1390427, 1277091, 1322685, 1480527, 1696378, 1854664, 1895651, 1800801, 1600288, 1389376, 1252583, 1284245, 1483024, 1713115, 1905010, 2103871, 2345546, 2645207, 3002705, 3386412, 3657999, 3656674, 3378595, 2904646, 2330756, 1788197, 1411963, 1236369, 1193806, 1216906, 1234508, 1194024, 1185445, 1290865, 1413761, 1387818, 1183909, 917800, 726637, 653438, 755217, 983654, 1257869, 1613840, 2000767, 2314641, 2540039, 2711995, 2767578, 2652592, 2486566, 2372473, 2315663, 2363663, 2484418, 2574905, 2549503, 2392889, 2234470, 2168688, 2124558, 2032133, 1969619, 2036818, 2150262]
10791B150262M7330m8268j67877k50446k01880j1594J93687K92023L41339N14448
10781B859024O57946O23703M67977K27153j5065k91101n46310o05710m44575j65515
10771B767527j7818l2707j3932P3092J31424J38442R9884J11240K04072K41760
10761C702984O6481k42598m89903o41070o55742m55932j74269O256K4728r7624
10751A043311k44683k22823k4686R3500M1931K3630J21461K03047J84573L5618
10741A254879j42919k35927k47656j92999j92988k45539j55106j5193l801n3474
10731b30723M779J58672K36456J99217J35197J58291L04090M22271L85602J49315
10721A923167k04280m30801m17217k43568p6961p6962j31782j09738m6868l4605
$$ y = [2150262, 2197592, 2149324, 1981447, 1731001, 1529121, 1517527, 1711214, 2003237, 2344576, 2859024, 3516970, 4140673, 4608650, 4835803, 4820738, 4529637, 3983327, 3377617, 2933042, 2767527, 2749709, 2717002, 2703070, 2776162, 2907586, 3046028, 3145912, 3257152, 3461224, 3702984, 3769465, 3526867, 3036964, 2395894, 1740152, 1284220, 1109951, 1116207, 1140935, 1043311, 798628, 575805, 551119, 644619, 686550, 710180, 831641, 1034688, 1219261, 1254879, 1111960, 876033, 628377, 435378, 242390, -3149, -158255, -173448, -177249, -230723, -225944, -67272, 169184, 368401, 503598, 661889, 965979, 1388250, 1773852, 1923167, 1718887, 1288086, 870869, 627301, 550340, 473378, 341596, 231858, 184990, 150385]
10711A50385p276R1343K02293K46418K51564J65350O8494N3952j0611j17357j39055
10700I55500n1354L0792J6226p9197j44185r5688n9390j08463r8200k0412k8947
10689C16682o9282p8243p5113j065J08320J22912J14045J52329J20097M6898L9567
10678G97147Q7919O5443l883o9179p1967P9982K33328J66376j538j6561O5428
10667A332495J06631P7577j6212j90759l63587l90734k98601k67793k82242k07564
10657e00789j05387K5150J56278J61809N8188o2790j38777n2490Q6669J26455
10647b45684J58195J68663J04563J9769j9640R5949K72737L45962K29706N8179
10637A188399N6537K32238L25605J99627Q7887M5216n0556k27522l59999k93574
$$ y = [150385, 143109, 234452, 436745, 683163, 934727, 1100077, 1168571, 1222523, 1211912, 1094555, 955500, 904146, 934938, 951164, 871967, 727782, 632094, 572704, 464241, 366041, 345629, 316682, 247400, 169157, 94044, 92979, 201299, 324211, 438256, 590585, 710682, 757580, 797147, 885066, 950509, 946626, 877447, 805480, 885462, 1118790, 1285166, 1283628, 1267067, 1332495, 1439126, 1516703, 1500491, 1309732, 946145, 555411, 256810, -10983, -293225, -500789, -606176, -581026, -424748, -262939, -204751, -267541, -406318, -458808, -372139, -245684, -87489, 81174, 185737, 205506, 185866, 281815, 554552, 900514, 1130220, 1188399, 1244936, 1477174, 1802779, 2002406, 2090293, 2135509, 2084953, 1857431, 1497432, 1203858]
10627A203858r8149q561n5990r4942p9128l1272J1804N4727O6500R0000J32096
10616A190943P7191o6889p5533L0847N1003o6218j97783k33006k26490k34342
10606B49723j64697K2365J36211J38973J01591k2551k00119l00337k43680p4136
10596c56657R9869K33021L14663K01599j62299m30820m06134k53790j11583J8627
10586h53504J34326J16309K769M162Q4572J42403K66993N16315O42451M28518
10576A485314R3219p6038j54121k56285k89916j84899K8713K51186K71938N8595
10566A227706j94266k39436j11170j5981m1088o2626k9395k1665j7985j10199
10556C83895k15990j49948j3274J1140j9283M0988J20228O3915j45538k57638
$$ y = [1203858, 1105709, 1097148, 1041158, 946216, 867088, 835816, 847620, 902347, 968847, 1058847, 1190943, 1268134, 1201245, 1125712, 1156559, 1207562, 1141344, 943561, 710555, 484065, 249723, 85026, 107391, 243602, 382575, 484166, 461615, 261496, -38841, -282521, -356657, -256788, -23767, 290896, 492495, 330196, -100624, -506758, -760548, -872131, -853504, -719178, -602869, -600100, -595938, -511366, -368963, -101970, 414345, 1056796, 1485314, 1578533, 1502495, 1348374, 1092089, 802173, 617274, 645987, 897173, 1169111, 1227706, 1033440, 794004, 682834, 666853, 625765, 563139, 533744, 512079, 494094, 383895, 167905, 17957, 4683, 15823, -3460, 37528, 157756, 221671, 76133, -181505]
10546a81505j96398q3615L9913J03880J48358K72771M15801M78822M11722K08448
10536A618197n8938k08460k28704k43713k60245k68526k37320j55637m1188O2535
10526b1999N1011O7568K15732L34499K70274J50296J62241K91643L79050L84760
10516B285075L70777K62932J30895R8858J01373J20597J34646J47980K03209K31799
10506D088141K40118K71139L73157N04623N85076O18500O29333M61334J29723
10497G901144k06005m87843o80914p32947o69373n87361n79643n40654l68239
10488C048165j95439j23205j69120k63797l41645m19532m84206m86944l92283
10479A71994k93039l04830l53507l01750j09001K0872K5736l318K6145J61396
$$ y = [-181505, -377903, -461518, -421605, -317725, -169367, 103404, 519205, 998027, 1409749, 1618197, 1559259, 1350799, 1122095, 878382, 618137, 349611, 112291, -43346, -84534, -21999, 29012, 96580, 312312, 646811, 917085, 1067381, 1229622, 1521265, 1900315, 2285075, 2655852, 2918784, 3049679, 3148537, 3249910, 3370507, 3505153, 3653133, 3856342, 4088141, 4328259, 4599398, 4972555, 5477178, 6062254, 6680754, 7310087, 7771421, 7901144, 7695139, 7207296, 6526382, 5793435, 5124062, 4536701, 3957058, 3416404, 3048165, 2852726, 2729521, 2560401, 2296604, 1954959, 1535427, 1051221, 564277, 171994, -121045, -425875, -779382, -1081132, -1190133, -1169261, -1143525, -1146843, -1120698, -959302]
10469i59302L54292N44369O01595M33111K37737J22715J19j00892r5949m6994
10459A090801j5417k3550j48462k96557k37510j32634j94142k93570k62172r7474
10449f10687J9004r687k4267J20785K53697J56429n5774j62106j61320q5934J7014
10438e42846P5100Q3308R9609O086k14526l85991m34483l55411k05863j08618
10428a983635O1676L04843L50777J71148k9427q9431P357J36762K11298K14116
10418f44516J52658Q9623J2825j58186k28193J9724L83637O30982P17790N40365
10408A516709K04276m7920j63153j76276j83779j32162j20821k70528k92790j05924
10398B27632P4918Q1562o0169r6913Q2890L45739M11554K80258J65216N0010n2367
$$ y = [-959302, -605010, -60641, 540954, 974065, 1211802, 1334517, 1334636, 1233744, 1137795, 1090801, 1075384, 1051834, 903372, 606815, 369305, 236671, 42529, -251041, -513213, -610687, -591683, -601370, -625637, -504852, -251155, -94726, -150500, -312606, -473926, -559860, -542846, -467746, -384438, -284829, -278743, -493269, -879260, -1313743, -1669154, -1875017, -1983635, -1921959, -1617116, -1266339, -1095191, -1124618, -1214049, -1206692, -1069930, -858632, -644516, -491858, -402235, -389410, -547596, -775789, -756065, -372428, 258554, 976344, 1516709, 1720985, 1673065, 1509912, 1333636, 1149857, 1017695, 896874, 626346, 333556, 227632, 302550, 384112, 323943, 227030, 309920, 655659, 1067213, 1347471, 1512687, 1562697, 1510330]
10387A510330q9911o7423K1191Q2741M9492k6237l6150O6541J19159L4544o2082
10376A602195j20053q5942R274J6227M9882R0591l018j42119k34917k88508l06974
10365E86638l30508l43462j51247J93396M01764L65767J73686l5866j15823k8490
10355G15855M7489m7921k49597l88184l74518k38478k0016K12027K71967J80811
10345A09435O7795l3414q5252r894P5709m8157k74064l23974j26168Q0847Q3454
10334d83683N9767P4894m0128j18849j5423J61554K69563K18234K1871j49791
10324a991o8551J92317M50341N41058M25217K83445K32841K22394K19133J77907
10314B674111M4021r9871k06344k33626j24284J05907K77784J92670J7696K0121
$$ y = [1510330, 1420419, 1352996, 1374187, 1456928, 1506420, 1480183, 1444033, 1510574, 1629733, 1664277, 1602195, 1482142, 1396200, 1405474, 1421701, 1471583, 1562174, 1559156, 1417037, 1182120, 893612, 586638, 256130, -87332, -238579, -45183, 356581, 722348, 896034, 860168, 744345, 715855, 763344, 715423, 465826, 77642, -296876, -535354, -555370, -343343, -71376, 109435, 177230, 143816, 58564, 48670, 124379, 76222, -197842, -521816, -647984, -567137, -483683, -423916, -349022, -389150, -507999, -523422, -361868, -92305, 125929, 147800, -1991, -70542, 121775, 572116, 1113174, 1538391, 1821836, 2054677, 2277071, 2496204, 2674111, 2718132, 2618261, 2411917, 2178291, 2054007, 2159914, 2437698, 2630368, 2648064, 2668185]
10304B668185J73484L33836L47171K11873K6361j28773k24375l36375m12689l64916
10294B293782k71625j86287p5180Q4538J44536J3557j48364k27748k25413k05931
10284A195865k15594j57012r8085r4951k7059O7957j3359j42436j04865l3044
10274C77417J0114J00471J37277O1341p0270l16731n91289o11046l83958q6465
10264a373139J14846Q5524k2144N7940K66176L58327J84300l9004r7300q2740
10254e47214r4162l1596J03954J80586J83637K02231K43185J69733j8335k36773
10244A55246m05263m35854l42367k24804j03365K7984J25670J20704N6579N2482
10234i72988J48057K45430K47727J31643n579o2148l3122q103L890P9956J30548
$$ y = [2668185, 2841669, 3175505, 3522676, 3734549, 3760910, 3632137, 3407762, 3071387, 2658698, 2293782, 2022157, 1835870, 1760690, 1845228, 1989764, 2003321, 1854957, 1627209, 1401796, 1195865, 980271, 823259, 725174, 630223, 603164, 671121, 657762, 515326, 410461, 377417, 387531, 488002, 625279, 686620, 616350, 299619, -291670, -902716, -1286674, -1373139, -1258293, -1172769, -1194913, -1136973, -870797, -512470, -328170, -367174, -464474, -547214, -641376, -672972, -569018, -388432, -204795, -2564, 240621, 410354, 392019, 155246, -250017, -685871, -1028238, -1253042, -1356407, -1328423, -1202753, -1082049, -1025470, -972988, -824931, -579501, -331774, -200131, -205710, -267858, -300980, -309083, -305193, -225237, -94689]
10223i4689L5390j44573l03684l47159k45686O3868M10415M65361K31389l0863
10213C9769j87852k24039j66529m7873R4932J19212P369q5078j28119j11859k3856
10202g13923P4391J23738N7678o8681j18929l6327P8180P5452l7920n2514Q4922
10191e33933K14974K27359J94999K89262K92843J33219J22438K37870K92892L26998
10181A798921L61607L58444K31045k0629k94401m97679n80775m95197l38289k27896
10171B95151j54163l2513N7213P292q7734j86624k48173j98278r3060M1797J66231
10160d32861K63797L51000L26362J93234M5483p3803k13626l81754l58090o6981
10150c47239J98245K75368K17160P2933p3096j00734n1796n247K4939l5313j17429
$$ y = [-94689, -59299, -203872, -507556, -854715, -1100401, -1036533, -626118, -160757, 70632, 39769, -148083, -372122, -538651, -586524, -491592, -372380, -365011, -450089, -578208, -690067, -713923, -639532, -515794, -458116, -526797, -645726, -682053, -603873, -528421, -566341, -618855, -533933, -318959, -91600, 103399, 392661, 685504, 818723, 941161, 1179031, 1471923, 1798921, 2160528, 2518972, 2750017, 2729388, 2434987, 1937308, 1356533, 861336, 523047, 295151, 140988, 108475, 165688, 172980, 85246, -101378, -349551, -547829, -640889, -599092, -432861, -169064, 181936, 508298, 701532, 747015, 673212, 459586, 77832, -280258, -347239, -148994, 126374, 343534, 416467, 343371, 242637, 190841, 185594, 210533, 175220, 57791]
10139E7791q8545k4595K8990L1792m7270p7762m1878P749O3631J31010K60595
10128C01508L48657K11733L9652k7501j55555l57142m27875l24316j74912o8026
10118f33777p7914j37815r1501J05659L08058M03424L37443J13831l0083p3690
10108B23635j69505k88086l06146q6208K30721M02797L17135O5737r3524p0629
10098B25927k1362p9911j71737q2590J12970J58176J19295J77287K23378J11373
10088G72806k9607n9883j47750l52678m10094l26488l37508l17379n8907K71605
10078i95883M38716N33062N90168M46816R7520k51651l87704k59494k5470O1440
$$ y = [57791, -30754, -55349, -26359, 5433, -41837, -119599, -161477, -153728, -90097, 40913, 301508, 650165, 861898, 901550, 874049, 718494, 361352, -66523, -390839, -565751, -633777, -711691, -849506, -941007, -835348, -527290, -123866, 213577, 327408, 297325, 223635, 54130, -233956, -540102, -626310, -395589, 7208, 324343, 390080, 296556, 225927, 204565, 124654, -47083, -129673, -16703, 141473, 260768, 438055, 661433, 772806, 743199, 683316, 535566, 182888, -227206, -553694, -891202, -1208581, -1267488, -995883, -557167, -24105, 566063, 1012879, 1110399, 858748, 471044, 211550, 186080, 247520]
$$ [...]
##END NTUPLES=NMR SPECTRUM
##END=
