##TITLE=C13_Ser 3511-NEA
 CDCl3, 23100 sc

 7.2.2024
##JCAMPDX= 6.0         $$ Bruker NMR JCAMP-DX V2.0
##DATA TYPE= NMR SPECTRUM
##DATA CLASS= NTUPLES
##ORIGIN= UXNMR, Bruker Analytische Messtechnik GmbH
##OWNER= root
$$ XWIN-NMR		Version 3.5
$$ Thu Feb  8 13:40:45 2024 Russian Standard Time (UT+4h)  she@DPX200
##.OBSERVE FREQUENCY= 50.327896
##.OBSERVE NUCLEUS= ^13C
##.ACQUISITION MODE= SIMULTANEOUS
##.ACQUISITION SCHEME= undefined
##.AVERAGES= 18220
##.DIGITISER RES= 17
##SPECTROMETER/DATA SYSTEM= spect
##.PULSE SEQUENCE= zgpg30
##.SOLVENT NAME= D2O
##.SHIFT REFERENCE= (INTERNAL, D2O, 0, 222.653)
##AUDIT TRAIL= $$ (NUMBER, WHEN, WHO, WHERE, WHAT)
$$ ##TITLE= Audit trail, XWIN-NMR		Version 3.5
$$ ##JCAMPDX= 5.01
$$ ##ORIGIN= Bruker BioSpin GmbH
$$ ##OWNER= she
$$ F:/spectra/data/she/nmr/c13/1/pdata/1/auditp.txt
$$ ##AUDIT TRAIL=  $$ (NUMBER, WHEN, WHO, WHERE, WHAT)
(   1,<2024-02-08 09:03:27.25 +0400>,<she>,<DPX200>,
      <created by zg, POWCHK disabled, PULCHK disabled
       terminated by command 'halt'
       configuration hash MD5:
       00 E9 B6 7A A2 85 ED C7 34 08 36 98 17 FE 4E 26
       data hash MD5: 32K
       3B 1D F0 FA 0B 0D 8A BE 65 5A 60 6D 9B 03 35 91>)
(   2,<2024-02-08 13:37:33.96 +0400>,<she>,<DPX200>,
      <Start of raw data processing
       efp BC_mod = 2 LB = 2 FT_mod = 6 PKNL = 1 PHC0 = -377.8617 PHC1 = 34.41885 SI = 32K 
       data hash MD5: 32K
       E2 1A F4 6A 10 31 32 59 6C FC F6 3A C8 48 AB 69>)
(   3,<2024-02-08 13:37:42.32 +0400>,<she>,<DPX200>,
      <abs ABSG = 5 
       data hash MD5: 32K
       15 FE A7 4F FF 6B 82 A4 47 5F 34 62 C6 80 6B 0D>)
(   4,<2024-02-08 13:38:31.07 +0400>,<she>,<DPX200>,
      <pk PHC0 = 9.128617 PHC1 = -15 
       data hash MD5: 32K
       AC 19 3C 2B A9 DC 3A 5B 94 AA 21 98 BA 05 A2 10>)
(   5,<2024-02-08 13:38:34.65 +0400>,<she>,<DPX200>,
      <abs ABSG = 5 
       data hash MD5: 32K
       30 20 BF 70 15 F1 9D 12 C3 CA D8 8A 51 E2 12 21>)
$$ ##END=
$$ 
$$ hash MD5
$$ 43 63 1A 22 DC F8 F1 20 97 A2 20 DC 06 41 99 B4
##$RELAX= 
##$RELAX= 
##$RELAX= 
##$RELAX= 
##$RELAX= 
##$RELAX= 
##$RELAX= 
##$RELAX= 
$$ Bruker specific parameters
$$ --------------------------
##$DU= <F:/spectra>
##$EXPNO= 1
##$NAME= <c13>
##$PROCNO= 1
##$TYPE= <nmr>
##$USER= <she>
##$AMP= (0..31)
100 100 100 100 100 100 100 100 100 100 100 100 100 100 100 100 100 100 
100 100 100 100 100 100 100 100 100 100 100 100 100 100 
##$AQSEQ= 0
##$AQ_mod= 1
##$AUNM= <au_zg>
##$AUTOPOS= <>
##$BF1= 50.322709
##$BF2= 200.13
##$BF3= 50.322709
##$BF4= 500.13
##$BF5= 500.13
##$BF6= 500.13
##$BF7= 500.13
##$BF8= 500.13
##$BYTORDA= 1
##$CFDGTYP= 0
##$CFRGTYP= 5
##$CHEMSTR= <none>
##$CNST= (0..31)
1 1 145 1 1 1 1 1 1 1 1 1 1 1 1 1 1 1 1 1 1 1 1 1 1 1 1 1 1 1 1 1 
##$CPDPRG= <waltz16>
##$CPDPRG1= <>
##$CPDPRG2= <waltz16>
##$CPDPRG3= <>
##$CPDPRG4= <mlev>
##$CPDPRG5= <mlev>
##$CPDPRG6= <mlev>
##$CPDPRG7= <mlev>
##$CPDPRG8= <mlev>
##$CPDPRGB= <>
##$CPDPRGT= <>
##$D= (0..31)
$$ [...]
##$SUBNAM4= <"">
##$SUBNAM5= <"">
##$SUBNAM6= <"">
##$SUBNAM7= <"">
##$SUBNAM8= <"">
##$SUBNAM9= <"">
##$SW= 239.972175391363
##$SWIBOX= (0..15)
0 1 3 0 0 0 0 0 0 0 0 0 0 0 0 0 
##$SW_h= 12077.2946859903
##$TD= 32768
##$TD0= 1
##$TE= 0
##$TE2= 300
##$TE3= 300
##$TEG= 300
##$TL= (0..7)
120 120 120 120 120 120 120 120 
##$TP= (0..7)
150 150 150 150 150 150 150 150 
##$TP07= 0
##$TPNAME0= <>
##$TPNAME1= <>
##$TPNAME2= <>
##$TPNAME3= <>
##$TPNAME4= <>
##$TPNAME5= <>
##$TPNAME6= <>
##$TPNAME7= <>
##$TPOAL= (0..7)
0.5 0.5 0.5 0.5 0.5 0.5 0.5 0.5 
##$TPOFFS= (0..7)
0 0 0 0 0 0 0 0 
##$TUNHIN= 0
##$TUNHOUT= 0
##$TUNXOUT= 0
##$USERA1= <user>
##$USERA2= <user>
##$USERA3= <user>
##$USERA4= <user>
##$USERA5= <user>
##$V9= 5
##$VALIST= <valist>
##$VCLIST= <CCCCCCCCCCCCCCC>
##$VD= 0
##$VDLIST= <DDDDDDDDDDDDDDD>
##$VPLIST= <PPPPPPPPPPPPPPP>
##$VTLIST= <TTTTTTTTTTTTTTT>
##$WBST= 1024
##$WBSW= 4
##$XGAIN= (0..3)
0 0 0 0 
##$XL= 0
##$YL= 0
##$YMAX_a= 119573445
##$YMIN_a= -87697950
##$ZGOPTNS= <>
##$ZL1= 120
##$ZL2= 120
##$ZL3= 120
##$ZL4= 120
##$ABSF1= 222.6533
##$ABSF2= -17.34351
##$ABSG= 5
##$ABSL= 3
##$ALPHA= 0
##$AQORDER= 0
##$ASSFAC= 0
##$ASSFACI= 0
##$ASSFACX= 0
##$ASSWID= 0
##$AUNMP= <proc_1d>
##$AZFE= 0.1
##$AZFW= 0.5
##$BCFW= 0
##$BC_mod= 2
##$BYTORDP= 0
##$COROFFS= 0
##$CY= -3
##$DATMOD= 1
##$DC= 0
##$DFILT= <>
##$DTYPP= 0
##$F1P= 0
##$F2P= 0
##$FCOR= 0.5
##$FTSIZE= 32768
##$FT_mod= 6
##$GAMMA= 0
##$GB= 0
##$INTBC= 1
##$INTSCL= 4.134877e-10
##$ISEN= 128
##$LB= 2
##$LEV0= 0
##$LPBIN= 0
##$MAXI= 10000
##$MC2= 0
##$MEAN= 0
##$ME_mod= 0
##$MI= 0.1934396
##$NCOEF= 0
##$NC_proc= 1
##$NLEV= 6
##$NOISF1= 120.0001
##$NOISF2= 80.00006
##$NSP= 0
##$NTH_PI= 0
##$NZP= 0
##$OFFSET= 222.6533
##$PC= 1.4
##$PHC0= -368.7331
##$PHC1= 19.41885
##$PH_mod= 1
##$PKNL= yes
##$PPARMOD= 0
##$PSCAL= 0
##$PSIGN= 0
##$REVERSE= no
##$SF= 50.3227301259044
##$SI= 32768
##$SIGF1= 140
##$SIGF2= 120
##$SINO= 11.81781
##$SIOLD= 32768
##$SREGLST= <13C.CDCl3>
##$SSB= 0
##$STSI= 32768
##$STSR= 0
##$SW_p= 12077.2946859903
##$SYMM= 0
##$S_DEV= 0
##$TDeff= 32768
##$TDoff= 0
##$TI= <>
##$TILT= no
##$TM1= 0
##$TM2= 0
##$TOPLEV= 0
##$USERP1= <user>
##$USERP2= <user>
##$USERP3= <user>
##$USERP4= <user>
##$USERP5= <user>
##$WDW= 1
##$XDIM= 32768
##$YMAX_p= 400144968
##$YMIN_p= -3395159
$$ End of Bruker specific parameters
$$ ---------------------------------
##NTUPLES= NMR SPECTRUM
##VAR_NAME=  FREQUENCY,     SPECTRUM/REAL,   SPECTRUM/IMAG
##SYMBOL=    X,             R,               I
##VAR_TYPE=  INDEPENDENT,   DEPENDENT,       DEPENDENT
##VAR_FORM=  AFFN,          ASDF,            ASDF
##VAR_DIM=   32768,         32768,           32768
##UNITS=     HZ,            ARBITRARY UNITS, ARBITRARY UNITS
##FACTOR=    0.368581032318806, 1,           1
##FIRST=     11204.5221818586, 0,            0
##LAST=      -872.772504131739, 0,           0
##MIN=       -872.772504131739, -3395159,    0
##MAX=       11204.5221818586, 400144968,    0
$$ Real data points
##PAGE= N=1
##DATA TABLE= (X++(R..R)), XYDATA
$$ [...]
17991 -8742 -27342 -73787 -52950 65048 259985 516342 806855 1069405 1239178 1286469 1227639
17980 1227639 1181889 1193397 1163782 1004408 777852 653164 647123 603715 502162 476830 599715
17969 599715 752925 825734 773652 566228 401441 474819 644571 762393 854069 935290
17959 935290 979044 845446 467696 37782 -249534 -442271 -688571 -947440 -1101625 -1153484
17949 -1153484 -1125360 -1034581 -958416 -912132 -822433 -647649 -422992 -253593 -149352 -99296
17939 -99296 -248727 -631222 -1059211 -1381943 -1617619 -1768814 -1765884 -1641907 -1474936 -1218289
17929 -1218289 -790999 -232477 281265 604582 751705 813731 875620 949454 1015845 1048789
17919 1048789 989103 837964 591205 287728 7598 -127670 11583 383488 798602 1128483
17909 1128483 1296494 1219298 989333 768731 613809 561005 649086 803703 852689 700899
17899 700899 430387 229803 196314 201279 91223 -129878 -419651 -747663 -951424 -935215
17889 -935215 -753084 -547871 -425686 -415470 -546934 -769797 -944597 -958560 -775418 -447403
17879 -447403 -167751 -1794 144592 296807 475795 685206 739465 522963 241135 139912
17869 139912 239522 385436 424177 390535 314066 191103 80350 10311 -32277 -103137 -254336
17858 -254336 -425473 -525270 -541932 -492653 -378038 -189927 -6559 100022 68283 -55932
17848 -55932 -121707 -165482 -300817 -411806 -337324 -71994 330403 770421 1133981 1343965
17838 1343965 1395245 1279124 1058990 806033 592780 498175 470358 482034 549450 600389
17828 600389 521990 312786 87097 24953 146511 313227 411717 433092 479401 483527 276577
17817 276577 -57140 -364774 -601502 -647455 -468603 -211403 -45137 -51827 -213975 -471897
17807 -471897 -734969 -923735 -957511 -727864 -231500 353494 765347 881157 832274 874281
17797 874281 1104395 1328509 1323662 1089592 763220 420067 155818 54258 105861 198003
17787 198003 263955 359603 471203 575358 749846 1023735 1346094 1576368 1603964 1432593
17777 1432593 1206150 1087217 1048994 945383 701937 328050 -92544 -407662 -541568 -488603
17767 -488603 -290515 -104347 -26160 -41591 -117426 -193796 -172765 31095 375168 694082
17757 694082 844720 780937 537764 168476 -200397 -398018 -417834 -413321 -496840 -584952 -578823
17746 -578823 -567148 -621862 -683992 -777784 -874991 -804365 -446149 131830 731661 1156539 1353012
17735 1353012 1362974 1274540 1198731 1133282 1023167 920014 845574 759756 721629 857355 1142932
17724 1142932 1424505 1641141 1793487 1789017 1588791 1349496 1189560 1104227 1015513 903431
17714 903431 771220 539942 202191 -190883 -513186 -634595 -583152 -430662 -289319 -313609
17704 -313609 -525024 -751131 -906240 -1053577 -1172779 -1140253 -839101 -409725 -109169 -9602
17694 -9602 -96401 -295911 -441388 -491115 -481178 -465576 -510933 -509910 -317742 38780 413866
17683 413866 639393 729699 792649 808454 823701 867520 703785 278001 -151055 -397644
17673 -397644 -469744 -562673 -764057 -949374 -1031247 -976955 -770204 -504473 -257626 -18025
17663 -18025 220536 406197 502611 524866 509076 546785 685332 793872 727591 532149 335496
17652 335496 153396 -26037 -151191 -143582 -54427 -66591 -235189 -435307 -522517 -483598 -392111
17641 -392111 -260639 -81507 65943 132284 126879 64017 7539 91070 304659 517300 672452
17630 672452 810670 1059505 1385300 1555652 1444584 1195738 953595 774345 658950 502821
17620 502821 286869 128679 91422 97750 -25385 -299135 -537504 -616070 -603490 -589520 -518491
17609 -518491 -369798 -220035 -74859 78075 150688 86475 36106 194859 484612 661441
17599 661441 642619 497187 325530 149037 -127941 -582789 -1086423 -1447572 -1611939 -1698017
17589 -1698017 -1735775 -1598313 -1319749 -1065990 -863260 -646175 -339461 48164 394857 623511
17579 623511 712865 738855 782100 797921 769736 679608 514220 327461 110476 -92226 -244541
17568 -244541 -341215 -290679 -53401 237150 484893 624379 578811 421455 269416 65998
17558 65998 -260652 -578591 -775548 -914565 -1004880 -1092540 -1249872 -1411147 -1363847 -1039916
17548 -1039916 -630304 -328209 -245813 -310414 -409899 -497858 -527017 -513190 -480522 -442939 -500137
17537 -500137 -727598 -952322 -884803 -529862 -118708 161695 305776 366923 274490 52898
17527 52898 -33559 93236 231289 270926 213743 122401 70985 42476 15054 19860 47023
17516 47023 26025 -76455 -252911 -431793 -549068 -586104 -566507 -568612 -540123 -413525 -323879
17505 -323879 -378694 -511860 -626875 -717853 -849774 -980996 -1006508 -921643 -840421 -870877 -979270
17494 -979270 -1064956 -1081589 -1030086 -966097 -845479 -622444 -377257 -144587 36973 88816
17484 88816 23515 -55105 -105435 -137322 -133857 -108110 -30242 147939 304956 276853 59267
17473 59267 -252631 -564544 -738187 -747856 -699209 -628536 -536206 -448642 -347023 -228122 -137616
17462 -137616 -83192 -54960 -121684 -346077 -670758 -932577 -969916 -754398 -441389 -211329
17452 -211329 -124105 -99011 -41768 41004 168533 311498 399304 437344 451258 512073 630497
17441 630497 720070 642713 366102 53676 -186161 -296749 -201271 45394 262975 291292
17431 291292 117706 -147202 -455309 -763170 -933630 -987713 -1083406 -1183981 -1226762 -1212281
17421 -1212281 -1159784 -1150094 -1219805 -1399504 -1614716 -1700626 -1611128 -1458694 -1375881 -1309116 -1145685
17410 -1145685 -862593 -531966 -282235 -171562 -145076 -130212 -122928 -164152 -266859 -400146
17400 -400146 -542349 -701207 -808056 -764571 -607837 -472121 -441356 -443313 -356024 -150111
17390 -150111 52848 129656 183051 290244 332837 254715 125550 -95484 -426237 -660004
17380 -660004 -661760 -510418 -403022 -429670 -524090 -652433 -875414 -1189238 -1342283 -1250951
17370 -1250951 -1045750 -863957 -805097 -835363 -893380 -940732 -907031 -686896 -385254 -299156
17360 -299156 -497578 -825456 -1198465 -1584142 -1856943 -1950903 -1904950 -1747704 -1561036 -1434083
17350 -1434083 -1359955 -1250260 -1081232 -987549 -1068170 -1223531 -1310686 -1301900 -1273585 -1292480 -1337996
17339 -1337996 -1484750 -1760667 -1917302 -1746100 -1344730 -864472 -350164 48429 137000 -162192
17329 -162192 -713683 -1172408 -1328723 -1218548 -934252 -586682 -333520 -280160 -405275 -539832
17319 -539832 -517861 -270639 168144 602597 792109 731777 522720 313215 242340 244035
17309 244035 165779 9613 -102533 -120894 -137418 -188636 -163079 26511 354140 640798
17299 640798 746099 617658 325242 76704 -49715 -207386 -410123 -466918 -314064 -143505
17289 -143505 -92880 -108511 -200090 -386748 -557284 -616473 -573326 -458864 -371253 -391186 -445492
17278 -445492 -453969 -471280 -545902 -635884 -701672 -744184 -681405 -404225 32820 388418 494125
17267 494125 386033 187245 42552 -9145 23682 171028 312156 249419 -37578 -357522
17257 -357522 -505153 -506309 -494952 -492189 -445142 -309554 -67195 157387 221627 249880 377572
17246 377572 496744 530638 569087 673464 747911 776129 763834 593164 231366 -100553
17236 -100553 -257882 -376619 -632535 -869780 -875806 -779381 -683698 -572290 -467158 -294269
17226 -294269 15003 365481 584900 595344 524620 483399 524159 639867 798819 910652
17216 910652 878248 804481 826591 889955 862979 780465 709435 610645 457081 299227 124344
17205 124344 -71928 -173699 -132002 -69683 -72275 -133047 -284519 -512026 -733083 -897215
17195 -897215 -968459 -903086 -727207 -554846 -460604 -435248 -387347 -194776 198863 683798
17185 683798 1072064 1363640 1567677 1576345 1294395 808702 361150 35566 -253810 -459372
17175 -459372 -494513 -457058 -402386 -336165 -308965 -290813 -238899 -189594 -239272 -397597 -522654
17164 -522654 -543150 -601491 -743371 -820396 -704559 -379156 30132 399768 698657 928854
17154 928854 1054874 1040669 932544 804122 717937 688731 659244 573939 447877 345417
17144 345417 191744 -119346 -459398 -682246 -750226 -603035 -282472 150132 706174 1285854
17134 1285854 1689027 1852956 1788878 1568082 1421762 1532660 1833744 2102345 2234410 2238674
17124 2238674 2049001 1624582 1165137 958495 1047256 1197788 1274071 1355796 1484968 1485321
17114 1485321 1298918 1128296 1045323 936113 809481 748058 784553 891469 941894 862781
17104 862781 609277 253908 -82458 -337996 -539769 -666344 -664877 -609223 -498374 -272327
17094 -272327 -33932 96110 58388 -92808 -181654 -211356 -360892 -657307 -914996 -966750
17084 -966750 -824387 -571303 -275886 35088 303532 431069 410242 268758 9811 -274362
17074 -274362 -479251 -541630 -424553 -212265 -12777 97021 38156 -132374 -278802 -304723
17064 -304723 -171740 113613 486921 807325 977574 1007692 905445 629039 177662 -285533
17054 -285533 -571010 -722805 -752551 -609688 -471800 -487735 -562510 -611199 -630776 -597081 -479405
17043 -479405 -353101 -358955 -536961 -797406 -997778 -1090068 -1099327 -1027733 -908334 -751789 -571225
17032 -571225 -472570 -466591 -513718 -597984 -657156 -698105 -706450 -593531 -338786 20902 326496
17021 326496 339476 205519 261786 532636 771319 824815 711483 485910 265062 200125
17011 200125 298226 397800 448999 494411 491346 410878 278781 119262 -14390 -13994 196723
17000 196723 538458 892558 1193966 1353454 1294416 1126679 947301 733693 477315 225948
16990 225948 71516 13872 -49328 -173710 -271603 -271578 -271735 -377376 -527774 -604438 -499482
16979 -499482 -198689 123201 256972 141539 -18840 63308 397796 761913 1004464 1125570
16969 1125570 1133409 973160 651388 394089 292712 213221 62809 -167542 -409661 -540155
16959 -540155 -501945 -395988 -257451 -134616 -180988 -356644 -479158 -530039 -583418 -669037
16949 -669037 -691885 -548929 -328254 -225078 -273973 -379210 -541597 -726717 -822864 -748720
16939 -748720 -498330 -154061 172137 436072 527433 365737 75292 -104408 -77047 -23757
16929 -23757 -143195 -238186 -35022 379867 756657 1040939 1250473 1350615 1369326 1318695
16919 1318695 1144941 803962 384865 94760 -29809 -149034 -307739 -414394 -498593 -719236
16909 -719236 -1028266 -1149117 -1002428 -805578 -739719 -811528 -1036807 -1287905 -1303635 -1037804
16899 -1037804 -651589 -323910 -137044 -123440 -237463 -301240 -163432 109062 380392 607745
16889 607745 857631 1147733 1366913 1363059 1111764 742040 408472 134635 -179817 -558574
16879 -558574 -798038 -729140 -506348 -316254 -210427 -206715 -232700 -173360 -117389 -247904 -514693
16868 -514693 -736827 -831836 -828364 -767786 -738832 -759108 -796944 -868598 -925929 -914056 -871316
16857 -871316 -905930 -946017 -817093 -496815 -139421 98848 223489 297852 287920 158601
16847 158601 -80218 -404657 -688204 -797535 -760976 -702519 -686145 -640429 -506559 -366350
16837 -366350 -260714 -86270 147286 298883 332663 241355 591 -272342 -472395 -607084
16827 -607084 -683577 -722901 -761133 -720463 -553885 -337882 -162584 -205622 -500652 -796517
16817 -796517 -850400 -628037 -220656 187145 448894 531134 445429 227309 982 -71882
16807 -71882 18810 109536 134422 36623 -240258 -477921 -543645 -558336 -498202 -330252 -195618
16796 -195618 -95732 86840 268023 197943 -134836 -429777 -524449 -544375 -508011 -336100
16786 -336100 -140732 -121601 -294274 -466662 -538946 -646077 -838429 -998738 -966218 -648420
16776 -648420 -154165 357084 772880 1004118 1075616 1092424 1048748 937522 833740 776286
16766 776286 763912 734791 646270 466578 160926 -216676 -512864 -688789 -827260 -915648
16756 -915648 -877813 -775152 -647246 -479522 -306959 -155605 -61588 -64699 -169429 -377263
16746 -377263 -641309 -898190 -1098190 -1177312 -1091930 -844540 -530250 -307535 -218925 -185616
16736 -185616 -134893 -157232 -382189 -697636 -906780 -964187 -872597 -691153 -613924 -727934
16726 -727934 -880088 -932944 -907417 -865113 -898857 -1074996 -1360690 -1629752 -1783992 -1837713
16716 -1837713 -1859892 -1792081 -1527163 -1155347 -888168 -826688 -867570 -858020 -792028 -782400 -905064
16705 -905064 -1137397 -1384421 -1497862 -1431331 -1322290 -1241525 -1137274 -1022594 -873373 -647533
16695 -647533 -361337 -130011 -66747 -120860 -277062 -575721 -913367 -1170058 -1270835 -1212023
16685 -1212023 -993290 -690980 -495166 -434937 -438846 -567056 -824375 -1025188 -1100143 -1126553
16675 -1126553 -1175327 -1231807 -1252334 -1248754 -1212716 -1178684 -1210534 -1269292 -1263899 -1174592 -1022166
16664 -1022166 -797699 -581858 -511574 -582835 -735569 -852149 -844065 -785977 -790765 -820163 -827591
16653 -827591 -782277 -692205 -669896 -668665 -594327 -593704 -821292 -1151500 -1352804 -1334243 -1152640
16642 -1152640 -929208 -700352 -480270 -367672 -367136 -251633 37963 229224 235282 198936
16632 198936 171164 186445 382290 753447 1119488 1345925 1398094 1354368 1311157 1290388 1241555
16621 1241555 1124525 1006039 979669 964391 762111 363894 -19413 -208913 -211478 -124730
16611 -124730 -1877 118984 174896 105810 -49155 -183726 -236840 -221871 -187496 -150871 -151567
16600 -151567 -266439 -402272 -360849 -96093 220757 395398 336735 107101 -139329 -323638
16590 -323638 -481038 -634967 -731470 -726102 -632612 -445015 -161178 216538 564212 742713
16580 742713 801662 880570 1071189 1211580 1161362 1072875 1124114 1256274 1291022 1205721 1153557
16569 1153557 1111552 932952 645376 457041 504121 665772 720047 611560 389597 108845
16559 108845 -108530 -238059 -333875 -389495 -322342 -182590 -220563 -469407 -679256 -676183 -514070
16548 -514070 -327828 -148138 66920 297240 399369 289850 91822 -56282 -130279 -199758
16538 -199758 -334882 -484432 -564049 -594714 -564014 -543965 -626684 -781389 -911652 -901498 -815645
16527 -815645 -788954 -779058 -780271 -867309 -991772 -1022499 -977162 -1046698 -1229843 -1335245 -1216340
16516 -1216340 -891709 -612962 -564811 -660544 -781297 -888063 -947774 -922325 -767047 -536542
16506 -536542 -347851 -224219 -192780 -215722 -150501 7040 160286 304340 424395 418537
16496 418537 298999 211669 221172 380819 711387 1075758 1237201 1160171 1012392 800284
16486 800284 469373 146837 -22239 -25019 99189 192989 123314 -59911 -320305 -615262
16476 -615262 -832374 -980462 -1075189 -1154503 -1304473 -1530816 -1784360 -1883431 -1686134 -1353557
16466 -1353557 -1145161 -1102902 -1183880 -1433786 -1701916 -1776787 -1686988 -1581956 -1545462 -1539860 -1389398
16455 -1389398 -1000630 -542715 -259497 -173879 -242401 -420039 -617498 -866585 -1085647 -1022119
16445 -1022119 -647865 -244516 -163507 -492390 -953500 -1252677 -1309955 -1153211 -914674 -655587
16435 -655587 -302417 45445 226637 273902 269413 189413 -68945 -434861 -677664 -764306
16425 -764306 -794760 -842909 -856110 -766596 -606644 -468925 -410454 -341280 -231827 -125330 15280
16414 15280 223540 369876 228291 -180812 -582778 -813268 -893588 -913953 -903337 -748617
16404 -748617 -404708 -74650 77830 116328 84928 -9297 -81744 -69896 23837 147074 210208
16393 210208 154462 -62861 -443760 -961408 -1611445 -2294043 -2858580 -3276637 -3395159 -2851381
16383 -2851381 -1756261 -722697 -69879 309482 560091 692843 635182 424980 160926
16374 160926 -44909 -88633 -66897 -157132 -336122 -466190 -495710 -438167 -322269 -172979
16364 -172979 13391 142035 104894 -94350 -303093 -375724 -347124 -308435 -276482 -164023
16354 -164023 99646 450158 753720 969554 1211785 1562089 1936498 2138406 2040953 1771779
16344 1771779 1521282 1274355 961392 611223 272219 -69672 -349742 -487651 -480149 -285289
16334 -285289 55498 338895 392535 298279 204980 208245 327505 488854 654952 839815
16324 839815 1056278 1247943 1286069 1135643 812208 455762 243605 227357 327644 403242
16314 403242 453118 633853 924396 1152423 1287670 1401624 1481490 1433297 1192805 865568
16304 865568 548692 245030 -83320 -455955 -881795 -1286496 -1509403 -1479680 -1210223 -821115
16294 -821115 -492190 -241733 -41990 -16715 -194807 -394998 -439403 -348161 -214916 -8965
16284 -8965 276778 551143 777124 920114 888551 660278 343969 73601 -52742 -15648
16274 -15648 126391 293299 405899 392347 179489 -229685 -700550 -1099843 -1348523 -1443504
16264 -1443504 -1451031 -1410027 -1311322 -1150364 -953911 -809473 -721841 -568875 -384298 -299783
16254 -299783 -292968 -323964 -327861 -241399 -92000 112406 402453 732933 967122 1010982 866982
16243 866982 559767 127740 -304294 -630290 -747004 -654425 -466528 -274660 -92904 76056
16233 76056 281610 455786 362905 -91781 -737980 -1285590 -1563068 -1621457 -1572701 -1464315
16223 -1464315 -1350567 -1280988 -1107545 -747146 -393992 -164433 -12879 60831 40374 -34347
16213 -34347 -88175 -7971 221054 513957 777727 988286 1101116 1065970 935700 789551
16203 789551 715084 765368 882783 906797 809415 789569 911898 1107659 1289871 1391179
16193 1391179 1339446 1142312 889974 678422 482502 209337 -140954 -413928 -530072 -628369
16183 -628369 -782171 -972929 -1183960 -1370394 -1436867 -1396534 -1267988 -983074 -611668 -251409
16173 -251409 95527 388963 604980 775686 865515 795069 595326 341369 164947 194449
16163 194449 329426 459610 557084 544289 413814 210651 -23402 -209117 -305917 -399347
16153 -399347 -523406 -599397 -579944 -477666 -409380 -473514 -656380 -789135 -786954 -735843 -636647
16142 -636647 -468792 -329834 -344509 -430206 -485266 -572767 -678161 -748705 -790874 -796160 -784592
16131 -784592 -799858 -805608 -787407 -681692 -377640 46504 376326 406867 108543 -297878
16121 -297878 -555948 -621673 -652034 -792119 -924894 -920999 -844812 -749301 -661227 -572253 -411486
16110 -411486 -208876 -91957 -184532 -472561 -742816 -831912 -749776 -568962 -325258 -119719
16100 -119719 -638 203741 501735 634333 470180 125567 -158852 -267589 -312938 -350167
16090 -350167 -310328 -206946 -77000 80580 147428 -5452 -285827 -448524 -380611 -215826
16080 -215826 -137412 -173806 -223410 -239283 -337511 -523544 -635152 -572154 -439932 -420000 -529830
16069 -529830 -626098 -659241 -740964 -899496 -1095807 -1322419 -1516450 -1617463 -1612320 -1480155
16059 -1480155 -1269780 -1018994 -738072 -491206 -280409 -86181 77424 233979 374363
16050 374363 444163 459885 509656 679791 940482 1151114 1203720 1077573 802212 404694
16040 404694 -36660 -351966 -483376 -495095 -467893 -441954 -375049 -252277 -123192 9936
16030 9936 197806 441536 725751 1041270 1327665 1527788 1654874 1725650 1721039 1614354
16020 1614354 1378594 1054876 774056 631591 686574 910162 1141009 1285870 1337571 1243272
16010 1243272 1057201 914346 856610 845653 814655 752147 747931 803833 857031 903625 914947
15999 914947 799126 529503 202796 -22881 -113575 -259998 -595795 -959975 -1132199 -1011944
15989 -1011944 -693163 -397076 -158186 58882 217155 277814 285735 322300 415504 561187
15979 561187 661377 697581 761483 856836 970174 1105521 1224590 1302354 1285428 1162934
15969 1162934 983031 705921 393245 204749 254528 536842 828462 884645 745365 635533
15959 635533 645175 687589 605241 373056 154825 45543 4176 -13462 -48935 -122982 -197153
15948 -197153 -183060 -38315 179453 452941 731122 876817 843542 732283 622535 568012
15938 568012 644596 732352 659951 430037 155913 -90552 -322004 -538651 -695388 -778359
15928 -778359 -800105 -792976 -760360 -710015 -650844 -474984 -30507 529755 873789 985321 969157
15917 969157 869478 760242 628611 401433 -8626 -566842 -1035671 -1280254 -1384122 -1418271
15907 -1418271 -1376484 -1296628 -1152428 -862884 -536920 -302780 -139974 11479 135584 185549
15897 185549 116568 -32945 -241318 -452295 -487327 -401910 -376763 -448353 -573887 -660277 -575555
15886 -575555 -322679 -7736 223651 211696 5303 -123905 -38926 100735 84584 -45105
15876 -45105 -108748 -7360 224157 438335 480351 351702 132076 -32669 10551 245027
15866 245027 495869 627670 610210 525909 511829 571955 584201 513001 436018 346211 135675
15855 135675 -210931 -663859 -1183630 -1656271 -1925101 -1955105 -1898656 -1818761 -1636912 -1272743
15845 -1272743 -859515 -617500 -550817 -506184 -501633 -611548 -713326 -781327 -908169 -1052215
15835 -1052215 -1090429 -1011485 -924756 -853612 -739127 -602020 -469248 -346045 -223177 -125816
15825 -125816 -109477 -123692 -105632 -22762 59794 -15304 -200339 -290934 -253450 -139327 -26341
15814 -26341 44286 131387 207562 150016 -103053 -422200 -661946 -845516 -950652 -987498 -1048107
15803 -1048107 -1083037 -1017875 -954988 -1045890 -1259330 -1476429 -1614991 -1640821 -1552027 -1298088
15793 -1298088 -888758 -551000 -537707 -856689 -1262580 -1517747 -1501418 -1304190 -1142044 -1125809
15783 -1125809 -1242045 -1438047 -1660558 -1816004 -1845482 -1758776 -1589978 -1320136 -923164 -536924
15773 -536924 -253841 -24436 140791 229529 292813 350651 309816 110924 -160341 -336754
15763 -336754 -341164 -266249 -197011 -153399 -224230 -357610 -377725 -304367 -253625 -247722 -353360
15752 -353360 -573564 -744911 -820955 -820971 -726930 -648084 -737229 -908189 -1000001 -963632 -802412
15741 -802412 -598166 -490747 -456782 -407481 -331521 -115950 291455 649829 668125 378278
15731 378278 28228 -214826 -310785 -249707 -137118 -120001 -230525 -409121 -595461 -706804
15721 -706804 -664090 -530442 -460702 -522534 -583295 -534098 -392553 -188934 -70818 -165644 -311245
15710 -311245 -415264 -561357 -686016 -689804 -669065 -738752 -859444 -893233 -739307 -486073
15700 -486073 -245324 -22041 129641 124607 93413 289060 753286 1257370 1566476 1704933
15690 1704933 1771403 1771217 1673632 1460821 1146823 799402 489060 222079 -6134 -190152
15680 -190152 -386124 -485882 -331160 15109 361876 549509 519814 331202 164767 45382
15670 45382 -97816 -246409 -280750 -141546 151491 505279 679958 564596 277478 -3256
15660 -3256 -86361 63109 307042 491862 555555 585996 636416 624712 482439 236636 -51220
15649 -51220 -316345 -512555 -593168 -493618 -305746 -207024 -178083 -163600 -115183 22714 137413
15638 137413 160848 163594 134165 71266 -36733 -175195 -197558 6138 380001 650032 636175
15627 636175 533765 553980 637456 603515 507548 546913 681397 703271 559953 398865 354906
15616 354906 469704 664240 838789 970068 1046858 1059056 1031764 927091 739320 591120
15606 591120 613340 798425 902839 713651 383322 232493 313941 444209 459235 374149
15596 374149 305593 216444 24564 -212668 -482378 -764173 -913480 -807152 -561182 -306398
15586 -306398 -75585 44192 24640 -37896 -134092 -259985 -362640 -478331 -624539 -696840
15576 -696840 -671881 -634559 -594997 -542527 -470838 -374661 -278268 -239683 -280496 -361102 -471108
15565 -471108 -650331 -891972 -1119811 -1207232 -1101535 -962597 -945026 -1049272 -1180569 -1233968
15555 -1233968 -1196318 -1061652 -847897 -617348 -370400 -12866 356181 534365 553339 514752
15545 514752 433131 364235 310420 230199 88452 -134494 -399120 -585270 -569430 -417370
15535 -417370 -271961 -193913 -164101 -146598 -223447 -442200 -683775 -846884 -901743 -894425 -881990
15524 -881990 -892292 -822949 -526066 -3785 508278 801262 931901 966800 920965 854876
15514 854876 882919 1011246 1095666 1052966 927024 803652 744939 769654 798706 714922 550977
15503 550977 437467 449094 559915 730878 877214 917881 820938 664086 609894 801204
15493 801204 1115976 1288146 1271005 1077526 757564 520079 469684 519859 535458 498081
15483 498081 519022 688906 942012 1160011 1304433 1293717 1164609 1029864 873628 725926
15473 725926 648202 618602 614071 654409 668602 530074 332896 185627 -71333 -521540 -918214
15462 -918214 -1038714 -946331 -824777 -732413 -617367 -465047 -250820 41547 335701 521323
15452 521323 586730 593222 594567 559462 435638 314356 237631 250384 467640 881109 1273477
15441 1273477 1408521 1294119 993654 590819 315473 211828 52942 -262565 -604993
15432 -604993 -830386 -899536 -904075 -1037724 -1307300 -1409977 -1189074 -848502 -692795 -730769
15422 -730769 -817148 -942806 -1069235 -1160527 -1306960 -1518584 -1594981 -1460124 -1272966 -1107625
15412 -1107625 -907358 -680198 -494486 -344631 -132051 186366 448834 585780 686319
15403 686319 783062 864991 885012 898335 965656 1038882 1104676 1173861 1211375 1179260 1095005
15392 1095005 1015682 917626 783454 775180 918428 946395 679981 299579 66001 -17187
15382 -17187 21038 236394 557204 841158 1109102 1391831 1564249 1476066 1174156 764816
15372 764816 294309 -115563 -344938 -374662 -257534 -39671 237316 469983 525844 333959
15362 333959 -71806 -490463 -705555 -698009 -569867 -325030 -13235 175499 190609 169469
15352 169469 232992 300375 201706 1555 -88893 23809 277486 452656 386077 191203
15342 191203 106465 194533 362182 502194 547156 478660 260731 -100279 -429109 -554324
15332 -554324 -512492 -365719 -104168 196416 397243 506445 554563 538821 450070 280489
15322 280489 49220 -233321 -568327 -871223 -1014717 -931020 -633158 -239548 852 -98367
15312 -98367 -474506 -841040 -944925 -748664 -348195 38655 280081 330910 216484 62620
15302 62620 17251 150528 410795 621028 621137 446271 210207 -30826 -283919 -489471
15292 -489471 -596269 -657404 -607205 -313114 133497 450711 442256 92448 -379105 -673652
15282 -673652 -692525 -629622 -741070 -961082 -1115563 -1163963 -1007556 -627711 -222580 73063
15272 73063 151775 -76544 -485411 -861131 -1149984 -1389890 -1497042 -1379753 -1110071 -818712
15262 -818712 -609060 -503966 -521230 -582911 -560606 -517444 -643445 -890013 -924642 -682600
15252 -682600 -411450 -302892 -464406 -872050 -1299075 -1512825 -1459203 -1300929 -1240787 -1299093
15242 -1299093 -1299605 -1213536 -1135950 -1041629 -897176 -674528 -391873 -140808 -4164 19640 28528
15231 28528 127859 294607 357633 266857 173235 212600 392674 599089 705631 699591 588673
15220 588673 457754 451014 538474 591761 588394 520344 405256 283038 115964 -66896 -158141
15209 -158141 -240544 -459483 -724253 -847183 -789899 -659176 -560615 -536061 -533317 -464412 -331882
15198 -331882 -211504 -143450 -170396 -317435 -419173 -306102 -30775 269696 492937 512142
15188 512142 292210 -74836 -509617 -903574 -1098234 -998442 -667045 -357594 -292128 -486807
15178 -486807 -859004 -1259856 -1526147 -1556965 -1338336 -912958 -397376 64445 417674 640631
15168 640631 752066 844140 891311 846686 779950 810934 920860 943689 744873 383050 21957
15157 21957 -106920 115083 466480 736110 917895 1027776 1044729 973315 908237 918997
15147 918997 892427 812121 740315 619089 443923 272551 162953 139732 151201 149443 234066
15136 234066 460887 690392 763780 720049 678637 669433 683396 688255 661368 635419 662429
15125 662429 800786 983457 1124615 1172197 1043114 740816 480363 438398 477288 438814
15115 438814 344956 217048 64137 -41897 -80648 -225233 -552286 -909378 -1171104 -1261508
15105 -1261508 -1158535 -959543 -816087 -776741 -789448 -764318 -634234 -391106 -119214 135093
15095 135093 342923 457228 517260 549544 496855 287896 -72205 -501634 -910045 -1167244
15085 -1167244 -1219541 -1147147 -1044344 -938787 -874193 -857166 -866116 -944140 -1060493 -1024386 -806562
15074 -806562 -627101 -627169 -728150 -782162 -798444 -795928 -745055 -652422 -573263 -614558 -798369 -1064527
15062 -1064527 -1346544 -1495603 -1348450 -908654 -409798 -142789 -148561 -248137 -300021 -318908
15052 -318908 -381810 -501196 -622797 -691858 -733265 -797628 -887357 -991911 -1132521 -1240577
15042 -1240577 -1215122 -1118229 -1052963 -964679 -745326 -458252 -270335 -265988 -369121 -462326 -528223
15031 -528223 -570975 -723449 -1067608 -1395504 -1525657 -1489159 -1411517 -1319121 -1131032 -813511
15021 -813511 -401352 985 246711 286118 210462 181347 252919 414905 645841 861974
15011 861974 956561 905217 701566 393397 108579 -121594 -260078 -228150 -25167 292544
15001 292544 569247 647238 515034 239918 -111212 -390847 -421238 -245737 -100191 -128489
14991 -128489 -295600 -471379 -622130 -766862 -876674 -962301 -1011332 -988113 -930442 -865799
14981 -865799 -747452 -560558 -348624 -133129 99672 308482 376879 269695 114845 31429
14971 31429 61862 178847 226410 101644 -80993 -204749 -289366 -286061 -172028 -39139 19359
14960 19359 27173 61579 97734 45883 -58732 -57468 43300 62933 -43636 -118739 -69057
14949 -69057 36150 115711 72084 -82121 -214638 -306936 -428945 -517706 -479642 -278474 -22206
14938 -22206 91237 55151 9732 -63517 -293491 -529209 -558089 -489053 -442412 -483015 -672643
14927 -672643 -876606 -852958 -469406 110791 657537 1041819 1189230 1139074 972044 766031
14917 766031 509493 166589 -198061 -428878 -469232 -422173 -319238 -113300 188153 519679
14907 519679 863564 1130156 1185550 1062857 913279 860165 958843 1122142 1244938 1295566
14897 1295566 1300444 1289675 1171639 855086 403879 15340 -80503 113345 426102 668614
14887 668614 782230 835320 917047 998010 937525 729153 523628 413304 305030 166310
14877 166310 135198 206391 213404 64954 -175164 -330295 -243168 42981 308387 438774
14867 438774 603566 898285 1215064 1417270 1447852 1388047 1304069 1116935 749360 355358
14857 355358 109146 -28717 -180018 -365362 -533468 -629997 -559800 -334960 -50201 143420
14847 143420 150298 45202 -71520 -59850 118264 318351 444677 475090 427789 265529
14837 265529 -11858 -153176 -29483 247003 478409 484458 303435 125189 37144 4025
14827 4025 -40690 -112695 -165272 -126765 25166 237886 442766 524507 459589 349513 277599
14816 277599 342762 531196 728552 825812 784421 644452 543288 500038 408110 292563
14806 292563 254714 290591 313423 323210 327148 295179 236980 126701 -91851 -357060 -589865
14795 -589865 -785252 -1009896 -1252791 -1424941 -1577810 -1710627 -1629207 -1319479 -999528 -811217
14785 -811217 -709988 -640080 -569608 -434324 -243552 -61036 91951 163223 40044 -337605
14775 -337605 -795381 -1074200 -1107951 -974784 -715038 -394355 -147425 -28595 50970 130117
14765 130117 265011 445872 563451 617472 585474 393880 86498 -161426 -225864 -240253
14755 -240253 -382438 -609377 -768198 -785123 -749808 -780047 -824830 -791253 -736497 -674180 -578865
14744 -578865 -484293 -433861 -412841 -334189 -159832 73366 185179 78627 -101822 -205499
14734 -205499 -234383 -271637 -388302 -586974 -738340 -725131 -642193 -643425 -735649 -882075 -1003883
14723 -1003883 -1014317 -854552 -605967 -461065 -504353 -546674 -448498 -345674 -327262 -277349
14713 -277349 -83434 257511 699883 1157815 1415278 1377057 1251630 1255573 1332765 1283809
14703 1283809 1056924 765204 533486 370877 230583 39379 -180183 -367523 -518438
14694 -518438 -606532 -588668 -450212 -237268 27830 281141 514489 848952 1332988 1823932
14684 1823932 2135653 2200465 2018033 1656750 1366193 1313456 1367657 1364044 1308131 1229885 1065257
14673 1065257 799110 578780 489686 474276 551610 774985 1033577 1117143 980498 731576
14663 731576 508411 493146 743408 1120748 1442269 1661217 1818200 1942395 2066060 2180213
14653 2180213 2330212 2519777 2644120 2672233 2663187 2670330 2651003 2613821 2662301 2878628 3240019
14642 3240019 3579725 3764081 3915664 4213464 4762389 5558121 6523240 7594517 8689156
14633 8689156 9894972 11563377 13873397 16692121 19974998 23758370 27700650 30701099
14625 30701099 31317625 29056898 24966589 20531289 16669550 13674717 11458451 9865564
14617 9865564 8732201 7858198 7053209 6141564 5052425 3953823 3079755 2532858 2254475
14608 2254475 2124429 2045013 1849606 1445418 1022706 806303 857486 1143712 1536179 1899189
14598 1899189 2145899 2296388 2408849 2419078 2298972 2180215 2158840 2191454 2175209 2090187
14588 2090187 1902754 1551181 1132734 789367 533520 403935 490701 681149 690389 441976
14578 441976 106310 -148602 -298569 -366967 -370701 -327368 -275790 -224389 -167246 -109429 -18983
14567 -18983 143462 346185 542942 673460 692070 597628 424860 266513 269051 446756
14557 446756 628241 670731 537368 303715 128922 79539 158086 248747 164864 -50733
14547 -50733 -231488 -313770 -279559 -175463 -72006 43319 251597 616201 962099 1043819
14537 1043819 859985 579476 276056 -97827 -465717 -678265 -755702 -822855 -961471 -1116636
14527 -1116636 -1221816 -1254840 -1207748 -1141284 -1072000 -962038 -806968 -602819 -391978 -234913
14517 -234913 -143819 -97700 -149337 -318907 -520714 -746948 -999740 -1139557 -1099428 -985458
14507 -985458 -842038 -616757 -337593 -209579 -327009 -515995 -630144 -693215 -774175 -818009
14497 -818009 -682099 -368929 -111431 -49198 -143545 -299919 -406197 -424475 -414100 -423458 -426199
14486 -426199 -361750 -279622 -223882 -193684 -225002 -339057 -518281 -669771 -772136 -811866 -762831
14475 -762831 -613710 -320713 87584 490818 698335 638841 400055 108292 -55357 41083
14465 41083 361857 804047 1201034 1363701 1196903 823890 439214 93398 -253699 -552834
14455 -552834 -675731 -561687 -311471 -143128 -134467 -73043 209270 567997 801668 766513
14445 766513 420979 -13449 -328631 -461227 -314036 68630 449289 725850 902065 968966
14435 968966 987680 989814 981024 936968 839271 706003 546117 361360 203751 167212 177610
14424 177610 51760 -181435 -422749 -606867 -720919 -880783 -1061077 -1026094 -687156 -187738
14414 -187738 225343 431333 520892 590370 636758 641790 594645 543524 521700 459976 365364
14403 365364 353855 408904 420454 406165 374817 359351 402759 456109 461928 488932 655499
14392 655499 915741 1091811 1110342 1037985 916634 721181 512845 387218 361154 272450
14382 272450 -88721 -718354 -1362878 -1796073 -1928935 -1788845 -1568529 -1339769 -1046360 -688378
14372 -688378 -320853 -77117 14845 123521 368784 678823 990909 1231790 1335073 1331505
14362 1331505 1231998 1008095 600726 115755 -223444 -335674 -311655 -254001 -111464 96306
14352 96306 183181 39639 -306132 -614337 -635849 -430199 -164340 138942 457035 764243
14342 764243 1015676 1161482 1181846 1061623 896221 855719 897262 850766 713211 588041
14332 588041 535004 552281 596302 638226 694712 717775 606617 433821 340825 339805 370823
14321 370823 329817 138539 -64120 -95925 19823 181031 440433 837378 1220219 1456519
14311 1456519 1591180 1585798 1300973 775175 217494 -259804 -627168 -763738 -608080 -302750
14301 -302750 -75340 -13312 -95240 -230200 -338631 -462889 -574616 -617689 -668489 -792533
14291 -792533 -910506 -892927 -718307 -479616 -256874 -101555 -43745 -46194 -92806 -126193 -49533
14280 -49533 138192 306668 344181 239824 -38670 -425958 -806116 -1104566 -1327251 -1498547
14270 -1498547 -1616368 -1655528 -1571029 -1373606 -1124811 -904075 -712559 -452300 -128276 167284
14260 167284 409561 606340 757445 844116 862746 877759 915310 876723 735140 599806
14250 599806 500406 311976 -964 -297004 -481699 -518691 -439683 -393630 -471185 -603822
14240 -603822 -775624 -938391 -964418 -905387 -900468 -971085 -976875 -876304 -812301 -868039 -953956
14229 -953956 -952138 -888628 -844523 -825249 -805214 -772816 -637508 -303539 79960 316824 432169
14218 432169 474077 383624 182669 17900 -13407 57605 90024 31268 -14226 -46844 -56217
14207 -56217 21268 166848 292688 260601 22776 -296830 -485693 -442760 -272948 -192418
14197 -192418 -270722 -376788 -376702 -242686 -120655 -121363 -228153 -377037 -464788 -469456 -558553 -845746
14185 -845746 -1243742 -1582959 -1764948 -1802807 -1710580 -1548965 -1374112 -1233372 -1220063 -1343740
14175 -1343740 -1519385 -1647806 -1653583 -1537640 -1412488 -1435131 -1585503 -1641119 -1449166 -1059713
14165 -1059713 -722208 -641642 -748547 -819416 -704111 -425575 -128470 89236 295142 626678
14155 626678 992823 1137043 980833 686433 420861 322635 390057 437247 391603 336481
14145 336481 340883 375696 383353 305986 135146 -57756 -141857 -35983 145002 285567 452127
14134 452127 670121 851286 918140 882723 876765 922383 834105 584988 286681 -72661 -445487
14123 -445487 -740970 -847391 -622194 -167437 272119 601910 761460 733965 633892 612236
14113 612236 571939 414136 247019 192712 212186 208146 187244 140163 27975 -154810 -382946
14102 -382946 -531564 -538974 -484617 -435786 -496893 -704002 -859383 -851182 -823290 -880279 -923588
14091 -923588 -783356 -470309 -167882 30626 183792 337551 508980 650827 683642 650686
14081 650686 597566 543865 505444 378980 151919 -42698 -69405 70408 171725 58171
14071 58171 -226549 -483583 -661319 -826246 -1004803 -1268301 -1629493 -1894842 -1866043 -1591751
14061 -1591751 -1256678 -993925 -810297 -721726 -815395 -981322 -978497 -861585 -793539 -804942
14051 -804942 -881250 -988454 -1029583 -905099 -710688 -582553 -494400 -369117 -310439 -426099
14041 -426099 -508387 -363122 -102982 104374 230161 264007 148460 -99123 -322822 -393322
14031 -393322 -312144 -186360 -50127 132240 244843 185697 63269 -70615 -253468 -404273
14021 -404273 -395517 -296149 -266456 -366187 -559184 -756453 -993443 -1337875 -1669638 -1812965
14011 -1812965 -1760536 -1679577 -1698637 -1713060 -1600253 -1436914 -1229700 -896915 -565721 -464477
14001 -464477 -505621 -465426 -300402 -95478 7209 -68658 -257510 -473272 -727577 -956183
13991 -956183 -1036735 -1029377 -1035934 -955206 -711876 -471228 -333998 -200033 -64488 -74654 -194051
13980 -194051 -269222 -223608 -6873 248392 291373 230325 317783 556299 808938 953996
13970 953996 1001456 992494 826723 526239 244975 21192 -127439 -82673 175606 499973
13960 499973 757953 846279 655980 282451 -74883 -335132 -440868 -468070 -614181 -870212
13950 -870212 -962697 -708782 -248619 158037 393144 422240 316670 246015 258287 285128
13940 285128 293097 294131 321944 451321 733462 1027031 1111369 993217 774218 457406 -13379
13929 -13379 -522676 -890457 -1115452 -1169714 -933916 -428789 120140 577327 863771 904756
13919 904756 788982 772281 952703 1148649 1237712 1231059 1152360 940163 522373 57885
13909 57885 -167200 -9946 378082 724478 853203 808250 794302 854399 911444 946663 971689
13898 971689 984729 932360 846143 872844 984593 1034139 944545 748204 570227 501374 472066
13887 472066 377649 234422 145339 70400 -28481 -149050 -393777 -795948 -1134466 -1192560
13877 -1192560 -1056525 -934996 -913665 -876879 -751399 -624240 -647260 -836185 -985426 -1006522
13867 -1006522 -947006 -783040 -582463 -468608 -391786 -238355 -78638 -69119 -205000 -326215
13857 -326215 -354300 -358936 -443348 -566334 -600990 -505632 -311571 -70716 90931 86216 -20057
13846 -20057 -98685 -84627 10517 124397 160198 30350 -241427 -542229 -798658 -989674
13836 -989674 -1098234 -1075098 -836445 -375866 115792 446734 642925 816661 967163 1061442
13826 1061442 1093457 1073548 1036508 1003839 987801 963373 863551 751349 729808 764359 751754
13815 751754 688996 686530 761825 844122 855654 823037 763551 657963 459450 167718 -133383
13804 -133383 -364832 -506248 -571386 -605257 -660287 -653175 -501727 -311827 -196476 -212645 -387316
13793 -387316 -621652 -789203 -902457 -1020523 -1089333 -1075217 -1024574 -975915 -936060 -963103 -1048191
13782 -1048191 -1088728 -1039237 -891204 -722145 -680236 -779204 -910235 -971361 -937920 -985953 -1281704
13771 -1281704 -1651934 -1828206 -1757967 -1532597 -1212044 -809870 -425154 -157025 20418 194210
13761 194210 354827 406839 325452 146853 -46722 -175807 -285748 -444425 -614437 -760380
13751 -760380 -907260 -1033049 -1088915 -1057786 -923612 -732855 -562780 -449987 -415658 -418266
13741 -418266 -470223 -532058 -410909 -99412 209130 412903 539898 607554 566084 442778
13731 442778 408456 565436 798578 959263 946234 734028 454778 236857 124262 107022
13721 107022 150052 232472 281008 250106 178598 65808 -32340 -95972 -111520 -65357 -10194
13710 -10194 64503 149570 170877 104506 53916 67634 -13864 -192864 -294405 -321364 -323738
13699 -323738 -251735 -77447 141483 305165 403018 446659 479811 566293 675822 675594 447380
13688 447380 60748 -252531 -355639 -263881 -11044 307874 444864 265156 -115470 -437853
13678 -437853 -508136 -322113 42168 402233 578322 626392 566511 257934 -247053 -665169
13668 -665169 -783537 -630265 -356924 -67823 207997 376838 309448 95717 10793 162523
13658 162523 432145 626860 647348 594402 563710 594468 733369 878453 900307 848886 778089
13647 778089 572925 248970 -7926 -109579 -181615 -336783 -562425 -747751 -739659 -503699
13637 -503699 -206247 12509 167678 272006 331335 357271 307646 160841 -47930 -223839
13627 -223839 -276596 -226195 -225968 -367875 -539244 -521478 -323235 -161214 -147322 -275540 -425484
13616 -425484 -451614 -384716 -312057 -279409 -270970 -278751 -338657 -448558 -592048 -699621 -604992
13605 -604992 -281549 55912 217596 217129 146617 53201 -54359 -158437 -182089 -126146 -7455
13594 -7455 98707 103693 115539 231552 329719 297955 104617 -217137 -579879 -939534 -1268312
13583 -1268312 -1532083 -1735489 -1873165 -1866285 -1676532 -1467860 -1379478 -1383994 -1352460 -1161565
13573 -1161565 -837092 -493035 -208607 -31950 50602 -31530 -292861 -581796 -761954 -770482
13563 -770482 -633333 -485844 -377389 -295587 -319135 -491616 -723227 -938999 -1120536 -1227543
13553 -1227543 -1241845 -1207837 -1193829 -1288697 -1506144 -1679452 -1692952 -1623451 -1560576 -1553691 -1649123
13542 -1649123 -1745020 -1635054 -1309230 -1004970 -894187 -948838 -1010452 -915528 -694483 -554831
13532 -554831 -616930 -827140 -1001504 -980939 -769988 -471332 -207278 -121525 -224420 -365267
13522 -365267 -501844 -667833 -803630 -848447 -862836 -932684 -1025537 -1096550 -1146015 -1160423 -1190121
13511 -1190121 -1299466 -1465555 -1558647 -1490046 -1323144 -1109585 -849558 -614287 -498017 -396204
13501 -396204 -166925 101448 238821 186567 -5060 -282872 -509024 -598899 -596428 -491256
13491 -491256 -292638 -146452 -146563 -218646 -262405 -241583 -211528 -197711 -77908 218905 578431
13480 578431 841110 945374 935507 929029 934961 898392 880583 963049 1149984 1399571 1581762
13469 1581762 1545555 1372951 1228797 1162347 1155226 1127568 958535 688619 525542 590461
13459 590461 754100 815857 769915 709489 637728 588290 575853 550032 575778 788371 1184033
13448 1184033 1563732 1629566 1378789 1033318 776947 674808 661527 661404 708979 790670 789105
13437 789105 674727 530099 439680 394530 365915 329512 261191 175379 108019 19717 -242859
13426 -242859 -626516 -842784 -785702 -767562 -990018 -1260774 -1417424 -1450549 -1335096 -1054322
13416 -1054322 -703788 -394702 -250305 -256510 -238747 -178991 -135590 -121172 -181992 -291151 -430913
13405 -430913 -581812 -648195 -593057 -554222 -568924 -493348 -253219 47748 278669 453055
13395 453055 583294 659624 710294 746010 749316 728237 672911 550783 363698 188745 56866
13384 56866 -57158 -140199 -141755 -23588 70560 45179 5487 12438 63870 128254 145700 103185
13372 103185 50138 46327 96765 175669 318805 514685 613369 520602 361951 223731 98624
13361 98624 318 -103679 -182347 -163447 -93471 -76451 -64133 24836 87178 82018 135653 278975
13349 278975 396761 395308 315057 267001 409330 762822 1148208 1389201 1420899 1279713
13339 1279713 1074221 977477 1039856 1211684 1423913 1587451 1575611 1415914 1269565 1155402
13329 1155402 976843 711479 523950 572227 778294 894905 747682 361598 -43044 -234866
13319 -234866 -193986 -6678 298695 658308 959661 1146530 1183515 1099631 1053646 1082715
13309 1082715 1143800 1280241 1479374 1595826 1546392 1479648 1578425 1834730 2012864 1968857
13299 1968857 1908940 1995216 2135470 2277563 2482769 2678908 2706807 2604861 2485710 2351847
13289 2351847 2192239 2073048 2088814 2218558 2353307 2394869 2278773 1987907 1549995 1100475
13279 1100475 803271 711306 788306 908804 947968 905111 871382 886240 936195 1050909 1262480
13268 1262480 1515743 1723700 1834486 1852717 1850451 1872753 1849261 1786830 1754558 1838751 2073212
13257 2073212 2272507 2262867 2138709 1985670 1863136 1965039 2283709 2567996 2650792 2546055
13247 2546055 2341270 2071680 1747685 1413456 1119862 888449 758329 747610 773526 764988
13237 764988 708922 587646 407734 258493 240150 388844 654688 936295 1219065 1464062
13227 1464062 1639797 1810561 1969539 2075635 2112400 2014090 1779336 1507596 1349277 1376178
13217 1376178 1524804 1713005 1807790 1767974 1725671 1745588 1818955 1929317 2025412 2042334 1898942
13206 1898942 1627061 1307963 1032102 885469 859270 967537 1168531 1246034 1141977 934814
13196 934814 667164 368050 130584 15020 -52018 -83957 34154 309535 656000 1070705
13186 1070705 1486890 1843146 2077788 2109706 1942357 1690960 1461423 1288716 1203258 1219528
13176 1219528 1355217 1581981 1752722 1717312 1555614 1395726 1204008 1027053 973977 1007924
13166 1007924 1088232 1185631 1194571 1100578 981156 879271 808104 773503 814350 916020 992411
13155 992411 1064943 1204175 1411515 1581905 1635038 1614290 1565861 1435894 1253625 1198952
13145 1198952 1316973 1507872 1734230 1934181 1946821 1687921 1297449 980650 873208 947016
13135 947016 1049081 1037656 889359 785812 785520 818489 987033 1311862 1584330 1689859
13125 1689859 1699651 1762480 1992643 2294303 2500143 2584554 2618145 2658420 2678962 2623631 2576071
13114 2576071 2566335 2525962 2478961 2436505 2321975 2066854 1806998 1749607 1901718 2096436
13104 2096436 2280718 2476062 2594966 2608635 2570002 2520197 2472482 2406953 2387665 2389200 2250311
13093 2250311 1978965 1753392 1689101 1747037 1885977 2071560 2210487 2292716 2484738 2897532
13083 2897532 3425166 3845483 4038899 4047083 3928906 3799524 3732652 3719652 3716991 3648166 3469740
13072 3469740 3244313 3030591 2834355 2735705 2838349 3079517 3307628 3476931 3728859 4160356
13062 4160356 4625706 4872408 4763162 4432553 4089448 3812174 3669362 3745593 4061904 4467040
13052 4467040 4814243 5121960 5413144 5622591 5743687 5819754 5854638 5872430 5928749 6070911
13042 6070911 6368137 6732873 6956966 6985069 6958441 6992922 7067010 7173567 7348640 7575629
13032 7575629 7793112 8034627 8289191 8511966 8780086 9189310 9713762 10265061 10760638
13023 10760638 11227103 11743252 12369550 13121179 13873437 14444609 14818955 15172685 15643161
13014 15643161 16228497 16932778 17738027 18588557 19484242 20400709 21284771 22126776 23057760
13005 23057760 24197468 25424360 26640918 27943340 29370345 30930872 32728086 34818827
12997 34818827 37229451 39973130 43009795 46287113 49862122 53802445 58141586 62950874
12989 62950874 68255738 74160478 80933635 88691632 97429150 107289107 118474146 131228743
12981 131228743 145913879 163051105 183264342 207246545 235759964 269329110 307200518
12974 307200518 345904953 378078751 393661941 385511886 355317500 312452210 267121565
12967 267121565 225729824 190722462 162106728 138891526 120027423 104604376 91859954
12960 91859954 81279883 72518084 65291349 59321017 54222565 49602963 45353700 41598017
12952 41598017 38447534 35995652 34232151 32911994 31722838 30530967 29368483 28273044
12944 28273044 27241145 26253299 25341501 24617582 24203726 24031062 23871264 23651530 23478570
12935 23478570 23426226 23519868 23655874 23709674 23724341 23775435 23954223 24381895 25148300 26246394
12925 26246394 27585102 29018396 30484370 32054362 33686097 35305575 36989415 38909868
12917 38909868 41212800 43973143 47062595 49999399 52230451 53557239 54238540 54742718
12909 54742718 55460135 56683169 58541115 60910064 63686507 66960510 70963766 75881217
12901 75881217 81665934 88224709 95613427 104119284 114078564 125650493 139020578 154538329
12893 154538329 172706333 194234900 219886416 250270037 285582383 324659300 363032940
12886 363032940 391720689 400144968 383336013 346411397 300457294 255050978 215031911
12879 215031911 181565493 154308583 132431508 114845972 100527289 88650908 78724711
12872 78724711 70525640 63724059 57916191 52930375 48702148 45089614 41865537 38852643
12864 38852643 36012506 33448481 31281244 29442278 27783334 26255803 24993401 24095951
12856 24095951 23429474 22896504 22551081 22381077 22264951 22148967 21995085 21786585 21599329
12847 21599329 21430149 21215534 21026931 20986875 21087492 21242520 21405023 21589807 21886341
12838 21886341 22318852 22823301 23447731 24353326 25535316 26802824 27982244 29065985 30196261
12829 30196261 31478799 32972096 34654793 36392011 38098835 39899353 42084362 44732981
12821 44732981 47692967 50986007 54721959 58960425 63658776 68748861 74303904 80517403
12813 80517403 87642829 95791908 104982557 115356932 127257309 141126373 157404157
12806 157404157 176469928 198888838 225454714 256856517 292967655 331651933 367263757
12799 367263757 390251454 391237011 368093023 328023585 281921470 237960665 199835153
12792 199835153 168310980 142775585 122118375 105264807 91382254 79857391 70226271
12785 70226271 62234174 55627019 50034114 45135656 40748244 36832613 33496411 30790674
12777 30790674 28572810 26596205 24701054 22904989 21329038 19963202 18690596 17463148
12769 17463148 16276581 15132375 14028727 13014191 12206415 11618863 11181156 10744826 10190638
12760 10190638 9646581 9341646 9262074 9129481 8702374 8003495 7339369 6959273 6794446
12751 6794446 6622996 6344580 6071356 5953549 5980542 6118202 6315940 6459423 6525234 6545715
12741 6545715 6411149 6112835 5804281 5524642 5208637 4815836 4426012 4206624 4205376 4294493
12731 4294493 4318280 4176897 3866419 3510844 3165889 2797849 2486272 2316728 2339916 2524279
12721 2524279 2724765 2826772 2787642 2647070 2485150 2317799 2145476 1995767 1899666 1843798
12711 1843798 1728820 1504715 1239694 1033009 960427 1022722 1135168 1216811 1289977 1397877
12701 1397877 1571372 1800078 1992952 2132074 2274463 2371670 2336316 2204926 2102075 2063618
12691 2063618 2025966 1939864 1817237 1717916 1683060 1705069 1748003 1753237 1793361 1877053 1910455
12680 1910455 1897137 1808809 1677447 1541797 1362654 1164828 928817 685319 583208 608044
12670 608044 597525 434510 158191 -143671 -427547 -637382 -641839 -410587 -36847 417834
12660 417834 789143 1010628 1121259 1114373 1043122 871447 565484 313639 282170 395337
12650 395337 456081 309140 -46560 -443681 -755720 -1006263 -1171289 -1177164 -996759 -668568
12640 -668568 -274863 141418 559752 908155 1154241 1352765 1562128 1829442 2163420 2504005
12630 2504005 2826525 3103095 3326305 3555888 3849706 4281479 4949306 5747839 6462772
12621 6462772 7055553 7501776 7694839 7635401 7374236 6890762 6237091 5589875 5025652 4473862
12611 4473862 3903960 3434705 3117108 2924977 2812417 2689034 2555996 2452095 2330560
12602 2330560 2118108 1804385 1475436 1307429 1366715 1458209 1453868 1502631 1702733 1888303
12592 1888303 1847573 1558541 1154781 871383 844467 899960 879934 794959 672277 577445
12582 577445 552040 570509 590218 598119 608622 652738 828284 1124403 1353293 1436248 1446726
12571 1446726 1449033 1421941 1294799 1185608 1157537 1132683 1181847 1373223 1598108 1631259 1431652
12560 1431652 1188625 998096 874708 917945 1126802 1347748 1422934 1366001 1328605 1322934
12550 1322934 1280691 1190454 1078808 1057126 1158301 1270868 1306946 1268483 1164597 966130
12540 966130 577877 116474 -158450 -173334 -19737 141392 238341 277302 255812 233848
12530 233848 316315 525583 734963 802751 781490 822409 924003 997703 1023273 1055035 1111012
12519 1111012 1107768 990583 895446 1029039 1282340 1418062 1396141 1323778 1287123 1198076 979389
12508 979389 768294 716432 833618 1037498 1199347 1222216 1112507 974632 959493 1149946
12498 1149946 1437652 1577143 1416756 1122617 926176 783055 620537 585237 739906 848804
12488 848804 750014 510590 249270 67249 -21432 -20482 56513 236572 493681 654995 735110
12477 735110 886380 1005266 1019687 1072569 1154041 1205331 1382620 1692971 1860086 1736586
12467 1736586 1440960 1120881 879620 775951 817818 957294 1103807 1245121 1343387 1250492
12457 1250492 961194 656011 405091 139240 -180170 -381224 -230635 255553 793376
12448 793376 1108285 1210019 1236838 1241697 1248426 1298630 1382294 1412848 1320939 1143122 1013354
12437 1013354 1103172 1479115 1923900 2137240 2091587 1946094 1829236 1772411 1756200 1731049
12427 1731049 1611942 1363787 960441 463672 43838 -182949 -94749 350253 901794 1224985
12417 1224985 1226763 1101188 986201 836800 650976 569698 618076 685425 785337 944663
12407 944663 1104534 1201266 1207100 1098973 917150 773916 743966 845339 1004293 1110499
12397 1110499 1137032 1154124 1172535 1084246 848891 478724 80001 -150139 -173634 -149777
12387 -149777 -162084 -135650 -79087 -54499 -96706 -161838 -192555 -204629 -242739 -372206 -557742
12376 -557742 -630254 -521177 -348159 -235453 -236224 -316887 -353710 -309888 -233281 -90789 96791
12365 96791 229134 251260 256193 292022 302292 260661 125167 -93898 -234767 -135287 173269
12354 173269 527844 809255 923126 864351 705490 505059 364920 360287 421676 414482 315237
12343 315237 202631 207156 363074 581228 729435 754473 782621 972402 1268716 1493677
12333 1493677 1537795 1413953 1189026 918048 589523 237913 -39490 -157966 -30303 238651
12323 238651 445130 555899 636036 722174 829543 842162 746692 726934 856481 1047499
12313 1047499 1189245 1302141 1487933 1805987 2232996 2562412 2551667 2285497 2024409 1796503
12303 1796503 1421425 935523 567251 498047 838307 1443512 1919463 2143496 2284211 2465136
12293 2465136 2633745 2652579 2506533 2270827 2074302 1983370 2043469 2326805 2737956 3136778
12283 3136778 3592439 4167868 4771673 5243600 5628450 6129672 6760585 7419788 8181048
12274 8181048 9301670 10905409 12793727 14684723 16604351 18943104 22068131 26037395
12266 26037395 30588861 34976935 37560661 36663161 32535190 27086601 21961920 17820477
12258 17820477 14645424 12233430 10445968 9121159 8052597 7120313 6367927 5790300
12250 5790300 5279264 4865859 4505992 4045238 3474968 2885979 2424510 2233708 2356347
12241 2356347 2735275 3162896 3461882 3648140 3745911 3714775 3527903 3210106 2812790 2403572
12231 2403572 2064481 1756826 1420750 1167780 1013034 800734 500451 208242 12702
12222 12702 -82569 -116403 -61209 70681 156738 54749 -159407 -294627 -344797 -345965 -298481
12211 -298481 -281203 -300147 -326935 -402802 -544358 -659315 -651376 -582444 -545389 -488996 -320865
12200 -320865 -35142 284964 534420 646501 553170 288921 17573 -57222 134205 426262
12190 426262 617745 688128 772721 939192 1149397 1313330 1405506 1527740 1683101 1799519
12180 1799519 1834339 1821637 1871071 1992989 2040763 2013439 2047964 2131312 2194457 2204843 2100599
12169 2100599 1861553 1602974 1423635 1309324 1206515 1140547 1223897 1437893 1583849 1496478
12159 1496478 1245032 1062972 976176 749053 280807 -227410 -551687 -625842 -540296 -469029
12149 -469029 -398802 -207691 19008 144992 225411 339617 455133 607425 782677 773658
12139 773658 512277 241890 239577 420843 542771 575996 579922 517725 395909 338185 438814
12128 438814 659720 847052 921210 927377 960049 1020385 999933 867048 698978 577596 513416
12117 513416 458155 372953 315862 367625 482748 595679 735856 810868 690930 515402
12107 515402 394680 226918 -22549 -260681 -382978 -280210 -10062 321004 710645 1128801
12097 1128801 1505079 1809396 2040958 2149011 2089072 1830205 1398442 975848 713424 663741
12087 663741 759889 818846 745001 564210 390452 210295 20713 -39370 81880 280190
12077 280190 468077 589793 605750 588274 686945 921777 1145536 1263431 1351591 1480254
12067 1480254 1631599 1684260 1576738 1359440 1100075 842141 575582 358452 236331 95123
12057 95123 -146384 -443678 -716710 -816191 -665503 -381497 -118141 90577 347895 685708
12047 685708 920262 898025 628451 209662 -182762 -434813 -539636 -492033 -374956 -321085
12037 -321085 -348166 -436020 -624417 -901002 -1116593 -1126928 -979373 -807997 -690799 -608152
12027 -608152 -477763 -415779 -510850 -647478 -790228 -943561 -1065035 -1116372 -1136239 -1176375
12017 -1176375 -1173263 -1022923 -769735 -484006 -195092 -947 105063 203899 238002 88122
12007 88122 -185676 -360402 -382782 -343589 -362138 -506381 -692520 -826846 -903078 -921188 -929170
11996 -929170 -1026282 -1170170 -1190332 -1075882 -900586 -757455 -628765 -429749 -168891 26061
11986 26061 69837 17896 -56509 -167603 -267048 -241971 -174944 -198220 -234721 -191426 -139061
11975 -139061 -142313 -150282 -133153 -114097 -98904 -34148 98527 272870 494753 656552 631479
11964 631479 574015 675823 836861 929059 897578 799718 802024 859663 863886 827194 665685
11953 665685 378026 188059 203476 332271 483613 582681 591214 536014 373995 50763
11943 50763 -318714 -496591 -437615 -287384 -176599 -182596 -241312 -323473 -394968 -380593 -302568
11932 -302568 -164820 57919 287184 401192 387701 353850 306599 201412 157791 244776
11922 244776 367164 459502 524782 636210 846268 1041639 1058005 836567 497429 162540
11912 162540 -133945 -419323 -766574 -1127302 -1345975 -1323679 -1093719 -821196 -608429 -459794
11902 -459794 -349117 -242095 -151527 -97713 -74285 -52789 -10667 11806 -108636 -344857 -536007
11891 -536007 -572429 -472235 -320827 -173872 -2724 256740 587997 936547 1238959 1404372
11881 1404372 1418671 1385866 1375042 1332994 1202584 988454 729014 438433 213006 157213
11871 157213 194265 286722 475199 687914 826541 818028 675316 464670 210090 25826
11861 25826 13798 82049 69344 -44852 -94347 101483 402898 518550 385239 202921
11851 202921 141098 191680 241401 219672 151798 -39848 -430882 -907386 -1249274 -1355906
11841 -1355906 -1323537 -1231958 -1029799 -742400 -543087 -470733 -406374 -319782 -239655 -185150 -207662
11830 -207662 -383239 -680538 -905920 -1001393 -1065926 -1111812 -1123389 -1065425 -863974 -611736
11820 -611736 -500918 -543492 -567468 -489848 -318813 -43844 237157 409127 450688 423231
11810 423231 413601 408884 376129 405911 481593 516870 561560 663644 706187 539738 233414
11799 233414 -19303 -171227 -264971 -294808 -245265 -139762 1386 143980 233484 222074
11789 222074 171484 204998 303629 315688 176342 -80886 -342019 -461317 -425076 -335328 -236339
11778 -236339 -169077 -201343 -333913 -543607 -801554 -1045170 -1170756 -1040298 -751110 -494438
11768 -494438 -326564 -233623 -156772 -118379 -149897 -282699 -443004 -439010 -159663 445987 1309651
11757 1309651 1970860 2138716 2015099 1809810 1542604 1206719 915138 783008 729064 628296
11747 628296 465463 252623 14114 -212014 -394700 -537185 -586240 -489324 -368649 -335872
11737 -335872 -333467 -319075 -331128 -397871 -452561 -461143 -463494 -428582 -279715 -180790 -340706 -640853
11725 -640853 -859794 -872793 -624765 -252798 5158 56397 -78298 -270068 -357531 -295504
11715 -295504 -133188 20096 90810 106356 95065 -24326 -291360 -564663 -700449 -658048
11705 -658048 -546666 -555764 -695067 -770403 -720145 -655046 -627150 -643478 -694146 -650330 -408375
11694 -408375 -66691 145938 113416 -77071 -252680 -344167 -403741 -500658 -620767 -667520
11684 -667520 -606694 -464341 -212155 133905 422059 576395 596404 566176 623776 756886
11674 756886 903170 1072176 1252964 1441103 1549714 1402785 1037239 594348 169351 -218441
11664 -218441 -493465 -523674 -351177 -160963 -121551 -263859 -445205 -572337 -662712 -667615
11654 -667615 -568288 -465656 -325546 -61995 185224 226823 66419 -146485 -257862 -188786
11644 -188786 16136 228651 300504 211905 91751 -20212 -208042 -422053 -496806 -395350
11634 -395350 -202024 -724 61657 -142449 -497413 -848691 -1151981 -1210735 -925116 -502021
11624 -502021 -39463 426883 671933 667584 631615 655828 660857 586821 442530 224582 -6203
11613 -6203 -118344 -109456 -34184 88247 220990 397520 623241 862164 1058612 1173457
11603 1173457 1210105 1155178 1046647 988116 951257 820543 546704 209282 18526 105961
11593 105961 367389 577942 607101 461909 193991 -44387 -122443 -69242 13891 59516
11583 59516 121415 247324 417381 528042 567248 653443 770336 740737 476451 102018
11573 102018 -203677 -467614 -770650 -1047654 -1191552 -1286080 -1422721 -1532963 -1639209 -1772230
11563 -1772230 -1852428 -1891402 -1904888 -1859802 -1768668 -1724986 -1833874 -2048810 -2194927 -2137838 -1856074
11552 -1856074 -1421517 -982313 -686970 -559225 -458358 -224018 154678 563960 950898
11543 950898 1267640 1406899 1339566 1118936 814574 523903 294135 91722 -112036 -314029
11533 -314029 -494773 -570818 -521800 -502901 -535946 -476046 -286898 -66351 112240 211423 202171
11522 202171 68393 -201305 -498990 -659428 -617218 -498117 -507465 -626762 -652817 -517075
11512 -517075 -302240 -48947 272987 553007 616178 540620 507528 527418 511266 412264 291537
11501 291537 192693 124861 76070 29196 -10734 8392 76632 136448 191729 214809 204399
11490 204399 174958 101498 35467 48079 47894 -19871 -68318 -65083 -85850 -206441 -348859 -402051
11478 -402051 -455474 -546090 -526239 -310242 40264 448724 815960 1063038 1185908 1267951
11468 1267951 1261934 961291 275687 -525470 -979151 -1058194 -1060936 -1069232 -1114056 -1273797 -1478418
11457 -1478418 -1677670 -1863717 -1881801 -1729689 -1566349 -1312440 -886981 -436105 -90944 180054
11447 180054 463929 752731 896678 830918 669118 568055 578766 688941 897879 1121073
11437 1121073 1140047 889526 463373 37465 -205170 -299808 -402174 -476131 -420215 -303034
11427 -303034 -286319 -404055 -556761 -645053 -564888 -282739 31840 169988 96358 -46968
11417 -46968 -151441 -239051 -284355 -226252 -118346 -96296 -218321 -315002 -141025 264591 614630
11406 614630 670891 436687 224553 296061 579206 840229 906717 854995 776389 546117
11396 546117 118979 -349972 -679041 -893908 -1106309 -1286412 -1293519 -1071274 -714832 -335914
11386 -335914 61512 443161 710807 833489 828250 724507 515483 226366 -101090 -342845
11376 -342845 -538887 -830898 -1075988 -1151751 -1166523 -1164432 -1086512 -997185 -970647 -864678 -600340
11365 -600340 -303493 -35316 201313 354799 471969 610488 756079 882736 904141 837266
11355 837266 805417 795207 718553 619765 546466 465590 384067 399738 549540 827705 1159243
11344 1159243 1363707 1346101 1202456 1081516 1071678 1183829 1329014 1392932 1386463 1407688 1516417
11333 1516417 1719580 1961280 2172946 2333993 2399120 2335578 2210602 1988728 1564490 1041287
11323 1041287 652130 467648 305654 34717 -228938 -412967 -559897 -702958 -866439
11314 -866439 -1057931 -1234125 -1322764 -1304544 -1181188 -1030383 -952192 -983450 -1132514 -1274393
11304 -1274393 -1247344 -1082617 -800581 -395014 -34366 139690 117670 -15459 -142704 -157578
11294 -157578 -29442 239421 567150 757792 639198 298541 50342 87226 247980 302571
11284 302571 207993 33903 -91181 -89413 -53295 -61309 -23372 121868 339257 531888 624345
11273 624345 594946 493678 445442 388280 222704 37196 -83241 -97994 5970 180125
11263 180125 314940 355478 308978 133856 -189783 -476589 -478877 -199734 162901 342001
11253 342001 241137 -20358 -225114 -235799 -61751 146173 176227 -19118 -303978 -543377
11243 -543377 -727829 -985836 -1271934 -1426490 -1471771 -1403479 -1258398 -1187902 -1246352 -1342485
11233 -1342485 -1400136 -1379469 -1266535 -1093683 -884062 -606377 -305853 -6452 268149 425883
11223 425883 482309 437482 211893 -149624 -495196 -653632 -573292 -355203 -145944 -59453
11213 -59453 -17803 95121 194492 128089 -124176 -491861 -799116 -941548 -943104 -833761 -668192
11202 -668192 -516353 -444881 -480630 -638514 -920071 -1272714 -1565487 -1668573 -1492120 -1084129
11192 -1084129 -608615 -191984 87406 304614 554566 811801 1070889 1277443 1367248 1302294
11182 1302294 996710 495004 -83682 -591068 -981618 -1234225 -1226957 -932350 -448667 109087
11172 109087 585503 819101 764778 539232 342879 272979 303696 383512 485030 447586
11162 447586 204482 -19800 -107606 -92333 -27809 -31545 -158529 -308489 -379794 -431355 -472455
11151 -472455 -423986 -282184 -110442 67517 244714 423178 578891 627431 509148 220465
11141 220465 -40957 -92560 44873 369620 793019 1031925 1020207 943385 953513 1042058
11131 1042058 1066371 985677 897718 903487 1019991 1112208 1065202 986547 933081 827963 685965
11120 685965 570301 584906 744027 921967 981237 856386 575201 166124 -296099 -702932
11110 -702932 -955046 -1054550 -1100172 -1083620 -996737 -888771 -719998 -416132 -115757 20574
11100 20574 -13042 -87796 17032 297900 500274 474633 281516 27531 -216202 -432427
11090 -432427 -629356 -837290 -1001986 -964748 -676433 -252301 75709 190867 205534 228208
11080 228208 305167 439424 536038 430581 79744 -336651 -632290 -783912 -796780 -733139
11070 -733139 -713134 -802917 -879939 -769771 -482538 -68978 379923 782157 1134218 1324532
11060 1324532 1210100 857812 492875 270126 147544 31235 -123752 -370122 -741716
11051 -741716 -1183781 -1537339 -1715455 -1714742 -1600087 -1511016 -1552064 -1727660 -1888782 -1865204 -1736866
11040 -1736866 -1695376 -1746475 -1841092 -1944748 -1986203 -1891980 -1655838 -1405974 -1218846 -1114567
11030 -1114567 -1058656 -937527 -702166 -435656 -301062 -328669 -368058 -306670 -259326 -407797
11020 -407797 -705966 -929259 -986625 -865041 -570206 -242139 2700 102445 527 -262587
11010 -262587 -547116 -751194 -889658 -982736 -1000288 -908678 -697463 -431018 -166095 131522
11000 131522 458987 688831 727485 656160 620677 687906 808842 849743 764174 656226 557854
10989 557854 330917 8234 -240750 -394871 -498304 -486525 -356323 -228086 -117995 -755
10979 -755 139543 301927 354048 268436 167257 136257 192226 211885 67781 -211484 -469509
10968 -469509 -645709 -767920 -798038 -684010 -378880 39190 360395 480278 471803 399245
10958 399245 276923 65463 -302757 -716407 -1013059 -1185378 -1283406 -1310042 -1264521 -1137915
10948 -1137915 -901220 -592457 -213295 260557 705847 955970 1059206 1148472 1168974 1016747
10938 1016747 748184 477008 324713 328405 403609 482891 521493 412853 88294 -378168
10928 -378168 -826770 -1123611 -1219288 -1185164 -1080250 -917194 -770543 -746217 -836256 -991432
10918 -991432 -1131047 -1094612 -919940 -840670 -956511 -1151523 -1258959 -1281783 -1274847 -1279726 -1359820
10907 -1359820 -1498100 -1651232 -1772085 -1753788 -1558418 -1322502 -1149973 -1006426 -922095 -905379
10897 -905379 -848949 -742142 -628720 -527105 -496720 -671565 -1097558 -1548647 -1708579 -1493877
10887 -1493877 -1076799 -702788 -528024 -530182 -510229 -407715 -298127 -217171 -175913 -246293
10877 -246293 -463538 -701299 -858766 -949664 -960574 -863401 -759397 -765521 -832788 -859821 -836289
10866 -836289 -828953 -870158 -874197 -770215 -566490 -358924 -183348 66581 417355 773657
10856 773657 1006738 1010843 841567 685644 668259 693793 620322 422888 48435 -435016
10846 -435016 -730812 -782096 -798522 -819536 -740739 -555133 -369080 -254248 -131379 28722
10836 28722 117124 143077 214779 340391 403252 357899 279771 284146 404453 543430 554850
10825 554850 423661 255435 192511 295978 382608 355994 331925 304312 219209 74176 -95221
10814 -95221 -323465 -717845 -1190959 -1489311 -1522186 -1411764 -1317676 -1273672 -1194835 -1085721
10804 -1085721 -1028378 -1044931 -1064767 -1062424 -1066882 -1027405 -893096 -691173 -511825 -416749 -410377
10793 -410377 -432792 -365672 -169364 97938 353285 442029 412696 448356 576681 752525
10783 752525 948687 1199827 1449671 1592563 1637797 1579880 1447979 1229057 955519 820003
10773 820003 942154 1220495 1493472 1649528 1585762 1239958 729109 292409 88850 88686
10763 88686 112179 62861 -1024 -1498 45214 141732 280298 463744 731129 997883 1134307
10752 1134307 1106046 963700 813841 625946 353298 118659 -2689 -76007 -80185 55809
10742 55809 257820 335805 176465 -92278 -345554 -627813 -920726 -1135916 -1246848 -1343666
10732 -1343666 -1506965 -1610986 -1511070 -1214162 -861381 -703772 -763093 -710254 -299829 296810
10722 296810 788280 1073207 1117776 993383 860541 734541 569071 324638 -47847 -473688
10712 -473688 -714849 -637661 -326930 22658 281247 476883 562067 473763 286613 102356
10702 102356 -29206 -76850 -65715 -43126 -69005 -86257 -43162 -36706 -44380 36332 153941
10691 153941 278573 447525 567907 556303 530517 631712 793469 901589 1092088 1461013
10681 1461013 1894684 2185716 2171850 1965957 1791454 1754755 1724767 1545667 1285299 1071923
10671 1071923 952076 886717 812304 734166 685464 648403 628152 622545 604530 584018 586034
10660 586034 643739 669875 537311 310762 131890 -29888 -272271 -492033 -570314 -521412
10650 -521412 -421867 -340300 -261668 -137595 -25442 -20495 -103381 -98016 108025 485948 858956
10639 858956 1050869 1123879 1091739 862055 483660 80325 -302764 -621336 -814201 -878584
10629 -878584 -861790 -807066 -752300 -742984 -827955 -1027828 -1204646 -1208868 -1070159 -935000 -916288
10618 -916288 -1041731 -1306762 -1559511 -1522118 -1187680 -797883 -514416 -351993 -229415 -115905
10608 -115905 -60749 -76411 -110482 -130813 -117389 2872 256549 480061 491726 330567 201026
10597 201026 218826 377225 583398 673842 510698 210332 -37764 -206579 -277744 -180833
10587 -180833 39110 169715 72321 -111186 -247530 -343805 -455746 -573211 -629454 -648508
10577 -648508 -684012 -789887 -1001765 -1296176 -1639150 -1869232 -1839320 -1635016 -1433636 -1288761
10567 -1288761 -1140506 -953340 -773884 -665434 -617944 -574378 -503821 -428184 -358839 -304025
10557 -304025 -203554 31655 336132 549893 622423 538062 331688 161865 178811 268491
10547 268491 228210 64446 -126621 -330642 -508079 -553503 -511968 -546889 -675728 -793993
10537 -793993 -895997 -1083349 -1325918 -1519910 -1609783 -1512736 -1218756 -863731 -602788 -461100
10527 -461100 -320975 -113659 137904 358301 372324 127288 -252890 -623678 -1018661 -1451604
10517 -1451604 -1743109 -1822817 -1804735 -1748424 -1585022 -1342045 -1228820 -1250586 -1231692 -1146067
10507 -1146067 -1087157 -1025057 -854372 -573297 -259649 29124 231324 295148 226974 43111
10497 43111 -266139 -577178 -726274 -697230 -541380 -323030 -141624 -46854 -28506 -61805
10487 -61805 -157961 -352971 -538734 -637172 -746738 -975069 -1264139 -1460466 -1518171 -1500444
10477 -1500444 -1497418 -1548037 -1593358 -1584215 -1503632 -1311791 -1044619 -835976 -800162 -908447 -994449
10466 -994449 -1014569 -1057778 -1135296 -1180129 -1200327 -1272965 -1462106 -1642665 -1607032 -1360465 -1098543
10455 -1098543 -935523 -804786 -594560 -317787 -64393 73992 18697 -198300 -507269 -772712
10445 -772712 -841747 -691204 -371412 -80655 -29458 -175329 -331848 -366937 -273797 -167921
10435 -167921 -165973 -212529 -251256 -344529 -537788 -861540 -1258531 -1430058 -1191509 -782733
10425 -782733 -616486 -818502 -1116367 -1225780 -1107751 -760453 -279373 68840 159029 113492
10415 113492 112763 213596 285630 255700 247975 345017 420582 373111 229233 57795 -98194
10404 -98194 -280809 -459526 -563965 -612874 -610305 -613492 -726555 -886585 -983734 -990075 -917932
10393 -917932 -824796 -772110 -696611 -505034 -309553 -250501 -326817 -545401 -803906 -906042
10383 -906042 -775326 -485262 -160064 50162 112911 209944 445163 731721 986758 1180960
10373 1180960 1271977 1217752 1026214 843322 759677 687379 570637 399195 197996 45799
10363 45799 36753 184354 328679 295952 30545 -471053 -992860 -1311107 -1338751 -1033875
10353 -1033875 -494789 23541 310118 429424 570267 738441 873991 915444 793597 591866
10343 591866 495278 560581 642939 589268 463734 433705 498452 545288 548790 540853 564612 653436
10331 653436 760501 844209 866812 743141 442445 54733 -300866 -609070 -838983 -1012734
10321 -1012734 -1138915 -1145212 -1054075 -870374 -587126 -371296 -331719 -331353 -273214 -250663 -349912
10310 -349912 -520543 -633768 -548757 -266296 134714 561184 918200 1151154 1207747 1121581
10300 1121581 982076 766059 406709 -39261 -367455 -389674 -112438 300436 629176 748315
10290 748315 687941 565059 467208 400751 375653 379736 337386 229874 110584 -21612 -131995
10279 -131995 -160136 -131873 -53658 81556 126221 -13949 -296123 -579861 -678083 -634669 -602507
10268 -602507 -541416 -410275 -315056 -261735 -164428 -39169 75713 152292 123940 7775 -100973
10257 -100973 -200366 -266860 -154374 198242 611970 894725 931653 703346 313580 -93599
10247 -93599 -442448 -688005 -801303 -834210 -896005 -1116449 -1436534 -1658667 -1712045 -1622393
10237 -1622393 -1485039 -1410679 -1378238 -1357450 -1358137 -1399879 -1413791 -1337146 -1172466 -899744 -495893
10226 -495893 585 339132 340058 114033 -193635 -429781 -449139 -288302 -64614 174847
10216 174847 428873 748913 1146022 1501262 1660633 1584135 1452460 1378910 1272052 1139873
10206 1139873 1022699 860838 619846 330451 23633 -172020 -222780 -249917 -329080 -426723
10196 -426723 -551121 -697280 -724319 -579312 -345773 -148116 -316 189976 439737 665456
10186 665456 807274 897236 966074 1030618 1090345 1091169 977390 775555 581312 391460 170954
10175 170954 -20299 -124245 -170400 -145962 12843 260039 487495 696616 937304 1198787
10165 1198787 1472766 1758073 2019594 2206739 2305614 2351419 2373534 2374916 2272455 1934670
10155 1934670 1438169 1012107 828936 934986 1185034 1415874 1552920 1560446 1499189 1462444
10145 1462444 1389224 1181448 871493 457403 -91905 -605386 -929681 -1148072 -1355810 -1539760
10135 -1539760 -1614056 -1543112 -1300797 -886342 -412079 -15054 306445 540421 641969 770804
10125 770804 1127206 1583058 1816376 1796631 1719433 1596195 1303605 885171 508381 265775
10115 265775 128939 46708 -34341 -104539 -28865 223297 483426 602479 610318 565688 538615
10104 538615 580472 633712 664516 668352 649770 609033 604071 633752 588105 471220 456327 586312
10092 586312 690163 681427 628260 580832 520020 456832 530146 780825 1050561 1186368 1101065
10081 1101065 874519 737445 784330 779461 587649 403458 386432 550412 790730 954586
10071 954586 1051950 1198185 1330175 1344839 1248470 1112204 964156 818839 705731 702249
10061 702249 903003 1103715 1011091 672374 389511 304915 380817 604262 969687 1348412
10051 1348412 1467469 1228639 801757 444125 276647 188183 110037 40336 -130315 -358017
10041 -358017 -506914 -623692 -779810 -891278 -825452 -570484 -176570 339301 834032 1104999
10031 1104999 1148502 1141610 1204152 1329312 1401329 1334252 1148999 858649 591651 495406 560682
10020 560682 646793 654377 627799 677522 823695 987910 1073811 1080070 1078031 1061880 995133 892372
10008 892372 804664 792710 916854 1151232 1357624 1385303 1160607 846164 631670 492216
9998 492216 334833 120443 -102901 -281860 -382737 -361719 -183054 51646 133737 49606
9988 49606 -48681 -105512 -176848 -313358 -464826 -462646 -234686 126038 560839 929371 1045748
9977 1045748 909791 684433 451407 210409 77566 150866 276726 268587 110096 -91071
9967 -91071 -270910 -405220 -422430 -299565 -129332 5025 33133 -63129 -180631 -206938 -95054
9956 -95054 121471 366779 525630 577685 684622 811515 796073 680594 553047 476324
9946 476324 518455 651964 762783 825818 786456 656822 552101 535970 611531 736908 846403
9935 846403 870753 807912 654807 365746 -7541 -326459 -570070 -813186 -1067833 -1264520
9925 -1264520 -1343023 -1306906 -1243339 -1225902 -1231348 -1188933 -1091356 -916942 -652398 -348473 -85440
9914 -85440 44515 78064 93328 135101 199815 216500 76551 -245125 -673135 -1098240 -1336076
9903 -1336076 -1230788 -897700 -584797 -414589 -317040 -199077 41137 445544 790311 830738
9893 830738 614359 454907 546641 756898 934105 1104218 1256538 1259917 1063336 748224
9883 748224 416280 149560 -37757 -192601 -349416 -458382 -523403 -565182 -549662 -521824
9873 -521824 -608242 -850380 -1181027 -1543932 -1869578 -2051876 -2046701 -1838825 -1497869 -1154937
9863 -1154937 -926870 -939396 -1199792 -1534237 -1725182 -1718500 -1553845 -1326626 -1156259 -1026830
9853 -1026830 -821734 -517530 -202984 -50702 -114713 -251639 -360240 -438597 -470878 -453134
9843 -453134 -333841 -161104 -100628 -176722 -220529 -155528 -52064 9482 37745 51942 84271
9832 84271 192568 318921 451172 667811 966635 1222334 1345846 1299796 1080591 766822
9822 766822 438729 124030 -173929 -463154 -659285 -678457 -562316 -362117 -126278 141435
9812 141435 382342 443107 314036 129488 8656 -116057 -334474 -601248 -936569 -1320332
9802 -1320332 -1646429 -1831185 -1818797 -1582110 -1192682 -809078 -506241 -307481 -131116 88992
9792 88992 299096 449122 511976 449129 259244 58079 -13789 -31875 -81952 -81902 11730 144422
9780 144422 254525 273947 182020 -9904 -235031 -347909 -375774 -488210 -684273 -911860
9770 -911860 -1145555 -1202957 -1056643 -907472 -868593 -885488 -897805 -869480 -781044 -614801 -338195
9759 -338195 -98671 -153540 -466151 -765848 -925961 -1030880 -1134535 -1189331 -1131611 -918654
9749 -918654 -660367 -484686 -427109 -482273 -616774 -848054 -1182872 -1533125 -1738479 -1709287
9739 -1709287 -1535278 -1303869 -1127451 -1070290 -956261 -658723 -174226 378678 756150 909734
9729 909734 884380 676876 378779 160413 110787 218696 435940 606299 682396 745058
9719 745058 826062 910063 853687 570508 221976 -47561 -198912 -231699 -248792 -323245 -460258
9708 -460258 -539696 -451457 -246750 -76473 -89094 -259926 -395457 -350669 -235564 -228201 -337814
9697 -337814 -431566 -440341 -484879 -627266 -796246 -890263 -794373 -472837 39540 573956 977462
9686 977462 1285176 1541940 1727934 1824471 1780506 1584410 1320833 1091090 912579 776787
9676 776787 757743 902086 1147360 1370381 1502083 1539509 1490903 1410181 1348261 1346487 1428231
9665 1428231 1494883 1403359 1093671 646838 233999 -86717 -264813 -180669 162349 520229
9655 520229 610588 316691 -172681 -536188 -711392 -781283 -714155 -473606 -168765 141551
9645 141551 423517 577839 508352 215230 -159502 -452959 -520783 -351421 -133712 -78409
9635 -78409 -255225 -465366 -450454 -361023 -415084 -472860 -399074 -216370 2182 172250 305349
9624 305349 499397 754400 993539 1217041 1387835 1470844 1538604 1612675 1619716 1524177 1359241
9613 1359241 1143713 971692 889509 881886 920438 961451 902227 646409 226750 -240174 -630430
9602 -630430 -910831 -1096564 -1154302 -1022344 -762767 -503123 -242794 -19589 52672 -30692
9592 -30692 -48244 112555 261177 268043 178710 108997 141036 258908 412748 523204 549735
9581 549735 530081 475423 331361 30948 -348629 -623991 -704306 -600992 -458566 -465219 -672672
9570 -672672 -1047696 -1439686 -1708039 -1748643 -1500645 -1065107 -641098 -406878 -407211 -539726
9560 -539726 -675893 -795609 -887438 -839911 -616915 -330441 -156691 -147797 -235238 -300618 -273857
9549 -273857 -161697 -51378 -36476 -70289 -147385 -270263 -469400 -734002 -967175 -1080640
9539 -1080640 -1044530 -1020258 -1175989 -1490851 -1775270 -1861210 -1809804 -1692656 -1430597 -1017087
9529 -1017087 -563237 -180129 97681 195615 67014 -138602 -260562 -193463 12525 166991
9519 166991 142830 -90534 -519216 -1083961 -1546448 -1683167 -1534846 -1251672 -952056 -695717
9509 -695717 -547460 -590862 -847349 -1208321 -1549446 -1814210 -1935479 -1843601 -1656099 -1491727
9499 -1491727 -1328128 -1215760 -1185908 -1192857 -1170183 -1038721 -828262 -679917 -558859 -367108
9489 -367108 -215351 -154556 -186912 -366875 -589172 -746844 -849501 -870111 -797163 -703832 -673403
9478 -673403 -730400 -811516 -818976 -726278 -652243 -686951 -704914 -583349 -433512 -428495 -552382
9467 -552382 -586985 -340575 53260 243597 128470 -141961 -408342 -590501 -696577 -753984
9457 -753984 -785008 -801983 -735259 -496803 -168473 102920 307810 515548 677866 703453
9447 703453 692143 773581 854477 721205 350473 26134 29034 252934 432675 545937 740557
9436 740557 1009320 1178599 1120986 919865 682283 551850 668956 935042 1106763 1093093
9426 1093093 968208 751704 495609 342287 333932 361725 259362 1658 -304113 -543119
9416 -543119 -590620 -453051 -342860 -428611 -649007 -941946 -1300856 -1622003 -1819960 -1874656
9406 -1874656 -1845901 -1791989 -1688745 -1619794 -1654174 -1612355 -1316966 -897108 -518959 -194803
9396 -194803 -9328 -36641 -193943 -404527 -652163 -855141 -878073 -711994 -487861 -283722
9386 -283722 -107386 18026 111464 209510 280590 272185 226066 167019 43628 -198023 -483158
9375 -483158 -670415 -660889 -449251 -127569 154578 293559 256898 -5679 -492996 -1015742
9365 -1015742 -1363235 -1483896 -1450311 -1321896 -1099790 -834104 -543693 -225857 -4816 33373
9355 33373 52914 188021 277563 243689 233036 385603 633210 789004 764627 585919 329629
9344 329629 71451 -188525 -450647 -701426 -887329 -933547 -912931 -903305 -905718 -942053 -937167
9333 -937167 -783860 -560815 -394624 -363318 -476577 -580515 -582042 -504419 -354115 -186618
9323 -186618 -57538 116800 444635 800870 1038234 1173890 1144585 857182 462763 197857
9313 197857 109338 88709 106843 216928 382293 536325 644097 666871 594491 431150 266798
9302 266798 176672 94978 -120 -30612 38632 89783 29655 -37070 -54658 -72656 -67176 38524
9290 38524 227373 344497 244536 -28243 -281471 -400693 -427700 -384893 -284330 -181818
9280 -181818 -185027 -314670 -409845 -403105 -397151 -517983 -788641 -1104697 -1306966 -1410382 -1515713
9269 -1515713 -1612517 -1616935 -1521735 -1377801 -1187228 -909096 -626699 -551929 -710704 -928614
9259 -928614 -1054444 -1080823 -1022392 -840789 -537357 -244920 -53724 100184 260967 465305
9249 465305 667218 718512 593604 425032 291653 134715 -14252 -53511 40504 195787
9239 195787 330270 368600 219243 -120055 -430744 -459171 -283091 -175685 -153906 -67139
9229 -67139 119599 370010 667018 1013285 1355710 1599214 1647961 1405857 921364 367439
9219 367439 -76631 -273718 -203718 44536 300960 428521 446503 513174 621936 665866
9209 665866 669830 595185 387271 163422 -34837 -197943 -230446 -157074 -129881 -160539 -11736
9198 -11736 403980 876952 1239567 1425995 1496678 1632560 1867879 2166609 2428451 2497866
9188 2497866 2361818 2189539 2113339 2033073 1782055 1356962 861453 480618 367130 428032
9178 428032 435497 392718 489599 754340 955246 844244 438979 65040 -54042 -93885 -340528
9167 -340528 -645650 -698581 -585492 -549032 -647115 -832203 -1017465 -1080304 -1044142 -1041135 -1071480
9156 -1071480 -1040797 -920540 -806230 -782932 -752588 -605866 -370507 -69014 258790 448424
9146 448424 399078 184752 -98563 -411195 -694192 -907866 -1081377 -1181929 -1189934 -1202339
9136 -1202339 -1209819 -1134643 -966715 -788274 -709904 -795738 -1043754 -1365785 -1703163 -1962345
9126 -1962345 -2003998 -1870443 -1740335 -1665709 -1619989 -1626410 -1721984 -1780805 -1595591 -1266085 -1022774
9115 -1022774 -866046 -671523 -369279 -90788 28945 24472 -18991 1260 83280 149434 256659
9104 256659 464065 655794 687350 562932 342398 96542 9801 131251 300753 399905
9094 399905 445296 484391 521970 487592 322387 69262 -96480 18155 406097 803049
9084 803049 1008152 1027828 903431 620785 207744 -174630 -347195 -327209 -344908 -526564
9074 -526564 -710822 -750273 -718755 -814390 -1066646 -1355003 -1549290 -1601737 -1550210 -1348544 -906935
9063 -906935 -341962 59999 157717 26206 -142672 -212524 -135238 -1187 3955 -172605 -467337
9052 -467337 -753787 -841501 -726759 -565556 -414472 -233528 37105 369025 710987 1020872
9042 1020872 1207858 1256607 1194065 1023115 847638 763958 770548 872850 1001729 1011127 906234
9031 906234 768374 585567 329834 91921 -33388 -71562 -31229 59948 142321 144715 100131
9020 100131 155415 313878 481680 598853 622489 544889 348758 53491 -262079 -514356
9010 -514356 -610199 -548383 -450120 -337001 -139457 156565 494024 709139 698506 508832
9000 508832 195969 -213118 -664380 -1030500 -1232419 -1266943 -1076855 -661745 -106488 350204
8990 350204 507148 499795 551501 655973 803853 899639 828070 728519 676716 587044 403981
8979 403981 224395 156097 160364 184809 221255 305417 418529 524410 656641 774537 690015
8968 690015 362031 23572 -193309 -305423 -409321 -588310 -859294 -1177965 -1444408 -1604242
8958 -1604242 -1632687 -1505089 -1220220 -839133 -508383 -321534 -238163 -140913 -17175 34056
8948 34056 -57213 -199678 -242952 -129929 108692 354734 488220 488628 383920 234701 66866
8937 66866 -88657 -118011 -27735 76149 74298 -133490 -488922 -859402 -1222750 -1568717 -1849137
8926 -1849137 -1992189 -1921444 -1698799 -1428600 -1121185 -782282 -457296 -244527 -161909 -103252
8916 -103252 -54962 -78568 -222194 -464489 -640395 -531499 -138817 355882 780378 1098331
8906 1098331 1477220 2010182 2582824 3058507 3420776 3793757 4266199 4812852 5403958 6049794
8896 6049794 6865907 7829682 8588929 8665164 7934925 6824797 5764568 4858013 4053732
8887 4053732 3316410 2725895 2364241 2141207 1957950 1785867 1616086 1461167 1295515 1118037
8877 1118037 970824 892865 899762 933189 877864 694354 372498 -71795 -567878 -951389
8867 -951389 -1038546 -847634 -546289 -352761 -315112 -215705 30130 296788 496106 607185
8857 607185 651684 648440 692948 776944 723954 546965 403389 407048 596418 826245 904963
8846 904963 765431 439930 103456 -88568 -192556 -374798 -676270 -904310 -925841 -817552
8836 -817552 -698140 -561459 -408262 -307256 -243647 -145925 -93521 -211974 -477247 -748748
8826 -748748 -949645 -1040309 -950000 -696852 -438360 -329784 -401935 -524180 -479999 -212286
8816 -212286 161510 418798 521382 646077 782285 752229 503258 192652 -58385 -192119
8806 -192119 -143457 52078 207658 138531 -87341 -286999 -386613 -346770 -165597 29523
8796 29523 144311 166382 164648 258815 425642 590517 740060 808259 833991 933363 1024225
8785 1024225 1032381 924029 696826 425817 140957 -238474 -735144 -1189088 -1436286 -1494441
8775 -1494441 -1503904 -1531152 -1564052 -1544342 -1409956 -1220686 -1044313 -914049 -819933 -724282 -674162
8764 -674162 -717036 -802923 -844011 -834821 -781187 -730212 -681004 -609470 -470289 -296277 -192761
8753 -192761 -162953 -81150 156856 523873 851798 1006393 1068930 1124684 1135905 1106734 1102790
8742 1102790 1117368 1134018 1133628 1057967 895065 658982 342600 25453 -233891 -504859 -774213
8731 -774213 -959192 -1047725 -1140801 -1252326 -1245457 -1198586 -1206887 -1137991 -905110 -582874 -309630
8720 -309630 -160689 -85854 -43416 -94973 -205750 -271339 -287234 -226058 -54441 171943 370189
8709 370189 454690 432402 396672 370079 266811 56530 -132764 -210705 -133048 47604 100550
8698 100550 -84149 -321802 -429661 -420433 -426805 -450005 -301096 -88482 -29652 -121636 -322021
8687 -322021 -590158 -838290 -1072897 -1305470 -1463434 -1476153 -1405924 -1369402 -1331173 -1205057
8677 -1205057 -998177 -786381 -625627 -518753 -387900 -177036 141342 509706 778530 980586
8667 980586 1240672 1523144 1750551 1855436 1776416 1534498 1279179 1169809 1227053 1325124
8657 1325124 1343590 1296428 1221866 1145824 1107753 1109951 1084026 987927 921734 929155 859130 623774
8645 623774 411081 338566 330425 363460 430279 445506 398948 397890 465791 466084 304653 171833
8633 171833 215747 313289 297280 111052 -145432 -323402 -345145 -233796 -136729 -174403 -293388
8622 -293388 -371517 -357166 -221407 -50996 -80173 -350006 -673199 -883133 -929844 -820332
8612 -820332 -552335 -204208 85921 274018 365547 433043 536569 668604 781534 786965
8602 786965 667484 567415 563929 593781 666100 697184 538297 237942 33026 23520 64170
8591 64170 35215 20453 95478 179670 193997 205095 297214 451948 545477 449311 189032
8580 189032 -80161 -230492 -318286 -416765 -534587 -623616 -632312 -587030 -507111 -397723 -274055
8569 -274055 -76401 266722 650290 979380 1271858 1528719 1764853 1907676 1829496 1608559
8559 1608559 1394093 1227286 1072184 923966 828805 838751 914918 1001274 988148 842045 657812
8548 657812 524449 521233 709098 993123 1185827 1181865 990985 729182 447062 134300
8538 134300 -151594 -254457 -77157 350768 898708 1347583 1528095 1525934 1537074 1578072
8528 1578072 1521665 1402277 1353358 1353573 1290933 1100804 837890 626120 529528 530198 541024
8517 541024 497364 408064 328643 281584 344992 535964 700789 711880 587800 422707 279031
8506 279031 92138 -254711 -745431 -1170996 -1248838 -879182 -317141 105716 268528 203425
8496 203425 14776 -112790 -65931 81558 218168 308907 354831 331084 188532 -12018
8486 -12018 -131023 -132586 -65112 -32042 -26856 -32373 -140583 -326404 -521947 -763173 -1051883
8475 -1051883 -1381077 -1692999 -1823272 -1708218 -1472870 -1237044 -980654 -738561 -568978 -436718
8465 -436718 -258373 -80978 18634 25887 -88023 -321795 -592786 -885153 -1185775 -1419270
8455 -1419270 -1575283 -1629800 -1567972 -1371248 -962450 -448356 -58457 193565 389892 589152
8445 589152 792415 912541 869130 697741 581667 630304 819254 1061085 1172656 1030846
8435 1030846 749818 571605 585664 610015 504092 332780 251617 369915 526202 511799
8425 511799 328395 102601 -72778 -195282 -255120 -171007 29212 214185 395347 703525
8415 703525 998603 1012813 833332 743122 824491 981913 1164910 1338901 1386558 1291307 1213239
8404 1213239 1221855 1234279 1192859 1171661 1296205 1454305 1425753 1261997 1188954 1244369 1303120
8393 1303120 1294796 1180222 912033 524211 151792 -166099 -415038 -512987 -439267 -365374
8383 -365374 -479921 -749705 -1042882 -1347166 -1620923 -1702816 -1566578 -1391187 -1362378 -1398110
8373 -1398110 -1250979 -920711 -637037 -549035 -649409 -827643 -1015739 -1167553 -1268421 -1279122
8363 -1279122 -1168753 -994513 -885269 -903350 -883848 -681525 -345420 6930 241891 306597
8353 306597 306665 295061 133518 -162941 -408674 -608603 -817883 -972135 -920279 -656337 -365672
8342 -365672 -219452 -216620 -245102 -277907 -336575 -378507 -350702 -271351 -174315 -123993 -56623 88709
8330 88709 227817 260966 87110 -250373 -654348 -1017807 -1122396 -906981 -558974 -292786
8320 -292786 -148157 -97475 -159066 -296931 -449340 -604858 -712605 -722925 -644057 -533597
8310 -533597 -434059 -394382 -465496 -525540 -455759 -330042 -200864 15720 275063 463808 600813
8299 600813 691553 698591 634792 604586 734901 963553 1042860 780718 266720 -253451 -699666
8288 -699666 -1012847 -1124027 -1081226 -974729 -882403 -827348 -745465 -558236 -275875 22745
8278 22745 282821 468902 638994 820007 896479 761878 453994 155109 -26425 -48985
8268 -48985 115632 306343 375198 432708 517621 493692 312243 -36973 -475884 -848167 -1032342
8257 -1032342 -954771 -681527 -333316 -66922 31292 8779 -34595 -48864 -28717 -218 30761
8246 30761 113522 274841 438522 514194 501688 503578 594957 715156 756384 681797 492105
8235 492105 214358 -35746 -222886 -405744 -553461 -582269 -447972 -217023 3080 84456
8225 84456 -47372 -343555 -664217 -930160 -1115707 -1224650 -1256879 -1141736 -916551 -734198
8215 -734198 -647087 -654131 -738091 -921073 -1233202 -1572066 -1749320 -1714982 -1653259 -1658056 -1588053
8204 -1588053 -1293389 -876602 -565471 -416705 -331488 -219628 -52299 108076 105167 -113817
8194 -113817 -378984 -619226 -952260 -1333390 -1569065 -1610306 -1598824 -1636145 -1654952 -1601233 -1455628
8183 -1455628 -1175359 -738046 -156551 428001 690939 499292 108300 -178331 -285737 -258022
8173 -258022 -131040 -15821 -16904 -166127 -438688 -728350 -851760 -787934 -683638 -681276 -770185
8162 -770185 -791234 -717339 -656145 -685434 -827673 -1052594 -1281023 -1465536 -1559461 -1472335 -1226634
8151 -1226634 -930887 -688712 -627210 -754360 -881944 -908932 -888759 -919141 -949857 -749314
8141 -749314 -320855 81123 371540 579793 635423 588724 584076 607669 554283 429341 327018
8130 327018 308854 386980 545284 676677 647087 544463 565625 732106 1029974 1424902
8120 1424902 1791582 2083508 2246283 2191608 1886015 1410395 915003 464497 140449 27304
8110 27304 50318 74531 94524 164086 313676 503215 627443 557341 271875 -92188 -419614
8099 -419614 -629793 -671875 -613682 -464764 -211901 108215 464121 772219 905415 855750
8089 855750 792086 856692 1036416 1234072 1275078 1075141 768224 499008 333921 314873
8079 314873 467495 711622 867818 805060 657084 670656 787764 850822 878549 864364 729753
8068 729753 511335 256866 4828 -164101 -158258 36748 380825 701034 771382 481376
8058 481376 -8850 -355126 -345846 -109413 116505 325411 585614 822897 936765 994670
8048 994670 995424 753491 228769 -403198 -974399 -1340786 -1359999 -1060582 -657249 -330326
8038 -330326 -48895 235140 383541 277123 33307 -144964 -214615 -243763 -372333 -649079
8028 -649079 -875520 -951483 -913912 -655292 -179675 260704 493606 580662 603012 560430 469604
8017 469604 353416 207441 120060 210551 449220 703816 863260 934533 1006146 1009651 828848
8006 828848 504904 150425 -125073 -258503 -270419 -181225 -58919 1620 -67694 -212896
7996 -212896 -327706 -437042 -509536 -469601 -397331 -364400 -350968 -339173 -314787 -313957 -382348 -416407
7984 -416407 -299393 -47045 190657 283861 281503 299550 388466 419190 165547 -378167 -840269
7973 -840269 -871807 -547682 -122447 236313 459684 597279 676592 613645 368713 35912
7963 35912 -261349 -406056 -336427 -131200 -5047 -63497 -131478 -67070 110669 294202 368207
7952 368207 335024 293675 340630 461765 559832 567831 470382 363209 278858 184039 90805
7941 90805 -27653 -137907 -125412 47759 309131 610061 890780 1088108 1258609 1429121
7931 1429121 1500461 1424383 1288981 1194392 1208068 1293109 1314223 1244828 1162375 1143565 1177932
7920 1177932 1131212 990532 945212 1134124 1480888 1810534 2065798 2252275 2316912 2281649
7910 2281649 2167628 1961515 1747199 1637021 1603095 1651845 1891594 2335978 2869945 3398492
7900 3398492 3933342 4528314 5229545 6069024 7103107 8285168 9445336 10504023 11549384
7891 11549384 12684255 13913587 15382399 17445132 20310558 23905540 27910354 31511479
7883 31511479 33356420 32340081 28774514 24167237 19738597 15984408 13038701 10863490
7875 10863490 9226010 7815106 6576762 5635577 5030554 4590667 4046624 3289767 2352545
7866 2352545 1374888 574023 78316 -138831 -181031 -137288 -51412 -4879 -62808 -134518 -122153
7855 -122153 -129711 -170243 -104675 53939 250149 415217 524274 649476 738064 676770 483339
7844 483339 314193 218558 182397 251018 396036 509601 476366 353572 277943 403435 687401
7833 687401 821034 634819 304310 118251 175106 456806 873152 1191980 1232125 1162669
7823 1162669 1211155 1258323 1053216 580507 35605 -405416 -686442 -926501 -1214983 -1474221
7813 -1474221 -1627503 -1706982 -1731244 -1592309 -1256076 -846036 -429362 3609 429962 833246
7803 833246 1267682 1687464 1891348 1833302 1687641 1640377 1776307 2019024 2087115 1754845
7793 1754845 1149375 556525 188636 69770 63263 2415 -122248 -222936 -301309 -296784 -165138
7782 -165138 55225 311706 423699 318514 193840 225256 357297 470144 566571 682054
7772 682054 748843 670932 567179 499706 400449 262347 33679 -334659 -779290 -1153630
7762 -1153630 -1278437 -1121635 -869392 -624882 -301268 39525 199297 205176 294167 550376
7752 550376 905190 1223155 1363865 1290551 1066629 823974 609780 388796 161213 -71870
7742 -71870 -239236 -232440 -7488 350141 700886 1066603 1419493 1671780 1811800 1844639
7732 1844639 1838857 1894575 1961461 1876064 1678002 1541680 1542550 1636522 1756877 1878071 1958128
7721 1958128 2032244 2167449 2307413 2476447 2778948 3274827 4021795 4926201 5749469 6286460
7711 6286460 6343711 5844574 4928562 3838917 2849657 2142883 1721377 1498111 1400694 1334572
7701 1334572 1210229 979484 665211 366489 207070 216868 204312 69749 -57953 -42330
7691 -42330 168132 475501 688674 764287 772956 739952 645404 511030 413377 378319 361199
7680 361199 349005 325169 246288 145793 126397 269949 478129 589188 575624 485573 446726
7669 446726 511128 562271 504431 374127 264857 242298 299064 448845 624674 744444 862098
7658 862098 999798 1077946 1045838 988798 932995 858516 682893 327192 -96976 -391144 -476513
7647 -476513 -405442 -321544 -356300 -423335 -421561 -408843 -407918 -362250 -226231 -65744 38277 107977
7635 107977 141900 100874 -18185 -184499 -373724 -595611 -828098 -1077925 -1375343 -1674860
7625 -1674860 -1849028 -1831132 -1649581 -1384834 -1154270 -1017572 -926043 -778400 -522089 -209257
7615 -209257 -15498 -49994 -206906 -272244 -177072 -63393 -23283 40427 194837 369844 465237
7604 465237 436561 352631 323077 414994 563923 685137 740241 700960 595003 445628 247304
7593 247304 109711 175847 404028 611615 692746 597549 319781 -64799 -398190 -557394
7583 -557394 -556499 -456589 -315087 -222069 -222543 -233862 -183070 -80000 -59761 -192672 -334775 -312076
7571 -312076 -63412 273731 495552 511856 388838 236758 151576 221334 394814 497988
7561 497988 402538 161088 -92806 -252589 -276890 -239430 -232832 -286882 -334080 -254201 -83404
7550 -83404 67919 216527 371041 507466 630988 670642 637416 615391 654675 728051 823538
7539 823538 939131 989330 903567 706334 514306 403919 313655 214899 195099 310484 500261
$$ [...]
##END NTUPLES=NMR SPECTRUM
##END=
