##TITLE=C13_Ser 3511-NEA-H
 CDCl3, 22100 sc

 12.3.2024
##JCAMPDX= 6.0         $$ Bruker NMR JCAMP-DX V2.0
##DATA TYPE= NMR SPECTRUM
##DATA CLASS= NTUPLES
##ORIGIN= UXNMR, Bruker Analytische Messtechnik GmbH
##OWNER= root
$$ XWIN-NMR		Version 3.5
$$ Wed Mar 13 13:45:14 2024 Russian Standard Time (UT+4h)  she@DPX200
##.OBSERVE FREQUENCY= 50.327896
##.OBSERVE NUCLEUS= ^13C
##.ACQUISITION MODE= SIMULTANEOUS
##.ACQUISITION SCHEME= undefined
##.AVERAGES= 22101
##.DIGITISER RES= 17
##SPECTROMETER/DATA SYSTEM= spect
##.PULSE SEQUENCE= zgpg30
##.SOLVENT NAME= CDCl3
##.SHIFT REFERENCE= (INTERNAL, CDCl3, 0, 222.646)
##AUDIT TRAIL= $$ (NUMBER, WHEN, WHO, WHERE, WHAT)
$$ ##TITLE= Audit trail, XWIN-NMR		Version 3.5
$$ ##JCAMPDX= 5.01
$$ ##ORIGIN= Bruker BioSpin GmbH
$$ ##OWNER= she
$$ F:/spectra/data/she/nmr/c13/1/pdata/1/auditp.txt
$$ ##AUDIT TRAIL=  $$ (NUMBER, WHEN, WHO, WHERE, WHAT)
(   1,<2024-03-13 13:41:54.92 +0400>,<she>,<DPX200>,
      <created by zg, POWCHK disabled, PULCHK disabled
       terminated by command 'halt'
       configuration hash MD5:
       00 E9 B6 7A A2 85 ED C7 34 08 36 98 17 FE 4E 26
       data hash MD5: 32K
       4D 55 8C B9 AA 99 FC 0F D6 78 2F 5F 15 B3 07 24>)
(   2,<2024-03-13 13:41:59.64 +0400>,<she>,<DPX200>,
      <Start of raw data processing
       efp BC_mod = 2 LB = 2 FT_mod = 6 PKNL = 1 PHC0 = -380.2667 PHC1 = 22.5201 SI = 32K 
       data hash MD5: 32K
       57 BC 8A 77 39 0E 8F 64 86 F1 50 6D 61 81 E7 5C>)
(   3,<2024-03-13 13:42:02.35 +0400>,<she>,<DPX200>,
      <abs ABSG = 5 
       data hash MD5: 32K
       34 FB 8C 8A BC BD 0D 8B 66 F2 CD C4 E0 1D 88 3B>)
(   4,<2024-03-13 13:42:31.84 +0400>,<she>,<DPX200>,
      <abs ABSG = 5 
       data hash MD5: 32K
       64 66 00 88 32 D0 A1 82 AA AA F9 41 F5 14 95 63>)
(   5,<2024-03-13 13:42:56.50 +0400>,<she>,<DPX200>,
      <pk PHC0 = -20.82167 PHC1 = 0 
       data hash MD5: 32K
       90 C8 1D 30 95 14 51 B5 07 4E 40 EA F9 4F B0 99>)
(   6,<2024-03-13 13:43:01.92 +0400>,<she>,<DPX200>,
      <abs ABSG = 5 
       data hash MD5: 32K
       9B 1C EA EB 3F EB 34 BC AF E0 00 23 22 7F 69 C4>)
(   7,<2024-03-13 13:43:29.70 +0400>,<she>,<DPX200>,
      <pk PHC0 = -7.529793 PHC1 = 45.20001 
       data hash MD5: 32K
       43 52 74 E9 23 79 52 11 F2 3F 0B A5 DC D7 E2 BD>)
(   8,<2024-03-13 13:43:33.29 +0400>,<she>,<DPX200>,
      <abs ABSG = 5 
       data hash MD5: 32K
       F2 E6 3D 68 98 B0 AA D4 06 8E 25 02 BC 80 19 6C>)
(   9,<2024-03-13 13:44:05.98 +0400>,<she>,<DPX200>,
      <pk PHC0 = -20.48494 PHC1 = 33.39998 
       data hash MD5: 32K
       A2 9C D1 DF 73 D1 40 56 11 E4 A9 8D 87 44 0A 46>)
(  10,<2024-03-13 13:44:10.00 +0400>,<she>,<DPX200>,
      <abs ABSG = 5 
       data hash MD5: 32K
       8D 07 38 2B 16 97 1A B9 70 04 FC C1 4C 23 55 0E>)
$$ ##END=
$$ 
$$ hash MD5
$$ BD FB F5 D9 1B 55 0F DA 25 2D E4 89 4D 03 E1 C2
##$RELAX= 
##$RELAX= 
##$RELAX= 
##$RELAX= 
##$RELAX= 
##$RELAX= 
##$RELAX= 
##$RELAX= 
$$ Bruker specific parameters
$$ [...]
##$SUBNAM4= <"">
##$SUBNAM5= <"">
##$SUBNAM6= <"">
##$SUBNAM7= <"">
##$SUBNAM8= <"">
##$SUBNAM9= <"">
##$SW= 239.972175391363
##$SWIBOX= (0..15)
0 1 3 0 0 0 0 0 0 0 0 0 0 0 0 0 
##$SW_h= 12077.2946859903
##$TD= 32768
##$TD0= 1
##$TE= 0
##$TE2= 300
##$TE3= 300
##$TEG= 300
##$TL= (0..7)
120 120 120 120 120 120 120 120 
##$TP= (0..7)
150 150 150 150 150 150 150 150 
##$TP07= 0
##$TPNAME0= <>
##$TPNAME1= <>
##$TPNAME2= <>
##$TPNAME3= <>
##$TPNAME4= <>
##$TPNAME5= <>
##$TPNAME6= <>
##$TPNAME7= <>
##$TPOAL= (0..7)
0.5 0.5 0.5 0.5 0.5 0.5 0.5 0.5 
##$TPOFFS= (0..7)
0 0 0 0 0 0 0 0 
##$TUNHIN= 0
##$TUNHOUT= 0
##$TUNXOUT= 0
##$USERA1= <user>
##$USERA2= <user>
##$USERA3= <user>
##$USERA4= <user>
##$USERA5= <user>
##$V9= 5
##$VALIST= <valist>
##$VCLIST= <CCCCCCCCCCCCCCC>
##$VD= 0
##$VDLIST= <DDDDDDDDDDDDDDD>
##$VPLIST= <PPPPPPPPPPPPPPP>
##$VTLIST= <TTTTTTTTTTTTTTT>
##$WBST= 1024
##$WBSW= 4
##$XGAIN= (0..3)
0 0 0 0 
##$XL= 0
##$YL= 0
##$YMAX_a= 123025901
##$YMIN_a= -114876909
##$ZGOPTNS= <>
##$ZL1= 120
##$ZL2= 120
##$ZL3= 120
##$ZL4= 120
##$ABSF1= 222.646
##$ABSF2= -17.35081
##$ABSG= 5
##$ABSL= 3
##$ALPHA= 0
##$AQORDER= 0
##$ASSFAC= 0
##$ASSFACI= 0
##$ASSFACX= 0
##$ASSWID= 0
##$AUNMP= <proc_1d>
##$AZFE= 0.1
##$AZFW= 0.5
##$BCFW= 0
##$BC_mod= 2
##$BYTORDP= 0
##$COROFFS= 0
##$CY= -3
##$DATMOD= 1
##$DC= 0
##$DFILT= <>
##$DTYPP= 0
##$F1P= 0
##$F2P= 0
##$FCOR= 0.5
##$FTSIZE= 32768
##$FT_mod= 6
##$GAMMA= 0
##$GB= 0
##$INTBC= 1
##$INTSCL= 4.134877e-10
##$ISEN= 128
##$LB= 2
##$LEV0= 0
##$LPBIN= 0
##$MAXI= 10000
##$MC2= 0
##$MEAN= 0
##$ME_mod= 0
##$MI= 0.1934396
##$NCOEF= 0
##$NC_proc= 1
##$NLEV= 6
##$NOISF1= 120.0001
##$NOISF2= 80.00006
##$NSP= 0
##$NTH_PI= 0
##$NZP= 0
##$OFFSET= 222.646
##$PC= 1.4
##$PHC0= -429.1031
##$PHC1= 101.1201
##$PH_mod= 1
##$PKNL= yes
##$PPARMOD= 0
##$PSCAL= 0
##$PSIGN= 0
##$REVERSE= no
##$SF= 50.3227304925793
##$SI= 32768
##$SIGF1= 140
##$SIGF2= 120
##$SINO= 11.81781
##$SIOLD= 32768
##$SREGLST= <13C.CDCl3>
##$SSB= 0
##$STSI= 32768
##$STSR= 0
##$SW_p= 12077.2946859903
##$SYMM= 0
##$S_DEV= 0
##$TDeff= 32768
##$TDoff= 0
##$TI= <>
##$TILT= no
##$TM1= 0
##$TM2= 0
##$TOPLEV= 0
##$USERP1= <user>
##$USERP2= <user>
##$USERP3= <user>
##$USERP4= <user>
##$USERP5= <user>
##$WDW= 1
##$XDIM= 32768
##$YMAX_p= 466252839
##$YMIN_p= -3355768
$$ End of Bruker specific parameters
$$ ---------------------------------
##NTUPLES= NMR SPECTRUM
##VAR_NAME=  FREQUENCY,     SPECTRUM/REAL,   SPECTRUM/IMAG
##SYMBOL=    X,             R,               I
##VAR_TYPE=  INDEPENDENT,   DEPENDENT,       DEPENDENT
##VAR_FORM=  AFFN,          ASDF,            ASDF
##VAR_DIM=   32768,         32768,           32768
##UNITS=     HZ,            ARBITRARY UNITS, ARBITRARY UNITS
##FACTOR=    0.368581032318806, 1,           1
##FIRST=     11204.1544566776, 0,            0
##LAST=      -873.140229312654, 0,           0
##MIN=       -873.140229312654, -3355768,    0
##MAX=       11204.1544566776, 466252839,    0
$$ Real data points
##PAGE= N=1
##DATA TABLE= (X++(R..R)), XYDATA
$$ [...]
17946 -414491 -291612 -15461 212182 233179 83086 -75363 -84176 32501 108363 90494
17936 90494 49668 -4082 -129419 -295376 -438036 -612458 -787409 -800517 -618952 -446757
17926 -446757 -441560 -657806 -961315 -1188606 -1283214 -1299957 -1388540 -1539919 -1614142 -1568434 -1460784
17915 -1460784 -1309244 -1101181 -940829 -933468 -979655 -1023773 -1093263 -1197946 -1371708 -1565774
17905 -1565774 -1589583 -1429598 -1369191 -1593460 -1870401 -1814631 -1473027 -1170719 -1024938 -1033978
17895 -1033978 -1201436 -1429359 -1612928 -1611228 -1382101 -1087442 -878070 -744850 -635979 -552851
17885 -552851 -449148 -244224 80624 402040 555445 462202 122596 -351286 -733105 -857144
17875 -857144 -797181 -761193 -882539 -1099651 -1296053 -1403468 -1498217 -1663685 -1788650 -1759187
17865 -1759187 -1628558 -1446773 -1215835 -1020869 -903713 -834187 -823556 -835432 -812438 -772241
17855 -772241 -749141 -682462 -572994 -479900 -488332 -706145 -1112340 -1577750 -1837874 -1730347
17845 -1730347 -1395218 -1053510 -812115 -622738 -477590 -412874 -436232 -518586 -573832 -559518
17835 -559518 -519527 -452749 -327443 -187820 -109271 -110501 -148553 -164585 -162994 -156320 -193034 -257156
17823 -257156 -222720 -47226 150397 313061 481235 670197 889530 1086249 1184087 1159884
17813 1159884 1084217 986533 808538 627171 588767 653518 681510 623561 517463 346295
17803 346295 85195 -181928 -353074 -337759 -55248 518161 1176210 1630616 1821991 1831811
17793 1831811 1712279 1568443 1535240 1508346 1298100 923420 542057 266375 110117 86460
17783 86460 246871 469469 617452 625844 398759 -46316 -476077 -619613 -458416 -129145
17773 -129145 230298 444768 473063 411620 394302 500596 688273 855100 981247 1131932
17763 1131932 1239587 1128505 728120 182212 -250005 -506690 -690906 -832021 -867179 -779273
17753 -779273 -630411 -529659 -564302 -669500 -767341 -804162 -639887 -269482 37993 131578
17743 131578 54346 -139399 -412304 -769392 -1131978 -1372214 -1426373 -1406867 -1466061 -1622650
17733 -1622650 -1764497 -1621019 -1082341 -465627 -126895 -46868 389 88384 80227 -68848
17723 -68848 -248764 -541241 -996651 -1448627 -1737574 -1809029 -1677881 -1394796 -1114115 -971297
17713 -971297 -829450 -528424 -134300 168942 171063 -143081 -474231 -588405 -542345 -487837
17703 -487837 -493296 -561953 -619310 -568626 -388122 -158832 -20513 -125638 -459949 -851508
17693 -851508 -1210244 -1468842 -1602879 -1602598 -1476753 -1280572 -1045897 -781910 -529346 -413583
17683 -413583 -452203 -525001 -546621 -490939 -408854 -377237 -369998 -292251 -178002 -181262 -342074
17672 -342074 -533739 -701493 -900879 -1050694 -1003745 -791591 -556288 -375769 -291230 -392881
17662 -392881 -699137 -1004564 -1101624 -1015451 -962083 -975496 -910746 -774666 -680593 -601474 -461873
17651 -461873 -339999 -250086 -162768 -105278 9229 200595 334402 411959 511374 590756 537734
17640 537734 190482 -344832 -733944 -877663 -903276 -884279 -814764 -786719 -942116 -1246949
17630 -1246949 -1534218 -1685446 -1606913 -1323361 -1051732 -902017 -811708 -700296 -612239 -584528
17620 -584528 -515710 -244708 211432 647305 967509 1126248 1050520 748471 441452 369561
17610 369561 489074 557825 554404 511036 310409 -8128 -225543 -233089 -175039 -233427 -459259
17599 -459259 -636954 -575140 -372325 -197621 -211785 -444629 -738291 -982083 -1162411 -1231980
17589 -1231980 -1160647 -919306 -631171 -489200 -562023 -822155 -1069374 -1115670 -896183 -515120
17579 -515120 -225532 -162237 -269602 -399172 -434511 -348510 -148000 96020 294570 392849
17569 392849 461894 527639 434573 278839 289031 528783 844934 948283 774573 631806
17559 631806 656867 723035 695542 611431 554723 502418 480200 510563 446418 84981 -450724
17548 -450724 -787239 -806520 -753297 -867108 -1174702 -1499669 -1570911 -1359000 -1131170 -1112793
17538 -1112793 -1221149 -1255048 -1101669 -744628 -403986 -164902 81003 298294 426403 496778
17528 496778 457216 194902 -267623 -707859 -910618 -892485 -798828 -746042 -702814 -507119
17518 -507119 -193997 3312 -24625 -284743 -605512 -645167 -441915 -324922 -437099 -737123
17508 -737123 -1017862 -1081619 -977797 -763826 -420181 -131215 -167375 -423807 -733944 -1064550
17498 -1064550 -1273269 -1274899 -1109590 -806863 -456992 -199889 -109134 -190405 -391792 -569857
17488 -569857 -620301 -569074 -506208 -587458 -893704 -1311185 -1688448 -1873461 -1767760 -1487588
17478 -1487588 -1105507 -677525 -423174 -455517 -596462 -805320 -1239689 -1814926 -2190968 -2165451
17468 -2165451 -1903698 -1663833 -1600826 -1754569 -1943901 -1993893 -1906146 -1739828 -1569217 -1416413
17458 -1416413 -1173280 -816644 -587422 -646979 -776531 -728506 -527239 -352335 -334456 -346759
17448 -346759 -188320 82195 297982 394409 330776 133603 -141505 -403290 -379636 19314
17438 19314 563869 1115185 1606651 1895167 1881717 1586976 1082389 565894 148556 -353885
17428 -353885 -923671 -1262668 -1291684 -1247548 -1240909 -1213601 -1162607 -1118240 -1068447 -1014347 -969014
17417 -969014 -927956 -857020 -681836 -364551 57647 486724 896756 1180490 1194724 987904
17407 987904 609468 176185 -238209 -590948 -713440 -533226 -179864 188051 433678 475363
17397 475363 361430 269762 394424 721717 994437 1003061 806743 626130 606248 611384 510966
17386 510966 420089 466118 608592 684001 525770 152813 -207436 -367785 -371680 -268706
17376 -268706 -24828 344444 738713 1018953 1127020 1113620 1176460 1397914 1583839 1661598
17366 1661598 1715337 1726394 1637017 1476541 1301351 1075955 866049 773819 720628 587999
17356 587999 434285 394961 478440 443593 101594 -401672 -825597 -1078543 -1245181 -1424047
17346 -1424047 -1586574 -1661869 -1653126 -1529081 -1334640 -1120559 -774321 -248207 268708 520677
17336 520677 464221 250514 73671 66517 226142 408937 481561 402280 264600 263822 500166
17325 500166 878141 1227844 1507788 1740076 1894401 1981148 2071815 2097655 1924613 1512612
17315 1512612 932904 333711 -151238 -402140 -366931 -140553 95315 169358 9261 -261218
17305 -261218 -440159 -583498 -836144 -1148412 -1389744 -1501132 -1441553 -1238671 -1087415 -1032992
17295 -1032992 -981170 -924078 -794799 -454529 -8267 317694 561235 867137 1151551 1267415
17285 1267415 1179309 977006 771253 602416 512199 609820 884993 1163723 1345396 1407357
17275 1407357 1238625 913034 660090 544420 533479 604062 629391 507517 313024 151702
17265 151702 126710 195466 183892 15160 -229390 -386967 -318431 -40866 220795 226495 114781
17254 114781 138194 250834 327459 382410 474976 510684 357620 53983 -237815 -432152
17244 -432152 -511910 -484943 -428408 -360223 -303296 -259787 -227899 -150323 -26146 10817 -31789
17233 -31789 -31731 65936 177689 240230 235661 239413 349414 562818 915084 1306020 1536816
17222 1536816 1538608 1359536 1069926 720910 279654 -315556 -841029 -973624 -807376 -754670
17212 -754670 -959033 -1156020 -1084678 -781195 -455339 -230070 -153211 -287562 -584463 -878862
17202 -878862 -1100348 -1274765 -1320465 -1185376 -982472 -792779 -622458 -484299 -381917 -261157
17192 -261157 -127467 -66391 -106620 -221308 -415253 -689003 -1068457 -1483379 -1729568 -1632636
17182 -1632636 -1259348 -805163 -407871 -110534 86068 169163 139710 15296 -161814 -331636
17172 -331636 -366069 -213169 70206 444770 673770 529842 236548 110750 161794 304011
17162 304011 480418 599337 541802 270348 -130186 -514293 -810735 -1167224 -1738456 -2381304
17152 -2381304 -2906861 -3199761 -3186767 -2924559 -2594727 -2295197 -2011729 -1659102 -1212578 -794015
17142 -794015 -522103 -379013 -268043 -151422 -73176 -46008 -116265 -314803 -526019 -544913
17132 -544913 -292726 73355 353742 356148 97721 -187176 -444138 -731118 -888860 -814927
17122 -814927 -748238 -864877 -994067 -1000904 -944980 -919832 -961414 -1084526 -1263328 -1450712 -1592333
17111 -1592333 -1665402 -1740676 -1819399 -1909071 -2054294 -2232018 -2380852 -2380715 -2217746 -1953450 -1653463
17100 -1653463 -1437706 -1331930 -1159531 -834004 -486926 -206912 -43991 -23075 -56725 -37834
17090 -37834 -3619 -128014 -504730 -987380 -1369563 -1556737 -1483895 -1228630 -991982 -895345
17080 -895345 -905642 -904824 -901469 -1001797 -1159352 -1256469 -1222442 -1163493 -1258465 -1437035 -1522503
17069 -1522503 -1466187 -1288255 -1000612 -772559 -743786 -786953 -834036 -986371 -1280473 -1554888
17059 -1554888 -1646250 -1582454 -1508342 -1452036 -1268598 -832153 -221710 293142 489304 364974
17049 364974 112385 -69368 -116304 -141566 -302513 -522951 -639515 -629474 -496990 -311093
17039 -311093 -169809 -113211 -73638 12251 71710 60985 155732 485912 927554 1193298 1228633
17028 1228633 1259247 1265932 1086040 854504 739995 709109 642348 433803 130985 -130269
17018 -130269 -286769 -344050 -290844 -178069 -43009 95641 144508 80933 72440 212157 393697
17007 393697 503221 429689 180305 1179 62763 306509 483124 470838 388379 442289
16997 442289 606797 690093 671542 648990 671281 647174 477150 295026 312894 410778 313717
16986 313717 52528 -51969 160189 515109 858420 1098806 1160275 1003029 692107 371993
16976 371993 76694 -196235 -364668 -425199 -426179 -388995 -350528 -268520 -101683 51001 -36813
16965 -36813 -324877 -480293 -375683 -152236 109703 423926 680549 714542 592677 475771
16955 475771 369052 205339 -62441 -388800 -598424 -510665 -140725 308823 593753 625484
16945 625484 538843 490842 591101 804553 985923 962324 712496 389454 143601 55113
16935 55113 -12701 -209731 -412055 -471871 -408036 -299636 -208586 -253139 -442157 -617446 -792873
16924 -792873 -1054794 -1294236 -1366098 -1243513 -1001796 -739901 -490123 -245201 -61071 -23918
16914 -23918 -56779 37308 307987 528376 494030 291273 37826 -124503 -60824 222248
16904 222248 492118 381085 -57652 -455554 -584712 -437500 -189705 -125039 -374082 -774326
16894 -774326 -941617 -740093 -344025 228 111391 78546 10681 -76169 -91548 24111
16884 24111 192944 282619 232250 8082 -357361 -733209 -1037270 -1266103 -1394998 -1411779
16874 -1411779 -1356159 -1363790 -1523324 -1737985 -1787309 -1594600 -1369821 -1124584 -787218 -460270
16864 -460270 -206487 11896 257350 497164 625135 644086 689375 774208 711018 437430
16854 437430 124956 -90431 -284885 -539058 -747565 -817271 -751042 -632803 -556805 -504887
16844 -504887 -404045 -231304 -96664 -141778 -385151 -707819 -949657 -1009424 -901014 -719082
16834 -719082 -643527 -755733 -965215 -1142759 -1221026 -1188226 -1024871 -753834 -489876 -362862
16824 -362862 -294443 -87022 164932 218515 100432 -14046 29820 206121 329312 306321
16814 306321 228886 259923 411492 585984 646855 518112 337122 175173 9423 22576
16804 22576 312403 674479 912970 1014793 1066369 1059415 897040 643548 472726 426064
16794 426064 482255 636780 773195 851554 858038 722616 592017 669402 907747 1107759
16784 1107759 1170947 1119250 1036595 913140 697413 490834 420511 480350 559130 566324 483714
16773 483714 284766 -100718 -716303 -1333402 -1702097 -1803738 -1787917 -1779452 -1793755 -1814244
16763 -1814244 -1811630 -1845444 -1910357 -1850196 -1620061 -1342038 -1157594 -1185514 -1398722 -1648165
16753 -1648165 -1754670 -1619490 -1396795 -1279731 -1259445 -1251510 -1219892 -1177961 -1133666 -1094145 -1107540
16742 -1107540 -1114221 -1021611 -851516 -630789 -418653 -301391 -238748 -99895 59151 69793
16732 69793 -62018 -169566 -108853 -60831 -283286 -661924 -955398 -1129636 -1225660 -1260746
16722 -1260746 -1319984 -1507735 -1844841 -2171263 -2285998 -2188160 -2037110 -2010653 -2081524 -2069559
16712 -2069559 -1947930 -1734374 -1368547 -874628 -354384 78365 270352 172380 5462 -73993
16702 -73993 -204584 -482244 -713588 -705940 -456323 -18131 406276 498973 213564 -158024
16692 -158024 -338543 -314582 -259939 -331009 -494752 -615187 -679926 -709706 -650046 -445835 -330042
16681 -330042 -548824 -964086 -1313454 -1548081 -1717991 -1883242 -2156485 -2469027 -2618808 -2653898
16671 -2653898 -2779601 -2940677 -2966924 -2835623 -2601238 -2312449 -1946746 -1544196 -1173012 -909545
16661 -909545 -809746 -800312 -833446 -918592 -1082077 -1240771 -1141680 -839433 -588931 -408564 -343830
16650 -343830 -447030 -616767 -799457 -1005815 -1249208 -1440978 -1431419 -1171852 -812786 -573918
16640 -573918 -472832 -413619 -380227 -475981 -779966 -1210991 -1708239 -2169414 -2373939 -2269459
16630 -2269459 -2029468 -1789477 -1608094 -1432618 -1225254 -1051060 -883679 -708055 -611779 -584514
16620 -584514 -569151 -557667 -530435 -435633 -294328 -214499 -102670 155355 458142 610006
16610 610006 416908 -53653 -467090 -642779 -731259 -732544 -481737 -57989 400167 765095
16600 765095 839970 654639 495317 483853 508364 424969 160507 -183575 -414333 -469389
16590 -469389 -403327 -205904 30283 98814 -18564 -184204 -336147 -437582 -461633 -483580
16580 -483580 -456474 -385346 -399319 -488614 -482867 -284656 -20138 158683 255841 292716 217010
16569 217010 -7360 -343093 -644670 -785838 -782631 -709791 -663401 -697190 -758165 -828933 -904284
16558 -904284 -933683 -870968 -652012 -332726 -28507 284288 626554 930473 1099016 980496
16548 980496 515557 -112818 -634926 -842690 -720292 -379774 71779 477531 731595 896457
16538 896457 1005955 953624 671354 300675 20097 -171965 -377830 -653585 -914337 -998144
16528 -998144 -900215 -695434 -422878 -272326 -417778 -730233 -1030144 -1312725 -1523980 -1611631
16518 -1611631 -1607125 -1589590 -1642177 -1720791 -1749920 -1745542 -1661836 -1410841 -1030656 -647616 -333849
16507 -333849 -86744 95083 98059 -160094 -474034 -574305 -344971 95001 461429 574626
16497 574626 446384 309826 396314 715569 1053300 1133711 929936 663433 538098 542261
16487 542261 657740 950241 1287783 1467842 1501780 1485033 1367674 1098705 690350 228252
16477 228252 -201851 -595024 -876928 -1097865 -1311246 -1407276 -1295741 -1070167 -826610 -616081
16467 -616081 -521837 -568926 -695617 -759712 -735930 -763572 -838718 -845231 -775621 -718938 -720600 -685998
16455 -685998 -515883 -202924 101466 210467 132003 7220 -31446 52664 102298 -66397
16445 -66397 -382251 -640385 -729478 -712750 -759526 -849464 -847994 -757033 -666671 -655848 -692119
16434 -692119 -599307 -308489 47156 335992 476903 476521 348151 84404 -147074 -220467
16424 -220467 -221108 -182082 -79472 48477 165773 269107 412678 606869 837446 1106052
16414 1106052 1365812 1512663 1474075 1297280 1026973 624736 180120 -62139 -50214 68564
16404 68564 209627 285096 279628 189085 57024 -69678 -201222 -339538 -467296 -512456 -467601
16393 -467601 -352089 -118446 145909 266345 205913 -6511 -277960 -547768 -745438 -702867
16383 -702867 -447266 -266352 -317012 -535708 -821480 -1063490 -1111531 -888027 -569528 -329552
16373 -329552 -146952 34965 141923 126756 124539 235956 354847 355575 306744 301586 336110
16362 336110 449237 645174 742900 624841 383103 82223 -218677 -410044 -486077 -493678
16352 -493678 -408445 -260990 -138908 -37521 39962 25072 -108935 -390415 -724732 -942457
16342 -942457 -968547 -835412 -682478 -550232 -363585 -129675 33043 9027 -187031 -348322
16332 -348322 -321113 -174130 -35506 -31611 -179853 -389583 -493175 -399343 -173289 29043
16322 29043 103260 81524 -50298 -353786 -714787 -948830 -1005153 -903072 -696391 -434704
16312 -434704 -176677 36151 142704 100636 -26582 -80540 84428 387956 658291 779832
16302 779832 645004 300142 -56267 -292455 -426084 -484574 -422222 -242374 2683 244665
16292 244665 398785 439376 380418 277998 137094 -41447 -164124 -160776 -100207 -140513 -291260
16281 -291260 -429309 -500441 -582790 -651525 -641027 -561425 -417754 -265620 -208135 -318987 -518466
16270 -518466 -641632 -609219 -482683 -343486 -202185 -40447 72650 83821 5216 -85686
16260 -85686 -91045 -15715 55109 133722 232585 283380 302356 331534 277208 130514 39170 35571
16248 35571 100388 214433 246044 85686 -271806 -717740 -980650 -877706 -577149 -295126
16238 -295126 -179314 -236993 -387851 -555363 -680362 -779206 -823445 -699110 -461990 -313022
16228 -313022 -273033 -282258 -419536 -760338 -1154761 -1419571 -1492358 -1436454 -1341575 -1225294 -1079738
16217 -1079738 -956992 -895349 -868024 -894407 -1028595 -1170324 -1184521 -1073907 -944560 -882446
16207 -882446 -829769 -681209 -413928 -66598 281549 515806 580594 532906 473584 317460
16197 317460 -129487 -821459 -1491326 -1901922 -1887367 -1496747 -1034430 -749314 -710358 -835543
16187 -835543 -947947 -960252 -993487 -1111896 -1181168 -1197098 -1246743 -1322509 -1363933 -1366698 -1307381
16176 -1307381 -1150575 -966400 -805007 -727914 -734433 -731122 -599088 -265234 159597 471945
16166 471945 590483 514839 249100 -100132 -380408 -532610 -551771 -390047 -168950 -246858
16156 -246858 -655707 -984705 -943941 -565571 -11931 506705 790650 843749 758309 626941
16146 626941 493213 365886 338824 522686 772798 784833 545794 318318 252606 265058
16136 265058 132701 -195214 -576545 -864382 -881819 -620477 -342541 -238845 -289186 -417665
16126 -417665 -538470 -569175 -618044 -876943 -1222754 -1396246 -1364290 -1206923 -1008803 -803953
16116 -803953 -565514 -243983 63512 191973 132911 34949 55798 214989 409809 518730
16106 518730 465988 339126 275628 316579 410431 421893 276259 12198 -225001 -364213
16096 -364213 -444653 -521215 -584857 -584400 -455657 -185775 159002 465820 633682 657466 603936
16085 603936 580013 605037 579998 455913 201541 -148499 -491069 -792440 -994400 -1028288
16075 -1028288 -937156 -761951 -504079 -199745 -20468 -102806 -362113 -590507 -642564 -571807
16065 -571807 -595591 -761155 -1074859 -1518632 -1873002 -2095788 -2271090 -2305580 -2064937 -1612913
16055 -1612913 -1153469 -866242 -812806 -973965 -1204095 -1269299 -1122020 -886179 -710233 -611573
16045 -611573 -525283 -497247 -622670 -927507 -1280069 -1466025 -1347206 -1016870 -680729 -403169
16035 -403169 -238779 -261561 -278850 -84002 195057 378997 452293 444169 390101 290984 161450
16024 161450 45384 -36537 -8355 207133 513236 781881 1064994 1337004 1452126 1420305
16014 1420305 1314636 1232640 1245274 1218126 1052581 912760 965213 1092970 1084161 892835
16004 892835 646767 421071 243678 62829 -113917 -157119 -46631 102734 218975 357703
15994 357703 482864 550920 628555 745735 808238 728475 533483 358413 290575 328238 356337
15983 356337 244305 94267 22713 -12037 -17239 815 7047 41595 120664 248908 420305
15972 420305 572470 635630 632948 555834 384793 247686 248595 276842 178336 -86818 -365486
15961 -365486 -586047 -853930 -1126931 -1283790 -1362533 -1318774 -1035000 -579493 -134039 141187
15951 141187 169235 47689 -161570 -503928 -823667 -940338 -871177 -759484 -677231 -469021
15941 -469021 -48055 352670 475663 353102 242966 327865 524529 626330 561889 320988
15931 320988 -100203 -527291 -675663 -463036 -159834 -16584 -26723 -89970 -214592 -404957
15921 -404957 -555066 -619506 -556248 -369895 -100561 233366 654812 1116905 1448175 1480692
15911 1480692 1174827 739160 345937 77876 -105367 -329721 -485147 -428836 -233495 -65784
15901 -65784 -26539 -54153 -73377 -117096 -203863 -223125 -8508 409943 792508 929001 879740
15890 879740 808654 794468 826303 854496 906037 1096920 1477350 1914238 2218635 2354342
15880 2354342 2406115 2438201 2355969 2092942 1751497 1438090 1219146 1130777 1074377 899248
15870 899248 648890 465163 417934 455942 474536 489770 572554 646498 659276 659035 660729 661039
15858 661039 590824 378139 107052 -81579 -272999 -515325 -652644 -639930 -570937 -512022
15848 -512022 -412106 -241468 -141358 -198623 -326341 -381523 -355103 -332322 -299646 -234305 -175272
15837 -175272 -236649 -429242 -547980 -487200 -337681 -301279 -356897 -200316 140265 415015
15827 415015 536426 463199 282523 225785 402142 685908 900859 962370 932807 961346
15817 961346 1098370 1198231 1103817 834761 474998 92494 -177413 -231905 -130007 -10719
15807 -10719 30377 46315 115913 169987 173334 196704 279091 301323 140455 -122406 -363330
15796 -363330 -516538 -546813 -507722 -464405 -398992 -260579 -24596 271314 514424 701401
15786 701401 939600 1242665 1516245 1561361 1343007 1129899 1075795 1031482 902598 854579
15776 854579 1067081 1571827 2126939 2375244 2342029 2236002 2124347 1926498 1529163 970347
15766 970347 368704 -163999 -573779 -799131 -778598 -523315 -64424 409954 607018 480973
15756 480973 191130 -125738 -319560 -273471 -4662 260652 336540 214359 -38200 -397399
15746 -397399 -742496 -790382 -448088 34914 311142 229343 -85072 -329917 -387635 -469928
15736 -469928 -647796 -667703 -427500 -199989 -220213 -296125 -171146 166006 665894 1175538
15726 1175538 1512155 1711203 1833781 1798771 1596360 1339687 1194088 1171210 1071536 763473
15716 763473 310450 -133380 -440665 -594281 -692270 -776918 -811922 -764697 -611946 -350151
15706 -350151 -72844 70670 99256 27965 -227710 -634207 -939066 -1029004 -1028800 -1000146 -915440
15695 -915440 -783028 -648075 -516075 -504473 -709416 -963497 -1007553 -836780 -683778 -688884
15685 -688884 -794800 -878234 -1003990 -1263675 -1528470 -1690561 -1695186 -1542091 -1301945 -1034788
15675 -1034788 -846031 -843974 -1066128 -1422721 -1732451 -1738930 -1408357 -982101 -598545 -288950
15665 -288950 -111014 -61274 -16246 127436 273743 346500 354698 354490 418663 527317 561685
15654 561685 422819 231738 127617 133626 244612 343415 267409 96399 -10942 -104077
15644 -104077 -278065 -447449 -480739 -464856 -605622 -854376 -1074723 -1348552 -1707905 -2007930
15634 -2007930 -2174674 -2268615 -2411020 -2573125 -2610801 -2537854 -2369588 -2152384 -1997206 -1939740
15624 -1939740 -1909618 -1873279 -1847684 -1780319 -1672526 -1564197 -1442021 -1345023 -1343894 -1410682 -1455716
15613 -1455716 -1437265 -1407573 -1461494 -1548088 -1495330 -1220726 -810089 -414998 -122833 18641
15603 18641 -24617 -147174 -208325 -268853 -398323 -532795 -543045 -339010 18618 358015
15593 358015 629170 887023 1169143 1428497 1608168 1803398 2105005 2425276 2624353 2693839
15583 2693839 2681633 2518501 2080991 1370212 639458 187287 86984 146592 253439 310770
15573 310770 223539 81759 -36704 -121993 -213321 -350972 -446998 -406139 -279676 -152329
15563 -152329 -24082 139427 413891 756314 1106302 1389235 1472204 1401673 1361431 1445620
15553 1445620 1591758 1721698 1895196 2097733 2165063 2041161 1746935 1339335 921576 462642
15543 462642 -4936 -247596 -172712 -13102 -4014 -14867 180393 534237 849786 958732
15533 958732 833173 586651 356789 185126 72790 39962 94986 185544 266358 308886
15523 308886 285467 252429 272265 352052 451433 598676 835419 1050705 1132753 1069264 860999
15512 860999 617392 523065 651158 886260 1004553 889007 617070 372847 250103 236601
15502 236601 319334 392300 394793 433486 596703 857206 1044037 1043562 934918 875573 859207
15491 859207 696848 349160 -40667 -411432 -820753 -1195795 -1394401 -1342123 -1086116 -715304
15481 -715304 -267680 200694 572207 722173 626864 441647 394104 572643 822861 919373
15471 919373 829837 660223 514770 392533 219203 9529 -130531 -189093 -225129 -268493
15461 -268493 -293450 -239248 -142907 -91096 -157139 -327279 -460452 -498551 -487959 -385364 -196887
15450 -196887 -61268 -22247 -30127 -139045 -389977 -683743 -846702 -787755 -570474 -334209
15440 -334209 -248250 -281057 -317775 -370071 -371081 -247877 19905 401577 785112 1013917 1082366
15429 1082366 1187683 1354802 1469794 1553112 1579466 1461229 1227002 994856 786748 520982
15419 520982 225212 19384 -71845 -170030 -422434 -808187 -1179064 -1490235 -1817647 -2091682
15409 -2091682 -2196421 -2133207 -1915426 -1609558 -1373027 -1245810 -1163863 -1099781 -1078175 -1027820
15399 -1027820 -853231 -577172 -367314 -313431 -365613 -529093 -714463 -780632 -693254 -485060
15389 -485060 -248607 -127118 -234471 -471588 -603737 -583534 -511411 -466058 -591302 -903526
15379 -903526 -1090710 -808263 -80542 701876 1252704 1511084 1507415 1395695 1213495 922737
15369 922737 608149 390525 252868 124007 52630 63201 121101 205083 392109 810847
15359 810847 1335551 1725449 1932572 1923584 1697873 1419683 1226152 1089838 900934 621736
15349 621736 264508 -206363 -759842 -1273597 -1605748 -1742821 -1793276 -1823449 -1834436 -1861213
15339 -1861213 -1904166 -1871440 -1700245 -1380831 -967499 -567883 -217291 104265 418387 606020
15329 606020 526773 308776 47733 -208732 -356106 -381329 -307924 -170572 -68184 -46889
15319 -46889 -60710 -132783 -313877 -425245 -245267 -6847 -52445 -357568 -710203 -942017
15309 -942017 -1061254 -1168429 -1285594 -1317774 -1185590 -930987 -640211 -360919 -135239 84916
15299 84916 262906 286099 190586 39118 -188119 -527327 -948061 -1335053 -1563150 -1636751
15289 -1636751 -1618840 -1527759 -1463855 -1577994 -1837882 -2086519 -2234352 -2284267 -2231281 -1990229
15279 -1990229 -1521790 -949699 -487074 -269309 -196586 -150762 -109865 -61513 -41113 -43940 -33954
15268 -33954 -60514 -135703 -221219 -209427 16573 416915 711896 742565 676961 646652 653422
15257 653422 705345 810435 971347 1199983 1393455 1510675 1618446 1712301 1795742 1845834
15247 1845834 1781287 1546922 1168551 740753 247770 -271095 -634710 -824177 -877860 -850305
15237 -850305 -874297 -993676 -1180247 -1384968 -1545130 -1659594 -1752616 -1874669 -2025108 -2094875
15227 -2094875 -1990197 -1676363 -1281408 -968129 -662669 -358485 -246832 -379910 -571662
15218 -571662 -612138 -591357 -640758 -623810 -400030 -47699 221057 362383 406352 338426 213508
15207 213508 102482 18573 -55281 -93889 -67025 93461 332817 486566 556314 638955 762849
15196 762849 818666 693201 425839 51082 -475950 -1071159 -1543783 -1786811 -1851228 -1777651
15186 -1777651 -1661215 -1723070 -1942654 -2053797 -1859589 -1505921 -1306468 -1391694 -1590141 -1645996
15176 -1645996 -1474412 -1130102 -827638 -810475 -1057975 -1269295 -1230314 -991366 -623734 -283730
15166 -283730 -164827 -275503 -525596 -844946 -1080662 -1147379 -1123966 -1023989 -816179 -528800
15156 -528800 -306488 -320191 -578459 -904229 -1136181 -1245072 -1216850 -1104055 -1059059 -1075770
15146 -1075770 -1058449 -1044172 -1076573 -1062876 -977749 -938368 -981426 -941419 -692120 -306648 104528
15135 104528 473683 750987 915151 1063370 1200837 1215853 1148999 1049053 947715 887056
15125 887056 787496 549151 263811 72543 52703 230561 547519 773834 813213 844108
15115 844108 943908 962829 828713 664025 510252 294614 89437 -26157 -6724 128665
15105 128665 293683 441868 473698 365747 260825 276803 383298 559351 740438 729752
15095 729752 466135 149871 12327 66823 221338 496120 869187 1206613 1427526 1451099
15085 1451099 1199196 773504 438423 359309 445003 503580 362825 69871 -130759 -186933
15075 -186933 -277226 -499210 -776719 -1042300 -1298861 -1509338 -1487288 -1193005 -815763 -598091
15065 -598091 -674556 -970611 -1321347 -1677191 -2046543 -2280054 -2278158 -2151374 -2008707 -1839518
15055 -1839518 -1594170 -1251353 -834834 -320527 274487 751126 937780 895726 775418 682983
15045 682983 619916 559831 543096 566372 576876 478766 189139 -133838 -258782 -166353 -52042
15034 -52042 -114227 -324446 -557320 -714265 -733386 -648305 -598004 -594548 -511103 -288326 80535
15023 80535 489026 761283 890605 972172 1024962 1022613 947246 803223 619367 442788 214764
15012 214764 -97696 -388431 -601530 -656480 -467702 -103362 278276 572125 709102 693432
15002 693432 599405 522183 500153 544650 717762 894605 886190 697046 480761 330767 205552
14991 205552 49188 -154424 -399032 -645072 -786357 -761295 -637541 -511523 -434183 -432248
14981 -432248 -518993 -706258 -931268 -1028851 -898513 -631175 -264449 186059 662455 1066490
14971 1066490 1212349 1059840 657851 24223 -690325 -1236365 -1431240 -1307491 -959098
14962 -959098 -420895 110890 333259 217274 -4589 -251405 -524056 -740186 -900299 -1090965
14952 -1090965 -1296278 -1422506 -1450784 -1409221 -1268250 -1008564 -692902 -411762 -133951 63380
14942 63380 21179 -322842 -768304 -1033167 -1096904 -1066019 -1029995 -1099340 -1263368 -1415538 -1525149
14931 -1525149 -1664238 -1785323 -1799302 -1712252 -1506608 -1202062 -935214 -797827 -721517 -658414
14921 -658414 -594847 -474106 -215434 139840 404272 476895 374524 122228 -227350 -497214
14911 -497214 -528961 -361697 -35940 392627 741556 916080 940045 851986 698079 509990
14901 509990 268062 -18384 -242583 -268597 -112615 187784 555782 797274 855522 839136
14891 839136 807009 761604 682687 535888 328011 80068 -126871 -196731 -146223 -15113
14881 -15113 214218 467822 647803 699917 574672 336940 123549 94111 356906 804837
14871 804837 1157544 1233482 1112965 930266 684446 347014 -37251 -409244 -723589 -977396
14861 -977396 -1218939 -1398051 -1401125 -1224242 -1017611 -954475 -1000944 -1014030 -901941 -672364
14851 -672364 -497669 -528834 -713595 -842046 -867712 -968945 -1177803 -1362277 -1392303 -1244770
14841 -1244770 -885139 -395064 19394 318119 511220 444625 86403 -361115 -720023 -976701
14831 -976701 -1174174 -1360611 -1483758 -1495832 -1452238 -1369173 -1243329 -1123117 -1022291 -880436
14821 -880436 -779035 -822733 -907678 -967390 -1035700 -1094354 -1143130 -1218933 -1347255 -1508492 -1724582
14810 -1724582 -1977597 -2106546 -1972774 -1601511 -1144800 -741471 -407135 -175037 -33141
14801 -33141 139094 352882 419965 255969 -9293 -199226 -210482 -39983 178014 277219
14791 277219 321697 505246 768430 872325 858497 867713 955046 1080510 1118658 1008215 748923
14780 748923 388921 15624 -233494 -363280 -520299 -719324 -877475 -880114 -677709 -296726
14770 -296726 203734 609314 744920 643277 453977 371038 488193 616293 539058 309519
14760 309519 74135 -98297 -274211 -571318 -1022148 -1429831 -1563047 -1430280 -1177100 -923694
14750 -923694 -681554 -376684 -66726 57598 31060 1503 5248 60330 174058 284442
14740 284442 339920 368341 377379 332352 272209 314810 398797 390481 304598 183175 57766
14729 57766 713 -19987 -111937 -209096 -260886 -362625 -485869 -516014 -441154 -315604 -222663
14718 -222663 -240602 -391548 -633845 -847569 -881303 -758922 -665708 -594898 -336292 167712
14708 167712 692639 967174 945705 720696 396984 -2772 -359695 -565725 -611260 -455322
14698 -455322 -218004 -39204 54927 65534 -41443 -278091 -623719 -939660 -988245 -759808
14688 -759808 -477902 -299950 -256521 -247581 -187240 -106319 -34221 38931 118269 258857 462924
14677 462924 642300 737159 693614 608518 606344 577300 346944 -154773 -816857 -1354689 -1599345
14666 -1599345 -1660768 -1709361 -1760793 -1736900 -1644160 -1481227 -1271878 -1073945 -950435 -953532 -999474
14655 -999474 -874662 -430456 188988 725431 1084325 1314149 1431777 1407204 1349239 1382734
14645 1382734 1451747 1412601 1219598 1007659 881886 719551 403005 -34086 -506798 -867541
14635 -867541 -1010244 -972134 -936447 -917200 -786536 -567674 -290814 48795 322676 442878
14625 442878 465378 336320 50313 -200352 -329308 -387803 -407974 -459987 -611749 -773896
14615 -773896 -786050 -648526 -544514 -587001 -696596 -822880 -919108 -886959 -736626 -556272
14605 -556272 -470978 -540999 -600758 -485371 -280230 -152067 -110295 24359 300962 606377
14595 606377 772578 672049 337514 -188261 -872794 -1587067 -2146456 -2477814 -2538588 -2365438
14585 -2365438 -2103616 -1835005 -1602025 -1395151 -1228137 -1226309 -1326624 -1200748 -723855 -130953
14575 -130953 287302 444003 394256 215981 46250 -18414 -58408 -212136 -429745 -549349
14565 -549349 -527042 -421688 -287678 -158724 -74088 -50378 9554 134539 127522 -136276 -466781
14554 -466781 -651181 -696266 -684243 -620343 -522204 -450483 -346446 -98093 194874 376540
14544 376540 457713 464296 486590 709435 1095251 1403245 1457140 1258762 893197 375685
14534 375685 -191117 -622343 -816033 -810605 -671362 -477422 -347508 -358180 -482960 -662719
14524 -662719 -872262 -1027490 -1051917 -873222 -573071 -385112 -420086 -689765 -1052713 -1310400
14514 -1310400 -1422993 -1352725 -1189597 -1056866 -926495 -798503 -720910 -735355 -833558 -1008402
14504 -1008402 -1243416 -1475163 -1627414 -1630308 -1480579 -1142633 -710540 -339340 -32715 142922
14494 142922 176963 71469 -208681 -508766 -661120 -687719 -692386 -794014 -1010343 -1252522
14484 -1252522 -1403963 -1340645 -1004722 -531675 -94758 196465 283512 215109 46205 -138223
14474 -138223 -248546 -319032 -433699 -585080 -717331 -807474 -892735 -1049674 -1275805 -1430065
14464 -1430065 -1444824 -1410218 -1454713 -1596560 -1623175 -1471695 -1354170 -1297870 -1228873 -1046332
14454 -1046332 -677586 -312601 -137178 -219725 -480821 -676469 -715276 -709878 -685593 -692471 -783860
14443 -783860 -748722 -448405 -50605 190761 140590 -40193 -137159 -67441 129585 308507
14433 308507 440465 564831 717886 869614 967397 935519 636389 146062 -222886 -417374
14423 -417374 -565279 -707260 -825359 -874048 -917538 -1001876 -1078557 -1077094 -982585 -796320 -468990
14412 -468990 3675 445688 652674 508564 103408 -297842 -591356 -739134 -739510 -662349
14402 -662349 -600042 -630184 -772530 -919964 -873066 -700271 -571583 -530857 -554642 -573713 -585909
14391 -585909 -583827 -515451 -361039 -191593 -140605 -237412 -319549 -359432 -419581 -474275 -498971
14380 -498971 -511060 -573912 -625354 -576339 -401096 -158802 27108 113041 136730 159974 311290
14369 311290 570769 716377 609921 351020 91044 -169170 -425607 -594760 -726922 -866135
14359 -866135 -951459 -922161 -824898 -758463 -738780 -750007 -790152 -846678 -839219 -705490 -471235
14348 -471235 -186697 104467 423259 796826 1164744 1434646 1541302 1462578 1299366 1148199
14338 1148199 990407 758922 429803 37547 -405702 -809467 -1064496 -1126668 -1029110 -894131
14328 -894131 -756900 -572356 -370703 -175146 82669 364625 498598 439039 321186 212162
14318 212162 59690 -183289 -455309 -709778 -977237 -1193137 -1352021 -1554518 -1731715 -1721622
14308 -1721622 -1473318 -982803 -358802 235027 700692 886112 749091 410157 85008
14299 85008 -11933 111064 264293 261872 75589 -144982 -265946 -286056 -209642 -70819 -12501
14288 -12501 -143475 -385012 -547991 -537382 -470182 -454028 -425180 -272379 29620 369198
14278 369198 600846 721814 829188 955244 1002892 847157 490417 -4114 -483231 -749467
14268 -749467 -758000 -606816 -368458 -36371 294409 569139 832308 945788 782735 540635
14258 540635 435612 428252 468954 476715 304585 69080 -51738 -62401 -56922 -83200 -212128
14247 -212128 -519555 -904792 -1159479 -1189883 -1121184 -1136817 -1278991 -1516937 -1837099 -2065533
14237 -2065533 -2001602 -1705038 -1355496 -1056344 -824500 -590981 -371588 -212005 -71951 12621
14227 12621 73842 188404 251595 70372 -294942 -575437 -642394 -612034 -538329 -339959 -70966
14216 -70966 112865 166647 178569 184848 193714 177836 75100 -72742 -150230 -106825 -17464
14205 -17464 36898 99029 218010 336923 388583 412318 383967 166214 -246789 -724595 -1124702
14194 -1124702 -1399047 -1561081 -1621141 -1588077 -1380341 -978347 -521640 -150467 23247 -64243
14184 -64243 -257650 -294077 -233863 -278254 -511728 -826102 -1090604 -1280973 -1379471 -1408689 -1380616
14173 -1380616 -1376723 -1429378 -1431762 -1357443 -1293864 -1306459 -1271577 -1053404 -748104 -459593 -243280
14162 -243280 -126590 -110681 -171270 -245635 -301611 -387604 -580504 -792511 -749900 -503373 -439468
14151 -439468 -708387 -1171736 -1595185 -1801819 -1816852 -1779486 -1689364 -1519022 -1371434 -1244959
14141 -1244959 -1012081 -726822 -523283 -393173 -434481 -718097 -1047342 -1173285 -1034985 -740294
14131 -740294 -514865 -541743 -670235 -683320 -616904 -580610 -613514 -733137 -862033 -900887 -922612
14120 -922612 -1019224 -1092067 -950837 -558524 -152722 8318 -98206 -327257 -646902 -982027
14110 -982027 -1147122 -1068644 -818064 -570529 -516877 -610972 -641493 -564214 -412820 -252227
14100 -252227 -164546 -78950 100950 315728 355711 93478 -345599 -686753 -753487 -581909
14090 -581909 -342244 -222704 -273129 -391622 -452883 -449305 -462419 -487893 -467787 -410374 -321836
14079 -321836 -180352 20848 232522 389236 499838 583489 614736 628537 660066 654207 644046
14068 644046 641719 558777 408818 269565 227894 348058 595480 848907 1020726 1065675
14058 1065675 1031121 1010583 1050368 1100302 1030319 777751 418685 134545 32010 24116 32248
14047 32248 111015 217523 296169 486351 767134 875983 725049 386572 -12003 -272837
14037 -272837 -198114 260071 945152 1591441 1982151 2110862 2039515 1807577 1469968 1180235
14027 1180235 1074724 1029515 861863 640319 458301 307121 164909 56373 41810 67538
14017 67538 55909 64296 142831 282214 447951 594440 698662 723925 652979 476447 250490
14006 250490 145281 185702 307364 404632 269894 -107517 -529565 -700015 -494993 -68929
13996 -68929 362442 686613 871838 992641 1130640 1248646 1319498 1276111 1077219 894563
13986 894563 845235 874454 1047051 1388925 1780188 2079132 2197097 2110035 1798403 1329456
13976 1329456 896439 613140 383425 130608 -134718 -406513 -679902 -950260 -1212931
13967 -1212931 -1410073 -1513682 -1505931 -1375262 -1152328 -902176 -756097 -743366 -686228 -425069
13957 -425069 24738 521331 995449 1424434 1728327 1839648 1698765 1424763 1225058 1151346
13947 1151346 1134477 1147643 1145231 1032732 815572 558659 410180 514447 673678 656951
13937 656951 458891 122366 -230015 -431589 -469658 -382859 -223612 -126399 -151076 -231467
13927 -231467 -261161 -184164 -22465 178951 322814 321207 237702 82913 -191599 -469366
13917 -469366 -561068 -433370 -155217 155118 367253 456856 446840 319822 67245 -226061
13907 -226061 -392857 -348609 -164259 3003 93652 117059 90819 -20858 -249804 -493027
13897 -493027 -533846 -241213 213527 515900 539290 423665 373562 343523 233968 122863
13887 122863 132360 249945 359936 354499 211355 51349 -41303 -55760 19142 154807 285532
13876 285532 434555 615904 790963 889594 819029 548914 278158 269905 524944 878309
13866 878309 1117350 1140014 1017510 800915 587326 506123 572541 618749 504515 255903
13856 255903 -44193 -230783 -172781 107683 512808 943364 1246973 1310155 1131047 816076
13846 816076 441083 80896 -141281 -162013 72802 505721 843814 882679 687420 341581
13836 341581 -34204 -345595 -600507 -806949 -988556 -1158553 -1182516 -907862 -462187 -104407
13826 -104407 127792 298951 387949 389720 366517 327795 169319 -125983 -423979 -604260
13816 -604260 -672962 -652147 -576078 -529594 -536574 -482353 -200603 247089 533436 390774 -70140
13805 -70140 -517383 -767279 -833134 -810212 -715536 -453327 -119034 62829 -3402 -223475
13795 -223475 -452355 -630620 -795517 -900466 -899776 -851578 -828282 -847267 -806497 -634483 -385462
13784 -385462 -67265 243068 474924 571047 390768 -17296 -408639 -642106 -769329 -910928
13774 -910928 -1107778 -1242079 -1317523 -1346112 -1261653 -1091234 -894007 -685271 -479171 -253877
13764 -253877 34186 436923 906543 1379799 1882117 2296235 2463463 2312371 1891502 1389561
13754 1389561 1023054 734684 446594 228613 107570 76104 85773 120943 241204 500794
13744 500794 809449 1046925 1258392 1397249 1398964 1381824 1412388 1536953 1730032 1805362
13734 1805362 1701491 1550181 1469157 1381692 1180780 873266 552695 251354 -145805 -684476
13724 -684476 -1138281 -1287040 -1143819 -885283 -583455 -203115 188353 491996 674786 782061
13714 782061 853611 868666 838914 902582 1119563 1302425 1257697 1049847 867820 858128 994691
13703 994691 1086653 1001173 729729 299822 -108159 -314928 -331462 -205979 -134209 -255279
13693 -255279 -428868 -497226 -419303 -186714 157281 545025 916340 1075387 875118 488776
13683 488776 173743 -44074 -211601 -282493 -238558 -213458 -318669 -486195 -630690 -721446
13673 -721446 -740765 -697715 -583645 -394306 -129077 100297 128698 -133633 -638055 -1065422
13663 -1065422 -1149709 -929668 -585144 -326021 -202105 -237894 -434450 -610661 -623618 -497615
13653 -497615 -275450 -18166 192743 311180 274428 119594 5510 29867 143290 147649
13643 147649 -55069 -345337 -595766 -762196 -813838 -801380 -761753 -645884 -470544 -353540
13633 -353540 -362542 -435819 -510479 -620088 -754265 -848144 -885110 -896515 -855388 -744661 -577816
13622 -577816 -339396 -49259 164146 211026 129936 -56437 -283329 -463907 -649969 -799878
13612 -799878 -779924 -579387 -289038 -7101 169608 154728 -29845 -258105 -511068 -809284
13602 -809284 -1038121 -1090656 -965617 -800513 -694500 -539399 -250327 47858 221569 284797
13592 284797 372108 530220 661232 656476 467895 141160 -169092 -335937 -440464 -554433
13582 -554433 -584443 -450738 -249722 -208496 -402259 -594767 -568854 -398469 -392489 -664200
13572 -664200 -959096 -1108873 -1067770 -971552 -846139 -699621 -736113 -996645 -1325893 -1538677
13562 -1538677 -1523942 -1304580 -997669 -753700 -668988 -574160 -288683 123764 529934 801528
13552 801528 798468 541374 228760 85933 110888 179010 278603 430744 626279 838587
13542 838587 1066490 1156089 981638 703429 539971 519991 454768 207829 -134356 -398544
13532 -398544 -550096 -674032 -788474 -817283 -686614 -453883 -184285 103629 410664 728231
13522 728231 941634 913230 679837 383877 145442 48526 94923 197654 308041 413362
13512 413362 471010 418253 346287 393196 482300 574731 749769 953931 1079826 1209000 1390258
13501 1390258 1446825 1216581 860470 659128 682343 818978 872920 760586 562933 421443
13491 421443 459124 721324 1123291 1441536 1562279 1546507 1493513 1335150 979593 520098
13481 520098 94395 -133553 -52731 236355 502157 587415 552483 613888 809436 947310
13471 947310 907985 727490 517113 376003 242014 -81638 -554914 -994817 -1246404 -1306014
13461 -1306014 -1168890 -729562 -43683 653780 1232870 1669077 1866297 1835173 1790007 1815355
13451 1815355 1859178 1943805 2110992 2316547 2511389 2584436 2392353 1981175 1530141 1214161
13441 1214161 1055311 1102148 1319440 1528635 1709837 1867642 1820318 1497968 994414 431253
13431 431253 -84333 -513818 -780962 -831374 -715951 -516138 -268725 26955 318314 586035
13421 586035 834403 1004688 1029991 901077 653479 392579 234209 265298 459727 652022
13411 652022 738237 766059 788734 851992 1015057 1264595 1475198 1425364 1102011 703127
13401 703127 414745 356473 476820 609784 605160 464564 312458 310892 456424 616587
13391 616587 722390 726853 637246 541734 493968 392006 133579 -97440 -58704 205396 467452
13380 467452 632963 803212 1048445 1233104 1092470 600126 33956 -297879 -355105 -222282
13370 -222282 157647 773373 1392719 1797385 1842764 1561160 1162286 823219 642200 506315
13360 506315 221773 -34540 20391 382791 866106 1251849 1494500 1692507 1848777 1918902
13350 1918902 1923469 1903215 1859780 1756806 1617332 1451245 1242212 995835 739268 503706
13340 503706 365474 321547 325324 357699 426963 505755 603759 705393 725292 683801 675175
13329 675175 781164 941191 1012891 922395 673485 333176 -75759 -432708 -560329 -473204
13319 -473204 -230086 72844 342215 619668 890853 1075817 1089144 916520 658508 359277
13309 359277 22754 -277093 -475683 -558244 -587158 -617249 -702193 -839786 -968744 -1005164
13299 -1005164 -852513 -593735 -344549 -6876 507195 1055825 1352767 1279534 1072523 969191
13289 969191 930487 805487 608886 492646 516022 660174 846254 993708 1174743 1451676
13279 1451676 1752916 2029855 2349369 2653536 2836105 2897601 2810568 2549404 2155166 1779507
13269 1779507 1564620 1585017 1702005 1764272 1819438 1772835 1531222 1360837 1521776 1910755
13259 1910755 2347885 2656415 2709218 2616017 2642871 2857464 3005222 2891990 2606259 2445394
13249 2445394 2443940 2397984 2277665 2147507 2075992 2064184 2104465 2278863 2582447 2879562
13239 2879562 2987921 2913958 2841287 2801064 2695084 2430930 2024912 1622052 1282090 1123593
13229 1123593 1268347 1484942 1464151 1244520 1073124 1083011 1233725 1357947 1400956 1456864
13219 1456864 1525947 1592367 1724750 1888672 1968100 1914180 1903068 2132087 2562518 3022209
13209 3022209 3352171 3462578 3390495 3222437 2954256 2588444 2321098 2305221 2508954 2768011
13199 2768011 2964531 3046915 3018063 2850263 2510535 2030747 1501437 1071320 843249 657238
13189 657238 406908 306836 471064 797196 1164693 1405728 1500519 1574792 1726741 1932922
13179 1932922 1966350 1846546 1787681 1826373 1817991 1679284 1418588 1129302 928500 823628
13169 823628 770986 724792 605556 437505 317172 329467 529182 845253 1172973 1460035
13159 1460035 1685705 1783716 1778725 1790817 1916844 2196832 2441655 2431075 2239850 2098991
13149 2098991 2085741 2056183 1916317 1696590 1422691 1247290 1297437 1434010 1469547 1352788
13139 1352788 1202510 1267008 1612999 2150084 2804903 3456955 3888418 4017578 3978391 3872815
13129 3872815 3792327 3778708 3761590 3770326 3865878 3929905 3933575 3936776 3972363 4138446 4439338
13118 4439338 4711023 4948178 5146524 5132542 4883485 4565119 4385704 4411798 4552579 4707709
13108 4707709 4901001 5178165 5406571 5624167 5980750 6378229 6641330 6728730 6687332 6579423
13098 6579423 6413864 6168702 5889613 5585429 5195825 4744658 4351355 4168792 4275604
13089 4275604 4578802 4843832 4973731 5087169 5214141 5257050 5211428 5198840 5252350 5353624
13079 5353624 5491044 5616184 5687919 5622075 5484891 5526494 5753922 5982052 6136594 6244646
13069 6244646 6439205 6756426 7081757 7323567 7499569 7606175 7676700 7781963 7939065 8086419
13059 8086419 8183013 8301711 8391207 8352502 8195147 8084562 8199348 8550031 8989181 9395068
13049 9395068 9779593 10121300 10350772 10535556 10891476 11471386 12071972 12468427 12660240
13040 12660240 12907704 13297928 13749981 14212926 14649880 15065024 15499306 15934262 16284101
13031 16284101 16493821 16584475 16698212 17006156 17572890 18252758 18826093 19196489 19501216
13022 19501216 19908432 20449943 21099836 21837698 22642313 23545401 24594375 25795847 27047751
13013 27047751 28288589 29618011 31046950 32465475 33842387 35250767 36664552 38092578
13005 38092578 39598046 41269630 43213427 45417392 47811550 50405973 53203057 56114990
12997 56114990 59145397 62536469 66379061 70589138 75228265 80251119 85477315 90968092
12989 90968092 96950406 103549704 110854667 118990588 127983372 137895804 149167576 162438153
12981 162438153 178171663 196838665 219251181 246270627 278512401 316258485 358636176
12974 358636176 402065930 439180729 459624169 454725133 424119444 376795096 324629352
12967 324629352 275908231 234085513 199495923 171196072 148048450 129074083 113400678
12960 113400678 100351336 89477441 80342112 72611784 66134710 60790932 56426498 52846925
12952 52846925 49828379 47220604 44906655 42723552 40663352 38903415 37557055 36440496
12944 36440496 35461856 34753170 34256901 33850339 33540102 33281156 32969355 32646254 32462685
12935 32462685 32486731 32672382 33049375 33579836 34151122 34840211 35722162 36742228 37834058
12926 37834058 38912546 39856752 40585448 41306520 42378423 43971870 46127419 48860782
12918 48860782 52042132 55478707 59042516 62593377 65990031 69035686 71567469 73617522
12910 73617522 75381341 77148905 79141855 81513357 84449074 88082011 92377677 97238003
12902 97238003 102693997 108773953 115559140 123324574 132400187 143026058 155286873 169319717
12894 169319717 185688475 205276349 229009580 257697667 291983697 331836440 375546736
12887 375546736 418554887 452383226 466252839 453149597 415772850 364961708 312124626
12880 312124626 264135484 223460883 190113981 163031583 140995511 123078936 108420046
12873 108420046 96167612 85733533 76812045 69281670 63133345 58178980 54054276 50501568
12865 50501568 47386601 44641807 42260174 40179214 38322204 36714854 35387982 34322820
12857 34322820 33469731 32707602 31906525 31108680 30410082 29949146 29796659 29872420 30118247
12848 30118247 30389106 30534748 30577684 30696624 31006342 31373354 31663927 31907309 32176979
12839 32176979 32518951 33025697 33727981 34570471 35578342 36734589 38096579 39815531 41827011
12830 41827011 43861368 45829747 47919086 50246758 52826787 55590244 58429496 61390312
12822 61390312 64706751 68434853 72488733 76894926 81681395 86891964 92589827 98768127
12814 98768127 105429324 112757623 121005129 130383122 141108515 153425038 167816086 185106915
12806 185106915 206191894 231687618 262019172 297568789 338098742 381407249 421736599
12799 421736599 449571984 454920267 433657039 391433402 339741305 288684712 243586979
12792 243586979 205868048 175021823 149948879 129455095 112466843 98202578 86087251
12785 86087251 75803788 67173218 59972460 53910316 48697359 44139180 40108840 36564838
12777 36564838 33519431 30995720 28923370 27125958 25541503 24195037 22969910 21664320
12769 21664320 20309363 19070608 17943641 16849091 15818487 14861452 13943846 13055400
12761 13055400 12234341 11549621 10944698 10321668 9604458 8783367 8021323 7453921 7050103
12752 7050103 6779670 6653615 6660838 6785359 6833781 6610285 6175514 5631550 5068249 4624444
12742 4624444 4367063 4213105 4045480 3804653 3518353 3288260 3127155 3048946 3115659 3326390
12732 3326390 3495189 3392033 3108287 2926699 2925834 2946394 2910688 2877698 2861442 2974276 3317185
12721 3317185 3755028 4060481 4213235 4389815 4548598 4558409 4540191 4630458 4746867 4739239
12711 4739239 4524104 4179092 3856783 3556584 3213594 2907614 2666960 2353118 2002862
12702 2002862 1778485 1726750 1762163 1811572 1870550 1938414 1999302 2030076 1901850 1585992 1385964
12691 1385964 1533240 1886974 2119514 2094058 1941118 1698801 1215757 494560 -277312 -908260
12681 -908260 -1211728 -1154720 -907324 -632109 -423666 -382244 -487925 -602565 -548399 -288974
12671 -288974 43851 386031 721986 928549 966805 932142 868812 773235 732326 864914
12661 864914 1083197 1264415 1340913 1281785 1081585 821011 665575 630270 543918 347532
12651 347532 158878 45216 58945 115562 82042 -47380 -196655 -294931 -292171 -248715 -274719
12640 -274719 -372805 -452690 -413881 -162150 244561 569420 697454 773780 991697 1328679
12630 1328679 1628382 1800310 1867658 1881951 1779144 1565019 1430737 1425992 1456095 1500076
12620 1500076 1583521 1677505 1683254 1535087 1206547 666776 11425 -475746 -583829 -287046
12610 -287046 221215 612070 642307 317690 -110971 -428720 -556611 -527977 -417523 -324198
12600 -324198 -329570 -479465 -743901 -887578 -728323 -355980 -4606 168611 266636 439090
12590 439090 676191 903748 1032049 978986 762817 536953 375185 229973 116935 112198
12580 112198 213317 328784 328853 228812 156317 107311 65718 124317 390573 740722 961445
12569 961445 964803 727880 317697 -50822 -241307 -316827 -387340 -529791 -730269 -853911
12559 -853911 -779466 -521574 -233115 -77776 -175886 -413923 -447255 -113273 430351 872664
12549 872664 1011744 922473 819403 795961 767429 565545 208430 -70162 -93500 171028
12539 171028 502616 652572 600000 475420 423610 515971 754334 979541 975941 757896
12529 757896 447510 139751 -81641 -193839 -339453 -676668 -1013305 -1099031 -938948 -692583
12519 -692583 -501369 -349167 -168285 165178 653163 1098234 1287151 1197813 1022164 897685
12509 897685 808146 704131 551016 391809 258684 131900 35157 72079 308430 566583
12499 566583 694497 672406 466372 157898 -100384 -194375 -97192 7469 10594 -66029 -214633
12488 -214633 -347777 -449836 -564383 -713385 -989648 -1464025 -2046656 -2531270 -2721434 -2619419
12478 -2619419 -2403787 -2161715 -1909291 -1728848 -1558172 -1279131 -942769 -617819 -334286
12469 -334286 -94911 104725 265802 337876 384171 491632 492429 232899 -121679 -310321
12459 -310321 -245592 -84201 37138 183929 422255 724392 995999 1097763 977491 754564
12449 754564 611076 631336 682394 636713 528670 421632 315948 217784 138742 127735 153707
12438 153707 39143 -248506 -484126 -524901 -427255 -269566 -129571 -72623 2695 163803
12428 163803 282578 320138 277085 210783 114856 -99005 -382570 -663678 -908821 -1057547
12418 -1057547 -1172321 -1341657 -1461689 -1349742 -958156 -538004 -330974 -401670 -656682 -900757
12408 -900757 -970505 -956851 -955002 -800307 -407079 -26969 153899 217521 237098 212773 122301
12397 122301 -31919 -175130 -242267 -282125 -315987 -287431 -220485 -254605 -461886 -775594 -1013469
12386 -1013469 -978793 -639231 -180061 208922 439680 514274 415989 205798 150156 295652
12376 295652 433607 399179 217897 -11619 -195605 -265390 -329855 -572206 -970929 -1237037
12366 -1237037 -1215041 -1029721 -899122 -950287 -1058691 -1005242 -791931 -612129 -480756 -205481
12356 -205481 235109 544627 487023 197687 -117122 -471249 -915701 -1304298 -1427070 -1248185
12346 -1248185 -862861 -409068 -8096 328407 611069 776162 883446 1000578 1115499
12337 1115499 1245202 1289356 1118508 823217 587187 546568 751378 1018147 1179767 1266284
12327 1266284 1357335 1390030 1216150 837036 345488 -93493 -313984 -330931 -200041 40358
12317 40358 375457 746759 1027542 1164770 1275507 1506075 1879668 2219397 2285150 2092436
12307 2092436 1783851 1402667 1085112 979272 1032978 1099531 1083434 837347 352857 -117477
12297 -117477 -461541 -661135 -654986 -430819 44531 709732 1322783 1750884 2082228 2275003
12287 2275003 2156647 1807406 1465724 1216601 1105001 1161431 1312689 1536897 1952711 2535678
12277 2535678 3106556 3513373 3639985 3582290 3566486 3672360 3897386 4242209 4666007 5127968
12267 5127968 5552697 5862445 6034800 6111942 6316804 6815225 7513049 8142033 8385620 8136534
12257 8136534 7556558 6809618 6032055 5326756 4621825 3846380 3089376 2401294 1835479
12248 1835479 1432999 1202610 1137423 1095442 959046 813884 800968 985563 1338932 1656967
12238 1656967 1818272 1865657 1857128 1936615 2109255 2150886 1943467 1563088 1077349 601510
12228 601510 311121 258029 413149 688140 919143 1071023 1187329 1249534 1260716 1268252
12218 1268252 1254086 1159753 1100185 1128318 1078516 905460 796337 896684 1071759 1123388
12208 1123388 1132965 1323358 1745850 2164554 2251204 1973163 1528518 1089577 788068 689338
12198 689338 748881 781580 735144 702866 727942 710167 545288 281380 14150 -177238 -263981
12187 -263981 -260695 -175942 -62356 9150 18433 -28210 -129106 -275172 -386872 -318418 -89336
12176 -89336 154603 374606 542709 688050 871332 1017098 1015907 893282 793244 676370
12166 676370 444344 148450 -137149 -379786 -583486 -722534 -767775 -650808 -329290 175448
12156 175448 685003 884264 705206 429751 293247 171559 -57902 -314744 -491398 -486939
12146 -486939 -419919 -531498 -799164 -1032650 -1126092 -1059557 -920693 -925339 -1129176 -1352101
12136 -1352101 -1408498 -1315671 -1134840 -917431 -641087 -286049 21230 279127 545097 773048
12126 773048 924556 1090648 1409000 1795291 2100194 2341856 2553829 2639652 2526960 2281621
12116 2281621 1891352 1355595 868714 652119 739772 938586 1047638 1089630 1163555 1254604
12106 1254604 1415771 1804396 2337464 2583318 2433997 2260487 2274703 2336804 2201210 1832460
12096 1832460 1377869 925289 586944 504272 652047 801629 764300 599354 452865 361333
12086 361333 284783 271971 315704 320428 315824 415154 629163 840351 947271 881675 703161
12075 703161 544985 487380 566982 680640 662686 522566 348729 152080 -86781 -391258
12065 -391258 -658109 -744549 -605469 -280279 109986 476349 723880 825253 889442 1012252
12055 1012252 1173269 1249769 1128459 812568 387898 3030 -177472 -153466 -35093 111094
12045 111094 270754 434912 579952 633490 524312 203118 -235325 -583258 -757686 -748732
12035 -748732 -594882 -379716 -214475 -145846 -25319 208585 391432 440528 350144 204282
12025 204282 130470 44795 -161658 -456329 -720213 -785527 -615447 -353066 -188734 -195332
12015 -195332 -309493 -485138 -703136 -851410 -945924 -1160566 -1445315 -1646285 -1695880 -1590986
12005 -1590986 -1390010 -1177880 -960140 -702791 -435131 -193695 49334 399601 860572
11996 860572 1331479 1653580 1696022 1491928 1187879 896582 604099 313957 168800 278546
11986 278546 552882 804953 982802 1141523 1191094 1072726 899328 717511 512970 281222
11976 281222 69169 -78700 -238997 -390863 -534996 -749713 -1000850 -1198272 -1357212 -1436765
11966 -1436765 -1314451 -984672 -673117 -575072 -657999 -797799 -923461 -1047627 -1198538 -1392431
11956 -1392431 -1530761 -1557947 -1550750 -1535829 -1363414 -957837 -506629 -215434 -102246 -122250
11946 -122250 -279094 -478942 -576195 -510300 -349045 -263080 -328080 -517048 -733148 -853924
11936 -853924 -924587 -1046797 -1168458 -1213780 -1115438 -876898 -675877 -653997 -779013 -853329
11926 -853329 -693882 -394888 -174137 -27280 157824 424005 682620 855016 933824 883489
11916 883489 736273 557709 424446 441922 493088 451769 439178 550505 659152 678183
11906 678183 639565 558665 498529 506389 510722 476355 441845 391705 338241 326991 334887 342576
11894 342576 391874 420133 398030 398480 376774 271725 112657 -154970 -546766 -885376 -1051552
11883 -1051552 -1110697 -1077535 -922574 -854272 -1053700 -1349109 -1456107 -1388461 -1280511 -1126424
11873 -1126424 -1001983 -1013750 -1075538 -1054959 -985854 -946752 -884140 -747352 -663499 -782061 -1067264
11862 -1067264 -1390883 -1625955 -1647410 -1453770 -1169488 -1010871 -1032352 -1094276 -1063178 -960067
11852 -960067 -882245 -794233 -631069 -393283 -133862 68221 190204 223098 179025 135860
11842 135860 178080 300936 521912 844417 1144731 1297699 1302630 1259876 1253835 1298130 1374851
11831 1374851 1418086 1243129 801745 279548 -180806 -583746 -845546 -838127 -663207 -446800
11821 -446800 -158293 207279 588744 923656 1135696 1121644 877727 614233 562746 663186
11811 663186 631973 311856 -180415 -617090 -839323 -898862 -901830 -873866 -826888 -766413 -662217
11800 -662217 -496791 -293856 -120376 67921 302719 501416 686330 855132 986731 1072739
11790 1072739 959622 574145 109993 -245429 -438243 -471080 -369834 -153500 56339 155978
11780 155978 152595 198488 456866 911352 1380448 1655941 1520963 950357 163760 -578258
11770 -578258 -1303190 -1731486 -1578007 -1245545 -1134444 -1233208 -1174356 -850807 -413581 -7648
11760 -7648 256655 359863 314546 101625 -162717 -227738 7878 438803 922292 1267524
11750 1267524 1292366 1022350 715594 574855 610208 687488 676120 613609 528508 417642
11740 417642 241085 -110363 -555306 -899511 -1036327 -921265 -653324 -490813 -615165 -922828
11730 -922828 -1163645 -1308547 -1553645 -2023693 -2422436 -2383081 -1966854 -1601108 -1536111 -1569057
11720 -1569057 -1439967 -1148723 -865416 -675220 -545789 -433091 -355208 -323555 -235619 -16372
11710 -16372 266378 450575 428084 287579 205654 136569 -92790 -416240 -643938 -700299
11700 -700299 -556458 -248756 13166 58383 41399 133109 275116 350821 347287 301455 203121
11689 203121 69636 -88350 -283377 -433656 -458099 -407266 -327772 -183240 -25447 -58899
11679 -58899 -334954 -616214 -692160 -509818 -163175 236283 650673 1059863 1415048 1644291
11669 1644291 1656350 1382995 896717 328924 -204028 -501642 -515372 -443974 -517230 -788415
11659 -788415 -1048111 -1104009 -1038599 -897133 -616389 -300583 -77024 80599 255517 578053
11649 578053 1025747 1483656 1908091 2092005 1861022 1367242 923904 642565 491158 452880
11639 452880 460678 427861 378971 359964 404897 572055 771016 787139 524555 166493 -53206
11628 -53206 -176362 -308640 -422055 -481337 -564326 -701669 -810177 -782141 -561834 -171312
11618 -171312 244522 531637 594363 522531 403581 253314 228614 369732 562321 759526
11608 759526 947741 1076068 1131900 1173274 1193606 1115928 827837 331118 -176574 -576092
11598 -576092 -904278 -1189992 -1370591 -1479911 -1605613 -1725338 -1829611 -1910851 -1964565 -2051204
11588 -2051204 -2172228 -2193798 -2003482 -1595565 -1020046 -361343 278317 756369 995677 1046176
11578 1046176 928970 659734 362485 273397 447857 703953 873387 878584 636195 225076
11568 225076 -127038 -273861 -234133 -188590 -178791 -89762 69214 215854 400167 600096
11558 600096 680796 594060 443658 381850 394928 262552 -81770 -377876 -441164 -341904 -237656
11547 -237656 -319753 -623480 -878041 -876799 -640729 -351002 -169931 -73551 31748 176833
11537 176833 358576 576400 672975 506927 217004 15682 -8194 93261 215290 352295
11527 352295 496689 608043 692531 767332 786489 653457 351993 -25976 -359287 -531307
11517 -531307 -520178 -333229 -118188 -21319 -50816 -228067 -529545 -706815 -558063 -121122
11507 -121122 386269 713699 812769 827421 860020 992435 1267085 1464488 1355329 1013118
11497 1013118 690209 490368 268200 -106983 -464469 -565121 -449213 -238157 -37324
11488 -37324 36424 1063 11171 119965 243097 339866 415483 498278 699953 1003581 1024814
11477 1024814 577196 62422 -180458 -184887 -29184 81759 26194 -95214 -234840 -335990
11467 -335990 -313393 -254704 -312468 -502120 -659181 -674758 -636037 -666712 -695858 -671189 -644872
11456 -644872 -584539 -521026 -574635 -620093 -463379 -188064 -7040 16968 -52603 -152386 -111927
11445 -111927 101039 291011 364901 318346 138891 -63526 -50369 246636 606499 842599
11435 842599 988846 1135696 1324209 1479566 1469383 1331465 1202632 1123343 1017912 829500
11425 829500 651556 587233 685492 949130 1196779 1238840 1130717 1153593 1476354 1948796
11415 1948796 2307409 2433268 2535407 2767506 2973152 3032730 3012197 3067598 3332282 3790363
11405 3790363 4328395 4917362 5582157 6422929 7540434 8642056 9187532 8777184 7515297
11396 7515297 5912048 4435235 3401485 2855831 2606058 2530268 2584470 2625582 2487209
11387 2487209 2202293 1882440 1577285 1302885 1046668 853231 780367 833410 952462 1060198
11377 1060198 1098226 980132 654879 295410 155819 198179 149668 -67767 -202194 -197917
11367 -197917 -234116 -345067 -468570 -542052 -562040 -497880 -309739 -126967 -39860 20783 62408
11356 62408 104586 197889 315042 396030 444513 439658 333165 271940 394765 677365 990466
11345 990466 1220640 1377433 1500520 1572691 1601363 1598292 1503106 1269680 981237 736744
11335 736744 535344 394683 365190 403703 415465 395092 352131 284363 260556 279623 259019
11324 259019 147555 9764 37949 242525 383780 266160 21048 -130058 -204558 -216453
11314 -216453 -109042 119668 405984 665136 872405 1017581 1127433 1168053 1042306 710950
11304 710950 335442 50818 -229222 -520311 -651943 -592789 -507397 -533697 -651925 -814305
11294 -814305 -991878 -1059106 -881583 -562732 -373527 -426882 -610731 -800650 -988587 -1140608
11284 -1140608 -1181381 -1164512 -1207663 -1285028 -1380115 -1575227 -1831170 -1943704 -1784751 -1389859
11274 -1389859 -915572 -534935 -305994 -236085 -259961 -248918 -190180 -119575 38319 314733
11264 314733 599275 777835 895316 1025578 1169071 1239890 1164252 862463 394031 -66298
11254 -66298 -454452 -709111 -813198 -863931 -920410 -971719 -941910 -739637 -372476 70689
11244 70689 468641 707329 784784 727556 638977 588010 492115 305470 127176 79462 166646
11233 166646 295750 262580 35365 -242692 -513217 -691411 -718551 -626367 -501912 -442586
11223 -442586 -538786 -816292 -1099396 -1216741 -1210354 -1206357 -1238552 -1264099 -1209685 -1060301 -874510
11212 -874510 -742382 -690011 -646368 -564125 -369532 -42897 221030 315813 305042 241862 195291
11201 195291 188802 125616 17651 -81217 -303069 -661206 -977054 -1151838 -1248173 -1388911
11191 -1388911 -1617674 -1905893 -2150746 -2145727 -1728884 -1038099 -444703 -174474 -185488 -270722
11181 -270722 -205918 -31005 102783 136940 108474 66184 18915 -14793 49125 224417 402025
11170 402025 446343 373344 362591 467640 515120 432942 411145 528505 601238 518205 454264
11159 454264 545451 688971 699365 468295 98371 -170057 -232656 -231104 -327642 -457305 -450441
11148 -450441 -321092 -130674 67008 216730 294663 290667 370546 724025 1114193 1253702
11138 1253702 1201715 1121340 1094310 1079929 1030503 978706 954489 858764 694469 585792 532213
11127 532213 422276 162869 -133139 -276576 -213547 -50126 38575 7794 -47173 -48130 -18388
11116 -18388 -112260 -389803 -649863 -682996 -470989 -245532 -178939 -167551 -98712 -30110 -125618
11105 -125618 -401397 -620761 -661962 -628265 -543156 -352999 -143869 -7719 131612 285647
11095 285647 340592 296409 268035 309375 390696 484581 597696 750192 1006961 1291782 1417227
11084 1417227 1379587 1311284 1230737 1059099 790132 458931 117587 -58931 131791 640735
11074 640735 1120527 1212562 933108 688608 691112 751506 688407 494185 246173 -37809
11064 -37809 -330843 -590616 -872810 -1187790 -1414900 -1492943 -1417906 -1230629 -974285 -677179
11054 -677179 -473836 -432029 -410013 -383309 -413070 -382333 -141850 353741 1034391 1729001
11044 1729001 2250091 2537638 2587096 2433599 2102282 1650698 1219881 937674 905020 1071403
11034 1071403 1214349 1148952 896934 649420 593632 753719 1061713 1393884 1618027 1675264
11024 1675264 1504786 1084093 515233 39786 -116484 8316 132955 -28463 -399853
11015 -399853 -733482 -888511 -845388 -648871 -393701 -224852 -186663 -225597 -354052 -491291
11005 -491291 -444571 -202564 47425 164399 145875 52130 -36619 -96400 -152178 -125795 70134
10994 70134 298264 327914 143590 -118093 -378364 -544192 -480744 -165151 318351 751791
10984 751791 830569 512311 35025 -394125 -691022 -905489 -1090705 -1147289 -1016257 -799513
10974 -799513 -636853 -524553 -510767 -667190 -845419 -860879 -691356 -441647 -209204 27637
10964 27637 343788 716041 1040912 1140387 1003744 876327 802648 695189 523656 263240
10954 263240 9076 -125702 -129236 -40337 77558 117611 107074 185879 300106 229812 -47221
10943 -47221 -364041 -600600 -796440 -1080050 -1369995 -1446870 -1260898 -897903 -411826 37455
10933 37455 282769 325860 218746 -4554 -259130 -390541 -315383 -117801 44391 87322
10923 87322 102185 202633 276199 117310 -218425 -585582 -903868 -1063451 -986073 -736261
10913 -736261 -447052 -95678 338933 654446 727175 576991 298085 79686 39860 220646
10903 220646 508183 743756 806406 666693 485590 261408 -96374 -488473 -824534 -973605
10893 -973605 -848815 -544336 -90193 347343 456710 157172 -336106 -739347 -874016 -809207
10883 -809207 -706370 -532225 -208347 103030 261676 344490 347522 273838 229593 232733 180730
10872 180730 -41418 -450310 -891311 -1162075 -1211359 -1130921 -970868 -750462 -517401 -356296
10862 -356296 -368266 -628669 -1089386 -1647867 -2185360 -2607627 -2850667 -2854616 -2684114 -2372365
10852 -2372365 -1885108 -1277359 -809437 -645160 -536212 -253525 102903 327010 293723 -67573
10842 -67573 -569687 -797464 -687908 -591808 -766533 -1146782 -1457945 -1621359 -1731040 -1798907
10832 -1798907 -1764152 -1649862 -1576935 -1604275 -1650171 -1570424 -1420892 -1355109 -1376368 -1337316 -1188907
10821 -1188907 -1093720 -1100199 -1001857 -733471 -410617 -90283 255448 522823 673157 800120
10811 800120 871704 827817 716489 670322 736653 791968 751567 706229 708697 496505 -23722
10800 -23722 -547941 -780009 -642883 -276276 177213 598324 922790 1141169 1305127 1543449
10790 1543449 1825366 1985897 1921184 1649853 1293337 948537 681889 527238 518265 599911
10780 599911 591974 404935 114227 -225137 -559099 -846821 -1096092 -1274882 -1391045 -1423002
10770 -1423002 -1259715 -1021722 -875478 -737893 -472007 -98113 238549 451213 532254 537047
10760 537047 502175 523483 568462 541794 527573 597149 687352 765684 841910 823853 586720
10749 586720 232304 -28949 -210118 -322332 -194467 142715 293585 37248 -416519 -745728
10739 -745728 -860934 -847034 -730584 -634022 -764409 -1104113 -1433451 -1603902 -1607079 -1551347
10729 -1551347 -1588225 -1734962 -1853849 -1784747 -1508783 -1139027 -763306 -501208 -514262 -693743
10719 -693743 -811837 -875718 -963457 -1029232 -951277 -780133 -635960 -493910 -330034 -117128
10709 -117128 200888 555545 795535 850434 644017 266169 -123251 -443126 -681726 -889181
10699 -889181 -1069330 -1245051 -1410100 -1531685 -1655952 -1734963 -1715639 -1705671 -1749533 -1664907 -1411000
10688 -1411000 -1171288 -964163 -706776 -383798 -25155 260414 402257 513815 663830
10679 663830 710336 584440 531046 719045 945652 1039864 1035684 1039207 1052714 985316 888600
10668 888600 903574 1032561 1145096 1105598 848092 498401 228372 41768 -138170 -382682
10658 -382682 -708005 -998744 -1117723 -1074939 -900676 -586222 -241091 -6423 53572 -19254
10648 -19254 -33878 210450 650144 1015150 1165531 1092583 819041 481540 238495 118382
10638 118382 43314 -121277 -351084 -489897 -495191 -402051 -163060 286602 907207 1641794
10628 1641794 2457994 3395390 4478514 5691154 6952495 7947797 8187186 7486880 6186468
10619 6186468 4793319 3665843 2915973 2447717 2101169 1783589 1532548 1385572 1274537
10610 1274537 1093154 772557 424391 266626 440889 833059 1128343 1160073 1009188 769204
10600 769204 526122 356698 214842 91059 64080 103839 139983 146374 85721 58310 285186
10589 285186 765542 1204404 1412207 1489352 1573115 1652997 1676343 1599354 1445438 1368836 1484054
10578 1484054 1662818 1611208 1231017 763654 430060 146187 -156012 -471032 -733740 -734291
10568 -734291 -499899 -291101 -181332 1417 354627 735361 1021886 1221970 1380644 1478094
10558 1478094 1541137 1594453 1568571 1501911 1428983 1277010 986780 614406 228572 -112106
10548 -112106 -301373 -331119 -319040 -299531 -137005 86480 182107 139059 12869 -114547
10538 -114547 -87805 210605 680802 1172521 1505181 1530998 1313755 1012322 779553 681435
10528 681435 667377 696347 655934 521428 363913 229483 102120 -105368 -370562 -578092
10518 -578092 -659480 -637534 -655942 -681080 -493407 -146061 43618 -101481 -402796 -607992
10508 -607992 -677411 -679393 -710945 -798809 -860637 -847784 -799913 -779164 -820991 -891609 -829773 -541712
10496 -541712 -174273 35621 -5860 -227046 -509573 -822202 -1159657 -1341701 -1295030 -1121864
10486 -1121864 -955165 -872542 -820757 -724273 -676879 -825952 -1083261 -1282472 -1364678 -1355397 -1317895
10475 -1317895 -1260622 -1137339 -1066848 -1218765 -1570406 -1876154 -1866075 -1465256 -834315 -289659
10465 -289659 17096 190596 280206 256594 128473 -11195 -184767 -413389 -629665 -868735
10455 -868735 -1146420 -1362254 -1466488 -1484724 -1386603 -1230998 -1024382 -704575 -354158 -56805
10445 -56805 233474 491450 596444 485816 198426 -69193 -134754 -85208 -7244 79472
10435 79472 38201 -178620 -443963 -617591 -766806 -1040390 -1332880 -1369527 -1101093 -652246
10425 -652246 -155681 235986 476133 577390 584367 579959 589601 598650 556631 465283 359716
10414 359716 304624 307584 261383 193957 183144 189841 159868 114606 145068 282190 509817
10403 509817 778861 948288 935139 773374 541847 320744 99045 -179919 -393942 -379385
10393 -379385 -165717 53386 120402 60609 -55023 -259402 -575602 -997862 -1383303 -1485453
10383 -1485453 -1314153 -1115521 -1040971 -1119040 -1298359 -1374411 -1152219 -693810 -124893 439280
10373 439280 812642 867896 675984 451932 422417 580918 806059 1081732 1428511 1715468
10363 1715468 1674005 1325306 944800 693110 635464 772138 970533 1060196 954439 697615
10353 697615 396492 99944 -214885 -481970 -532234 -440497 -428033 -504865 -607002 -724798
10343 -724798 -893347 -1087572 -1117952 -924077 -656367 -432313 -179164 138741 419234 552706
10333 552706 503767 322425 56020 -243645 -422261 -328116 -15774 222970 177189 58720
10323 58720 202455 540675 771153 797699 574986 113567 -330150 -569983 -632040 -581194
10313 -581194 -471954 -336615 -211815 -29344 234965 434002 501126 390343 136915 -99246
10303 -99246 -334047 -605497 -772415 -684854 -479408 -369507 -314908 -202434 -41283 100656
10293 100656 139757 51256 -146880 -410687 -650758 -764910 -782724 -794941 -782458 -771572 -878802
10282 -878802 -993603 -958827 -785713 -596469 -478728 -437623 -444187 -372095 -149780 56282
10272 56282 86247 -15648 -187225 -351225 -383713 -299295 -135463 132743 492704 796496
10262 796496 912676 769379 495226 234094 -11152 -223110 -367620 -454810 -527448 -630292
10252 -630292 -797828 -1041172 -1293427 -1424198 -1325797 -1027979 -645497 -352063 -276920 -347198
10242 -347198 -450724 -504578 -420277 -174109 111613 281389 248527 52184 -111129 -126661
10232 -126661 -44650 97393 181044 45999 -287112 -585856 -681285 -599600 -440224 -242416
10222 -242416 -1417 246345 463618 628181 686363 660667 590080 427197 155327 -146300
10212 -146300 -380342 -511149 -655744 -811892 -889861 -965594 -1158417 -1419957 -1578087 -1523472
10202 -1523472 -1334986 -1109746 -822960 -513688 -340189 -312216 -386414 -521850 -567875 -573538
10192 -573538 -625196 -628973 -527102 -368936 -252496 -261035 -441442 -733945 -1086317 -1376829
10182 -1376829 -1339038 -881157 -202005 411292 780943 891321 845995 664577 365674 119845
10172 119845 36428 31794 9120 27939 195351 443163 559712 491573 414117 491684 596001
10161 596001 555610 377516 189243 44105 -143559 -328361 -338272 -162514 148472 484904
10151 484904 687416 794118 888111 920037 855752 763191 676505 664161 801992 989127 1136230
10140 1136230 1265655 1333384 1195848 808804 364244 27414 -184249 -307187 -362461 -421131
10130 -421131 -505269 -564475 -551937 -472832 -309114 3940 445227 798878 817224 457714
10120 457714 -79366 -509653 -643060 -421893 -3983 267286 236889 128166 79667 67894
10110 67894 93186 110909 83523 12413 -74448 -172511 -228247 -197039 -109908 72742 291178
10099 291178 441691 497935 370885 27971 -395893 -711438 -861269 -854164 -692141 -493442
10089 -493442 -355379 -311727 -369067 -483193 -602294 -616277 -506452 -418854 -436509 -481709 -447944
10078 -447944 -306448 -77505 142669 192247 55278 -132730 -284364 -427080 -555528 -590570
10068 -590570 -484836 -316967 -260415 -374833 -644868 -972189 -1157431 -1129579 -985325 -924336
10058 -924336 -1077013 -1290616 -1442766 -1490317 -1355584 -1075938 -808951 -634725 -578682 -678210
10048 -678210 -935467 -1258813 -1326683 -904393 -142369 632057 1197682 1590413 1899931 2134278
10038 2134278 2166368 1898076 1564980 1385234 1251225 1058918 869441 709266 558633 423175
10028 423175 316326 278254 356071 516418 662694 765562 938686 1159644 1283057 1309920
10018 1309920 1344853 1408822 1430804 1337917 1116285 871499 691096 519443 283815 99627
10008 99627 62513 39873 -36023 -70132 -70794 -194403 -521230 -857071 -941182 -749126 -475055
9997 -475055 -338543 -405414 -594606 -784994 -897764 -1008977 -1208027 -1345495 -1275974 -1063284
9987 -1063284 -836672 -655759 -504793 -345306 -216980 -88055 166585 510679 748241 756055
9977 756055 563799 262145 -47962 -246552 -323520 -464354 -762510 -1095079 -1254895 -1295277
9967 -1295277 -1423571 -1625758 -1645570 -1400644 -1093696 -800681 -401503 127848 645201 966916
9957 966916 1005874 881117 762551 659830 475417 211529 -38369 -164760 -160288 -103420
9947 -103420 -74923 -95057 -155785 -248773 -325951 -401320 -508555 -600369 -711190 -879108 -975687
9936 -975687 -858689 -616093 -369018 -203366 -137928 -105832 -71598 -81159 -158646 -232620 -132425
9925 -132425 195138 556523 765856 893686 1118907 1423649 1619427 1648005 1554839 1371078
9915 1371078 1104110 708571 239647 -92010 -226019 -291039 -282377 -84283 222320 495461
9905 495461 669230 623212 408049 204476 116503 237127 575723 954030 1210196 1233980
9895 1233980 1054535 837429 678087 609292 545906 425125 222687 -178814 -708959 -1101247
9885 -1101247 -1249037 -1302518 -1334486 -1292824 -1183524 -1123214 -1137750 -1102870 -881068 -551501 -339426
9874 -339426 -295478 -381325 -552638 -750716 -902963 -892500 -670366 -325628 -17118 122229
9864 122229 11548 -213052 -399346 -569759 -811133 -1020315 -1012492 -787428 -460845 -140531
9854 -140531 124455 203149 39151 -145930 -170629 -153273 -216276 -345576 -387278 -265239 -135507
9843 -135507 -45169 83847 256635 404664 504513 609499 705422 710645 671833 673437 779076
9832 779076 859930 802647 709237 655617 547192 345953 149458 -71630 -319781 -484618
9822 -484618 -564585 -627875 -709430 -744835 -679153 -528031 -480481 -565682 -559612 -418532 -218910
9811 -218910 -45627 64819 127642 174696 171008 48975 -162171 -416277 -619889 -602838 -391803
9800 -391803 -95922 237146 551470 701241 662932 579828 506317 454779 415656 270598 -126685
9789 -126685 -635238 -816063 -548531 -51408 461194 788700 923858 943781 890924 795941
9779 795941 597312 284461 -34405 -199938 -240347 -269120 -200838 54192 360807 605637
9769 605637 733646 743692 767350 837738 859444 701470 439934 244607 -6604 -368755
9759 -368755 -709556 -983998 -1192807 -1265504 -1084455 -685392 -267902 130735 567837 956190
9749 956190 1207380 1381582 1481202 1417281 1212632 1021988 915460 716053 333602 -74304
9739 -74304 -387679 -707876 -1097391 -1389976 -1519577 -1646923 -1883585 -2168752 -2388175 -2446634
9729 -2446634 -2373826 -2232826 -2052113 -1877913 -1758200 -1716386 -1724596 -1670242 -1464941 -1189593
9719 -1189593 -955720 -804608 -742177 -783417 -891402 -1006748 -1097716 -1111390 -1046743 -941654
9709 -941654 -870760 -846368 -788285 -736914 -719102 -645395 -499928 -424215 -532491 -756425 -1024710
9698 -1024710 -1287373 -1454518 -1438935 -1259632 -977850 -667418 -474621 -348974 -121167 39273
9688 39273 -55739 -306604 -559583 -743825 -776444 -603666 -306592 -83307 -81777 -229431 -412427
9677 -412427 -600702 -777630 -846926 -688456 -419489 -298257 -306865 -205011 21809 236257
9667 236257 436239 601861 613620 458769 219826 -66720 -334042 -488292 -472183 -295499
9657 -295499 -82623 62159 130624 157163 189976 228201 275102 317523 301629 190636 -4219
9646 -4219 -133684 -48878 136528 201304 47544 -249639 -599964 -836926 -761532 -444494 -176389
9635 -176389 -122506 -255920 -422575 -562245 -728197 -927058 -1117957 -1237946 -1217336 -954256
9625 -954256 -488373 9602 458858 775918 924661 1026335 1107053 1112159 1059691 904191
9615 904191 573845 115535 -392125 -819796 -1067824 -1115316 -1067531 -1121575 -1292688 -1407405
9605 -1407405 -1387289 -1231523 -949564 -612687 -356881 -285273 -413047 -691246 -959464 -994943
9595 -994943 -701891 -214800 163218 165282 -192449 -598503 -791685 -815469 -824085 -845173 -779629
9584 -779629 -597263 -422906 -378630 -387770 -271215 26791 368759 580188 581914 325629 -161257
9573 -161257 -613227 -834682 -761218 -433002 -47846 263473 442297 464463 427175 492390
9563 492390 678941 976768 1336887 1570272 1577393 1475082 1400379 1357665 1209876 964220
9553 964220 756478 539803 259175 -72207 -382954 -502541 -400880 -289687 -362344 -569491
9543 -569491 -684840 -657041 -580634 -456789 -296234 -163608 -118246 -171244 -193866 -60627 165315
9532 165315 349524 427901 415948 452645 602408 809923 962754 1012645 1068422 1122463 1080742
9521 1080742 906662 612085 278819 50979 38464 115199 142723 196304 413371 841597
9511 841597 1385905 1839156 2150844 2446958 2768310 3119175 3517032 3913218 4321409 4845773
9501 4845773 5492017 6238538 7108240 7964718 8369603 8071869 7342931 6401621 5273424
9492 5273424 4128142 3115247 2214999 1407273 771537 501614 603834 801670 891371
9483 891371 798142 544204 266460 87890 -8452 -55976 -27972 99120 258820 395524
9473 395524 532009 663447 802887 962330 1069799 1051095 935378 841229 895780 1097980
9463 1097980 1320825 1541881 1890510 2268329 2395538 2158621 1669722 1201215 990686 990871
9453 990871 1049324 1197347 1455587 1625437 1523354 1249787 1017699 884701 896789 1102351
9443 1102351 1374653 1540222 1518788 1360081 1193577 1183074 1366986 1529758 1511527 1304996
9433 1304996 965436 624725 397553 231039 45851 -26524 24156 8065 -20051 34770
9423 34770 144477 258046 366749 540412 691584 680356 536384 400411 347786 335855
9413 335855 287676 284479 377740 531807 640789 633184 623327 760943 980363 1119442 1235546
9402 1235546 1359099 1321930 1093285 778711 479523 306284 330735 495348 738987 1081003
9392 1081003 1309814 1167643 771319 421713 307547 450194 790835 1199254 1400927 1300902
9382 1300902 1061565 788376 501759 198063 -100855 -428826 -851296 -1259527 -1487429 -1559397
9372 -1559397 -1501436 -1251704 -838501 -406741 -73147 101125 48775 -18557 133206 304703
9362 304703 275601 117579 21973 -37883 -92912 -17794 203058 417687 419060 148623 -243455
9351 -243455 -588743 -798106 -871127 -836879 -740297 -671294 -679926 -661438 -519024 -328072 -159309
9340 -159309 12021 145514 189784 176178 188638 218657 242619 278371 318218 369399 430630
9329 430630 471846 444433 357238 190683 -132348 -568761 -959879 -1210698 -1312801 -1336434
9319 -1336434 -1397212 -1479423 -1519608 -1512855 -1501478 -1568077 -1744386 -2016730 -2256285 -2369284 -2281046
9308 -2281046 -1984474 -1647932 -1394024 -1207740 -1051421 -903842 -849653 -965052 -1281609 -1736103
9298 -1736103 -2104605 -2188553 -1940096 -1568420 -1319115 -1246756 -1265050 -1264570 -1062926 -589421 -142196
9287 -142196 55659 71016 20809 -18080 -22378 -29524 -56682 -72749 -22392 217137 637991
9276 637991 981192 1026895 836710 539852 151027 -202032 -293255 -100179 139055 175553
9266 175553 15573 -16949 203688 369658 310805 183541 211795 411432 592638 667999
9256 667999 553538 172761 -361712 -805151 -1018959 -1053755 -1015523 -935161 -781893 -582494
9246 -582494 -356516 -55095 282023 474125 401140 153650 -128138 -365780 -546318 -619706
9236 -619706 -503922 -202904 171300 635512 1203467 1647588 1717257 1448054 998985 507649
9226 507649 141051 -9009 24452 24922 -96257 -135791 43851 354045 585840 596866 407716
9215 407716 176343 109608 222891 378473 532615 724901 940922 1147149 1287637 1334789
9205 1334789 1210040 842100 341503 -87705 -374513 -535091 -576015 -528630 -474546 -431060
9195 -431060 -349372 -291421 -345079 -429867 -334256 -27276 401036 815618 1046674 1096435 1006458
9184 1006458 835032 733442 797831 1045739 1299018 1334140 1191536 1044766 1036079 1150674
9174 1150674 1410296 1793073 2111829 2280911 2283303 2126750 1893098 1671197 1441008 1075252
9164 1075252 544899 110846 5353 85881 125356 70767 23350 123914 332621 505882
9154 505882 611507 659681 696181 777930 903472 1026277 1094468 1010572 704075 205710 -294688
9143 -294688 -547646 -467217 -170041 187142 445522 415402 142816 -166127 -391634 -459611
9133 -459611 -349550 -196727 -165049 -299640 -524208 -737602 -911686 -1053517 -1161158 -1271221
9123 -1271221 -1309566 -1108166 -790666 -654730 -670040 -617176 -457368 -265047 -119472 -71582
9113 -71582 -139587 -317403 -609779 -1026194 -1416103 -1569100 -1473833 -1276227 -1092582 -927354
9103 -927354 -828903 -785683 -699497 -615746 -609327 -725999 -912136 -996334 -914670 -701753 -378297
9092 -378297 -72081 44487 -43394 -264886 -553284 -916598 -1273916 -1385992 -1209538 -995316
9082 -995316 -941092 -953808 -903349 -838666 -885025 -1031517 -1152488 -1136329 -928893 -591417 -187978
9071 -187978 213209 497924 576084 448247 272174 220114 248652 183249 -94502 -507088
9061 -507088 -873072 -1048105 -964253 -743178 -582934 -549029 -554415 -490774 -231546 115202 356496
9050 356496 507719 625082 649629 526259 262686 -63600 -432269 -801210 -1065245 -1161151
9040 -1161151 -1033411 -724080 -332786 48015 257788 209408 16284 -256099 -578408 -789700
9030 -789700 -718493 -422750 -120127 72865 147948 128974 -1207 -164923 -300587 -388669
9020 -388669 -372069 -352775 -402634 -516024 -657554 -736203 -660048 -485266 -281017 -10255 323948
9009 323948 590943 665937 596502 554552 679733 914879 1034560 957127 760285 464889
8999 464889 123653 -109493 -186782 -303674 -701129 -1260849 -1622176 -1656097 -1508147 -1366579
8989 -1366579 -1331933 -1396231 -1454292 -1354895 -996585 -547809 -211509 -25046 109416 402479
8979 402479 819640 1184606 1379439 1346902 1104717 777740 562081 515771 496539 364946
8969 364946 176360 65715 58802 54562 9083 -157982 -436226 -645552 -695883 -547033 -319954
8958 -319954 -137198 44389 213976 216084 -15798 -300121 -423645 -422620 -477300 -624775 -770826
8947 -770826 -806586 -616291 -217715 160434 303902 266998 173680 42051 -150820 -426375
8937 -426375 -765726 -1081283 -1258953 -1264858 -1204342 -1152236 -1022830 -691903 -147627 414967
8927 414967 646775 399451 -99432 -567424 -982623 -1375164 -1584490 -1534561 -1488530 -1558599
8917 -1558599 -1640338 -1663708 -1570713 -1350914 -1018778 -653972 -371777 -231277 -148229 37988
8907 37988 389269 834272 1319061 1793121 2121374 2189326 2011485 1700097 1337829 1020163
8897 1020163 710319 272718 -157365 -401530 -558476 -726976 -791310 -743485 -732036 -765413
8887 -765413 -683075 -407645 -73828 102620 105146 86896 50729 -124907 -490110 -898698 -1198484
8876 -1198484 -1368044 -1363129 -1242534 -1092731 -955079 -958264 -1154015 -1469485 -1833288 -2115557
8866 -2115557 -2181234 -1982616 -1612426 -1181313 -696284 -159581 273003 515093 650510 718454
8856 718454 732542 818700 947634 935437 825890 708109 578508 493599 504016 526607 415512
8845 415512 204232 104907 254195 596341 1054967 1518079 1813562 1814179 1548078 1198524
8835 1198524 886907 708998 691144 757682 731691 540842 337292 255489 204226 47953
8825 47953 -256636 -646213 -902186 -941508 -901730 -884674 -866413 -795908 -587051 -283523 -90243
8814 -90243 -73604 -150973 -300751 -569767 -932470 -1328473 -1710757 -2021999 -2238249 -2317899
8804 -2317899 -2272585 -2197329 -2127894 -2035803 -1860371 -1552215 -1195039 -944332 -801770 -611484
8794 -611484 -431164 -431705 -488976 -453899 -457562 -496116 -488163 -424861 -209207 155916 449281 528223
8782 528223 454949 273862 8201 -271297 -424290 -351410 -129996 171057 546892 907789
8772 907789 1094616 1143262 1160670 1028639 647560 177905 -121925 -182241 -127917 -98058 -178050
8761 -178050 -297432 -308557 -132615 227752 652029 903846 876176 744332 698065 717688
8751 717688 671054 549016 390158 183006 112562 318469 632845 942146 1334133 1737234
8741 1737234 1905487 1756049 1347271 841695 354317 -68006 -302351 -333145 -310421 -248709
8731 -248709 -138838 -100455 -131872 -142756 -164056 -247267 -392577 -517756 -503881 -310149 29654
8720 29654 351190 527034 635099 760863 854696 837362 752816 638585 568342 605050 655263
8709 655263 572699 359073 165137 59514 -7247 -68802 -139035 -222574 -315058 -392383 -273152
8698 -273152 78742 381402 496025 454494 325916 108567 -77621 -66658 53146 81406
8688 81406 17738 38513 113986 172588 261910 335448 279586 122661 -53877 -224314 -331056
8677 -331056 -341951 -276053 -139640 -27716 -81387 -288201 -515940 -694581 -736907 -612863
8667 -612863 -534859 -616021 -652323 -491838 -172218 175360 399842 515114 646355 715613
8657 715613 658055 530739 371160 276987 309851 406066 502240 558585 602096 682293 784885
8646 784885 854770 810072 641449 470313 443647 629242 939895 1167617 1238872 1281519 1415571
8635 1415571 1617608 1704480 1468316 966543 515929 245380 173236 354671 726385 1104150
8625 1104150 1259916 1090068 754694 411717 9794 -479550 -919997 -1183595 -1272846 -1257790
8615 -1257790 -1203746 -1164662 -1116796 -942361 -610398 -175906 213396 329669 16782 -535681
8605 -535681 -1004051 -1268785 -1370661 -1337253 -1149176 -832493 -502229 -259927 -136528 -200612
8595 -200612 -403038 -567601 -584762 -454648 -228903 -13090 26956 -81037 -109478 13101
8585 13101 195854 445917 659370 738142 703699 557754 322321 59122 -133355 -166204
8575 -166204 -19791 181028 279743 365035 484598 559200 636898 674314 442925 -60763 -558285
8564 -558285 -840895 -885482 -737574 -392454 48169 424343 722632 1025900 1314008 1525245
8554 1525245 1630220 1631757 1599081 1531086 1338984 1023128 757371 600608 476407 321163
8544 321163 150197 16092 -127362 -233897 -195367 -1259 223218 336911 272465 23837
8534 23837 -227265 -248888 -109507 6473 -9668 -157142 -243831 -133446 17987 45665 -33431
8523 -33431 -178486 -270723 -199640 -14242 159776 300685 381240 328903 183134 82477 27248
8512 27248 -65182 -233120 -461612 -626421 -648748 -609573 -643993 -651729 -488420 -169523 227422
8501 227422 548228 648772 604004 576314 683705 933251 1179350 1262488 1158708 887277
8491 887277 549486 281700 58633 -221946 -556662 -799748 -886437 -837710 -655858 -441246
8481 -441246 -314704 -349905 -529826 -718485 -893594 -1026843 -997247 -902354 -845642 -758485 -555716
8470 -555716 -263944 16755 170191 154660 41979 -95020 -190203 -239624 -314609 -362402 -233214
8459 -233214 116811 481209 591121 482813 403533 492626 660423 795097 805693 733377
8449 733377 734814 834748 909930 851045 743913 759154 871516 979933 1091167 1240430 1318383
8438 1318383 1208742 999738 830964 817756 991200 1196871 1211274 946074 525491 196841
8428 196841 101846 108173 128601 178679 146561 -164101 -645914 -869663 -647864 -193507 138172
8417 138172 214487 205424 326807 636535 1033598 1388470 1614657 1669453 1481008 998140
8407 998140 317830 -338360 -784524 -951303 -954020 -887723 -766992 -578892 -277356 36719
8397 36719 212507 327602 513940 765988 963404 1010630 957717 872622 671861 311764
8387 311764 -64377 -332540 -416762 -337753 -265633 -347483 -548430 -781801 -986652 -1106268
8377 -1106268 -1126406 -1123794 -1195006 -1259803 -1152880 -882876 -569344 -270879 -20084 42977 -153413
8366 -153413 -570794 -999695 -1186580 -1137585 -941201 -649603 -413438 -369412 -493148 -673441
8356 -673441 -816138 -860611 -786844 -619849 -425189 -308027 -292647 -292805 -218881 -119793 -142078
8345 -142078 -328130 -549026 -683101 -787131 -932359 -1050651 -1078986 -1021698 -976563 -1094243
8335 -1094243 -1337753 -1427079 -1198748 -784726 -368188 -18116 346640 799583 1241685 1499937
8325 1499937 1510758 1333478 1093140 879695 631878 326924 39278 -166705 -242087 -160310
8315 -160310 18033 175816 262200 298037 269114 225851 261639 424634 816487 1275816 1464181
8304 1464181 1307587 951359 621366 521847 611651 889637 1356818 1812153 2231696 2794217
8294 2794217 3549229 4479943 5561979 6669747 7615998 8099245 7812768 6871488 5828077
8285 5828077 5140422 4849289 4687553 4328966 3676236 2888630 2248999 1906576 1697980 1435875
8275 1435875 1154095 860158 578579 397569 327810 295897 180595 -58823 -357563 -465002
8265 -465002 -205970 278023 698508 906897 1000990 1152850 1404690 1701054 1874172 1774094
8255 1774094 1445944 1092088 840167 746500 758149 806603 856689 798431 554957 149786
8245 149786 -315685 -664987 -694784 -451222 -213128 -139371 -157228 -65345 171697 443353
8235 443353 672063 839510 949917 954473 795566 499500 151951 -180435 -443787 -529460
8225 -529460 -428418 -305987 -261207 -246862 -155286 -48360 -92646 -284825 -578118 -993620
8215 -993620 -1436905 -1701433 -1644265 -1348108 -1022416 -779246 -635344 -566229 -478984 -290559
8205 -290559 -12597 283443 574555 660707 509981 380630 321345 295300 277615 243722 199686
8194 199686 89900 -23720 -77284 -135490 -264021 -443324 -518793 -461284 -384339 -302625 -121362
8183 -121362 151127 452189 708521 791977 746371 716207 758130 859981 988721 1164680
8173 1164680 1356441 1432406 1337336 1173809 1025680 887508 753159 568282 319212 75595
8163 75595 -78656 -136733 -140418 -101574 -34762 -51536 -179426 -335787 -523451 -738105 -929375
8152 -929375 -1061972 -1131138 -1116618 -1019393 -930038 -835697 -627953 -345356 -93273 81034 198661
8141 198661 364386 655573 959257 1102031 1041830 860304 629931 393977 208193 78912
8131 78912 -97695 -311570 -381434 -203441 85143 249671 322818 415210 508270 516547 477286
8120 477286 463162 425841 342244 250688 196953 120163 -130923 -464997 -591922 -326457 124237
8109 124237 414368 466770 372090 273673 252388 355706 516363 626764 634797 557186 349750
8098 349750 -102381 -697098 -1135464 -1268506 -1234293 -1232569 -1330010 -1491030 -1703983 -1883523
8088 -1883523 -1844997 -1582608 -1305228 -1176566 -1172466 -1192952 -1197911 -1125828 -938512 -778583 -740917
8077 -740917 -726374 -680008 -526470 -257093 19158 263002 495224 818857 1259902 1713654
8067 1713654 2073436 2270713 2341069 2345170 2274224 2179267 2112601 2064856 2059148 2133287 2269964
8056 2269964 2484303 2760105 3059216 3489635 4168884 4962011 5672880 6435484 7471340
8047 7471340 8591563 9253465 9141421 8491676 7656434 6829436 6095549 5336625 4520595
8038 4520595 3678916 2786091 1861515 1047984 566229 435304 439042 453590 455468 403835 329984
8027 329984 269662 321658 475309 541645 463883 343212 300772 386469 467374 405698 264819
8016 264819 194438 107539 -118222 -308944 -243705 -103799 -235126 -678260 -1146233 -1411148
8006 -1411148 -1398700 -1203199 -1066252 -1052871 -1047553 -925884 -698463 -456846 -108181 412064
7996 412064 933809 1251698 1327065 1258554 1109274 841397 409043 -121344 -587596 -874626
7986 -874626 -865193 -510051 34160 541493 889187 1114515 1268178 1355585 1262571 923753
7976 923753 542060 361500 419166 568317 682315 702962 602099 381583 124937 -61212
7966 -61212 -87763 34781 226795 432922 572707 587400 532613 457102 340159 251415 262483
7955 262483 369357 419083 329325 256675 329497 565146 979467 1444586 1777432 1875267 1720717
7944 1720717 1355677 910946 463194 47261 -230235 -320876 -199462 -10477 82029 124795
7934 124795 158600 184396 276664 443696 546508 594141 772166 1011770 1092057 990016 851491
7923 851491 802392 867845 995164 1148249 1235806 1196234 1133017 1083884 974263 856019 819274
7912 819274 911568 1148193 1350091 1304631 1032403 670690 300793 39369 -33236 26687
7902 26687 116089 194858 282911 363986 356494 169221 -220182 -675491 -1021534 -1165571 -1086813
7891 -1086813 -901032 -775787 -722668 -621795 -390156 -67341 239411 445014 597091 683113
7881 683113 569247 327553 137153 62319 122862 246711 337816 430997 570039 803891
7871 803891 1079789 1274075 1346998 1302970 1162859 984185 884247 905701 992707 1087536 1200259
7860 1200259 1258950 1064769 561670 -35733 -515764 -799089 -929784 -1002613 -979612 -832990
7850 -832990 -672859 -601236 -649165 -763199 -855527 -834054 -634666 -372574 -154152 109181
7840 109181 526635 999753 1368572 1585457 1663287 1660009 1608387 1460869 1136181 776438
7830 776438 610666 660427 774601 815900 842342 910257 956825 863037 585131 391448 448351
7819 448351 630554 740262 749016 770524 818023 812359 679245 339898 -150733 -616944 -986479
7808 -986479 -1283172 -1518608 -1674402 -1720308 -1713691 -1704000 -1649251 -1590704 -1529431 -1402227 -1228631
7797 -1228631 -997409 -694135 -376650 -44237 265429 408844 319570 123082 -4528 -13550
7787 -13550 95719 382385 905418 1582528 2064889 2003293 1479191 860747 439536 340312
7777 340312 499980 668595 627602 448998 279537 183398 223265 312992 314093 211256 60255
7766 60255 -128565 -331746 -487291 -564794 -581106 -528206 -348472 -93859 138206 232015 158407
7755 158407 40853 17628 99057 129995 41826 -77100 -161643 -176313 -69248 172287 436706
7744 436706 679847 954832 1209950 1283352 1123460 870137 575978 168697 -261964 -587911
7734 -587911 -813995 -1010702 -1171712 -1268400 -1264780 -1084125 -771440 -435301 -197351 -219555
7724 -219555 -512022 -917409 -1252100 -1352663 -1191037 -913566 -699961 -618493 -617508 -575510 -434650
7713 -434650 -245952 -70047 37687 72327 132187 264714 522372 903258 1220111 1327989
7703 1327989 1291430 1140515 904175 768085 761008 717930 556953 345164 221172 234258
7693 234258 325719 524660 829568 1107096 1252221 1294808 1239148 1018214 629233 155619
7683 155619 -263974 -557739 -681314 -648763 -602414 -603235 -566972 -470928 -413300 -429864 -443458
7672 -443458 -353893 -176344 -18845 60808 117088 194017 320140 576230 949745 1335927
7662 1335927 1642713 1778177 1817336 1996253 2381049 2877449 3425705 3987967 4522682 5055962
7652 5055962 5558674 5953885 6179871 6176096 5915544 5427737 4797759 4130635 3478169 2850554
7642 2850554 2322050 1948344 1773049 1789656 1854041 1886210 1918077 1929979 1850509 1735609 1644871
7631 1644871 1521687 1308299 971719 579092 223851 -2746 61431 427809 871147 1141229
7621 1141229 1191840 1064912 846142 732037 791516 969906 1127198 1085749 962361 926976
7611 926976 887073 710082 475004 343224 339832 391649 430738 423239 353318 204871 57602
7600 57602 -112447 -328343 -397989 -228306 59629 224739 183112 -2542 -326054 -766344
7590 -766344 -1133309 -1225257 -986931 -572672 -178646 43601 87904 116149 169428 186550 174392
7579 174392 182052 283847 449790 522744 422934 244624 23351 -191892 -258199 -175012 -105536
7568 -105536 -140956 -282375 -432447 -413112 -264140 -130817 -77994 -90770 -213114 -430528
$$ [...]
##END NTUPLES=NMR SPECTRUM
##END=
