##TITLE=C13_Ser 2859
 CDCl3, 22300 sc

 16.1.2023
##JCAMPDX= 6.0         $$ Bruker NMR JCAMP-DX V2.0
##DATA TYPE= NMR SPECTRUM
##DATA CLASS= NTUPLES
##ORIGIN= UXNMR, Bruker Analytische Messtechnik GmbH
##OWNER= root
$$ XWIN-NMR		Version 3.5
$$ Fri Feb 17 13:53:27 2023 Russian Standard Time (UT+4h)  she@DPX200
##.OBSERVE FREQUENCY= 50.327896
##.OBSERVE NUCLEUS= ^13C
##.ACQUISITION MODE= SIMULTANEOUS
##.ACQUISITION SCHEME= undefined
##.AVERAGES= 22301
##.DIGITISER RES= 17
##SPECTROMETER/DATA SYSTEM= spect
##.PULSE SEQUENCE= zgpg30
##.SOLVENT NAME= CDCl3
##.SHIFT REFERENCE= (INTERNAL, CDCl3, 0, 222.624)
##AUDIT TRAIL= $$ (NUMBER, WHEN, WHO, WHERE, WHAT)
$$ ##TITLE= Audit trail, XWIN-NMR		Version 3.5
$$ ##JCAMPDX= 5.01
$$ ##ORIGIN= Bruker BioSpin GmbH
$$ ##OWNER= she
$$ F:/spectra/data/she/nmr/c13/1/pdata/1/auditp.txt
$$ ##AUDIT TRAIL=  $$ (NUMBER, WHEN, WHO, WHERE, WHAT)
(   1,<2023-02-17 13:51:40.01 +0400>,<she>,<DPX200>,
      <created by zg, POWCHK disabled, PULCHK disabled
       terminated by command 'halt'
       configuration hash MD5:
       00 E9 B6 7A A2 85 ED C7 34 08 36 98 17 FE 4E 26
       data hash MD5: 32K
       E0 B2 0E 52 65 49 84 6E 05 F2 BF 37 8E 43 07 DF>)
(   2,<2023-02-17 13:51:45.35 +0400>,<she>,<DPX200>,
      <Start of raw data processing
       efp BC_mod = 2 LB = 2 FT_mod = 6 PKNL = 1 PHC0 = -321.0057 PHC1 = 30.58446 SI = 32K 
       data hash MD5: 32K
       6E 30 36 2C 46 82 FD CC CA 6B 9B E5 2C 1D 47 1B>)
(   3,<2023-02-17 13:52:19.26 +0400>,<she>,<DPX200>,
      <pk PHC0 = 4.54927 PHC1 = 7.400005 
       data hash MD5: 32K
       8A 94 4E 6F 99 44 8F 2D B8 D9 00 87 4F 51 4F 5D>)
(   4,<2023-02-17 13:52:22.71 +0400>,<she>,<DPX200>,
      <abs ABSG = 5 
       data hash MD5: 32K
       F9 52 58 83 08 30 5B 70 E3 92 32 E7 E2 53 0D 51>)
$$ ##END=
$$ 
$$ hash MD5
$$ 22 CB DC FB D9 2E 08 F9 F8 A5 16 05 E2 75 9A 15
##$RELAX= 
##$RELAX= 
##$RELAX= 
##$RELAX= 
##$RELAX= 
##$RELAX= 
##$RELAX= 
##$RELAX= 
$$ Bruker specific parameters
$$ --------------------------
##$DU= <F:/spectra>
##$EXPNO= 1
##$NAME= <c13>
##$PROCNO= 1
##$TYPE= <nmr>
##$USER= <she>
##$AMP= (0..31)
100 100 100 100 100 100 100 100 100 100 100 100 100 100 100 100 100 100 
100 100 100 100 100 100 100 100 100 100 100 100 100 100 
##$AQSEQ= 0
##$AQ_mod= 1
##$AUNM= <au_zg>
##$AUTOPOS= <>
##$BF1= 50.322709
##$BF2= 200.13
##$BF3= 50.322709
##$BF4= 500.13
##$BF5= 500.13
##$BF6= 500.13
##$BF7= 500.13
##$BF8= 500.13
##$BYTORDA= 1
##$CFDGTYP= 0
##$CFRGTYP= 5
##$CHEMSTR= <none>
##$CNST= (0..31)
1 1 145 1 1 1 1 1 1 1 1 1 1 1 1 1 1 1 1 1 1 1 1 1 1 1 1 1 1 1 1 1 
##$CPDPRG= <waltz16>
##$CPDPRG1= <>
##$CPDPRG2= <waltz16>
##$CPDPRG3= <>
##$CPDPRG4= <mlev>
##$CPDPRG5= <mlev>
##$CPDPRG6= <mlev>
##$CPDPRG7= <mlev>
##$CPDPRG8= <mlev>
##$CPDPRGB= <>
##$CPDPRGT= <>
##$D= (0..31)
0 2 0.00345 0 0 0 0 0 0 0 0 0.03 2e-05 3e-06 0 0 0 0 0 0 0 0 0 0 0 0 0 
0 0 0 0 0 
##$DATE= 1676551336
##$DBL= (0..7)
120 120 120 120 120 120 120 120 
##$DBP= (0..7)
150 150 150 150 150 150 150 150 
$$ [...]
##$SUBNAM4= <"">
##$SUBNAM5= <"">
##$SUBNAM6= <"">
##$SUBNAM7= <"">
##$SUBNAM8= <"">
##$SUBNAM9= <"">
##$SW= 239.972175391363
##$SWIBOX= (0..15)
0 1 3 0 0 0 0 0 0 0 0 0 0 0 0 0 
##$SW_h= 12077.2946859903
##$TD= 32768
##$TD0= 1
##$TE= 0
##$TE2= 300
##$TE3= 300
##$TEG= 300
##$TL= (0..7)
120 120 120 120 120 120 120 120 
##$TP= (0..7)
150 150 150 150 150 150 150 150 
##$TP07= 0
##$TPNAME0= <>
##$TPNAME1= <>
##$TPNAME2= <>
##$TPNAME3= <>
##$TPNAME4= <>
##$TPNAME5= <>
##$TPNAME6= <>
##$TPNAME7= <>
##$TPOAL= (0..7)
0.5 0.5 0.5 0.5 0.5 0.5 0.5 0.5 
##$TPOFFS= (0..7)
0 0 0 0 0 0 0 0 
##$TUNHIN= 0
##$TUNHOUT= 0
##$TUNXOUT= 0
##$USERA1= <user>
##$USERA2= <user>
##$USERA3= <user>
##$USERA4= <user>
##$USERA5= <user>
##$V9= 5
##$VALIST= <valist>
##$VCLIST= <CCCCCCCCCCCCCCC>
##$VD= 0
##$VDLIST= <DDDDDDDDDDDDDDD>
##$VPLIST= <PPPPPPPPPPPPPPP>
##$VTLIST= <TTTTTTTTTTTTTTT>
##$WBST= 1024
##$WBSW= 4
##$XGAIN= (0..3)
0 0 0 0 
##$XL= 0
##$YL= 0
##$YMAX_a= 141397409
##$YMIN_a= -32775136
##$ZGOPTNS= <>
##$ZL1= 120
##$ZL2= 120
##$ZL3= 120
##$ZL4= 120
##$ABSF1= 222.6533
##$ABSF2= -17.34351
##$ABSG= 5
##$ABSL= 3
##$ALPHA= 0
##$AQORDER= 0
##$ASSFAC= 0
##$ASSFACI= 0
##$ASSFACX= 0
##$ASSWID= 0
##$AUNMP= <proc_1d>
##$AZFE= 0.1
##$AZFW= 0.5
##$BCFW= 0
##$BC_mod= 2
##$BYTORDP= 0
##$COROFFS= 0
##$CY= -3
##$DATMOD= 1
##$DC= 0
##$DFILT= <>
##$DTYPP= 0
##$F1P= 0
##$F2P= 0
##$FCOR= 0.5
##$FTSIZE= 32768
##$FT_mod= 6
##$GAMMA= 0
##$GB= 0
##$INTBC= 1
##$INTSCL= 4.134877e-10
##$ISEN= 128
##$LB= 2
##$LEV0= 0
##$LPBIN= 0
##$MAXI= 10000
##$MC2= 0
##$MEAN= 0
##$ME_mod= 0
##$MI= 0.1934396
##$NCOEF= 0
##$NC_proc= 2
##$NLEV= 6
##$NOISF1= 120.0001
##$NOISF2= 80.00006
##$NSP= 0
##$NTH_PI= 0
##$NZP= 0
##$OFFSET= 222.624
##$PC= 1.4
##$PHC0= -316.4565
##$PHC1= 37.98446
##$PH_mod= 1
##$PKNL= yes
##$PPARMOD= 0
##$PSCAL= 0
##$PSIGN= 0
##$REVERSE= no
##$SF= 50.3227315983092
##$SI= 32768
##$SIGF1= 140
##$SIGF2= 120
##$SINO= 11.81781
##$SIOLD= 32768
##$SREGLST= <13C.CDCl3>
##$SSB= 0
##$STSI= 32768
##$STSR= 0
##$SW_p= 12077.2946859903
##$SYMM= 0
##$S_DEV= 0
##$TDeff= 32768
##$TDoff= 0
##$TI= <>
##$TILT= no
##$TM1= 0
##$TM2= 0
##$TOPLEV= 0
##$USERP1= <user>
##$USERP2= <user>
##$USERP3= <user>
##$USERP4= <user>
##$USERP5= <user>
##$WDW= 1
##$XDIM= 32768
##$YMAX_p= 439305383
##$YMIN_p= -1757705
$$ End of Bruker specific parameters
$$ ---------------------------------
##NTUPLES= NMR SPECTRUM
##VAR_NAME=  FREQUENCY,     SPECTRUM/REAL,   SPECTRUM/IMAG
##SYMBOL=    X,             R,               I
##VAR_TYPE=  INDEPENDENT,   DEPENDENT,       DEPENDENT
##VAR_FORM=  AFFN,          ASDF,            ASDF
##VAR_DIM=   32768,         32768,           32768
##UNITS=     HZ,            ARBITRARY UNITS, ARBITRARY UNITS
##FACTOR=    0.368581032318806, 1,           1
##FIRST=     11203.0474430531, 0,            0
##LAST=      -874.247242937185, 0,           0
##MIN=       -874.247242937185, -1757705,    0
##MAX=       11203.0474430531, 439305383,    0
$$ Real data points
##PAGE= N=1
##DATA TABLE= (X++(R..R)), XYDATA
$$ [...]
23071e61594K123Q9078J04507J7008m3275p8059j23204q4740J5149N3384n1899
23060f61522j57024q1406P2431J36347J24467R5829M0031n8804r1267K2672J53931
23049d04315J65381P8859P823J2046K5464M925J5183O6283R4177Q3870L5066o7606
23037A17156j46437j09350o257P9038R0127J7174r3141j02879M0772J47367J16834
23026A50404P9665P8044N6570O8471J17093J08136M0918j6418l778K064m7787
23015F33382r2562j06905j05766j12958j04853p0719k7368n55P777J4052n4929
23004b1404j21615q1221k5288P277Q4590J98368K69982K54156J99537J19202J4445
22993H98029q4005j22983p4944o8584j01237p7580q243O1304J24134J40137J06764
$$ y = [-561594, -559471, -470393, -365886, -348878, -392153, -470212, -593416, -678156, -663007, -609623, -661522, -818546, -899952, -827521, -691174, -566707, -470878, -430847, -489651, -580918, -558246, -404315, -238934, -160075, -152252, -140206, -114742, -109817, -94634, -28351, 65826, 149696, 184762, 117156, -29281, -138631, -144888, -65850, 24277, 41451, -51690, -154569, -113797, 33570, 150404, 230069, 308113, 364683, 433154, 550247, 658383, 699301, 682883, 679105, 681169, 633382, 540820, 433915, 328149, 215191, 110338, 39619, 12251, 11696, 19473, 33525, -21404, -143019, -224240, -249528, -242251, -157661, 40707, 310689, 564845, 764382, 883584, 898029, 814024, 691041, 616097, 547513, 446276, 368696, 360453, 421757, 545891, 686028, 792792]
22982G92792R3663R1290L7511J163L2854M6958o6307k25534k22600q5522R506
22971E05774L8063N7593R0526R2543j0705j48297k24101j68877m1215p976m4742
22960A38586p4965j04455j07955m5898K8782K7275j0889j723N679j9940m9304
22949b14807q1449q9179k2373P8517J30825R1391K2745R089L5149J6682o573J9397
22937a0586P6883J01622P8615M3625L274j9936o0187j12942r3932q883M5770Q0834
22925A24157J15525J38797J40642J03067O5916J2478r5742j92552j82136j03573
22915A26579j690M5834n4551j93783k01559p2862M8930M1605n749M4592J22782
22904i9872J14234J14690J31582Q6229Q57p0015o9615P804J12956J31027N2122
$$ y = [792792, 886455, 977745, 1015256, 1016419, 1049273, 1096231, 1029924, 804390, 581790, 496268, 505774, 543837, 601430, 691956, 784499, 773794, 625497, 401396, 232519, 191304, 183328, 138586, 63621, -40834, -148789, -194687, -165905, -138630, -149519, -151242, -145563, -165503, -214807, -296256, -385435, -407808, -329291, -198466, -107075, -84330, -75241, -40092, -23410, -29983, -10586, 66297, 167919, 246534, 290159, 293433, 273497, 213310, 100368, 6436, -2447, 43323, 124157, 239682, 378479, 519121, 622188, 688104, 700582, 604840, 412288, 230152, 126579, 124889, 170723, 116172, -77611, -279170, -352032, -303102, -261497, -267246, -222654, -99872, 14362, 129052, 260634, 346863, 347720, 277705, 208090, 215894, 328850, 459877, 511999]
22893E11999j6363j0522Q847k1784j02178j71877j61922j07948n0871J4722J8680
22882h9217m1504m4841Q413M9840Q8133J36173J25354J4245j01573j19928k2346
22871B749J21661J99463J45175J8138m3475P937O9598N5766L654k7520k4968j4406
22859E13772o743L4878P9389N4567K5370R2339J86939J71867M5863j17851k03561
22848H76829j83399p9956M5286N4485j4431m4405l0789l6255m896K5906p6288
22837E32087k19849j91265j1841J45549J94561J23788o605j05090j83619j95004
22827H2712o9533N3086K3077p7067j09234o7667k7539m6521p8255l9852L0963
22816c25830Q6228J18442M5072p7979q6327m0977n8981p0355K5575J62435J97991
$$ y = [511999, 495636, 485114, 493961, 472177, 369999, 198122, 36200, -71748, -122619, -107897, -89217, -130721, -175562, -167149, -117309, -29176, 106997, 232351, 246596, 145023, 25095, 2749, 124410, 323873, 469048, 487186, 443711, 451648, 521246, 577012, 580666, 553146, 528178, 513772, 507029, 541907, 621296, 675863, 701233, 793572, 980511, 1152378, 1198241, 1080390, 876829, 693430, 613474, 658760, 713245, 698814, 654409, 623620, 587365, 582469, 608375, 532087, 312238, 120973, 109132, 254681, 449242, 573030, 566425, 461335, 277716, 82712, 13179, 66265, 89342, 12275, -96959, -164626, -192165, -238686, -316941, -356793, -325830, -239602, -121160, -76088, -154067, -240394, -281371, -340352, -410707, -385132, -222697, -24706]
22805b4706P7580m8027k3499J01050J78104J38919J8698q9574j07468o5896k6845
22794A28336m999P471N9837J07521P5470L8714J1892n1530p9126r283P1623J02868
22782D58794R4165J8429r7841j74800k05305j89381j03657K3167P2076L093j07297
22771b08557j52557j20233r2086q8959q4996o7273m7438l8165n3123r8177j03791
22760a155355n545J68013K54257K15675J50639Q2543J7615l2827n3373k2277K3419
22749c57216M1235L4492L3301L7105o108j7651O0720J21618Q2490O223o3577q1870
22737a09238K688N9885O258l4922j2699L2667M0797Q673j9807l0534n063O2023
22725G28J05883P2592N7778P7421M9951l975n3761o1319j5794O963l0586l7629
$$ y = [-24706, 52874, 4847, -18652, 82398, 260502, 399421, 418119, 328545, 221077, 155181, 128336, 123337, 130808, 190645, 298166, 373636, 412350, 424242, 372712, 293586, 284303, 355926, 458794, 552959, 571388, 473547, 298747, 93442, -95939, -199596, -176429, -104353, -101260, -208557, -361114, -481347, -573433, -662392, -747388, -814661, -862099, -900264, -953387, -1051564, -1155355, -1160900, -992887, -738630, -522955, -372316, -289773, -272158, -304985, -358358, -380635, -357216, -315981, -281489, -248188, -211083, -217191, -234842, -174122, -52504, 29986, 36209, -27368, -109238, -106550, -46665, -40407, -75329, -88028, -55361, -14564, -5891, -25698, -56232, -61295, 728, 106611, 179203, 236981, 314402, 364353, 360378, 306617, 245298, 229504, 236467, 205881, 168252]
22713A68252p975L0982P6518M4261n4640j04841o5647J0880O0173Q593o1645o9218
22701C5693n6124j23531k07935j67037p7335l1370k1531k6100q960L7382P1418
22690e75430P3181L8285J9486J7688K8863K5721j0495m3182n3975k9833L0508
22679d79183Q4054O9191p433o9844m8561J0281M0764O2788J08100J42916Q0844
22668f083m5808q7867k7240K9676M5364N4377O7357J27795K06508J92940Q5527
22657F42546j0197n3864n4499n5249q7722j05181m6206R024l968l7279m0903q434
22645A48068N1338N7978L8860M4429N97m1835l1810l9593j25766k31525k87023
22634d16282k97486k88483k47685j30297M9104J84644K17217J50782O5553L3153
$$ y = [168252, 160277, 191259, 267777, 312038, 257398, 152557, 86910, 97790, 157963, 166556, 104911, 35693, -20431, -143962, -351897, -518934, -596269, -627639, -649170, -675270, -684230, -646848, -575430, -502249, -463964, -444478, -426790, -397927, -372206, -382701, -425883, -479858, -509691, -479183, -395129, -325938, -333371, -403215, -451776, -441495, -400731, -337943, -229843, -86927, -6083, -51891, -139758, -166998, -137322, -91958, -37581, 29776, 157571, 364079, 557019, 642546, 632349, 578485, 523986, 468737, 381015, 275834, 229628, 238652, 234684, 197405, 156502, 148068, 199406, 257384, 296244, 340673, 341270, 299435, 267625, 228032, 102266, -129259, -416282, -713768, -1002251, -1249936, -1380233, -1331129, -1146485, -929268, -778486, -712933, -679780]
22624f79780M6702R5886J73473J99874J59106J17464L5962p9308j53160j73666
22614b57447j30828j8604L4741M265K8108J06353J32197J29407J58893J54195
22604C41280R1282j1976j19524j22116m1897J8678K1799K4462M9589O4783L7863
22593C54223k8976p4015r0099r9290j16641o5582M9140J61656K42470K70105K16207
22582H19198J36265Q2221O277o9732r6867r9536j18474j51690j75043j60171r6038
22571G6410O769O3669K4278l2644n8398j27722k21806k04359o1630N2725N5665
22560d27043K6363r173m4658m2719K4737J14153J39095J18629Q0583K0070m4585
22549d4548j00094j09045p1648n7013m1851O2570J49676J25615P0380M565j3803
$$ y = [-679780, -633078, -537192, -363719, -163845, -4739, 112725, 148687, 69379, -83781, -257447, -388275, -406879, -372138, -367873, -339765, -233412, -101215, 28192, 187085, 341280, 432562, 420586, 301062, 178946, 137049, 155727, 177526, 201988, 251577, 316360, 354223, 325247, 251232, 161133, 61843, -54798, -120380, -71240, 90416, 332886, 602991, 819198, 955463, 1037684, 1043961, 974229, 877362, 777826, 659352, 507662, 332619, 172448, 76410, 83179, 146848, 171126, 138482, 80084, -47638, -269444, -473803, -535433, -482708, -427043, -400680, -409853, -454511, -497230, -472493, -358340, -219245, -100616, -20033, 37, -44548, -144642, -253687, -325335, -382348, -424199, -361629, -211953, -86338, -15958, -11393, -25196]
22538b5196M7703P7880j6870j58745j62674M013J92066K50596J45722l5870j21285
22527A97340q5814n0821l6767p8559j26851r1224m3911N868Q6347J32071J08673
22516A6352K3402r1866j72617j73599j30206p8503q330M1742L3262Q656Q218J0534
22504e12955J774j1018l7583m1992j1038K0731O5648R1519R6991R7419M5363l0116
22492b25257j3082O5832P6862l3756j78683k08793q9555O9608J22262O1223K4533
22481c28806M9381P5535J11325J46549J43708J33189J29096Q9868J1001n4075
22471E06771n2132k6732n3970o6168n3638p4799q5468j5737P3201P4565K9840
22460B55733l2168n4403j7136l335m0907q0414r8119j27198j36066p5585K040
$$ y = [-25196, 22507, 100387, 83517, -75228, -237902, -233889, -41823, 208773, 354495, 318625, 197340, 111526, 60705, 23938, -54621, -181472, -272696, -316607, -310739, -224392, -92321, 16352, 39754, -52112, -224729, -398328, -528534, -607037, -615367, -573625, -540363, -531707, -523489, -512955, -511181, -522199, -559782, -601774, -612812, -592081, -526433, -434914, -337923, -240504, -195141, -225257, -238339, -172507, -95645, -129401, -308084, -516877, -606432, -536824, -414562, -353339, -328806, -279425, -203890, -92565, 53984, 197692, 330881, 459977, 549845, 560846, 506771, 454639, 427907, 373937, 307769, 254131, 179332, 93864, 78127, 151328, 225893, 255733, 223565, 169162, 152026, 148691, 107784, 27370, -70749, -197947, -334013, -409598, -407558]
22449d07558n881k5477K593J7746J4587J4009m229j9616o084J1711N1488J16064
22437b40647R4431l6147j24575q5731L806J7155k2491r093K2209j771m7526m9712
22425d80092j2264Q3758J82099K00538J66516P5322m9465j05653l1278L4051R963
22414G3495k5394o5517r0072n3916l539M958M446L8309R9021J58169J66830J04340
22402D11130l3786j52732j45310l0760P5133J10612K5003j74925l07854k87436
22392e10925j65125l5847M3740J09091J79308K42556K02867M6859o5272o8037
22382b0785m4193m8290J6912J09074J38747J19903R1698M5184n5959j89154l22955
22371a59818l83253k66976p0377N8584J71461K63414K51637J65254N8760l9615
$$ y = [-407558, -413439, -438916, -436323, -418577, -403990, -389981, -394210, -413826, -419910, -408199, -356711, -240647, -146216, -182363, -306938, -392669, -388863, -371708, -394199, -403292, -381083, -382854, -430380, -480092, -492356, -408598, -226499, -25961, 140555, 215877, 166412, 60759, 29481, 63532, 73495, 48101, -17416, -107488, -161404, -164943, -159985, -155539, -117230, -18209, 139960, 306790, 411130, 377344, 224612, 79302, 48542, 123675, 234287, 259290, 84365, -223489, -510925, -676050, -711897, -668157, -559066, -379758, -137202, 65665, 112524, 47252, -20785, -64978, -113268, -96356, 12718, 151465, 271368, 363066, 408250, 352291, 163137, -159818, -543071, -810047, -880424, -821840, -650379, -386965, -135328, 29926, 88686, 49071]
22361D9071m6977M4903J08776P3323K8703j7627j39706k69404l02873k19523o5515
22350g56849Q3067J56327J46567J25878J00404O8813M2908J6344K5140L1411q1227
22339d1217k23712k26112o7976M6721j8o1959l8818L3717Q3922R4658J01000N3766
22327b46028j3900J3139R4650J33396J08339M8602m5952j47881j79716j21313
22317c56664r5R0349P4907j6192p5417m9763P175M7608L9193J8679L1199M2445
22305a46576J8758J4953J8826K0475M7474O1202N9271L8546j5483r0828j61128
22294a34510j66406p9632N762K5702K2556M7381J11947J98950K45057K33545J86226
22283F96578R9277m9564j77187j73255j39342j34320q2568Q142P4868J21150Q7615
$$ y = [49071, 2094, 46997, 155773, 229096, 257799, 240172, 100466, -168938, -471811, -691334, -756849, -673782, -517455, -370888, -245010, -144606, -75793, -32885, -16541, 8599, 40010, -41217, -264929, -491041, -559017, -512296, -512314, -574273, -613091, -579374, -495452, -400794, -299794, -246028, -259928, -246789, -152139, -18743, 89596, 138198, 92246, -55635, -235351, -356664, -356759, -266410, -191503, -207695, -283112, -332875, -325700, -278092, -238899, -220220, -189021, -146576, -127818, -112865, -94039, -73564, -26090, 35112, 94383, 132929, 117446, 26618, -134510, -300916, -380548, -374786, -349084, -326528, -279147, -167200, 31750, 276807, 510352, 696578, 795855, 746291, 569104, 395849, 256507, 122187, 39619, 47761, 122629, 243779, 331394]
22272C31394m1869j76486k30563j97107j56398j26453p5653j0320O2875J48441
22262d72139J73094J23285R6943R7150J61544K58502K56135J11309o2818j87621
22252E55384k68516k76859k16745r5031J1465M1036N3768P8211J07929J17809
22242A08451Q8233M6950P632k4257k9941j0228n874j7543j7697L120L4329K7600
22230B10775k2038p2337j31974j95590j92646n9148J48408K26300J41471N2321
22220A05542O994k7490o1657p2925m8963j3169l726n3902j02396m3152N5215P0461
22208a89168J9870n8232q0763R164R5452J14366J08849N0433k4684j6640O3543
22197I2190J00836P5812N0281L9020L9062j0322o3682n9059m0837l3116l7682
$$ y = [331394, 289525, 113039, -117524, -314631, -471029, -597482, -673135, -683455, -620580, -472139, -299045, -175760, -78817, 18333, 179877, 438379, 694514, 805823, 743005, 555384, 286868, 10009, -206736, -301767, -290302, -249266, -195498, -117287, -9358, 108451, 196684, 243634, 251266, 227009, 197068, 186840, 180966, 163423, 145726, 148846, 183175, 210775, 188737, 116400, -15574, -211164, -403810, -462958, -314550, -88250, 53221, 105542, 112536, 85046, 23389, -49536, -98499, -111668, -115394, -169296, -271692, -314844, -259629, -189168, -169298, -227530, -308293, -299129, -203677, -89311, 19538, 69971, 45287, 28647, 92190, 193026, 268838, 319119, 358139, 397201, 386879, 323197, 264138, 223301, 190185, 152503]
22186A52503p3588j03418o4533j5095p863k6846j9514K1245K0245l6027k8755
22175a81646P2138J26224J05561P7443O9859M9736R703l1883p0091j25835j51607
22164e0398q9634M686N2427L5859j4793m1605n8241p0712n9302j4802P4690J49423
22152h2402J47646O8147k3021p2211o6959j00783j70018j86757j59886j47594
22142g93838j52280j07985J2072J13811R4981O2935J26704J93835J82814J35550
22132a31401Q0286J2725o1502p6308p623N3672M1149k1065j36661k39061k56985
22121g42774k05721j02370j6300J7338L825K0289P0367J27161J54902J25925R5504
22110d51854J50518K07849J59252L9177q3304j75581j84694j06188j6196M1122
$$ y = [152503, 78915, -24503, -89036, -104131, -111994, -138840, -158354, -137109, -116864, -152891, -181646, -109508, 16716, 122277, 199720, 269579, 319315, 329018, 297135, 227044, 101209, -50398, -140032, -135346, -82919, -47060, -61853, -103458, -161699, -232411, -291713, -306515, -231825, -82402, 65244, 133391, 110370, 38159, -28800, -129583, -299601, -486358, -646244, -793838, -946118, -1054103, -1042031, -928220, -833239, -770304, -643600, -449765, -266951, -131401, -51115, -38390, -99892, -176200, -183823, -130151, -89002, -110067, -246728, -485789, -742774, -948495, -1050865, -1067165, -1049827, -1046002, -1025713, -955346, -828185, -673283, -547358, -451854, -301336, -93487, 65765, 104942, 21638, -153943, -338637, -444825, -461021, -419899]
22100d19899K9241o4776j49991j82825k12546k03669j04035O5092K23492K81578
22090g38338K34935J30867J2121j14517k07957j71900q0106p720Q2813J70744
22080f89058K27186K37466J86741J69917J72245J03555L2362K1698L8885J3047
22070E14044r4895j91476j75540j03240n7788N625O5300L9833p5456j50906p3681
22059b98180M6972P8458N8644O3760Q8136J02809R9574Q7008R7964P4868q717
22048D91296n9117j00442k12872k76555k05075k6891J28522J29037K4890l0050
22038a37257P631J0650n4633m7552K0343L5025J7095K9007M7798M3046M7249R5601
22026A14003J03471M2164j6265p2534p3677j0507M2825L3107j0225l8228n5889
$$ y = [-419899, -390658, -455434, -605425, -788250, -1000796, -1204465, -1308500, -1243408, -1019916, -738338, -503403, -372536, -360415, -474932, -682889, -854789, -934895, -942615, -859802, -689058, -461872, -224406, -37665, 132252, 304497, 408052, 440414, 462112, 500997, 514044, 419149, 227673, 52133, -51107, -108895, -103270, -37970, 1863, -73593, -224499, -298180, -251208, -172750, -114106, -50346, 37790, 140599, 240173, 327181, 425145, 500013, 491296, 432179, 331737, 118865, -157690, -362765, -389656, -261134, -132097, -107207, -137257, -129626, -118976, -173609, -221161, -200818, -165793, -148698, -119691, -71893, -28847, 18402, 114003, 217474, 259638, 243373, 170839, 97162, 86655, 129480, 162587, 152362, 114134, 58245]
22015E8245n0375j7047L0299P9238P9178O3817M9699k7197j08189j40315j79612
22004a62259j80272j12943l5677M2958J09769J38027J18881P8148L1335k0759
21994G208o7677r3538l8689M2228O4915N6130P5305J29505J52937J42254Q5979
21983E56557J2660J3590M5881L5026l3934j27038j31881o0321p2452j62762j84020
21972a08694j17075r5755j21853j18719j01379p6962k5952L6360O7004N5332L7782
21961e69911K9079L4914L2626P117O887K345n44N8289J07806P7274j1554p9517
21949c05189q3614n5527k1891L6146R1813J02392Q2879L1722k1316L7717J81389
21938G6521J85066J3750j31283j13212o6198j07191j20447n4749O821K1109Q293
$$ y = [58245, 7870, -9177, 21122, 100360, 179538, 243355, 293054, 265857, 157668, 17353, -162259, -342531, -455474, -491151, -448193, -338424, -200397, -81516, -3368, 27967, 7208, -60469, -154007, -192696, -150468, -85553, -29423, 45882, 175387, 328324, 470578, 556557, 569217, 582807, 628688, 663714, 629780, 502742, 370861, 310540, 238088, 75326, -108694, -225769, -321524, -443377, -562096, -663475, -740437, -766389, -730029, -663025, -607693, -569911, -540832, -505918, -473292, -466175, -459288, -456943, -457487, -399198, -291392, -214118, -225672, -305189, -388803, -444330, -466221, -430075, -338262, -235870, -152991, -121269, -142585, -104868, 76521, 261587, 275337, 144054, 30842, -35356, -142547, -262994, -317743, -310922, -289813, -281520]
21927b81520L589j7644o6303j04320j20929r7339j531J41181K35785K45763K30752
21916A67484J78990P5679J6637Q404l2366j15805j26607l9365J5400q294l5837
21905A04320k7135M529O0328J44365J92117J56065O4648l6546j31943j55134n7470
21894C18144K7213P147m7296j05662j69146j73647p8316M0955Q0273N8514M2407
21883E86K3462K995K1155K3265k3923n7181n3039m7322j23162k13700j85952q8717
21871g21533K7916J25232J30378Q7707N2712N51n5705m2683J4741N0282N3183
21860b77219l5476j20451l5778J36141J92562O5585j01644j23622n600J03239
21850b02263J45631J55981J71221J90314K18783K23454J73933R7778K1462n0738
$$ y = [-281520, -277931, -295575, -361878, -466198, -587127, -684466, -685997, -544816, -309031, -63268, 167484, 346474, 422153, 438790, 447194, 414828, 299023, 172416, 133051, 148451, 140157, 104320, 77185, 81714, 142042, 286407, 478524, 634589, 699237, 662691, 530748, 375614, 318144, 345357, 352504, 305208, 199546, 30400, -143247, -221563, -180608, -100335, -41821, 586, 24048, 27043, 48198, 71463, 47540, -9641, -62680, -110002, -233164, -446864, -632816, -721533, -693617, -568385, -438007, -350300, -297588, -297037, -352742, -395425, -380684, -330402, -277219, -312695, -433146, -468924, -332783, -140221, -74636, -176280, -299902, -305502, -202263, -56632, 99349, 270570, 460884, 679667, 903121, 1077054, 1174832, 1196294, 1145556]
21840A145556j29292j97150j96615j23002r2487j17427j35468j49727j88721j86798
21830c71131q3205N5250R5078J8845p2716j15803j36985q9304K5013J20767J79809
21819c74382K20962K44832J92632R9012Q1022J25257J19791N5800o2110j86523
21809E16293k14354j54130r7533p5799p5031r7920j19609j07279m0908M1074O8711
21798c56485M4288N6799J26612J60589J38084R3249K4251l6039m6422n7815q2557
21787F4554o8035k9465O017p221q4426j39113j31145q3959l1034l410o537n589
21775e19363n698k0712l6660N822Q0092J04478M6811m6839p4248n6754o2470l9158
21763f24699O3778J56951J44444Q8707R0034R8038N9308L6123N0806J3559m9386
$$ y = [1145556, 1016264, 819114, 622499, 499497, 407010, 289583, 154115, 4388, -184333, -371131, -454336, -399086, -304008, -285163, -357879, -473682, -610667, -699971, -674958, -554191, -374382, -153420, 91412, 284044, 383056, 464078, 589335, 709126, 764926, 702816, 516293, 301939, 147809, 50276, -25523, -100554, -198474, -318083, -425362, -466270, -425196, -356485, -312197, -255398, -128786, 31803, 169887, 263136, 287387, 251348, 204926, 147111, 64554, -3481, -32946, -26929, -34150, -118576, -257689, -388834, -472793, -503827, -507237, -513774, -519363, -525061, -545773, -582433, -576611, -496519, -392041, -345230, -392069, -466317, -523071, -585541, -624699, -560921, -403970, -259526, -170819, -80785, 17253, 76561, 112684, 163490, 177049, 127663]
21752A27663m4750j005J2008K0701P6921J48863J60228R1222J0766n2213q7314
21741D63090q4303p6689o5273j3765L7231K7037n207m6864j13458j19925m3085
21730d1211M0608Q6805R2486O9706K2794l3904j7122N8062R9583J37668J01395
21719F16870l4737r1826k7889M4352j0085j38864j79655j12045J0185Q2606Q1019
21708B39931N1216N9983Q6085M9790j4093o1682j07765j43055j59448j42212m4839
21697a86089K2726J866k7237p2736j19061r7648J7723J29179J60811J32011P8212
21686C9757J5944k4275k0013L8934J42781J83566J29334O1281R860l7384q7522
21675D52263j12125p3750O781N8978N4993K4942L08Q03M2669Q9195Q0239L8541
$$ y = [127663, 82913, 81908, 93916, 114617, 191538, 340401, 500629, 591851, 602617, 550404, 463090, 378787, 302098, 236825, 223060, 260291, 287328, 282121, 235257, 121799, 1874, -41211, -603, 86202, 178688, 248394, 271188, 237284, 220162, 278224, 377807, 515475, 616870, 582133, 490307, 462418, 506770, 496685, 357821, 178166, 66121, 76306, 158912, 239931, 291147, 351130, 437215, 487005, 472912, 411230, 303465, 160410, 962, -141250, -186089, -163363, -161497, -188734, -261470, -380531, -478179, -460456, -331277, -170466, -38455, 39757, 55701, 31426, 11413, 50347, 193128, 376694, 506028, 567309, 577169, 539785, 452263, 340138, 266388, 273169, 332147, 387140, 412082, 412390, 413193, 455862, 545057, 625296, 663837]
21663F63837r344R037P8117N3316p6871j83592k10437j67129p9020p239K8881
21652I9556N3619N3490J4378o0320j01674q2676r3956j66977j53692m553J71699
21641b71106K81791K68587J44478K502p5072j27514j83436j78356j15603m7286
21631c01015P407N1050Q6032J32171J76793J71758O7657n8611l1068O9229L6727
21620D08130p1357j01516m3032k0270m8571p1163m9897l933J2473J0211Q408J7290
21608D6773N5759J03790P8204L3475L3618N867p1750j26546j21715p0801k6072
21597e9398m1401m2278N0779J33186J20010Q5183J14002J20519M9744o893k9012
21586D94441m6173m0276k7416k9019r4818j70334j06943J5771K2320o3656j22197
$$ y = [663837, 654493, 663530, 741647, 794963, 718092, 534500, 324063, 156934, 77914, 70675, 99556, 153175, 206665, 221043, 160723, 59049, -23627, -117583, -284560, -438252, -442805, -271106, 10685, 279272, 423750, 426252, 351180, 223666, 40230, -138126, -253729, -301015, -293608, -242558, -156526, -24355, 152438, 324196, 391853, 333242, 302174, 371403, 408130, 336773, 235257, 192225, 171955, 123384, 52221, 2324, -1609, 10864, 21075, 29483, 46773, 102532, 206322, 284526, 318001, 351619, 357486, 285736, 159190, 37475, -33326, -59398, -100799, -143077, -92298, 40888, 160898, 246081, 360083, 480602, 530346, 523453, 494441, 448268, 407992, 380576, 351557, 256739, 86405, -20538, -4767, 17553, -46103, -168300]
21575a68300o9475M6197J04273Q9675J4786n5284k5678K9219L4760P7609J28711
21564B06493Q5574J8439J6906O8115Q1624K3453n6924j12586r4360l5044l3014
21553A68676j21422k18494j86087l1641J06063R3634l7982j25771j00159k2890
21543d76073N5539R0205J09774J40850J66574J87245J34499K1625l3087K513L1895
21532D31559J9249n102k7475l8127j0931O7531R7352K8148l6306k762O1988L8464
21520F23588n4187n2997K2314N8447M8406Q058n2399j21623j51477j23760j04175
21509A00195j48204k21343k38093j37886M6104K08812K47419K21271J80217J00814
21499C59306N2892O9569J30585J40810M1349o5776o4160j9039L2287O0990m4915
$$ y = [-168300, -237775, -191578, -87305, 2370, 17156, -38128, -63806, -34587, 173, 77782, 206493, 292067, 310506, 327412, 395527, 477151, 500604, 443680, 331094, 236734, 201690, 168676, 47254, -171240, -357327, -388968, -282905, -189271, -227253, -353024, -453183, -476073, -420534, -330329, -220555, -79705, 86869, 274114, 408613, 430238, 397151, 399664, 431559, 450808, 445706, 418231, 380104, 369173, 436704, 534056, 562204, 525898, 523136, 585124, 623588, 569401, 516404, 538718, 597165, 645571, 653629, 601230, 479607, 328130, 204370, 100195, -48009, -269352, -507445, -645331, -599227, -390415, -142996, 78275, 258492, 359306, 412198, 481767, 612352, 753162, 794511, 728735, 664575, 645536, 677823, 738813, 693898]
21488F93898k21216k50745j13325K5031O4204J5628o2803p1708j9225R98j5911
21477D4826L233L0130j5011j00838j33337r1165l9823K5180J03415J00797R122
21466f3471m4614m2877O839R6775J11802j3090j25080j42036j36995j25248l2391
21455e10386J27577K30761J82939L1836o6805p9800l1505j102j8418l5114p9860
21444b49877j15171k9214R1906J64897K25625K33298J52802P0994L4310m1300
21434E38270j30759j42031p9328K2306J11873J44969J50233J95443K31634J92273
21424A234883J52318J12438J1329q3873j13133p4849n8293j51993k28316j71603
21414F28908l8049N7827P552j55903k68929k50363j05396O6447R8210K9072K1288
$$ y = [693898, 472682, 221937, 108612, 133643, 197847, 213475, 150672, 78964, 59739, 60737, 44826, 48059, 78189, 63178, -37660, -170997, -262162, -301985, -276805, -173390, -72593, -63471, -108085, -150962, -144123, -47348, 64454, 51364, -73716, -215752, -352747, -477995, -510386, -382809, -152048, 30891, 62727, -4078, -83878, -115383, -116485, -134903, -170017, -249877, -365048, -394262, -302356, -137459, 88166, 321464, 474266, 545260, 579570, 538270, 407511, 265480, 186152, 208458, 320331, 465300, 615533, 810976, 1042610, 1234883, 1387201, 1499639, 1510968, 1427095, 1313962, 1239113, 1180820, 1028827, 800511, 628908, 590859, 648686, 656238, 500335, 231406, -18957, -124353, -57906, 40304, 69376, 90664]
21403I0664N7641M7414J2967L3588P3447R2573R7074Q1722N8706L5177K7589J0845
21391G19407q7892k03100k47133k22026j71886j58392j35738k2846J10491J37297
21381b81818Q3188P4548J34713J89234J54571Q1276O6588O8745K1925j3047l0812
21370E49111q6138j30920j49898j69562j67962j30428p6918n2784n1110l0550
21360d97159K5566P7645Q2775L3207k2984n1147o1759q5195q2431l7253l122L1567
21348e90290P5626R9848N5376m5388r2023k7291R0865K05237K57038K11856J21185
21337C62039K9167l0101o9825r5600j42782j91537j34647k4302L8058Q7676J21218
21326e0636O1722q5638j65358p6558L4602P9061J14596J13384P1932M4537K6189
$$ y = [90664, 148305, 195719, 208686, 242274, 315721, 408294, 505368, 587090, 645796, 680973, 708562, 719407, 631515, 428415, 181282, -40744, -212630, -371022, -506760, -529606, -419115, -281818, -198630, -124082, 10631, 199865, 354436, 435712, 502300, 571045, 592970, 579923, 549111, 462973, 332053, 182155, 12593, -155369, -285797, -362715, -415499, -466609, -497159, -471593, -393948, -311173, -277966, -300950, -352097, -413856, -499051, -581482, -618735, -621857, -590290, -514664, -414816, -359440, -404828, -496851, -524142, -433277, -228040, 28998, 240854, 362039, 391206, 361105, 291280, 195680, 52898, -138639, -273286, -297588, -259530, -171854, -50636, 11086, -74552, -239910, -316468, -281866, -202805, -88209, 25175, 97107, 141644, 167833]
21315A67833K8310Q7566J49938J47397Q8871N2096M7593L1630j4034p1567r1251
21304F24382o2525k9365k1450m9405j09808j04876l1769J9940N2162N5511L3922
21293C76719J3722L227l3521r1407j42356j99030j96854j21876n3214k5212m5060
21282e14862j18172j56727j11092m0966N4464J67579J88191J06848N5327O8245
21272c01165Q5227L8170q0574j49631r1772p895K0563L5981M1413M4052P7401
21261b88230J47396J65125M8685l9133K246O2248K5336m3590p1524m6170P9967
21250D2356K19890K15489J13373L1639n4789j71312k22291j73937r5379j5944
21240a10905Q1234J44365J41786Q8442K5089j9904l6698m4926q6645j33274j20582
$$ y = [167833, 196143, 283709, 433647, 581044, 669915, 722011, 769604, 801234, 787200, 715633, 624382, 561857, 532492, 511042, 461637, 351829, 246953, 215184, 235124, 287286, 342797, 376719, 390441, 393668, 360147, 268740, 126384, -72646, -269500, -391376, -444590, -469802, -514862, -633034, -789761, -900853, -941819, -887355, -719776, -531585, -424737, -369410, -301165, -215938, -177768, -258342, -407973, -499745, -507640, -487077, -451096, -409683, -365631, -288230, -140834, 24291, 72976, 33843, 36089, 98337, 123673, 80083, 8559, -37611, 42356, 262246, 477735, 591108, 622747, 567958, 396646, 174355, 418, -94961, -110905, -29671, 114694, 256480, 344922, 370011, 350107, 313409, 268483, 181838, 48564, -72018]
21229g2018n4492m6714q7397q8109j1965J05571J37795O5037L2635P4839J13551
21218A68733J09646J42516J85929J47645P7909L8575j7026j16695j68582j15637
21208D53013m2340j4778K5914P8402N3047o369J8908J12209J63954J10702P114
21197I59776n6656j13287j85063k35770k52884j66931K7044J72046J87844J10368
21187D46487L5215J4749o676n6199o1584l9867P287P2331P5106O0450N4585r210
21175E92674k4855O4554J37585Q8776l4208j17453j10585k6533M2108K5184n7563
21164E79684j30324j68379j92663j81393q8493K8926R6212J35710J30730Q9700
21154B99710O4557N1191N103p2919r9769Q484J70621K12631J42428R7820Q3013
$$ y = [-72018, -126510, -173224, -260621, -348730, -360695, -255124, -117329, -52292, -19657, 55182, 168733, 278379, 420895, 606824, 754469, 832378, 870953, 853927, 737232, 568650, 453013, 410673, 395895, 421809, 500211, 553258, 546889, 565797, 678006, 841960, 952662, 959776, 903120, 789833, 604770, 369000, 116116, -50815, -23771, 148275, 336119, 446487, 481702, 496451, 489775, 433576, 371992, 332125, 339412, 411743, 486849, 547299, 601884, 592674, 567819, 632373, 769958, 858734, 824526, 707073, 596488, 569955, 612063, 637247, 579684, 449360, 280981, 88318, -93075, -181568, -152642, -56430, 79280, 210010, 299710, 364267, 415458, 420561, 347642, 247873, 256357, 426978, 639609, 782037, 879857, 962870]
21143I62870M3569k406j683M4477P0576N8048O0352P4431M6584q383p1336j48449
21131A128650j85210j63359j02839k2273L7029J7255k3675k7758m2584r0015j41505
21120C83716j34996o5910J008L4202N5886L6580R869M6858P9700M7950R211M526
21108E08600n22k7849m8854m5677j7549K4015M8294J2593k2666l7672n9615l9608
21096B93490M0952P8191O0739M6433L3113R5123K11447K51714J28916n8751j08055
21085A073312k2132J17240K04619J24921p9419k35187k33270j17849n8203r4873
21075F79159j18873p4368p54L2870O8319J38629J83931J76025J67191J57765P0686
21064A480580m2817j23827j76362j31109k1809R788o1924j38286j80117k00680
$$ y = [962870, 1006439, 1004033, 1002350, 1046827, 1117403, 1175451, 1235803, 1310234, 1356818, 1348435, 1277099, 1128650, 943440, 780081, 677242, 654969, 691998, 709253, 685578, 657820, 615236, 525221, 383716, 248720, 182810, 183818, 218020, 273906, 310486, 320355, 367213, 446913, 494863, 504074, 508600, 508078, 480229, 431375, 385698, 368149, 392164, 440458, 453051, 430385, 392713, 333098, 293490, 334442, 412633, 473372, 519805, 552918, 648041, 859488, 1111202, 1240118, 1181367, 1073312, 1051180, 1168420, 1373039, 1497960, 1418541, 1183354, 950084, 832235, 774032, 679159, 560286, 485918, 485164, 518034, 586353, 724982, 908913, 1084938, 1252129, 1409894, 1480580, 1437763, 1313936, 1137574, 1006465, 984656, 994444, 932520, 794234, 614117, 413437]
21054D13437j80012q0026L6682J20591J23861K4543q7426j03519j1113J08994
21044C66012J48097N9893r5453j92974j50391k3425R2994J57748J25989J7321
21034E05811q1915j15910r6954n3788N990L9566J6070R236M0856K8760k1361l6203
21022B40158O854M2207R756m3668r8557j30293j05535k3782Q9066J94173K59330
21011D39709K86545K63149J83723O5322o6014j76767k27348j70675m8811N0085
21001E98918R9449P5296Q803o840L1970J04220J96012K17734J32261J5112p8264
20990A394671j00011p7663o4558m5415R422K0502m2548r3348j13335o3633N2557
20979H76641Q1107n379j14894k05042k09602q8697N2780J17614R4787M6612n901
$$ y = [413437, 233425, 153399, 190081, 310672, 434533, 459076, 371650, 268131, 257018, 366012, 514109, 574002, 478549, 285575, 135184, 111759, 204753, 362501, 488490, 505811, 423896, 307986, 211032, 157244, 163234, 202800, 218870, 228106, 268962, 297722, 276361, 240158, 247012, 289219, 298975, 255307, 156750, 26457, -79078, -102860, -13794, 180379, 439709, 726254, 989403, 1173126, 1238448, 1172434, 995667, 768319, 597644, 548833, 598918, 698367, 773663, 782466, 775626, 807596, 911816, 1107828, 1325562, 1457823, 1472935, 1394671, 1294660, 1216997, 1152439, 1107024, 1116446, 1136948, 1094400, 1001052, 887717, 824084, 876641, 957748, 952369, 837475, 632433, 422831, 334134, 386914, 504528, 599315, 645927, 640026]
20968F40026p7958p4213O687P3867J05560J54620K35974K85826K83458K39501
20958A873348J56534J9037p3575k6910J0258j02577k77582l90860l86804j95254
20948F05615R2959K23564J52985O3991O1104P2505J4133j20344k64809k80175
20938F21528j71850n7980M4893J49967K26705K35125J80638Q9223L5708O1350
20928A415307P8347M504q7366j60408j97129j61338r6439m6314J9660J12247J54871
20917A035942J76782K55055L02659K25388Q2963o650j2089L5302P8615N8472k3471
20906B208968m4670K2634O9010J12264K32528L33025L50113L52425L85093M09071
20896D430461M10897L72504L42287M28501O20851Q24088J005194J167831J343146
$$ y = [640026, 562068, 487855, 494542, 568409, 673969, 828589, 1064563, 1350389, 1633847, 1873348, 2029882, 2048919, 1975344, 1948434, 1958692, 1856115, 1578533, 1187673, 800869, 605615, 698574, 922138, 1075123, 1139114, 1200218, 1272723, 1286856, 1166512, 901703, 621528, 449678, 391698, 436591, 586558, 813263, 1048388, 1229026, 1318249, 1353957, 1415307, 1493654, 1498158, 1410792, 1250384, 1053255, 891917, 795478, 749164, 768824, 881071, 1035942, 1212724, 1467779, 1770438, 1995826, 2078789, 2072139, 2060050, 2095352, 2173967, 2232439, 2208968, 2164298, 2186932, 2255942, 2368206, 2600734, 2933759, 3283872, 3636297, 4021390, 4430461, 4841358, 5213862, 5556149, 5984650, 6605501, 7429589, 8434783, 9602614, 10945760]
20887A0945760J540471J728404J954956K271198K675586L223141L939153M826693
20879C3105362N935513P486691R729283J2763063J6367258J9777594K0857565
20872A26022329J5531202J823942j3379009k0954444k0722688j7320840j3686785
20865E7313707j0614720q171371o324644m915128l834920l088996k645115k320898
20857A5397915k000873j721725j454402j175400r66503q27433p09850o17353n25643
20848E398733l96575k57914j39321p7048j15155k32929l36206l33051k55951j61073
20838C093510r2113r4549j41071k15207k78269k95744l06079l10720k73809k54238
20828H31711k09969m4437J56276J81543M6964J0262Q4854J04090O0444K0872L1012
$$ y = [10945760, 12486231, 14214635, 16169591, 18440789, 21116375, 24339516, 28278669, 33105362, 39040875, 46527566, 56256849, 69019912, 85387170, 105164764, 126022329, 141553531, 143377473, 129998464, 109044020, 88321332, 71000492, 57313707, 46698987, 38527616, 32202972, 27287844, 23452924, 20363928, 17718813, 15397915, 13397042, 11675317, 10220915, 9045515, 8079012, 7251579, 6541729, 5924376, 5398733, 5002158, 4744244, 4604923, 4527875, 4412720, 4179791, 3843585, 3510534, 3254583, 3093510, 3001397, 2906848, 2765777, 2550570, 2272301, 1976557, 1670478, 1359758, 1085949, 831711, 621742, 577305, 733581, 915124, 962088, 972350, 1057204, 1161294, 1221738, 1242610, 1273622]
20817A273622R4298J10657O3015M8891R1041J28666J41723J32616Q3884J2409
20807B180822k8679k0178K0954N7934J7773m5434m9077j1208J04490K48542K54009
20796B729948J21701m6323j79533k17815k16957k31941k46791k02331q0618Q5906
20786A515246K43660L14377K65592K26204K93849M38217N91738O61878N90586
20777E141347N22763O21831Q17153J034675J289974J531561J792168K132471K560137
20768A7444080L035591L600108M432637N636751P209109R182455J1619475J4281098
20760G6441304J5710909J2669413K910087r025090j5667478j6010963j3508242
20753E3519940j0669004q289129o384804m874997l757215k944260k368461j995692
$$ y = [1273622, 1367920, 1478577, 1541592, 1590483, 1681524, 1810190, 1951913, 2084529, 2168413, 2180822, 2152143, 2131965, 2152919, 2210853, 2228626, 2183192, 2134115, 2122907, 2227397, 2475939, 2729948, 2851649, 2805326, 2625793, 2407978, 2191021, 1959080, 1712289, 1509958, 1429340, 1515246, 1758906, 2073283, 2338875, 2565079, 2858928, 3297145, 3888883, 4550761, 5141347, 5664110, 6285941, 7103094, 8137769, 9427743, 10959304, 12751472, 14883943, 17444080, 20479671, 24079779, 28512416, 34149167, 41358276, 50540731, 62160206, 76441304, 92152213, 104821626, 107731713, 98706623, 83039145, 67028182, 53519940, 42850936, 34561807, 28177003, 23302006, 19544791, 16600531, 14232070, 12236378]
20745A2236378j717610j428266j168379j027196r70916q93409p44332n47593l87346
20736C351331k89565j99849j26043j03502j19442j19339m5798M7616P6632K9104
20726B501145n9874j60520j93052j67175j53943j21341q0354j9035J6591l7577
20716A524865j45449k25537k29385j88061j47007j01876j566J28392J72141J12327
20706H98844N0650O7600J21097J01483L9888K2360q329n6862m6498L2630P2217
20695A295080j6588j00267p8688k0407j3337n0237n4678m9762j2618P9088J35301
20684A112887R2368K9902L8259P9087J07061J22576J10037O3543m1780j74934
20674A539006k65335l12570l17150k62735j86076j04779k1999P097l2783o5405
$$ y = [12236378, 10518768, 9090502, 7922123, 6894927, 5924011, 5030602, 4286270, 3738677, 3351331, 3061766, 2861917, 2735874, 2632372, 2512930, 2393591, 2347793, 2395409, 2472041, 2501145, 2441271, 2280751, 2087699, 1920524, 1766581, 1645240, 1564886, 1545851, 1562442, 1524865, 1379416, 1153879, 924494, 736433, 589426, 487550, 485984, 614376, 786517, 898844, 949494, 1017094, 1138191, 1239674, 1279562, 1301922, 1293593, 1236731, 1190233, 1222863, 1295080, 1278492, 1178225, 1099537, 1079130, 1065793, 1015556, 960878, 911116, 898498, 977586, 1112887, 1205255, 1235157, 1273416, 1352503, 1459564, 1582140, 1692177, 1755720, 1713940, 1539006, 1273671, 961101, 643951, 381216, 195140, 90361, 68362, 75459, 42676, -22729]
20664b2729n740J62768L46315L30385J33493j6072r0253j51487j79832j62491
20654C44357j33883j32878j20300q2476k511N9722L9476l7291n8508q82M0610
20643h4564N4185N1753K5054j3270j6666J6214L5459L3164M3098K4622k2256l7751
20631A09042j9359J0973P2144J46461J65224P5327o2584q2826K3625J14847J35105
20620F87979J26047J04030M1495n2948j38625j99456k31960j98041j06179m559
20610B7783M6627N3966M7067J9588l7989j02359j53887j75153r3320O8352K02099
20599i7226K62578K13016J28313M1537o4847j14554p4464J2403N9483J1693m9973
20588C27959l5620J9941N3427M1264j5886m3193j0175L0308R3018J27598Q8881
$$ y = [-22729, -28469, 134299, 480614, 810999, 944492, 928420, 838167, 686680, 506848, 344357, 210474, 77596, -42704, -125180, -127691, -67969, -28493, -65784, -124292, -125174, -84564, -30379, 21374, 46428, 33158, 16492, 32706, 68165, 101329, 144427, 169049, 146793, 109042, 89683, 100656, 172800, 319261, 484485, 559812, 497228, 414402, 438027, 552874, 687979, 814026, 918056, 959551, 906603, 767978, 568522, 336562, 138521, 32342, 27783, 74410, 128376, 175443, 195031, 157042, 54683, -99204, -274357, -367677, -299325, -97226, 165352, 378368, 506681, 548218, 483371, 368817, 294353, 306756, 366239, 377932, 327959, 292339, 312280, 365707, 406971, 391085, 347892, 337717, 368025, 461043, 588641, 677522]
20577F77522M2554k8613j32958j44438l7978O4516J02820P9565M417q9600j60391
20566C77416j49057q2469q5040j23557j15050n4076M1311J19223J59242J99811
20556B87754K04513J66700J15623P4610K5921P084K9544m883o0383q0583o1495
20545G04405m4841r5581j60718k02709j53759J710R9211R4549N1240n8749j37696
20534I7062r3443j0593N4313J00452J58486J65707O7055m1556n3390k6230k2577
20523C95286j3533j7926o8300q8837n2662k0594P485O3883J42187J79901J60257
20512F87147J28593Q8962J1315j6292L2612L3722j6924p1035j39378k18098k48338
20501B72286j55878j4191L1351J4567M504L1611J27008K12433J88553P8710q6520
$$ y = [677522, 720076, 691463, 558505, 414067, 376089, 440605, 543425, 622990, 627407, 537807, 377416, 228359, 145890, 60850, -62707, -177757, -231833, -190522, -71299, 87943, 287754, 492267, 658967, 774590, 849200, 875121, 882205, 911749, 906866, 846483, 765900, 704405, 659564, 563983, 403265, 200556, 46797, 48507, 147718, 242267, 293507, 234758, 97062, 3619, -6974, 47339, 147791, 306277, 471984, 539039, 497483, 444093, 417863, 395286, 381753, 363827, 295527, 206690, 154028, 133434, 140919, 204802, 346989, 526890, 687147, 815740, 904702, 916017, 899725, 932337, 966059, 949135, 878100, 738722, 520624, 272286, 116408, 102217, 133568, 148135, 152639, 184250, 311258, 523691, 712244, 790954, 704434]
20490G04434k60719l24383k90895k12355r4544M065Q2169K42820M31067M27027
20480G08686K21124m4749k38110k71760j49011N8896J76723J23555j2574p7195
20470D95585k7197K3270Q718k3107j1996j5307m1902o8184p9538l8643M5784J65248
20458D32731K36087K05848J85738J77756Q8182l9922j38721j77603j68728j18388
20448F82980l2506R0508K29513L19818L06828J97738M9813m0891o7739k8308L6530
20437A744284M6535j7557o7955O293J75001L22342M06376M34778M23643M80118
20427C953858O22867O95909O86612P23530Q91292J221194J681677K256090K956638
20418A5689667L812952M787362N485978M723697J540218k103839l362551k495114
$$ y = [704434, 443715, 119332, -171563, -383918, -478462, -474397, -392228, -149408, 281659, 708686, 929810, 885061, 646951, 375191, 226180, 285076, 461799, 585354, 572780, 495585, 468388, 491658, 500376, 477269, 465273, 449966, 408064, 339880, 260342, 221699, 267483, 432731, 668818, 874666, 1060404, 1238160, 1326342, 1286420, 1147699, 970096, 801368, 682980, 650474, 740982, 970495, 1290313, 1597141, 1794879, 1844692, 1803801, 1736062, 1707754, 1744284, 1790819, 1773262, 1705307, 1711600, 1886601, 2208943, 2615319, 3050097, 3473740, 3953858, 4576725, 5272634, 5959246, 6682776, 7574068, 8795262, 10476939, 12733029, 15689667, 19502619, 24289981, 29775959, 34499656, 36039874, 33936035, 30573484, 28078370]
20410B8078370r48656P15232K315005L263438K361039r31223m322172n442775
20402B5088258m895956l939653l072239k361595j778315j340274j046123q17055
20394E837048o06332m66655m32662m42081m13289l25030k51984k38544k38664
20385B421807k42558k37215k20236j48676o6136n2231q8445j19096r1769j9179
20375A136266L9266P0295L6377o6637j48830j44550r5802o0125j0748O2450P8421
20364H96383L3041K9767R6599J61019J44146N8941n088n2982j00657r0873o0729
20353A109567l2225P103L5674J1025n9604j10627m7419J45023K97560K53987O8658
20342A678722n1896k0889M5313K4285n5313r7861q1582j3518O7498Q9127M9947
$$ y = [28078370, 27129714, 27844946, 30159951, 33423389, 35784428, 34853205, 30531033, 25088258, 20192302, 16252649, 13180410, 10818815, 9040500, 7700226, 6654103, 5837048, 5230716, 4764061, 4331399, 3889318, 3476029, 3150999, 2899015, 2660471, 2421807, 2179249, 1942034, 1721798, 1573122, 1506986, 1454755, 1366310, 1247214, 1155445, 1136266, 1175532, 1245827, 1282204, 1215567, 1066737, 922187, 826385, 766260, 755512, 817962, 896383, 929424, 959191, 1055790, 1216809, 1360955, 1419896, 1414808, 1361826, 1261169, 1170296, 1109567, 1077342, 1084445, 1120119, 1131144, 1071540, 960913, 913494, 1058517, 1356077, 1610064, 1678722, 1626826, 1605937, 1651250, 1675535, 1620222, 1522361, 1440779, 1427261, 1494759, 1583886, 1633833]
20331A633833p1474j89345j41674M0212J83566K30136K07800J26078j6275j79986
20321A822871k54216k00643j44308j12124p5975l6874k61m2137j20461j01696
20311G34176Q584J14574J25273Q6779P4518L7903m9986j51703j80938q3613M1616
20300G57183J29674J30611L9096j3830k282j5375o7316r7489j04831j20693j09964
20289E24784n9896Q718J15069J95277K09688J43869J1466m1273J4160Q3653J62138
20278A367653K29514J84446J2741j62506k37630k16022j51908r5954r5941j64760
20268F69633j90755j38815q3464k2371J9467L1473L849q5051j57114j81908j74395
20257c09451j17823j8378P0833P5898K6982L2147J16032K40950L26911L24702
$$ y = [1633833, 1562359, 1373014, 1231340, 1271552, 1455118, 1685254, 1893054, 2019132, 2002857, 1822871, 1568655, 1368012, 1223704, 1111580, 1035605, 998731, 998470, 956333, 835872, 734176, 742760, 857334, 982607, 1069386, 1143904, 1181807, 1131821, 980118, 799180, 715567, 757183, 886857, 1017468, 1056564, 1042734, 1040452, 1025077, 957761, 860272, 755441, 634748, 524784, 464888, 473606, 588675, 783952, 993640, 1137509, 1148975, 1107702, 1121862, 1205515, 1367653, 1597167, 1781613, 1794354, 1631848, 1394218, 1178196, 1026288, 930334, 834393, 669633, 478878, 340063, 256599, 234228, 253695, 285168, 289017, 203966, 46852, -135056, -309451, -427274, -445652, -374819, -298921, -271939, -239792, -123760, 117190, 444101, 768803]
20247G68803K35847J02481N638n9127p3233J2131P4778L8522n4959j35704j73963
20236G41214j99812k06493j48847n6727K4979M7454N5365Q9301R2362R5223J02714
20225F36733P5201K3466n929P651P1433J85111K12717J15363k626q1394p4549
20214A163177k1975N8666J14012M1676j10567k16264k08610j43250p1154K1518
20204F27229J04795R5982R210n4275o2292m1734p4426j74694k17957j55645o5602
20193i409K3286R7278J02226O0111M3257K3754M427K4761L1679K8004O8416J27927
20181F25717J27810P4219Q4850J92678K53001J80293P0091N572n0307r7330q2003
20170A384591l3619j4537k7378m2477n4056p4937j11271j32916j19352o3636M986
$$ y = [768803, 1004650, 1107131, 1112769, 1053642, 980409, 992540, 1067318, 1105840, 1050881, 915177, 741214, 541402, 334909, 186062, 129335, 154314, 201768, 257133, 346434, 438796, 534019, 636733, 711934, 735400, 729471, 737122, 808555, 993666, 1206383, 1321746, 1319120, 1237726, 1163177, 1141202, 1199868, 1313880, 1355556, 1244989, 1028725, 820115, 676865, 605711, 627229, 732024, 828006, 837216, 782941, 720649, 678915, 604489, 429795, 211838, 56193, -9409, 13877, 111155, 213381, 273492, 316749, 340503, 344930, 369691, 401370, 429374, 497790, 625717, 753527, 827746, 912596, 1105274, 1358275, 1538568, 1608659, 1614231, 1563924, 1466594, 1384591, 1350972, 1336435, 1309057, 1266580, 1212524, 1137587, 1026316, 893400, 774048, 710412, 715398]
20159G15398O1393J45999K34987K42759K01455J47476J08819Q8766M4526j7104
20149A974474p0559j28455j76742j67160r5347m117Q6217J62537J77279P0562
20139A828689p4868j34149p2682J450k3599m3283k0799l3883k4637N6784J31303
20128A590326J58266J47479J06254O7781P7726J28127J45675R9287N1605L6800
20118B609326K2689l2724n7650p004O5493J37897J63487J49742J55727J19259
20108C326242J4854n1681J3063J46706K18758K71714L32426L41643K95631K38509
20098E147865J65966J17077J29107J20072L6467j9868j6221q580k9645k6560J7773
20087E633453L5438O1097J58478K58908K97164L20789M45770O83865Q43564Q36224
$$ y = [715398, 776791, 922790, 1157777, 1400536, 1601991, 1749467, 1858286, 1947052, 1991578, 1974474, 1903915, 1775460, 1598718, 1431558, 1336211, 1332094, 1418311, 1580848, 1758127, 1828689, 1753821, 1619672, 1546990, 1548440, 1524841, 1481558, 1460759, 1426876, 1402239, 1459023, 1590326, 1748592, 1896071, 2002325, 2070106, 2147832, 2275959, 2421634, 2520921, 2572526, 2609326, 2632015, 2599291, 2541641, 2534637, 2600130, 2738027, 2901514, 3051256, 3206983, 3326242, 3341096, 3289415, 3302478, 3449184, 3667942, 3939656, 4272082, 4613725, 4909356, 5147865, 5313831, 5430908, 5560015, 5680087, 5716554, 5696686, 5680465, 5671885, 5642240, 5615680, 5633453, 5668891, 5729988, 5888466, 6147374, 6444538, 6765327, 7211097, 7894962, 8738526, 9574750]
20077I574750Q01225Q78373J127455J482129J896732K348914K852445L457484
20069B4419507M211961N178053O516729Q430681J1053117J4271220J6893157J5544816
20061A06519241O331512p400622j5809624j6253001j3118356r714017o999775
20054D3555358m942638l433495k306531j304322l62940N65182J577424K672096
20046C6020134L869234N281897P061873R365479J2271485J5339999J6235229J0518638
20038A15963968k415497j3955625j7383134j5286474j1833635q798931o504848
20031C9785824m823839l562949k557019j722531j064102n63022j94124J77770
20023B5476008P05723J347022J928655K464824K975939L564758M371683N284690
$$ y = [9574750, 10375975, 11254348, 12381803, 13863932, 15760664, 18109578, 20962023, 24419507, 28631468, 33809521, 40326250, 48756931, 59810048, 74081268, 90974425, 106519241, 112850753, 105450131, 89640507, 73387506, 60269150, 50555133, 43555358, 38612720, 35179225, 32872694, 31568372, 31205432, 31770614, 33348038, 36020134, 39889368, 45171265, 52233138, 61598617, 73870102, 89210101, 105445330, 115963968, 113548471, 99592846, 82209712, 66923238, 55089603, 46290672, 39785824, 34961985, 31399036, 28842017, 27119486, 26055384, 25492362, 25298238, 25476008, 26181731, 27528753, 29457408, 31922232, 34898171, 38462929, 42834612, 48119302]
20015D8119302O252059P447259R042525J1056596J3558366J6872313K1427269
20008A33775689K7520661L5484108M5600790N6951255O4426523N5819112J9727245
20001D39305383l0250202o1990496o6304892n6536053m4265928l3803657k5737302
19994A20416853j9703300j5237227j1978931r710498q241475p138980o093721
19987D2312721n083082m190625l427900k812543k373585k028720j750278j545929
19979A9100059j397779j270074j147729j055615r52061q18031p19064o37466m68153
19970A0634087k54456j25797r9531j28238j22548n2309l595M396j9536j12010
19960I720463k33804j94010L6695J55632n7739m57215p13101o17286l49685j95274
$$ y = [48119302, 54371361, 61818620, 70861145, 81917741, 95476107, 112348420, 133775689, 161296350, 196780458, 242381248, 299332503, 363759026, 419578138, 439305383, 409055181, 347064685, 280759793, 224223740, 179957812, 146154155, 120416853, 100713553, 85476326, 73497395, 63786897, 55545422, 48406442, 42312721, 37229639, 33039014, 29611114, 26798571, 24424986, 22396266, 20645988, 19100059, 17702280, 16432206, 15284477, 14228862, 13276801, 12458770, 11739706, 11102240, 10634087, 10379631, 10253834, 10154303, 10026065, 9903517, 9851208, 9847613, 9852009, 9832473, 9720463, 9486659, 9292649, 9329344, 9484976, 9427237, 8970022, 8256921, 7639635, 7289950, 7094676]
19950G094676j87601j48895p4989m5095j2678P0229J79331K38105J41687j14311
19940G140459l17316l96143m24144m36258m71279m83439l86140k57908j85390
19931C782442j30691r2597j11392j92206j97636j05395m6242J428Q6995J25704
19921C120410Q6963N9071N3301q801q2642l5120Q0799J81729K74601K80058K01920
19910D212289J67055K39402L27050L54729L97108M94914N90723P33277R84687
19901H501234J306562J516826J490822J381227J429910J694997J729865P85693
19893A9837136r65051k160816k268243j864643j375174r55049o01885l44943j93692
19884I107640o5919R4167K85527M45818N75806P09467Q39456J009775J288202
$$ y = [7094676, 6907075, 6758180, 6683191, 6638096, 6625418, 6695647, 6874978, 7113083, 7254770, 7140459, 6823143, 6427000, 6002856, 5566598, 5095319, 4611880, 4225740, 3967832, 3782442, 3651751, 3559154, 3447762, 3255556, 3057920, 2952525, 2906283, 2907711, 2994706, 3120410, 3207373, 3266444, 3319745, 3310944, 3228302, 3193182, 3273981, 3455710, 3730311, 4010369, 4212289, 4379344, 4618746, 4945796, 5300525, 5697633, 6192547, 6783270, 7516547, 8501234, 9807796, 11324622, 12815444, 14196671, 15626581, 17321578, 19051443, 19837136, 18872085, 16711269, 14443026, 12578383, 11203209, 10248160, 9646275, 9301332, 9107640, 9041721, 9135888, 9421415, 9867233, 10443039, 11152506, 11991962, 13001737, 14289939]
19875A4289939J653176K056807K488308K876558L211944L646409M353607N356190
19867C9932938O683581Q423806J0664560J3534060J7176661K1651425K6622144
19860A44689175L0152695K7269104J2637256r935794k6897124l1552444k8356684
19853A18006184k2939052j7894000j3800509j0622459q190927o344118m994887
19846C3220232m085895l483023l051396k670972k296710j928969j598861j351537
19838A2752869j139808r50198q42015p33323n89640n10415m83485m18733l60177
19829F725075l45594l12103k04483j35932j67830k73394l40495l08115k13865
19820D423264j24052p6123q0298p8806o5071q7229j10595l4638Q9533J67802J44668
$$ y = [14289939, 15943115, 17999922, 20488230, 23364788, 26576732, 30223141, 34576748, 39932938, 46616519, 55040325, 65704885, 79238945, 96415606, 118067031, 144689175, 174841870, 202110974, 214748230, 204812436, 177915312, 146362868, 118006184, 95067132, 77173132, 63372623, 52750164, 44559237, 38215119, 33220232, 29134337, 25651314, 22599918, 19928946, 17632236, 15703267, 14104406, 12752869, 11613061, 10662863, 9820848, 9087525, 8497885, 7987470, 7503985, 7085252, 6725075, 6379481, 6067378, 5862895, 5726963, 5559133, 5285739, 4945244, 4637129, 4423264, 4299212, 4223089, 4142791, 4063985, 3998914, 3911685, 3801090, 3766452, 3855985, 4023787, 4168455]
19809D168455N8361p6197j88092j91555j45503j47575j64886j81215j97889j80937
19799B752967q4444O6092J65519J77289J83377K20192K30430J77858J28169J28578
19789D146027J70873K87249M05475L42442J27002o1724j61289j77376j32741j24412
19779D821526j41072r6777J2273J35149K08692K36495K54826K55246K36235K03050
19769F125643J02325o5267k12367l12152l36215k62568j89600j10986O6479K61786
19759E067078L38085K98003K44429K24045K30483K72637L28210L44483K96717
19750G644170K14982J32377P5717O7152R6194K29610M69449O63790P30741P87280
19740A1111462R43633J107671J228287J330718J476217J722469K022899K353331
$$ y = [4168455, 4226816, 4150619, 3962527, 3770972, 3625469, 3477894, 3313008, 3131793, 2933904, 2752967, 2668523, 2734615, 2900134, 3077423, 3260800, 3480992, 3711422, 3889280, 4017449, 4146027, 4316900, 4604149, 5009624, 5352066, 5479068, 5417344, 5256055, 5078679, 4945938, 4821526, 4680454, 4583677, 4595950, 4731099, 4939791, 5176286, 5431112, 5686358, 5922593, 6125643, 6227968, 6162701, 5950334, 5638182, 5301967, 5039399, 4849799, 4738813, 4805292, 5067078, 5405163, 5703166, 5947595, 6171640, 6402123, 6674760, 7002970, 7347453, 7644170, 7859152, 7991529, 8067246, 8134398, 8230592, 8460202, 8929651, 9593441, 10324182, 11111462, 12055095, 13162766, 14391053, 15721771, 17197988, 18920457, 20943356, 23296687]
19732B3296687K751799L256756L873420M603331N483419O466341P581857Q864747
19724F6178357J0448500J2646810J5638715J9584257K4874477L1770804M0167058
19717B21308978M9342629N6383301N3527234L0733826r454446m4874444n8809207
19710B98157871n5658328m6239534l6653966k8603551k2242609j7377213j3667563
19703G7715107j0841964q782600p225589o018547n086537m374327l852966l415458
19695B8117119k983816k576232k226982j885426j548140j351575j260499j180883
19687A3103566j094386j004082q79329p21473n88989n02862m59795m20101l71502
19678G061047l53247l75921l83171l94463m17716l59016k11927j17427j47913
$$ y = [23296687, 26048486, 29305242, 33178662, 37781993, 43265412, 49731753, 57313610, 66178357, 76626857, 89273667, 104912382, 124496639, 149371116, 181141920, 221308978, 270651607, 327034908, 380562142, 411295968, 401841522, 356967078, 298157871, 242499543, 196260009, 159606043, 131002492, 108759883, 91382670, 77715107, 66873143, 58090543, 50864954, 44846407, 39759870, 35385543, 31532577, 28117119, 25133303, 22557071, 20330089, 18444663, 16896523, 15544948, 14284449, 13103566, 12009180, 11005098, 10125769, 9404296, 8815307, 8312445, 7852650, 7432549, 7061047, 6707800, 6331879, 5948708, 5554245, 5136529, 4777513, 4565586, 4448159, 4300246]
19669D300246k56304l75523m44747m68273l68404j46570K2716O6650O2136P1804
19659B463731O7572L0173n6283j54269j47275l0873J01410Q3704p5086j76073
19649B106731j22586p619P3160J15038Q4773j4399p1052o4523p4191j01485j08898
19638A814949p8367K0321J22760J06321L5117M6280J33551K33769K89885K81871
19628C006457J95974l3399k91955l64662k75993j51111q3506n5143k293N5183
19618A999552Q1532J09523J01420j5373j27808j16219m5510k6761m8988l5000
19608A876368k4187r0066j37240j37355j66138k12304k20286k02428j82473j68826
19598C35065j51739r1494K279M6850r875q9635r0214J2903J00570N4735k3655
$$ y = [4300246, 4043942, 3668419, 3223672, 2755399, 2386995, 2240425, 2263141, 2329791, 2391927, 2463731, 2531303, 2561476, 2505193, 2350924, 2203649, 2172776, 2274186, 2357890, 2282804, 2106731, 1984145, 1976526, 2049686, 2164724, 2249497, 2235098, 2164046, 2099523, 2025332, 1923847, 1814949, 1736582, 1756903, 1879663, 1985984, 2021101, 2067381, 2200932, 2434701, 2724586, 3006457, 3202431, 3169032, 2877077, 2512415, 2236422, 2085311, 2001805, 1946662, 1944369, 1999552, 2081084, 2190607, 2292027, 2276654, 2148846, 2032627, 1987117, 1960356, 1911368, 1876368, 1852181, 1762115, 1624875, 1487520, 1321382, 1109078, 888792, 686364, 503891, 335065, 183326, 91832, 94111, 140961, 131086, 41451, -48763, -35860, 64710, 119445, 95790]
19587I5790J4775Q3940N100j42398j92653j81522j48914q0893k2855J6723O0912
19576d91995J37615K16907K23791J66660J35949J17510M1333l3788j14614j92400
19566B06968j96033j11980J081L6868J2069Q0373K66985M03121L46560J52067
19556A198079p841o7676q3064r8242j11385j18186j32959j45894j39308j00398
19546A93126m3421K0819J11215J50900P6665q912m9065j02756j88315k24153j09122
19535a73019N3006J16267J15131P0251k6994j06881r0735K811J19735J96113J61242
19524D36927R2875J07378J92172K60189K51285J29717n9963j55710j26234p6380
19514A052256o6577r8726j31552j04606o337L7366o7389j98485j81968m9995N3995
$$ y = [95790, 110565, 194505, 199605, 57207, -135446, -316968, -465882, -546775, -569630, -552907, -491995, -354380, -137473, 86318, 252978, 388927, 506437, 547770, 513982, 399368, 206968, 10935, -101045, -99964, -63096, -51027, 29346, 296331, 699452, 1046012, 1198079, 1190238, 1122562, 1039498, 941256, 829871, 711685, 578726, 432832, 293524, 193126, 149705, 170524, 281739, 432639, 509304, 500392, 451327, 348571, 160256, -63897, -173019, -120013, -3746, 111385, 181636, 154642, 47761, -42974, -40163, 79572, 275685, 436927, 529802, 637180, 829352, 1089541, 1340826, 1470543, 1410580, 1254870, 1128636, 1052256, 985679, 886953, 755401, 650795, 644458, 681824, 614435, 415950, 233982, 183987, 237982]
19503B37982P7013P2151O7783L6746k1663l0346L4495J16124J36212Q6014O2641
19492H75152J04888J33526O4087o2639j34245j20831j06236j20453j43678j23695
19482C65876k821Q6263Q405j08586j36778r7777l8198M83L7020P7770M0928m5402
19470A87183o2463l7967k5141j766L690j9240n9412o7494L0351J47728J63257
19459B58726J29940J42293J85017J81649Q2790k4947q1047j09558j38687j49202
19449D76974p8955M8602J06695L0255n5540o5219o2651n6196p6815j07781r0077
19438F9292m0719J8956N5782L3019j6953P824R6434J36919J55514K07892K90827
19427A014787L43534K89491K04558J65951J80293K43587K46842J86270J26079
$$ y = [237982, 314995, 387146, 454929, 491675, 470012, 439666, 474161, 590285, 726497, 812511, 875152, 980040, 1113566, 1177653, 1115014, 980769, 859938, 753702, 633249, 489571, 365876, 363055, 449318, 457723, 349137, 212359, 114582, 76384, 76867, 113887, 191657, 232585, 187183, 124720, 86753, 61612, 59846, 63536, 44296, -15116, -82610, -52259, 95469, 258726, 388666, 530959, 715976, 897625, 980415, 955468, 874421, 764863, 626176, 476974, 398019, 446621, 553316, 583571, 528031, 462812, 400161, 343965, 267150, 159369, 69292, 28573, 47529, 103311, 136330, 119377, 127201, 223635, 360554, 516068, 723960, 1014787, 1358321, 1647812, 1852370, 2018321, 2198614, 2442201, 2689043, 2875313, 3001392]
19418C001392P5715P2783J63343L60573N70324P44366Q97304J042416J178987
19409H107203J344071J611528J954288K321620K716991L161182L713324M482894
19401B9413101N563184O997960Q787160J0891158J2969878J3558729J0102207
19394I8283377J700047p826669j3323897j3982012j2142715r780299p708895o118109
19386B9100828m875725l887683l126561k498517j979773j606864j332557j139609
19378H653539j047949j037262r96947q29834o33412m85228l38884k65864k91125
19369B727034l45665l92511l98763l10077j47458j3009L9449K1555k9695j10677
19359A040183j95131k24211k29854j79900l8163O0762O3976L7724K3020l591j9173
$$ y = [3001392, 3077107, 3149890, 3313233, 3673806, 4244130, 4988496, 5885800, 6928216, 8107203, 9451274, 11062802, 13017090, 15338710, 18055701, 21216883, 24930207, 29413101, 34976285, 41974245, 50761405, 61652563, 74622441, 88181170, 98283377, 99983424, 92156755, 78832858, 64850846, 52708131, 42927832, 35218937, 29100828, 24225103, 20337420, 17210859, 14712342, 12732569, 11125705, 9793148, 8653539, 7605590, 6568328, 5571381, 4741547, 4108135, 3622907, 3284023, 3018159, 2727034, 2381369, 1988858, 1590095, 1280018, 1132560, 1119551, 1159000, 1180555, 1150860, 1040183, 845052, 620841, 390987, 211087, 172924, 233686, 297662, 335386, 358406, 354815, 335642]
19348C35642R305N0425P1638O5734O8447N0094j0676k8593k9226p1235o7174j0097
19336D34284j9940p3575p9718j4386R2118K00478K86081K72398Q7592j22156j65318
19325H97858p1231L1696K9228j1589k9754p0227o6238l2704m3007l6207K6653
19314F24478J05016J61990J51850N9016k0708l2383o5384j49494k36991l10475
19304B86915k91275k14461j73390j08293O810J31076J61427J05528P7131K2839
19294D307q9075j63827j34035p6420j18570k02774j85617o0635M8067R7460R7214
19283g83905L0992m3501p1413j15366j53537j05963J7008J87462L37473L92406
19273c08344L50827K35517J09503L313l5969J1898M6838L6676K6554K2745J6622
$$ y = [335642, 344947, 395372, 467010, 532744, 601191, 651285, 640609, 612016, 582790, 511555, 444381, 434284, 414344, 340769, 261051, 246665, 338783, 539261, 825342, 1097740, 1185332, 1063176, 897858, 826627, 858323, 887551, 875962, 846208, 775981, 709743, 677039, 634032, 597825, 624478, 729494, 891484, 1043334, 1102350, 1081642, 1049259, 983875, 834381, 597390, 286915, -4360, -218821, -392211, -500504, -493694, -362618, -201191, -95663, -18532, 4307, -84768, -248595, -382630, -459050, -577620, -780394, -966011, -1026646, -978579, -881119, -783905, -752913, -796414, -867827, -983193, -1136730, -1242693, -1225685, -1038223, -700750, -308344, 42483, 278000, 387503, 390816, 354847, 366745, 413583, 450259, 476813, 499558, 516180]
19262E16180J423l3317q6482r9434l6971L9451J06494J69668J59776N6199q0179
19251G12808j36270j17925j24593j61046j28319l0874N6459J13857J41183J09771
19241D35051O2589P6459Q4696J0885m9843j0560N3020R5173J20998J28595J36146
19230A143209P5846j3394k0602L7700P3005L3951o7217j64689j83258q4628N7730
19219H87653Q7927l8245j45924j52636j47545j66685j65517p6778P1483J97930
19209C51663K77932L48840L67000K59977N1655j06753o3575R2134K21353L11316
19199B111542M12626N25406N51854M87088M27625M56582N74702P43112R41019
19190G231556J179800J419830J667030K012548K449058K977483L775419M961966
$$ y = [516180, 517603, 484286, 397804, 298370, 261399, 300850, 407344, 577012, 736788, 792987, 712808, 576538, 458613, 334020, 172974, 44655, 13781, 70240, 184097, 325280, 435051, 497640, 574099, 658795, 669680, 619837, 609277, 662297, 757470, 878468, 1007063, 1143209, 1219055, 1205661, 1185059, 1222759, 1295764, 1329715, 1262498, 1097809, 914551, 829923, 887653, 975580, 937335, 791411, 638775, 491230, 324545, 159028, 82250, 153733, 351663, 629595, 978435, 1345435, 1605412, 1657067, 1550314, 1486739, 1578873, 1800226, 2111542, 2524168, 3049574, 3601428, 4088516, 4516141, 4972723, 5547425, 6290537, 7231556, 8411356, 9831186, 11498216, 13510764, 15959822, 18937305, 22712724, 27674690]
19182B7674690O568363Q495155J0260371J0558075P102721n57316p922005j0819222
19174E1360832j0152466q306183o521297n097298l959556k972575k178077j680375
19166A0493005j442313j320068j218630j101961r67962p87014n58031l58696k40379
19157B497951j70241j56438k40839k96940k14252n5680N9587L8096n2722j08391
19147A300131r6635l0697l2234o8729l7566Q133J034r9379k21554k35005j65594
19136C21905j16683j01643j14214j36540j28857j04393q0639n7479m8521m3703
19126f10767O974J06357J38422P5431J1916J5447M8186O1425N8042L6535J6731
19115c5301N2902J41367J68423J08858J3739q5444j29907r8718j6205K9196j9265
$$ y = [27674690, 34243053, 42738208, 52998579, 63556654, 70659375, 70102059, 62180054, 51360832, 41208366, 32902183, 26380886, 21283588, 17324032, 14351457, 12173380, 10493005, 9050692, 7730624, 6511994, 5410033, 4442071, 3655057, 3097026, 2738330, 2497951, 2327710, 2171272, 1930433, 1633493, 1419241, 1363561, 1423148, 1461244, 1408522, 1300131, 1203496, 1172799, 1140565, 1071836, 1034270, 1042403, 1043437, 944058, 722504, 487499, 321905, 205222, 103579, -10635, -147175, -276032, -380425, -461064, -518543, -567064, -610767, -603793, -497436, -359014, -283583, -271667, -256220, -208034, -146609, -88567, -52032, -35301, 17601, 158968, 327391, 436249, 449988, 364544, 234637, 135919, 119714, 148910, 129645]
19104A29645j14229j33317m6497N3397J16070J50500J55460J39155J12481J04575
19094F67240Q0037M3448P0928J00519L4968r8960k06473k01383j03582O614O5770
19083D59126M5506q780n5154p8055o1062k0545l128J0054j9115j16965j96218
19072d4336j88061j41930j11317n3983R7930K25491J87274L0463j24781j93700
19062c16950j71798j03247L2825J40123J37089J26734J58702J98620J45764J0871
19052C58733l9542k4399m3986n4799o774K8083J1521N591K4447N0742O4802M8338
19040D22757K6307K8339J08811K03185J82278M0203j30461k32869k14962j35854
19030B97734q9781r4533j43817j65793o8662R3569J55914P2451k4303n9114q9306
$$ y = [129645, 15416, -117901, -164398, -111001, 5069, 155569, 311029, 450184, 562665, 667240, 747277, 790725, 861653, 962172, 997140, 898180, 691707, 490324, 386742, 393356, 459126, 504632, 495852, 440698, 362643, 301581, 281036, 277908, 287962, 268847, 151882, -44336, -232397, -374327, -485644, -539627, -441697, -216206, -28932, 1531, -123250, -316950, -488748, -591995, -559170, -419047, -281958, -155224, 3478, 202098, 347862, 358733, 319191, 294792, 250806, 196007, 189233, 217316, 228837, 234428, 258875, 309617, 374419, 422757, 449064, 477403, 586214, 789399, 971677, 1011880, 881419, 648550, 433588, 297734, 207953, 113420, -30397, -196190, -264852, -171283, -15369, 57082, 32779, -26335, -115641]
19019a15641j10392m7586O8592J60852J61268J09585P8513L3111l230J24k5352
19008C09844j01227j62280j53337j29237j12017r1809o2058O7L4141L9896J08853
18997c19164J64798J17976L4436k1023o6296j22984j13795o8929n2891m479M5881
18986d06470O165m7512j1350Q0485J15998N6278M355M2156J14727J03438J7951
18975G6221l6073n2557q3437q6219j1114N7575N0123j9512m6509j987J5737R787
18963a27965L8331P3192P1600O3964O5059K8050p529j133k9546q6579j40457j49182
18951b02195j06486r9278j53220j98012j98941j73753r2902J7403Q6307J18644
18941a002433J53170K06481K22140J89044Q7328n4854j58808k03740j52067o8452
$$ y = [-115641, -226033, -273619, -205027, -44175, 117093, 226678, 305191, 338302, 335072, 335196, 309844, 208617, 46337, -107000, -236237, -348254, -440063, -502121, -502054, -467913, -428017, -319164, -154366, -36390, -1954, -22977, -89273, -212257, -326052, -394981, -447872, -452351, -406470, -400305, -447817, -459167, -378682, -262684, -206406, -202051, -159895, -45168, 58270, 76221, 40148, -12409, -95846, -182065, -193179, -135604, -85481, -104993, -151502, -153489, -137752, -127965, -89634, -16442, 55158, 119122, 184181, 212231, 204702, 203569, 174023, 87444, -53013, -202195, -308681, -407959, -561179, -759191, -958132, -1131885, -1224787, -1207384, -1121077, -1002433, -849263, -642782, -420642, -231598, -144270, -199124, -357932, -561672, -713739, -782191]
18931g82191p7171j07820m4108N9513R7421Q8385O6005J00006J49472J39066P4728
18920b36694l1063q1654p4756m0986L1253Q8857N8253o050l5800K759O2280O0837
18908b02764J9260l6995n2654P810K7865n441J2337N7015P0472M7231K5781O2679
18896C2596J17752P7992k0247k8712J7744P904k1803j3832l608k4734m4275j3135
18884H3642O536l6837r1410j01169j02530r6628n8199M4765J68821K09212J51209
18873A77412R5039N4293O162j7866J0908N3119P7186N6099j8691m3882K6018Q8954
18861E64751K147j22187j35325r5634p7623o4783m6189n8815r5898r5638q6044
18850c11238n0758j0932j2071J3705J11221J89186J69981J10424O3698P9671J08934
$$ y = [-782191, -859362, -967182, -1011290, -951777, -854356, -765971, -699966, -599960, -450488, -311422, -236694, -267757, -349411, -424167, -465153, -433900, -345043, -286790, -292840, -328640, -325881, -263601, -202764, -183504, -220499, -273153, -265343, -237478, -242919, -230582, -173567, -103095, -55864, -30083, 32596, 150348, 228340, 208093, 179381, 197125, 205029, 183226, 169394, 165786, 141052, 96777, 83642, 90178, 53341, -38069, -139238, -241768, -338396, -396595, -351830, -183009, 26203, 177412, 272451, 326744, 332906, 315040, 325948, 379067, 456253, 512352, 493661, 449779, 475797, 564751, 566898, 444711, 309386, 213752, 136129, 71346, 25157, -33658, -129556, -225194, -311238, -361996, -372928, -384999, -371294, -260073, -70887, 99094, 209518, 273216, 352887, 461821]
18839D61821M6762o1656j50407j95079j88527j65407j29574n1633N3126J42243
18829b38331J49424Q8550O7472J03620J14027N9059m696k4149m062K9069L4710
18818C74693j4860q6624j52926j86655j31542J6664J26605J00702J3701Q154O2614
18807A30526N8996P817p1850j35937j29771j15434j06339o8258q297L7016o87
18796d02218r9346j57328j60362j28365o4147m98J7114K2767O1943J24032J62863
18785f23545Q2744m7009p7734J3619J21000J50343J14595Q6032P7717K4701j5056
18774i2593j5837k5482J0464Q8914J52852J41061R6383O5401M5002J1818l2810
18763D45173o2667j14327j68800j56927j05043r5520j29303j34679p5587N110
$$ y = [461821, 508583, 446927, 296520, 101441, -87086, -252493, -382067, -433700, -380574, -238331, -88907, -357, 67115, 170735, 284762, 343821, 339125, 314976, 310914, 339983, 374693, 359833, 273209, 120283, -66372, -197914, -181250, -54645, 46057, 59758, 67912, 130526, 189522, 197339, 125489, -10448, -140219, -255653, -361992, -430250, -438547, -401531, -402218, -501564, -658892, -819254, -947619, -1011766, -1012264, -995150, -972383, -910440, -786408, -623545, -540801, -587810, -665544, -651925, -530925, -380582, -265987, -179955, -102238, -77537, -92593, -108430, -133912, -123448, -34534, 118318, 259379, 355762, 421163, 466165, 477983, 445173, 382506, 268179, 99379, -57548, -162591, -258111, -387414, -522093, -597680, -592570]
18753e92570M4530O0789J08142J66888J61975M4443p1376n8774p915q979Q342
18742a44505K0517l8053q9306j8825R4358J62254J89109J41893K9771m7621j10462
18731A89130k37749l30159k68878j59763r1258o458J09002J81252J73741J09047
18721c32093j489q6552o9874j6775j0757j5688L1527Q8273Q8297K9602j147o427
18709c03103n1535q2629m4984J8424L7815L5204Q0692J62120J98285J61805J01437
18698C13531N2914j9153k5838R0504J42271N4950p2594j47323j23732o5405m6128
18687A53997o8136r5940j22616j10930k2556P2979R7401Q1394P3708P0022M2886
18676A72209J2132L6263P4844P6485L7127L964J2623p474r0630j38308j21907
$$ y = [-592570, -548040, -487251, -379109, -212221, -50246, -5803, -77179, -135953, -143868, -152847, -144505, -123988, -162041, -251347, -270172, -175814, -13560, 175549, 317442, 347213, 299592, 189130, -48619, -378778, -647656, -807419, -898677, -905135, -796133, -614881, -441140, -332093, -333582, -420134, -490008, -506783, -517540, -533228, -501701, -413428, -325131, -295529, -296676, -303103, -354638, -437267, -482251, -463827, -426012, -390808, -310116, -147996, 50289, 212094, 313531, 366445, 347292, 321454, 411958, 554229, 609179, 536585, 389262, 265530, 200125, 153997, 85861, -10079, -132695, -243625, -266181, -193202, -95801, -14407, 59301, 129323, 172209, 184341, 220604, 295448, 371933, 409060, 413024, 425647, 418173, 327543, 189235, 67328]
18665F7328j22929j80840k07736j52479p5884m379N4444O8701O7872M8215j645
18654d39332K752M1165k944q4639o2614J9633Q0421J39939J24409L0619p2528
18643b23119j30692j12541k1384N2151N3320K5555K9841P6458J23554J56965J46032
18632A76140O5440o0278j61173j40253o173J07461P7459l8568o2225l819P0187
18621B4198J15750J07409J01425J30136J08141l733j34544j88759j46812o0017
18611E3194K0588O1611Q8176O1159m2163j53825k00338j51869j14610q6246L288
18600d61035P9580R8501J11646J49366J62136Q9363L282k5685J8621N4312L0255
18589C10342k847q352Q4649K06019K05717J24909R0031P6435K449j01870j70869
$$ y = [67328, -55601, -236441, -444177, -596656, -672540, -676919, -622475, -553774, -485902, -437687, -439332, -436580, -395415, -398359, -482998, -545612, -525979, -445558, -305619, -181210, -150591, -223119, -353811, -466352, -487736, -435585, -382265, -356710, -326869, -250411, -126857, 30108, 176140, 241580, 181302, 20129, -120124, -126297, -18836, 58623, 20055, -42170, -45989, 24198, 139948, 247357, 348782, 478918, 587059, 583326, 448782, 260023, 113211, 53194, 73782, 135393, 223569, 284728, 242565, 88740, -111598, -263467, -378077, -464323, -461035, -381455, -282954, -171308, -21942, 140194, 229557, 232839, 207154, 225775, 280087, 310342, 307495, 299143, 383792, 589811, 795528, 920437, 1010468, 1086903, 1089352, 987482, 816613]
18578H16613j91735j53205q5771q0249j11411j25182o4543O8734J41696Q3884
18568B98831k6768r6524j37302j79735j71672p5174M6067J18169J47370J86670
18558A09932K20974J55938O5699J6637m1508p0405k7442p376n6087j26434k08483
18547C1445k70492k19462n8264P0310J20073J49405J33457Q7410N2133L5861R230
18536A41106m8715j09574q1795M9122R3278K7846Q020L5027N4026O9120J10448
18525C47909J80902J99602J01827P932O1596J60655J52558M7716n6870j15750
18515A088077j25945r6833j2992Q2458R2362J6361q5921j38685j35471j08823
18505E74588n5901j9002k5891n1804o5085q4780j25459p2908P1397J63670J08730
$$ y = [816613, 624878, 471673, 385902, 305653, 194242, 69060, 4517, 73251, 214947, 298831, 272063, 175539, 38237, -141498, -313170, -388344, -342277, -224108, -76738, 109932, 330906, 486844, 552543, 569180, 527672, 457267, 429825, 422449, 366362, 239928, 31445, -239047, -458509, -516773, -446463, -326390, -176985, -43528, 43882, 96015, 131876, 141106, 92391, -17183, -98978, -49856, 43422, 71268, 79288, 114315, 168341, 237461, 347909, 528811, 728413, 830240, 838172, 899768, 1060423, 1212981, 1260697, 1203827, 1088077, 962132, 865299, 852307, 934765, 1027127, 1043488, 957567, 818882, 683411, 574588, 518687, 499685, 473794, 421990, 356905, 272125, 146666, 73758, 145155, 308825, 417555]
18494D17555j1302p2822j06483j11914j09580j25875j06550o8123l7500J5153
18484c17441P9478R0282L9790k1390m1412q2608j46193j35913q2875k9351P584
18473f40049j2040q3085j05534j5426J09883J91890J97908J44527O7344j4360
18463a58942n5308l7431J247Q595j5565m8526m6726l0580o4598o3840L6056J07667
18451c67951M9796n3808p6508K0745J24141J35735J22958J22985Q0428J201o6864
18440I2858p9947k0781K4427J3093N6425J60128J93896J30485M3630J8336L7643
18429F70193M6630L3082L8298L8581r934p2252r2995j22106j57587j46816j32522
18418I2572k05881k73809k05963j02220n2576o5779r1020p6594k3133Q8894J82934
$$ y = [417555, 406253, 333431, 226948, 115034, 5454, -120421, -226971, -295094, -332594, -317441, -237963, -147681, -107891, -129281, -170693, -253301, -399494, -535407, -618282, -647633, -640049, -652089, -735174, -840708, -856134, -746251, -554361, -356453, -211926, -144582, -158942, -214250, -251681, -250434, -241839, -257404, -305930, -352656, -383236, -447834, -511674, -475618, -367951, -318155, -371963, -448471, -427726, -303585, -167850, -44892, 78093, 158521, 159722, 92858, 12911, -7870, 16557, 29650, 86075, 246203, 440099, 570584, 614214, 632550, 670193, 716823, 749905, 788203, 826784, 816850, 744598, 651603, 529497, 371910, 225094, 92572, -113309, -387118, -593081, -695301, -747877, -813656, -904676, -981270, -1004403, -915509, -732575]
18407g32575J88233J55679J60065J94878J61333L9948l9866j3522L7273O7254
18397B18700N1151o9656k16972k69090j64683R568O6942J7467k5620j7795J9906
18386c80082P5068J35726J73376J73364J28525N6588L922k1824j7107J9184K3811
18375C70551l116L499O66o1719j76454k66945k40723j40904m8902p82L8059J05027
18363d21743J20571M2357m0328q8849r7410o9164n2225m2046j9855M7135J28974
18352d92583J36191Q3155M0771O2871O6710J6945N975L8304O7333N8267J0979
18341I4918k932n6129j40731j08373J540K0668j11856k68691k59083j05167Q0063
18330h55773K27233K38857J25644j213p9129q0855k3194J8017L6142N4370J04792
$$ y = [-732575, -544342, -388663, -228598, -33720, 127613, 167561, 127695, 114173, 151446, 218700, 269851, 200195, -16777, -285867, -450550, -440982, -374040, -356573, -382193, -399988, -380082, -305014, -169288, 4088, 177452, 305977, 362565, 366487, 344663, 327556, 346740, 370551, 367435, 370934, 371600, 309881, 133427, -133518, -374241, -515145, -564047, -564829, -526770, -421743, -301172, -258815, -299143, -387992, -485402, -554566, -606791, -648837, -668692, -621557, -492583, -356392, -273237, -232466, -169595, -102885, -85940, -79965, -41661, 25672, 83939, 94918, 91986, 35857, -104874, -213247, -211707, -191039, -302895, -571586, -830669, -935836, -855773, -628540, -389683, -264039, -265252, -344381, -425236, -448430, -430413, -394271, -339901, -235109]
18319b35109J65443J67684R2929J5895L9K9472Q2891J07716L7623r0600j59810
18308B14173j72433j36506k0130J06523J11261L5362l875K024J8944L2574K8695
18297B16612K5118N1986O1040M9425M0304L8219P8233J21721N2543p3050p5073
18286E87078L265N6585M1181k1027p2906j00753j18704j14994o4243J9808Q3938
18275B99228Q6931O8746N3284J9709l6554r6334q7646n7816p2203o9147k2920
18264H5278R399J2776j2722l7791p4258j00890m6002M5989R7596J26797J62044
18253B68216J81083J94862K14921J75872R1052J5416o6451j26822r9539Q94Q5873
18242I35377R6501O8266O7281K1228o0260q1047k3475K3902M4304Q4200R8270
$$ y = [-235109, -69666, 98018, 190947, 206842, 206881, 236353, 319244, 426960, 464583, 373983, 214173, 41740, -94766, -114896, -8373, 102888, 138250, 134375, 136399, 155343, 187917, 216612, 241730, 293716, 354756, 404181, 444485, 482704, 560937, 682658, 735201, 662151, 587078, 590343, 646928, 688109, 667082, 594176, 493423, 374719, 259725, 195482, 215290, 299228, 386159, 454905, 508189, 527898, 491344, 395010, 307364, 249548, 177345, 108198, 85278, 94677, 107453, 94731, 56940, -17318, -118208, -164210, -118221, -20625, 106172, 268216, 449299, 644161, 859082, 1034954, 1126006, 1141422, 1074971, 948149, 848610, 849504, 935377, 1031878, 1100144, 1167425, 1188653, 1128393, 1047346, 1023871, 1047773, 1092077, 1176277, 1274547]
18231A274547R0877J27582K04614K29405K02336J71951J80134K56016L65018L66722
18221C469202K46683J56598J50385K73978N29650Q03352R80203J089342J188873
18212H888266J330245J547401J805251K103218K478490K993048L713974M685215
18204B9545108O048878P954997J0518136J3629784J6254799J5240985O540174
18197A05732861p029386j5769307j6664275j3840208j0573027p949818o030895
18190B7875945m640376l608754k879932k410672k061262j688204j323621j018767
18182H244357p66302n77914n18319n21851m79409m16089l44974j93762J4525J20582
18172D560844N1049p7878j50034j13432o02P1621R2168Q1514L9655K1364P0966
$$ y = [1274547, 1365424, 1493006, 1697620, 1927025, 2129361, 2301312, 2481446, 2737462, 3102480, 3469202, 3715885, 3872483, 4022868, 4296846, 4826496, 5629848, 6610051, 7699393, 8888266, 10218511, 11765912, 13571163, 15674381, 18152871, 21145919, 24859893, 29545108, 35593986, 43548983, 54067119, 67696903, 83951702, 99192687, 105732861, 98703475, 82934168, 66269893, 52429685, 41856658, 33906840, 27875945, 23235569, 19626815, 16746883, 14336211, 12274949, 10586745, 9263124, 8244357, 7478055, 6900141, 6381822, 5859971, 5380562, 4964473, 4619499, 4425737, 4440262, 4560844, 4611893, 4534015, 4383981, 4270549, 4269947, 4341568, 4433736, 4515250, 4554905, 4576269, 4647235]
18161D647235J72966L14949M57939N58369O03469O18683P06220R33811J216493
18152A0230134J480286J769638K198619K776405L404670M076461N055611O496915
18144C7488739Q519255J1283399J4512888J6619264J3690691K699864j0475041
18137I4339059j6743570j6014463j2829359r734921p293746n495848m250401l406693
18129A8570058k824191k376950j978950j585155j180864q76313o74310n73392
18121F499933n63824n19102m18334l49320l13679k85652k06975j14818j27757
18112C600472k20867k56411j81087j10063j61359k87624l52155l08187j84083
18103A538636N914J72662J78635N119j36580j11384l0749r39Q291J5668n1241
$$ y = [4647235, 4820201, 5135150, 5593089, 6151458, 6754927, 7373610, 8079830, 9013641, 10230134, 11710420, 13480058, 15678677, 18455082, 21859752, 25936213, 30991824, 37488739, 46007994, 57291393, 71804281, 88423545, 102114236, 104814100, 94339059, 77595489, 61581026, 48751667, 39016746, 31723000, 26227152, 21976751, 18570058, 15745867, 13368917, 11389967, 9804812, 8623948, 7747635, 7073325, 6499933, 5936109, 5417007, 4998673, 4649353, 4335674, 4050022, 3843047, 3728229, 3600472, 3379605, 3123194, 2942107, 2832044, 2670685, 2383061, 2030906, 1722719, 1538636, 1544550, 1717212, 1895847, 1900966, 1764386, 1653002, 1622253, 1621314, 1629605, 1645273, 1594032]
18092A594032j79759l09533l57597k26886J3779J50805R7457m8622j48109j41252
18082D44315o4895J8077M1778N5341J25093J19404R089l9856k1672o7057j45286
18071D74331j74557j70105j32205l0318J01128J90484J78860K6305j71673k44060
18061D8190j48976J7654J50537K30778K37513J06866p5378j56757j07515K2612
18051C25524J05682N4615o6963j39357j00139k7298j2158K1809P5668O1230j8445
18040B80168o6998p2297j34517j75318j57629j01884J661J05285J59123J64761
18030B355J58659J49339R4331L0196m829l7981o7987j18281j67644r1681Q6450
18019C2927J46925O5335j9514n2748k2204J7233k9841j33059j76049j47428j17821
$$ y = [1594032, 1414273, 1104740, 747143, 520257, 534036, 684841, 782298, 733676, 585567, 444315, 379420, 397497, 439275, 494616, 619709, 739113, 748202, 708346, 686674, 619617, 474331, 299774, 129669, -2536, -32854, 68274, 258758, 437618, 463923, 292250, 48190, -100786, -83132, 67405, 298183, 535696, 642562, 567184, 410427, 302912, 325524, 431206, 485821, 418858, 279501, 179362, 152064, 139906, 161715, 237383, 298613, 280168, 213170, 140873, 6356, -168962, -326591, -428475, -426814, -321529, -162406, 2355, 161014, 310353, 404684, 434880, 430051, 392070, 324083, 205802, 38158, -53523, 32927, 179852, 245187, 225673, 172925, 150721, 167954, 138113, 5054, -170995, -318423, -436244]
18008d36244p5607k1616J042o876k364K3219O1039J07730J23291J15583R1883
17997a8920P4586Q2659N7815o8069k23690l00019k68085k02889j18105j777J03597
17986h82897J55824K09469K50678K08663J11442k083r8310r1907k508K4029q0949
17975a98549j71690j60068j04686l515J27326J87686J74784J63483J37523N6966
17965B09260j8641l2756l672j7409j05624j79141j70101r8042k2895K2877K9899
17954c86245k7052j17265j06954k0641O4560J17281J05237N6998P073k2759K8556
17943c01211Q4357M6733k6823p1306j38130j51349o4523N4023J32288J34409Q9122
17932b12410K7274l0249q1091r0141k5348R471K081r016k6671k9863N659O6831
$$ y = [-436244, -511851, -533467, -532425, -539301, -541665, -518446, -457407, -349677, -226386, -110803, -18920, 55666, 138325, 196140, 128071, -95619, -395638, -663723, -866612, -984717, -986494, -882897, -727073, -517604, -266926, -58263, 53179, 51096, -47214, -139121, -141629, -117600, -198549, -370239, -530307, -634993, -638508, -511182, -323496, -148712, 14771, 152294, 209260, 190619, 157863, 154191, 136782, 31158, -147983, -318084, -416126, -439021, -416144, -386245, -413297, -530562, -637516, -658157, -593597, -476316, -371079, -314081, -307008, -329767, -301211, -216854, -170121, -196944, -268250, -406380, -557729, -622252, -568229, -435941, -301532, -212410, -185136, -215385, -296476, -386617, -411965, -402494, -400413, -409429, -436100, -465963, -460304, -393473]
17920c93473P0214L022l9613J127N4608P4155M6398j7362k2613M5145J15488J83422
17908A20518K05356J38420O73j11120j11886n3899m2236p1882o9415r198N1253
17897D6584K279j12492j66889j47144r7717p3020o9241l3134L9878R3790J05256
17886d11850J09483Q5162K7003j4500j8122k9281m4111m5246k4020K7370P2366
17875b65746Q9889O3506K6448K1125L6257L3531N4980N8429j4383r7389j49935
17864a43288j46943q6799m0554l1748L126P2918J11646J02725O0393K6420K7098
17853d5006P7141J32666J06897K1409o1498j73400k54502k13534r7393l2731K5430
17842e14521J00257J10390P4120J03620J67461J16839P571r8874k08579k21517
$$ y = [-393473, -323259, -320237, -359850, -358723, -304115, -229960, -183562, -200924, -223537, -178392, -62904, 120518, 325874, 464294, 464967, 353847, 241961, 188062, 145826, 73944, 4529, -4669, 46584, 48863, -63629, -230518, -377662, -475379, -548399, -617640, -650774, -610896, -517106, -411850, -302367, -217205, -190202, -204702, -222824, -252105, -296216, -341462, -365482, -338112, -265746, -175857, -112351, -85903, -64778, -28521, 5010, 59990, 118419, 104036, 6647, -143288, -290231, -377030, -417584, -449332, -446206, -373288, -261642, -158917, -98524, -72104, -45006, 32135, 164801, 271698, 293107, 231609, 58209, -196293, -409827, -507220, -539951, -514521, -414264, -303874, -229754, -126134, 41327, 158166, 165737, 66863, -141716, -363233]
17832c63233q1842J20254K47163J87171M4255m7201n7408n6810j19084j44216
17822b70951r1713n5626l3555l915J0857k590l1233N920Q7175Q5019L8105K2254
17810b40253L1021O801p9670j30047n3802O8348J68929K01837J83420J75274J16903
17799D48761m364q4911r7977j08358j49166j98365k10120j56454j14077j08624
17789g83655p1027L5771J72640K74924K71787J67729Q3767M5922j7154o7558r2994
17778B0152j42550j97210j72013q9011J2366P9055Q1067O7128O1308O0643K6678
17767a92387m375L3893O3129n054r1752j26050j56045j33300m2341Q3027K22710
17756c48545K85662K47564J92807R2791o2176j59654j72717j86011k29858k45684
$$ y = [-363233, -445075, -324821, -77658, 109513, 153768, 106567, 49159, -7651, -126735, -270951, -362664, -418290, -451845, -455760, -444903, -447493, -478726, -472806, -385631, -300612, -262507, -240253, -209232, -202431, -282101, -412148, -465950, -397602, -228673, -26836, 156584, 331858, 448761, 444397, 359486, 261509, 153151, 3985, -194380, -404500, -560954, -675031, -783655, -854682, -818911, -646271, -371347, -99560, 68169, 151936, 197858, 180704, 113146, 20152, -122398, -319608, -491621, -580632, -568266, -489211, -408144, -341016, -279708, -219065, -192387, -196762, -162869, -99740, -104794, -196546, -322596, -478641, -611941, -654282, -571255, -348545, -62883, 184681, 377488, 470279, 408103, 248449, 75732, -110279, -340137, -585821]
17746e85821j89634q9732N0254J52460J19979K6269K4993Q7139J05570J18970
17736a79553J18943P2697q838j02778j62602j62394j43204q7049p416M1585N2090
17725e68519K6526J7770N2954J29228J39946J4829m9083K4754R2039J15626J75503
17714A71573K20699J78732J06520j3146j48673k28721k53484k07292j06367J1146
17704b69013P0562J3781n4520p1578r8739j21786j01046l1111O4018J19867J45739
17693c33826J69482J40201N4793o3356j80530k11006j12568M1114J27732J17464
17683b50500N9434J6330M1122R2695J10159J12196R0473R350q7521j39643p9067
17672b4972M4526Q4620M5846k3577p4899q2050j14216j46120j47861j17663k5418
$$ y = [-585821, -775455, -865187, -814933, -662473, -542494, -516225, -491232, -404093, -298523, -179553, -60610, 12087, 3249, -99529, -262131, -424525, -567729, -654778, -662194, -620609, -568519, -541993, -524223, -471269, -342041, -202095, -187266, -236349, -211595, -119556, -3930, 171573, 392272, 571004, 677524, 664378, 515705, 286984, 33500, -173792, -280159, -269013, -198451, -184670, -239190, -310768, -409507, -531293, -632339, -663450, -599432, -479565, -333826, -164344, -24143, 30650, -32706, -213236, -424242, -536810, -495696, -367964, -250500, -191066, -174736, -133614, -40919, 69240, 181436, 271909, 281259, 193738, 54095, -24972, 19554, 104174, 150020, 126443, 51544, -30506, -144722, -290842, -438703, -556366, -581784]
17661e81784N9650M9378L5693O7553P5776L9638K0317Q2794J67867J88846J69342
17650C75070J39307P0933j6368p8094r9054r0403q6313j06685r5753l008J10483
17639A20115J62983J51036R4702J0843m9158r5232j17249r1451k9794M6912R4787
17628B98494J12128J01553L4285q8629j60499j51875r6338l5465n6606j44602
17618a87554j81707j44414m7497N2154O0407L2183Q2349J88351K45672J56939
17608B56883l0453j30413j01633M871J06652J26593J08124Q0736J9470q500j8507
17597D13823q2310j91741k74211k75111j98574j17851q3816p1880n4274p5028
17587a010973r1496k880J17962J29605Q7325O7895N1258L0176N3047J37875K02235
$$ y = [-581784, -522134, -472756, -437063, -369510, -293734, -254096, -233779, -150985, 16882, 205728, 375070, 514377, 585310, 568942, 490848, 391794, 301391, 215078, 108393, 12640, 9632, 120115, 283098, 434134, 528836, 539679, 490521, 395289, 278040, 186589, 156795, 203707, 298494, 410622, 512175, 546460, 457831, 297332, 145457, 49119, 13654, -42952, -187554, -369261, -513675, -561172, -509018, -448611, -416428, -334079, -145728, 99944, 256883, 226430, 96017, -5616, -745, 105907, 232500, 340624, 421360, 440830, 432330, 413823, 331513, 139772, -134439, -409550, -608124, -725975, -809791, -881671, -935945, -1010973, -1102469, -1105349, -987387, -857782, -770457, -702562, -651304, -621128, -568081, -430206, -227971]
17576b27971J84572J02172M501r3351j45163q8996J3928N5236K3549k9870p5566
17565b76959q9144k5546L0938J6526R794P7478Q9285K819m1499J0883O9364K6008
17553a00053n4971q9777j16464j42681j13665n2554J3235Q8690J26492R0864M2752
17542c08132L1056K0543k7081q3132r8009o3344k1301L9790J28387K25117K81332
17531A25226K42819J71313P9355o1146j56515j52486j04591l9139q940p3357j22079
17520i9540j05544p0450l4431P704N1861P7420P1568J0752q7725j19245m1135
17509c38765Q9095J69100J35465J8266p2705m6121Q154p985l9763l6479n073o626
17497a33437l9308p8020j11800j16270j20146j18093o6275k2235j9084j3427L1525
$$ y = [-227971, -43399, 58773, 63274, -30077, -175240, -264236, -250308, -195072, -171523, -201393, -276959, -366103, -391649, -360711, -344185, -334391, -256913, -167628, -164809, -206308, -195425, -126061, -100053, -155024, -244801, -361265, -503946, -617611, -670165, -656930, -568240, -441748, -350884, -308132, -277076, -256533, -283614, -366746, -464755, -528099, -549400, -509610, -381223, -156106, 125226, 368045, 539358, 618713, 557567, 401052, 248566, 143975, 104836, 95896, 22539, -99540, -205084, -275534, -309965, -302261, -250400, -172980, -101412, -90660, -178385, -297630, -338765, -249670, -80570, 54895, 73161, 456, -45665, -37511, -45496, -85259, -121738, -126811, -133437, -172745, -250765, -362565, -478835, -598981, -717074, -783349, -805584, -824668, -838095, -806570]
17486h06570J08613J47996J35084J27997J45920J33890L2280q4053j07178p6730
17476b42751j7339L5675M2015O7479P4609M1384K8477J6130l9852j13060j84050
17465b91283k54120k39396j47148o2655p661K5447N9130Q1906R9676J89465K38297
17454c08342J64407M9305J093K6349N2945Q1616J28337J76272J67527J48778J38326
17443H26613P7327K4627K117p3899j70880k04013j40073p2633p2635q1809j03245
17432A1497j26232r7964P358J09767R3249o34q3519j17164j00088n9906O391M6721
17420c10524O8689R8701J08570J31298J44802J7540j64091k24857j66742p6522
17410c73136K2783J17688J54421J70050J71393R6415j3553j08408j88705k10779
$$ y = [-806570, -697957, -549961, -414877, -286880, -140960, -7070, 25210, -58843, -166021, -242751, -260090, -224415, -182400, -114921, -40312, 1072, 29549, 45679, 5827, -107233, -291283, -545403, -784799, -931947, -994602, -1002263, -976816, -917686, -835780, -736104, -546639, -308342, -143935, -94630, -93537, -67188, -14243, 67373, 195710, 371982, 539509, 688287, 826613, 903940, 928567, 930684, 856785, 685905, 481892, 341819, 269186, 196551, 114742, 11497, -114735, -212699, -205341, -95574, -2325, -2959, -86478, -203642, -303730, -363636, -357245, -310524, -241835, -143134, -34564, 96734, 241536, 259076, 94985, -129872, -296614, -373136, -350353, -232665, -78244, 91806, 263199, 359614, 346061, 237653, 48948, -161831]
17400a61831j42137l0905j6090n5223m9908r1939j94339j77200k8236J28219K02780
17389f16809J28168l156m0944L8117J19948J39966J74380K07374J54557N7969
17379C59570j5942r9237k13384k71926k24774j10553k0940L6188Q0509R6659J04291
17368b79539J09432P0537J0523M761J2770l7204j24378j34126m1288M1339O6633
17357c00540O1383K4678l9660o6067k231J25101J85626Q6550n9025j48566j45940
17346b78691q6632o459P1824O2624r565o4268j23099j64565r4196N9473J87726
17335d45828K26473J59037O3394K3189j5352p4682r4274q5293l9829O3537J18979
17324a00649N6744p1379j89165k14466j39797p3760n4710o065P1042J06840P1429
$$ y = [-161831, -303968, -334873, -350963, -406186, -456094, -548033, -742372, -919572, -947808, -819589, -616809, -488641, -491797, -532741, -494624, -374676, -234710, -60330, 147044, 301601, 359570, 343628, 244391, 31007, -240919, -465693, -576246, -597186, -560998, -480489, -383830, -279539, -170107, -99570, -89047, -84286, -71516, -108720, -233098, -367224, -408512, -367173, -300540, -239157, -214479, -254139, -320206, -322437, -197336, -11710, 74840, 15815, -132751, -278691, -365323, -371782, -299958, -237334, -246899, -311167, -434266, -598831, -693027, -633554, -445828, -219355, -60318, 3076, 26265, 10913, -63769, -158043, -243336, -283165, -219628, -100649, -43905, -115284, -304449, -518915, -658712, -732472, -787182, -793247, -722205, -615365, -543936]
17313e43936j4144m6385J5825O0845Q554k2638O9130J56503J49764J13561N5922
17302C001l3600n0637j2415m8198j14306j38322j29135p9237K9540J22355J71286
17291b79668J93898J46048Q401j20379j96467k37289k14231j06446K7374Q9381
17281f89378J14448J24591P2995J8372m1702j11848j02046k3846J4806J9818P2485
17270e31305J13617Q3383q639r7366m7257J08782K13014K12730J17882K957o2778
17259A05020p8482o5474k9479n219n0864j28460j65994j35817j7200R6940R7334
17248c77695P6493P6903N9970K4035j4676n010J4986K1215K0816K2599R2562J99490
17236B11688K46520K03186R9512j5055q0277r4995r0804r0094j04625j03659o5744
$$ y = [-543936, -558080, -604465, -588640, -527795, -519241, -541879, -472749, -316246, -166482, -52921, 3001, -30599, -81236, -93651, -141849, -256155, -394477, -523612, -602849, -573309, -450954, -279668, -85770, 60278, 68679, -51700, -248167, -485456, -699687, -806133, -778759, -689378, -574930, -450339, -377344, -358972, -400674, -512522, -614568, -638414, -623608, -603790, -531305, -417688, -334305, -342944, -440310, -487567, -378785, -165771, 46959, 164841, 167798, 105020, 26538, -38936, -68415, -73634, -124498, -252958, -418952, -554769, -571969, -475029, -377695, -301202, -224299, -164329, -140294, -154970, -159980, -144994, -123779, -102963, -80364, 12198, 211688, 458208, 661394, 760906, 745851, 665574, 570579, 479775, 389681, 285056, 181397, 115653]
17225A15653J865R2569J25022Q8091K1353o6405j55885j70989j17339j22310k21305
17214d09680k32019j07721j8595J84Q0482K02827K50361J84318Q1762L9278P8258
17203A49455J38116J47747J12382O2271P069m7229j11701j71147j72184j48277
17193c3498j34440j03559o8740m8178l3352j5762J9870K5697j7824j2200M1812
17182c80174O5155J9719l3866j764R7527J66603J17463j2863j84143k80878k06625
17171f33846o1948N8417J22296R3610n625q2680j5228J31713K27981K48903K09713
17160B93306J44051L8005j28458k35700k06920j07449p8917j15228l4297J19723
17150c11884J86329J95282J88052J04366j1828l3160o563m3233p3734j6495L694
$$ y = [115653, 117518, 210087, 335109, 423200, 444553, 378148, 222263, 51274, -66065, -188375, -409680, -641699, -749420, -768015, -767831, -687349, -484522, -234161, -49843, 31919, 71197, 149455, 287571, 435318, 547700, 609971, 617040, 569811, 458110, 286963, 114779, -33498, -167938, -271497, -340237, -388415, -421767, -437529, -417659, -391962, -409786, -421986, -380174, -315019, -295300, -329166, -330930, -233403, -66800, 50663, 37800, -146343, -427221, -633846, -695794, -637377, -515081, -421471, -427096, -509776, -525004, -393291, -165310, 83593, 293306, 437357, 475362, 346904, 111204, -95716, -203165, -282082, -397310, -431607, -311884, -125555, 69727, 257779, 362145, 350317, 317157, 310594, 267361, 193627, 177132, 180826]
17139A80826j04327k32053k02257m2290P1737J07860J12983R5720R3594J10063
17129A91856J18850J08582R5768O0813M0946J5008j06772k04483k30009k45313
17119a54754j98456q8910L537N2035R0071J78885K36541J84287M6353q7348j43281
17108A18960j08604m1844j7236j6726m978n532m2053j12355j56561o8893K9747
17097d26075J9278m1336m4749k171L9753O2006Q3775J31378J45801J25714P3298
17086A66672Q056k294J329q215o217l5068q9233j01242r9333j10232q8331j992
17074c66100P9168Q5014K9330n4842j27883j53872p5789J5356k3351j18329r1162
17063h02460O6711J66318R2751k9095j08427j56638j46677m2057Q8096J82421
$$ y = [180826, 76499, -155554, -357811, -400101, -328364, -220504, -107521, -11801, 81793, 191856, 310706, 419288, 515056, 575869, 616815, 631823, 525051, 320568, 90559, -154754, -353210, -442120, -438583, -386548, -296477, -117592, 118949, 303236, 349589, 262241, 118960, 10356, -31488, -48724, -65450, -70428, -75960, -118013, -230368, -386929, -455822, -426075, -406797, -448133, -492882, -495053, -455300, -393294, -309519, -178141, -32340, 93374, 166672, 174728, 172434, 173763, 165548, 159331, 124263, 35030, -66212, -165545, -275777, -364108, -366100, -286932, -201918, -172588, -227430, -355313, -509185, -584974, -569618, -592969, -711298, -802460, -735749, -569431, -476680, -505775, -614202, -770840, -917517, -959574, -871478, -689057]
17053f89057K14958J73048J07013M2406l8396r7578q8009p6386r1831r0087k7835
17042f61754M9709J00163J02380P9937J26173J91983K22919K23421J33344m6264
17032E22011j68062j92868j75032r7703l6633j9891M2400J78435K39709J64997
17022D57363O0912L475k7019k6075k0128r3084j82465j92368j03932J5203J2593
17011i5525q2424j46464j35250k8921O7132P3264P2847J07506J13973O2718L1270
17000D0126J3724p5482j75753j66345r5438n2407k9790K4391J05727J65460J21665
$$ y = [-689057, -474099, -301051, -194038, -151632, -190028, -287606, -375615, -452001, -543832, -633919, -661754, -612045, -511882, -409502, -329565, -203392, -11409, 211510, 434931, 568275, 522011, 353949, 161081, -13951, -111654, -148287, -168178, -125778, 52657, 292366, 457363, 518275, 521750, 494731, 468656, 448528, 355444, 172979, -19389, -123321, -108118, -95525, -177949, -324413, -459663, -488584, -421452, -348188, -275341, -167835, -53862, 8856, 40126, 53850, -21632, -197385, -363730, -459168, -511575, -541365, -516974, -411247, -245787, -124122]
$$ [...]
##END NTUPLES=NMR SPECTRUM
##END=
