##TITLE=C13_Ser 2511-NEA-H
 CDCl3, 22000 sc

 11.3.2024
##JCAMPDX= 6.0         $$ Bruker NMR JCAMP-DX V2.0
##DATA TYPE= NMR SPECTRUM
##DATA CLASS= NTUPLES
##ORIGIN= UXNMR, Bruker Analytische Messtechnik GmbH
##OWNER= root
$$ XWIN-NMR		Version 3.5
$$ Tue Mar 12 13:38:14 2024 Russian Standard Time (UT+4h)  she@DPX200
##.OBSERVE FREQUENCY= 50.327896
##.OBSERVE NUCLEUS= ^13C
##.ACQUISITION MODE= SIMULTANEOUS
##.ACQUISITION SCHEME= undefined
##.AVERAGES= 22013
##.DIGITISER RES= 17
##SPECTROMETER/DATA SYSTEM= spect
##.PULSE SEQUENCE= zgpg30
##.SOLVENT NAME= CDCl3
##.SHIFT REFERENCE= (INTERNAL, CDCl3, 0, 222.646)
##AUDIT TRAIL= $$ (NUMBER, WHEN, WHO, WHERE, WHAT)
$$ ##TITLE= Audit trail, XWIN-NMR		Version 3.5
$$ ##JCAMPDX= 5.01
$$ ##ORIGIN= Bruker BioSpin GmbH
$$ ##OWNER= she
$$ F:/spectra/data/she/nmr/c13/1/pdata/1/auditp.txt
$$ ##AUDIT TRAIL=  $$ (NUMBER, WHEN, WHO, WHERE, WHAT)
(   1,<2024-03-12 13:35:28.29 +0400>,<she>,<DPX200>,
      <created by zg, POWCHK disabled, PULCHK disabled
       terminated by command 'halt'
       configuration hash MD5:
       00 E9 B6 7A A2 85 ED C7 34 08 36 98 17 FE 4E 26
       data hash MD5: 32K
       CD C2 28 75 46 D1 CF 0B BB 6F 5B BB 03 1C 3C 7F>)
(   2,<2024-03-12 13:35:44.46 +0400>,<she>,<DPX200>,
      <Start of raw data processing
       efp BC_mod = 2 LB = 2 FT_mod = 6 PKNL = 1 PHC0 = -388.9835 PHC1 = 22.5201 SI = 32K 
       data hash MD5: 32K
       31 84 15 31 9D 23 85 99 16 CD 68 96 62 A0 00 E2>)
(   3,<2024-03-12 13:35:47.23 +0400>,<she>,<DPX200>,
      <abs ABSG = 5 
       data hash MD5: 32K
       F9 48 6D 41 7E CA 15 01 23 C9 AB E0 2A 0D BD 77>)
(   4,<2024-03-12 13:36:14.01 +0400>,<she>,<DPX200>,
      <pk PHC0 = 9.247178 PHC1 = 0 
       data hash MD5: 32K
       44 AC AD A6 C6 9E DC A5 CF 98 CA 2A E7 C5 95 7E>)
(   5,<2024-03-12 13:36:17.20 +0400>,<she>,<DPX200>,
      <abs ABSG = 5 
       data hash MD5: 32K
       6C CF E1 FE 14 50 8D 6F E5 DD E9 82 5D CB FF D5>)
(   6,<2024-03-12 13:37:29.76 +0400>,<she>,<DPX200>,
      <pk PHC0 = -0.5303532 PHC1 = 0 
       data hash MD5: 32K
       9C 24 0B 0F 18 79 AD 1B 24 59 82 CD 46 51 0F 4E>)
$$ ##END=
$$ 
$$ hash MD5
$$ A7 1D BD 9B 64 E4 BD 57 2C 3B 06 0D 69 C4 DC 3F
##$RELAX= 
##$RELAX= 
##$RELAX= 
##$RELAX= 
##$RELAX= 
##$RELAX= 
##$RELAX= 
##$RELAX= 
$$ Bruker specific parameters
$$ --------------------------
##$DU= <F:/spectra>
##$EXPNO= 1
##$NAME= <c13>
##$PROCNO= 1
##$TYPE= <nmr>
##$USER= <she>
##$AMP= (0..31)
100 100 100 100 100 100 100 100 100 100 100 100 100 100 100 100 100 100 
100 100 100 100 100 100 100 100 100 100 100 100 100 100 
##$AQSEQ= 0
##$AQ_mod= 1
##$AUNM= <au_zg>
##$AUTOPOS= <>
##$BF1= 50.322709
##$BF2= 200.13
##$BF3= 50.322709
##$BF4= 500.13
##$BF5= 500.13
##$BF6= 500.13
##$BF7= 500.13
##$BF8= 500.13
##$BYTORDA= 1
##$CFDGTYP= 0
##$CFRGTYP= 5
##$CHEMSTR= <none>
##$CNST= (0..31)
1 1 145 1 1 1 1 1 1 1 1 1 1 1 1 1 1 1 1 1 1 1 1 1 1 1 1 1 1 1 1 1 
##$CPDPRG= <waltz16>
##$CPDPRG1= <>
##$CPDPRG2= <waltz16>
##$CPDPRG3= <>
$$ [...]
##$SUBNAM4= <"">
##$SUBNAM5= <"">
##$SUBNAM6= <"">
##$SUBNAM7= <"">
##$SUBNAM8= <"">
##$SUBNAM9= <"">
##$SW= 239.972175391363
##$SWIBOX= (0..15)
0 1 3 0 0 0 0 0 0 0 0 0 0 0 0 0 
##$SW_h= 12077.2946859903
##$TD= 32768
##$TD0= 1
##$TE= 0
##$TE2= 300
##$TE3= 300
##$TEG= 300
##$TL= (0..7)
120 120 120 120 120 120 120 120 
##$TP= (0..7)
150 150 150 150 150 150 150 150 
##$TP07= 0
##$TPNAME0= <>
##$TPNAME1= <>
##$TPNAME2= <>
##$TPNAME3= <>
##$TPNAME4= <>
##$TPNAME5= <>
##$TPNAME6= <>
##$TPNAME7= <>
##$TPOAL= (0..7)
0.5 0.5 0.5 0.5 0.5 0.5 0.5 0.5 
##$TPOFFS= (0..7)
0 0 0 0 0 0 0 0 
##$TUNHIN= 0
##$TUNHOUT= 0
##$TUNXOUT= 0
##$USERA1= <user>
##$USERA2= <user>
##$USERA3= <user>
##$USERA4= <user>
##$USERA5= <user>
##$V9= 5
##$VALIST= <valist>
##$VCLIST= <CCCCCCCCCCCCCCC>
##$VD= 0
##$VDLIST= <DDDDDDDDDDDDDDD>
##$VPLIST= <PPPPPPPPPPPPPPP>
##$VTLIST= <TTTTTTTTTTTTTTT>
##$WBST= 1024
##$WBSW= 4
##$XGAIN= (0..3)
0 0 0 0 
##$XL= 0
##$YL= 0
##$YMAX_a= 131539364
##$YMIN_a= -93378818
##$ZGOPTNS= <>
##$ZL1= 120
##$ZL2= 120
##$ZL3= 120
##$ZL4= 120
##$ABSF1= 222.646
##$ABSF2= -17.35081
##$ABSG= 5
##$ABSL= 3
##$ALPHA= 0
##$AQORDER= 0
##$ASSFAC= 0
##$ASSFACI= 0
##$ASSFACX= 0
##$ASSWID= 0
##$AUNMP= <proc_1d>
##$AZFE= 0.1
##$AZFW= 0.5
##$BCFW= 0
##$BC_mod= 2
##$BYTORDP= 0
##$COROFFS= 0
##$CY= -3
##$DATMOD= 1
##$DC= 0
##$DFILT= <>
##$DTYPP= 0
##$F1P= 0
##$F2P= 0
##$FCOR= 0.5
##$FTSIZE= 32768
##$FT_mod= 6
##$GAMMA= 0
##$GB= 0
##$INTBC= 1
##$INTSCL= 4.134877e-10
##$ISEN= 128
##$LB= 2
##$LEV0= 0
##$LPBIN= 0
##$MAXI= 10000
##$MC2= 0
##$MEAN= 0
##$ME_mod= 0
##$MI= 0.1934396
##$NCOEF= 0
##$NC_proc= 0
##$NLEV= 6
##$NOISF1= 120.0001
##$NOISF2= 80.00006
##$NSP= 0
##$NTH_PI= 0
##$NZP= 0
##$OFFSET= 222.646
##$PC= 1.4
##$PHC0= -380.2667
##$PHC1= 22.5201
##$PH_mod= 1
##$PKNL= yes
##$PPARMOD= 0
##$PSCAL= 0
##$PSIGN= 0
##$REVERSE= no
##$SF= 50.3227304925793
##$SI= 32768
##$SIGF1= 140
##$SIGF2= 120
##$SINO= 11.81781
##$SIOLD= 32768
##$SREGLST= <13C.CDCl3>
##$SSB= 0
##$STSI= 32768
##$STSR= 0
##$SW_p= 12077.2946859903
##$SYMM= 0
##$S_DEV= 0
##$TDeff= 32768
##$TDoff= 0
##$TI= <>
##$TILT= no
##$TM1= 0
##$TM2= 0
##$TOPLEV= 0
##$USERP1= <user>
##$USERP2= <user>
##$USERP3= <user>
##$USERP4= <user>
##$USERP5= <user>
##$WDW= 1
##$XDIM= 32768
##$YMAX_p= 446980396
##$YMIN_p= -5177382
$$ End of Bruker specific parameters
$$ ---------------------------------
##NTUPLES= NMR SPECTRUM
##VAR_NAME=  FREQUENCY,     SPECTRUM/REAL,   SPECTRUM/IMAG
##SYMBOL=    X,             R,               I
##VAR_TYPE=  INDEPENDENT,   DEPENDENT,       DEPENDENT
##VAR_FORM=  AFFN,          ASDF,            ASDF
##VAR_DIM=   32768,         32768,           32768
##UNITS=     HZ,            ARBITRARY UNITS, ARBITRARY UNITS
##FACTOR=    0.368581032318806, 1,           1
##FIRST=     11204.1544566776, 0,            0
##LAST=      -873.140229312654, 0,           0
##MIN=       -873.140229312654, -5177382,    0
##MAX=       11204.1544566776, 446980396,    0
$$ Real data points
##PAGE= N=1
##DATA TABLE= (X++(R..R)), XYDATA
$$ [...]
17881 1900461 2044581 1757134 1230892 830028 700631 875949 1188778 1394451 1466175 1493387
17871 1493387 1574071 1708550 1609645 1138578 691716 610851 804603 1125802 1383442 1406664
17861 1406664 1280460 1194670 1269341 1549919 1989949 2371255 2520056 2445837 2173877 1688223
17851 1688223 1099084 701494 737610 967795 1123784 1293359 1474726 1583659 1680143 1779428
17841 1779428 1668629 1303888 1044541 1081210 1244229 1442082 1653194 1683331 1565688 1397083
17831 1397083 1152694 842972 497978 296394 171394 -103692 -493176 -923642 -1345264
17822 -1345264 -1629062 -1694090 -1594944 -1514720 -1709083 -2241242 -2924989 -3501994 -3716395 -3416124
17812 -3416124 -2714595 -1891338 -1095353 -474719 -137376 49963 272821 524292 478852 85846
17802 85846 -234101 -199191 -29833 -123817 -614586 -1190094 -1323261 -861980 -133921 576075
17792 576075 1200195 1684704 1914132 1968038 2228031 2859814 3479067 3666963 3396225 2928180
17782 2928180 2527882 2371200 2483433 2535009 2174141 1395827 482455 -164707 -463241 -617699
17772 -617699 -728785 -966821 -1579542 -2420250 -2964234 -3045096 -2786196 -2251219 -1670035 -1133291
17762 -1133291 -679076 -453933 -483059 -717490 -1139679 -1860543 -2887450 -3915427 -4584306
17753 -4584306 -4756032 -4506672 -3799277 -2571041 -1314884 -546995 -285815 -302305 -388414
17744 -388414 -448440 -576480 -878155 -1208708 -1469343 -1566185 -1503088 -1351092 -1288820 -1619295
17734 -1619295 -2063570 -2123811 -1856930 -1589110 -1394635 -1083541 -501830 237042 793905 833026
17724 833026 485744 175438 215499 565125 988552 1298860 1395633 1311926 1119058 1090446
17714 1090446 1332538 1486497 1396588 1223849 1043569 891030 802204 866508 1045020 1174853
17704 1174853 1190608 1362154 1865001 2437502 2766730 2709389 2189022 1361015 736836 535808
17694 535808 616424 848208 898710 487642 -126145 -730227 -1293301 -1616755 -1596262 -1366877
17684 -1366877 -1074809 -904118 -949390 -886343 -413276 253635 677620 569702 -93682 -1131370
17674 -1131370 -2087656 -2592956 -2598596 -2374339 -2161032 -1901684 -1384968 -528846 430888 1140809
17664 1140809 1375270 1223156 939907 761440 903245 1395422 1821491 1854356 1625776 1296831
17654 1296831 960976 668788 521013 782649 1409908 1816121 1531956 692191 -229285
17645 -229285 -714970 -539061 25091 496172 477515 -10142 -511673 -592156 -131101 614297
17635 614297 1244007 1542231 1611599 1552917 1311894 1039055 973305 1167607 1470201 1781124
17625 1781124 2084374 2270529 2326705 2407081 2455436 2284114 1871946 1415707 1242945 1404281
17615 1404281 1544727 1462456 1277358 1095405 963221 935069 781473 360581 -166226 -790611
17605 -790611 -1463116 -1926351 -1956672 -1596765 -1078055 -477632 382236 1273872 1588226 1135809
17595 1135809 309653 -488433 -1135262 -1490662 -1388479 -972203 -534204 -34330 711647
17586 711647 1447120 1769508 1599010 1108256 577656 319192 571216 1143480 1644864 2015732
17576 2015732 2396430 2859901 3288852 3434397 3191400 2781812 2384801 1970181 1325995
17567 1325995 532261 12542 -53436 148301 552240 1185804 1752627 1822553 1392031 858270
17557 858270 662397 945286 1470924 1810420 1629267 1076359 694215 792097 1261139 1916858
17547 1916858 2365446 2356571 2145978 2041535 2007035 1806034 1352236 797504 386725 135474
17537 135474 -95212 -259460 -277746 62913 868270 1636653 1860513 1658443 1480542 1541523
17527 1541523 1612947 1439293 963827 399192 133673 353829 867815 1424237 1940860 2350684
17517 2350684 2452576 2140562 1541026 902774 538835 653795 1043949 1448141 1811649
17508 1811649 1948796 1746856 1433256 1144454 1043524 1232232 1347375 1142878 846516
17499 846516 800602 1207367 1824430 2261868 2540929 2652287 2601301 2691355 2947842 3101196
17489 3101196 2883024 2347902 1684738 967198 549945 681091 1070193 1194031 854710
17480 854710 272338 -244820 -672788 -1011486 -1261414 -1446796 -1531810 -1597696 -1689815 -1711119
17470 -1711119 -1572329 -1388833 -1287399 -1272092 -1199010 -794535 -135301 587487 1332082 1710372
17460 1710372 1446471 825024 231209 -226445 -558957 -702788 -513190 -1909 416527
17451 416527 544478 637046 749850 774967 776782 738201 565303 367495 270457 316913 472576
17440 472576 578195 612282 688810 829689 1023869 1224230 1491911 1768811 1586732 822338
17430 822338 -79402 -745359 -1221473 -1601835 -1918252 -2168537 -2168234 -1823325 -1312377 -1075170
17420 -1075170 -1388176 -2033661 -2620081 -2791946 -2583670 -2247745 -1869217 -1526087 -1370160
17411 -1370160 -1534234 -1822798 -1824525 -1427945 -557496 627600 1613190 2135360 2189132 1924750
17401 1924750 1566953 1176505 686490 212224 -8308 74601 354949 733279 1144517 1449229
17391 1449229 1338603 752914 177136 33959 201852 403475 454848 396931 372031 467818
17381 467818 550895 340191 -7951 -27167 265175 687820 1337158 2146690 2661792 2607481
17371 2607481 2246538 1787154 1281876 787795 379605 -23723 -645188 -1299301 -1609477
17362 -1609477 -1577913 -1439395 -1217842 -881630 -646460 -722356 -1039308 -1349406 -1419393 -1197261
17352 -1197261 -995237 -945156 -764639 -504644 -380010 -266937 -194167 -502480 -1066149 -1304915
17342 -1304915 -931352 -267061 189457 261832 20866 -520385 -1172685 -1541914 -1563841 -1386190
17332 -1386190 -1086836 -702285 -238366 387525 1136105 1688825 1812836 1578987 1122553
17323 1122553 626936 242745 -211372 -903305 -1599530 -2098993 -2408261 -2439626 -2258449 -2053884
17313 -2053884 -1928599 -1909840 -1832048 -1566541 -1197123 -959849 -987847 -1092107 -1034314 -878465
17303 -878465 -708246 -713202 -1081680 -1716802 -2226117 -2361821 -2278435 -2199937 -2312291 -2571645
17293 -2571645 -2774201 -2820947 -2820584 -2708298 -2246087 -1500973 -843824 -559177 -400575 -31624
17283 -31624 301614 174925 -333134 -810036 -916287 -470384 176825 437247 223564 -206056
17273 -206056 -679060 -1066438 -1100566 -691208 -44789 661640 1246666 1330090 759434 -65216
17263 -65216 -698617 -875855 -660861 -478448 -412468 -315244 -266071 -351845 -489507 -458169 -286266
17252 -286266 -207851 -165415 -83382 35204 205857 524343 836618 725527 233446 -390016
17242 -390016 -939000 -1020926 -643229 -253639 -50332 -34886 -300705 -784102 -1227890 -1475167
17232 -1475167 -1385395 -1072085 -872736 -1098375 -1734579 -2398262 -2726783 -2607572 -2333500 -2031847
17222 -2031847 -1612152 -1074833 -400040 206969 365315 117747 -295122 -767092 -1360027
17213 -1360027 -1965800 -2243317 -2041625 -1341192 -507711 239136 1030551 1910450 2852548
17204 2852548 3597164 3790058 3502420 3020719 2485736 2126317 2190301 2648999 3282307 3902860
17194 3902860 4433251 4604442 4310954 3836307 3524335 3422795 3381894 3238847 2785400 1982063
17184 1982063 1074861 366317 -182763 -804026 -1564264 -2386506 -2981954 -3037236 -2574389 -2097533
17174 -2097533 -2000526 -1949118 -1648102 -1309450 -1124870 -1097262 -1220234 -1510090 -1744733 -1697979
17164 -1697979 -1387705 -961053 -509648 37055 782902 1578033 2134057 2430845 2484126 2191864
17154 2191864 1926114 2174713 2720658 3126871 3356379 3563456 3714711 3681089 3464537 3098763
17144 3098763 2620631 2216878 2060469 2288966 2787135 3119777 3229628 3398219 3720731
17135 3720731 4001366 3949889 3482030 2839518 2302251 1831187 1229567 534603 -9756 -291221
17125 -291221 -295251 -127032 38441 43651 -320412 -1002376 -1589696 -1739813 -1449293 -1078318
17115 -1078318 -928018 -784569 -331119 304163 783789 1037830 1216551 1380157 1624681
17106 1624681 2005883 2290631 2212512 1657301 803835 10593 -615711 -1187599 -1762571 -2194311
17096 -2194311 -2263335 -1749199 -693173 438685 1262353 1717108 1781395 1489631 870464
17087 870464 37406 -559041 -707514 -598251 -396254 -304717 -329433 -181720 224318 707184
17077 707184 1314239 1978150 2397952 2423568 2154460 1987744 2113056 2281977 2269982 1976876
17067 1976876 1551671 1346634 1343076 1216177 855919 457262 413521 862019 1449119 1881187
17057 1881187 2167276 2284373 2141956 1811789 1592824 1636332 1658203 1588770 1525055 1414349
17047 1414349 1441058 1736024 2145050 2515060 2654438 2472006 2071785 1354583 450816 -53487
17037 -53487 191369 1141650 2198286 2594582 2198821 1425993 791707 509384 414569 215177
17027 215177 -164184 -376106 -132701 246740 493241 667061 604970 84973 -661547 -1310888
17017 -1310888 -1770548 -1988221 -2020223 -1962146 -1769358 -1415128 -781310 180627 1043545 1499330
17007 1499330 1672253 1667508 1311435 517985 -455156 -1179328 -1348005 -1106351 -666319 -189485
16997 -189485 171366 427824 531973 514693 524067 501393 356480 58704 -234012 -404610
16987 -404610 -407549 -361300 -455330 -617673 -711230 -594319 -346971 -205223 -204155 -202616 -21059
16976 -21059 230836 430772 624514 550120 -77120 -995954 -1789683 -2477840 -2941131 -2796431
16966 -2796431 -1926143 -735412 68016 117116 -453695 -1272938 -1937987 -2310342 -2354763 -2157510
16956 -2157510 -1759854 -1291185 -939185 -641326 -195387 306087 418684 70137 -304905
16947 -304905 -634793 -1107408 -1521831 -1610248 -1348432 -993954 -895820 -1218348 -1750495 -2164318
16937 -2164318 -2207039 -2005988 -1834167 -1627904 -1268143 -675326 114792 953836 1649042 1852146
16927 1852146 1477704 827077 214223 -175959 -235551 -166554 20040 564478 1323862 2021288
16917 2021288 2559517 2998043 3349518 3499309 3074366 2031905 799959 -31478 -129476
16908 -129476 184310 328811 361836 538499 849312 1336252 1723151 1558036 1123359 1086501
16898 1086501 1624541 2524894 3303981 3399007 2695089 1584683 454441 -349812 -636575
16889 -636575 -629526 -782053 -1290763 -1885860 -2211464 -2284821 -2333501 -2383075 -2406486 -2358058 -2296034
16878 -2296034 -2344193 -2363658 -2160658 -1704730 -1265940 -1126162 -1299279 -1636275 -1885203 -1869805
16868 -1869805 -1597076 -1160327 -626275 -146188 126852 253272 556629 1252464 2268281
16859 2268281 3298469 4044261 4545348 4826412 4724600 4341437 3921355 3668076 3484315
16850 3484315 3065241 2591583 2463645 2865002 3641046 4360023 4600521 4203383 3360714
16841 3360714 2315902 1316325 688947 560946 827098 1127508 1095598 737044 284936
16832 284936 -109474 -466070 -775315 -1185278 -1905118 -2695797 -3135435 -3125596 -2830370 -2270946
16822 -2270946 -1476483 -710329 -85052 406202 552065 381881 185116 -30497 -88031 249532
16812 249532 671108 713674 168356 -712854 -1516229 -1901893 -1602732 -806715 27065 500922
16802 500922 602118 605657 554409 592152 861421 1172620 1259657 1018953 677646 435358
16792 435358 267176 167950 153302 135129 96074 90964 124031 290227 749558 1368041 1892864
16781 1892864 2110153 1923008 1394369 787181 493773 594340 785300 799768 732425 706712
16771 706712 614164 213292 -576151 -1485894 -2094658 -2126512 -1604599 -902944 -374127 95785
16761 95785 758766 1502527 1890606 1879509 1830540 1757153 1518168 1215873 945508 592641
16751 592641 225222 -64272 -338273 -666745 -1084998 -1531105 -1716278 -1454642 -1136846 -1130217
16741 -1130217 -1253411 -1175103 -662610 204506 970059 1477057 1762076 1741477 1311886 302422
16731 302422 -1033387 -2198170 -3145173 -3738311 -3844282 -3842177 -3852444 -3725931 -3600786 -3575714
16721 -3575714 -3459877 -3248448 -3088310 -3052746 -3137145 -3385066 -3598274 -3555277 -3366949 -3110796
16711 -3110796 -2696927 -2129669 -1592349 -1394853 -1515765 -1593061 -1462992 -1026040 -330727 235491
16701 235491 406123 404120 623285 977710 1170511 1038179 808996 803667 832832 595826
16691 595826 119076 -210008 -189513 71916 570546 1248164 1816224 2216190 2749477 3589964
16681 3589964 4396164 4698499 4392341 3673136 2620988 1351742 196789 -625974 -1065245
16672 -1065245 -1070147 -942757 -875212 -760030 -437296 216604 845804 1251197 1839656 2737506
16662 2737506 3561467 3948109 3920370 3774833 3657362 3487855 3147501 2713942 2397288 2180688
16652 2180688 1790052 1177032 624686 363737 318620 344733 413183 503575 575232 643406
16642 643406 722605 723149 649905 493380 160498 -249031 -591327 -895375 -1213099 -1528789
16632 -1528789 -1701668 -1345393 -339389 749792 1545500 2250957 2791837 2873056 2549843
16623 2549843 2125863 1824397 1702574 1750729 1947002 2264016 2631495 3049560 3299569 3129485
16613 3129485 2595473 1895751 1231828 890122 995863 1378754 1895281 2270976 2141851
16604 2141851 1357466 279686 -553269 -972331 -1001095 -683288 -212773 415300 1104120
16595 1104120 1381658 1227595 1068533 1254552 1756416 2207528 2307386 2083067 1703472 1236649
16585 1236649 789500 323586 -198881 -558796 -630378 -537659 -553440 -754276 -810807 -482547
16575 -482547 75673 573229 884319 1071286 1269973 1493731 1727444 2053189 2319188 2457372
16565 2457372 2684147 2954112 3074264 3008335 2658280 1959807 1108368 473352 206421 218039
16555 218039 436734 706540 734838 302669 -452564 -1158735 -1741213 -2378187 -2959884 -3338072
16545 -3338072 -3501738 -3448828 -3137889 -2452343 -1574652 -749675 -62115 400915 663595 724720
16535 724720 457482 170101 181509 244747 213531 344156 854373 1607719 2282703 2627761
16525 2627761 2672723 2587623 2647834 2932274 3140624 3180861 3005546 2421869 1595764 969078
16515 969078 607706 216428 -208654 -329245 -109353 259114 547571 652384 787048 1022206
16505 1022206 1183912 942084 142048 -683686 -856802 -240065 694577 1293719 1254294 747748
16495 747748 443831 603509 821442 733086 369708 129370 289306 684386 959515 948594
16485 948594 740779 566260 570738 729108 945365 1182405 1402989 1533637 1616170 1721714
16475 1721714 1814130 1904048 2005055 1916364 1596362 1560563 2167664 3076277 3699893 3771919
16465 3771919 3434072 2825398 1999585 1161180 627659 413377 223342 -177120 -651531
16456 -651531 -618892 157358 1289202 2253614 2754020 2807157 2514158 1909321 1118956 450361
16446 450361 38357 -182528 -343037 -321537 -27935 203567 280562 352262 390297 394494 633707
16435 633707 1310835 2149676 2770944 3049236 2925936 2501230 2098919 1913228 1959809 2215456
16425 2215456 2459803 2456867 2343782 2358146 2389426 2189328 1771490 1321578 1144565 1161183
16415 1161183 1067747 1037981 1270780 1606130 1896153 2027898 1780587 1082280 359043 -40837
16405 -40837 -214263 -303570 -190577 301321 956483 1314135 1280275 970845 452594 12107
16395 12107 33557 392536 806773 1196606 1483885 1604940 1537784 1329501 877746 39481
16385 39481 -1063311 -1842589 -1740356 -972812 -185250 350648 540281 235747 -355275 -861960
16375 -861960 -1149443 -1178774 -887773 -481807 -95317 328385 629930 621417 449264 243412
16365 243412 -218400 -1081802 -2070185 -2672531 -2744734 -2337174 -1614288 -1028762 -743285 -673636
16355 -673636 -731197 -683190 -362072 203169 788871 1290571 1736987 2121102 2365813 2292785
16345 2292785 1844269 1462467 1603268 2006166 2197496 2237043 2465763 2878270 3170087 3002719
16335 3002719 2206167 1165964 394902 -63950 -442681 -753447 -778876 -546734 -279259
16326 -279259 -200156 -307474 -366486 -345788 -205812 -52513 -80654 -213439 -287213 -242669 130688
16315 130688 839440 1408435 1381518 707440 -206962 -899024 -1120770 -858261 -241144 487599
16305 487599 943243 1031737 929715 628297 82450 -470322 -609513 -51747 1083103 2211375
16295 2211375 2744910 2580343 1918959 1172957 731728 708635 941916 1271779 1624655 1711125
16285 1711125 1440644 1075103 836833 672042 528954 559912 769464 1002742 894873 243206
16275 243206 -522139 -806669 -627818 -296708 290473 1239661 2217570 2856958 2987108 2769039
16265 2769039 2715505 3204222 3986939 4557884 4628240 4052397 3059026 2411851 2240227 2006431
16255 2006431 1467627 796356 280178 165210 473903 957269 1402274 1622550 1458156
16246 1458156 1083748 841873 915823 1240256 1476900 1452403 1270187 1055067 887875 806095
16236 806095 769526 806786 990407 1340884 1751935 2084108 2029056 1388862 503167 -75261
16226 -75261 -119493 188811 494346 589497 402628 136521 61424 172397 399595 624196
16216 624196 660268 401547 -15381 -352210 -534659 -502335 -325170 -270528 -466270 -864632
16206 -864632 -1322670 -1665816 -1919035 -2196217 -2460049 -2662999 -2821645 -2932612 -2931409 -2761610
16196 -2761610 -2508226 -2307701 -2149771 -1867704 -1424762 -967447 -515591 54050 758374
16187 758374 1368665 1666266 1698924 1797229 2054541 2198901 2235040 2397542 2537795 2316588
16177 2316588 1803691 1164407 359323 -451254 -913980 -1106940 -1307415 -1344515 -822616 -5816
16167 -5816 622171 978079 1123563 1206855 1424397 1689292 1588055 1169056 757499 301367
16157 301367 -328121 -1128025 -1970992 -2451553 -2249578 -1621134 -1012962 -697510 -693077 -584439
16147 -584439 -97773 512745 850668 913615 1072671 1333253 1452721 1506262 1550261 1456718
16137 1456718 1142918 694950 234411 -217467 -753262 -1435624 -2128795 -2750533 -3236755
16128 -3236755 -3462628 -3452143 -3418512 -3424501 -3297814 -3087706 -3057656 -3265538 -3516413 -3587446
16118 -3587446 -3418816 -3199367 -3110730 -3069315 -2995285 -2993876 -2988516 -2861325 -2686083 -2601185 -2649986
16107 -2649986 -2684369 -2506710 -2101597 -1698099 -1571660 -1674135 -1715985 -1666375 -1814854 -2099455
16097 -2099455 -2090390 -1966808 -2121621 -2358142 -2480150 -2627479 -2666289 -2415284 -2007202 -1513947
16087 -1513947 -1031435 -785034 -867047 -1115521 -1533949 -2232508 -2955337 -3371898 -3233991 -2657804
16077 -2657804 -2087328 -1826328 -1730612 -1571205 -1169403 -436467 359707 1019830 1575014 1622074
16067 1622074 902872 -59822 -766908 -1121871 -1455376 -1879112 -2082385 -1898047 -1436056
16058 -1436056 -924470 -521666 -350733 -406442 -580069 -752132 -986346 -1392682 -1589870 -1173292
16048 -1173292 -460836 90510 549338 1011318 1208659 1054487 711969 393321 392814 698472
16038 698472 982896 946386 627389 213451 -23868 237269 960605 1924569 2763310 3460116
16028 3460116 4132833 4416629 4126814 3493070 2677859 1859289 1335165 1337956 1653885 1638822
16018 1638822 1085450 369860 -320704 -1100626 -1811124 -2125823 -2063722 -1896377 -1738057 -1648754
16008 -1648754 -1491407 -1069585 -534849 -127363 197271 561521 750888 454954 -360862
15999 -360862 -1453169 -2478674 -3046312 -3166938 -3325931 -3808008 -4226998 -4112186 -3520750
15990 -3520750 -2686743 -1912020 -1301393 -729916 -225907 182784 473514 586463 506996 456515
15980 456515 450853 255087 -170401 -598131 -806083 -887366 -1101121 -1400687 -1541602 -1562828
15970 -1562828 -1493955 -1158319 -565174 -31934 262355 470712 667724 707028 633377 678262
15960 678262 994827 1594752 2229825 2660066 2854886 2889203 3001011 3297788 3439416 3189156
15950 3189156 2591894 1805266 1226048 1151218 1425275 1751908 1963312 2025659 1986531 2003568
15940 2003568 2243345 2717506 3321939 3850628 3812984 3173825 2616777 2587681 2851778 2982148
15930 2982148 2883159 2642902 2397348 2302903 2502005 2912818 3098666 2730314 1946001 908895
15920 908895 -98546 -620720 -465415 232522 1162783 1881203 2216881 2379878 2354308 1834675
15910 1834675 959919 231190 -213286 -432431 -353487 73361 648795 1040313 1292537 1541329
15900 1541329 1614988 1391950 839574 84474 -460545 -612079 -468746 -220016 178167 721222
15890 721222 1003022 889744 563776 223839 20222 -119224 -373913 -749645 -1012182 -1197061
15880 -1197061 -1400745 -1514457 -1555203 -1650790 -1808356 -1845666 -1713750 -1638410 -1805768 -2068473
15870 -2068473 -2193367 -2180699 -2070702 -1801722 -1347295 -814165 -248733 374692 887060 957980
15860 957980 693112 722609 1333416 2183923 2813383 2922276 2524315 1786268 903954 82730
15850 82730 -451377 -765594 -1035078 -1163796 -1072694 -816832 -440770 -53935 349520 826529
15840 826529 1236720 1264568 904542 714285 940985 1132180 905939 353988 -77980 -181557
15830 -181557 -77185 -33835 -3203 362772 1043023 1583085 1794134 2101329 2573109 2821270
15820 2821270 2905246 2879752 2464356 1733506 856652 -58763 -924748 -1863140 -2767440 -3398576
15810 -3398576 -3634036 -3456520 -3090737 -2775750 -2556330 -2350604 -2079024 -1736482 -1458761
15801 -1458761 -1221207 -840764 -489181 -389779 -500930 -680335 -690694 -321589 484317 1295132
15791 1295132 1646955 1642038 1503921 1387489 1580299 2092335 2666306 3034575 3035059 2818099
15781 2818099 2492634 1963451 1260983 693094 580802 1007850 1759964 2491692 2902320
15772 2902320 2902731 2591362 2025465 1350681 813654 300553 -361654 -958854 -1178851 -1094721
15762 -1094721 -1105667 -1312278 -1384851 -1271940 -1270339 -1382338 -1461441 -1692184 -2239013 -2813221
15752 -2813221 -2977100 -2633748 -2172002 -1885824 -1554718 -984472 -325593 165234 331660
15743 331660 142082 -206817 -452186 -605426 -871455 -1191750 -1124111 -544209 199537 847812
15733 847812 1320386 1473948 1423628 1586804 2180128 2800598 2814251 2130126 1333119 917701
15723 917701 1017809 1418263 1712401 1732296 1651219 1632685 1686067 1654351 1506023 1464952 1497838
15712 1497838 1305834 666993 -388641 -1411322 -1717866 -1097654 -127351 548597 704228
15703 704228 499688 407458 783043 1305993 1445024 1059293 495836 186646 315576 902931
15693 902931 1696336 2254238 2414144 2463407 2702839 2993730 2994409 2572554 2225737 2534490
15683 2534490 3258932 3898758 4412905 4803875 4806819 4413799 3804110 3287664 3215734 3466595
15673 3466595 3579829 3210845 2438473 1456271 444401 -296376 -638402 -642058 -398730 58794
15663 58794 462926 387332 -204384 -881479 -1227404 -1114688 -777924 -583198 -487377 -210344
15653 -210344 242307 643661 792126 627541 452831 686488 1331528 2042860 2354192 2143783
15643 2143783 1815886 1506207 1068039 516146 24611 -187274 -146126 -157277 -683635 -1655144
15633 -1655144 -2555948 -3317105 -4005701 -4238880 -3646824 -2487026 -1369107 -664886 -280783
15624 -280783 34453 335837 597524 804977 859218 697586 393175 237827 320286 325765
15614 325765 142353 17923 -48568 -155061 -152056 -156888 -271567 -121245 552819 1502362
15604 1502362 2264752 2549751 2335764 1813911 1310969 1032528 1082923 1434141 1870091 2116247
15594 2116247 1922402 1534408 1425089 1584511 1856177 2172660 2381265 2494474 2705604
15585 2705604 2776294 2305234 1460394 635884 -44271 -716380 -1337601 -1829061 -2122734 -2027467
15575 -2027467 -1486946 -705868 132942 1067030 2072824 2884666 3373660 3899185 4396312
15566 4396312 4384221 3840453 3027552 2300545 2130461 2623622 3076469 2861468 2065708 1100534
15556 1100534 321756 -175653 -452772 -500433 -341685 -108895 41674 110114 380351 847586
15546 847586 1212116 1265400 975247 671135 654444 916886 1227978 1465184 1587786 1510972
15536 1510972 1308988 1078483 934464 1025690 1271647 1534360 1800472 2076427 2358699 2625455
15526 2625455 2782144 2748833 2623119 2535887 2471477 2447412 2435734 2233560 1857668 1457945
15516 1457945 1100800 817476 498011 -55591 -850514 -1675788 -2105047 -1983982 -1649505
15507 -1649505 -1271717 -758024 -240704 58271 152563 245559 549119 991167 1291636 1247627
15497 1247627 788741 88787 -456074 -756330 -875489 -655929 -146064 358744 684895
15488 684895 893938 925523 728216 636370 720401 814447 1087903 1538462 1947642 2251252
15478 2251252 2363907 2211317 2036135 2249073 2651734 2641278 2023344 1085098 181122 -459313
15468 -459313 -825533 -1156878 -1416159 -1356233 -1030156 -738632 -687999 -870146 -1085552 -1281100
15458 -1281100 -1549879 -1863725 -2178567 -2433681 -2404173 -1920474 -1032876 32492 961950
15449 961950 1587411 1800887 1508182 933400 484737 439843 764156 1033711 1004164 805672
15439 805672 533910 164129 -371187 -944604 -1284513 -1194214 -723055 -327473 -347750 -777050
15429 -777050 -1350025 -1699224 -1591022 -962516 -126794 515729 773245 526629 19199 -258260
15419 -258260 -256226 -331423 -784461 -1430184 -1860471 -1771662 -1207770 -553987 22746 485530
15409 485530 790846 898948 753517 429471 290594 609688 1274458 1982500 2558661 2863081
15399 2863081 2612170 1757749 783247 344699 545867 977480 1182748 1118701 960702 748309
15389 748309 508872 380382 567575 1128839 1805161 2340273 2718222 2837369 2648643 2312110
15379 2312110 1912592 1525084 1335694 1336902 1386561 1410862 1443846 1517723 1564035 1749514 2092911
15368 2092911 2285757 2410286 2682027 2849624 2471257 1503675 498990 -183133 -657009
15359 -657009 -820508 -556757 -77045 439062 789502 807764 554426 172831 -185832 -376358
15349 -376358 -326007 -113090 145891 272833 151792 -120593 -498561 -842728 -843625 -277386
15339 -277386 744558 1655108 1987495 1609250 659673 -299973 -687520 -465583 -53769
15330 -53769 53196 -247610 -622577 -778048 -874579 -995728 -978360 -756698 -440409 -197916
15320 -197916 70411 492181 743850 610748 434662 453925 814306 1315123 1472628 1117313
15310 1117313 349234 -360534 -483662 -231954 -99207 -230069 -393552 -503155 -497924 -199922
15300 -199922 318459 779718 900270 669669 483260 509481 631319 812893 957278 968649
15290 968649 751979 170524 -620958 -1243915 -1340434 -853920 -131073 565151 1071669 1123035
15280 1123035 654230 -102339 -707320 -932861 -948412 -840419 -565691 -243676 -56484 66308
15270 66308 246781 291459 -10651 -573831 -1246800 -1816785 -1904310 -1463157 -873881 -351922
15260 -351922 62567 257272 289095 429712 614273 624070 608999 768363 1125616 1657841
15250 1657841 2213867 2661454 2965759 3164173 3285046 3119462 2420721 1458893 746250
15241 746250 336598 157616 320148 986671 1928139 2566702 2669366 2459272 2465095 2980895
15231 2980895 3670207 4118935 4296121 4303464 3961266 3268599 2784396 2873203 3332735 3773828
15221 3773828 4009560 3986058 3616261 2941602 2248791 1715612 1375346 1118781 698840 255172
15211 255172 286179 788059 1322365 1610194 1741554 1946663 2180900 2205569 1929750 1536949
15201 1536949 1011711 312574 -314958 -607433 -548945 -497424 -759082 -1191947 -1394573 -1241341
15191 -1241341 -786721 -253212 -123203 -400116 -656547 -504121 116230 821414 1329042
15182 1329042 1719874 2093141 2214707 2014356 1744002 1550656 1459715 1498263 1575963 1607587
15172 1607587 1546117 1377406 1163447 844707 428350 7582 -269601 -332121 -290556 -293855
15162 -293855 -452322 -709021 -692964 -7130 1331275 2839210 3986606 4754322 5167025
15153 5167025 5362812 5625521 5877547 6003834 5871805 5295238 4317463 3296036 2643270
15144 2643270 2279600 2077545 2081635 2115481 2107523 2286925 2736655 3145650 3076185 2627767
15134 2627767 2258812 2084786 1791734 1192416 589585 377764 643393 1150204 1596933
15125 1596933 1860277 1964072 2027656 2292552 2675500 2943559 3141435 3330224 3533302 3712694
15115 3712694 3861400 3886766 3585448 2924112 2098346 1314903 667427 202413 -102977 -369829
15105 -369829 -660267 -937656 -1014619 -867426 -603736 -394116 -450490 -702103 -1070957 -1684424
15095 -1684424 -2481284 -3024158 -2915614 -2232626 -1500738 -1042914 -783458 -627922 -493633
15086 -493633 -266766 -49133 100508 308305 439121 297831 124688 168507 268024 323639
15076 323639 384226 505146 713843 953752 1113379 976547 586894 226097 149972 462356
15066 462356 874032 1074562 1014129 842554 699612 741836 1085989 1697440 2319811 2552139
15056 2552139 2410795 2249081 2219932 2345199 2689883 3131511 3386198 3246204 2844513 2587168
15046 2587168 2560683 2657580 2817489 2869979 2693751 2175513 1394134 483582 -546221 -1309351
15036 -1309351 -1425519 -993717 -285279 441914 986195 1432293 1955412 2403788 2474581 2300696
15026 2300696 2137549 1855970 1384615 996456 830633 708669 426353 29881 -266927
15017 -266927 -464716 -616987 -757698 -973036 -1251509 -1476235 -1608365 -1639988 -1428368 -1010911
15007 -1010911 -579458 -281020 -304620 -653533 -1105358 -1365864 -1468664 -1627515 -1898397 -2071519
14997 -2071519 -1813915 -1157006 -317676 513159 1112578 1394359 1419140 1366231 1443610 1576125
14987 1576125 1499531 1163862 817557 626019 664401 829131 839366 771687 866296 1257289
14977 1257289 1744411 1997224 2139788 2379488 2548362 2330690 1701290 934794 266151
14968 266151 -110358 -372600 -799346 -1287501 -1642802 -1830790 -2011854 -2157101 -1981255 -1516433
14958 -1516433 -926738 -470971 -381144 -594950 -884956 -1050350 -1048143 -915214 -602920 -78233
14948 -78233 402054 434489 -75314 -870949 -1564501 -1871537 -1742504 -1500206 -1372338 -1357959
14938 -1357959 -1301189 -1183721 -1185148 -1253700 -1135649 -704551 -126791 298833 454625 465015
14928 465015 372990 303597 493356 873770 1068457 821985 215095 -359277 -520267 -285713
14918 -285713 33977 287770 401281 388628 336110 336739 343854 151223 -150774 -354396 -389356
14907 -389356 -123897 518584 1156922 1259185 841520 452312 337074 299493 239358 183850
14897 183850 199426 282210 641425 1526794 2631184 3353648 3468677 3160911 2583125 1872473
14887 1872473 1284146 918840 541075 68054 -258067 -438164 -614748 -838421 -902255 -634859
14877 -634859 -228114 226257 629511 750971 785382 1089769 1642322 2063955 2050765 1870591
14867 1870591 1911294 2155980 2152224 1671060 989141 478632 266646 181445 223142 414939
14857 414939 695147 1124211 1646998 2074123 2357809 2486984 2483474 2471354 2423007 2198736
14847 2198736 1861541 1584176 1546859 1674906 1716487 1727107 1839669 1807417 1577498 1441923
14837 1441923 1561719 1918992 2245911 2098724 1404023 683607 483214 786577 1213245
14828 1213245 1689628 2193630 2547271 2704189 2627687 2364119 2179615 2234166 2271826 2175214
14818 2175214 1974673 1482867 802667 207318 161654 737981 1376850 1670464 1583370 1226260
14808 1226260 768747 411332 339477 406650 337059 116027 -123444 -159792 191661 766606
14798 766606 1196549 1521921 1916074 2218657 2282818 2143344 1796525 1339325 912944 705283
14788 705283 714367 773674 973300 1356119 1861117 2234853 2192130 1788308 1113091 194045
14778 194045 -709373 -1327726 -1593537 -1488061 -980793 -285717 319537 885911 1506327 2200114
14768 2200114 2748132 2741684 2271717 1759710 1388275 1287097 1427883 1481952 1027142 36496
14758 36496 -1084827 -2001931 -2644391 -3011792 -3120421 -3119408 -3174284 -3160921 -2816383 -2255633
14748 -2255633 -1854586 -1635033 -1557976 -1733605 -1979151 -2129444 -2218669 -2247817 -2316544 -2365942
14738 -2365942 -2056153 -1310812 -247070 810913 1318686 1199256 864805 624962 587174
14729 587174 717856 863329 909298 901795 837268 682601 420630 114326 -176462 -231212
14719 -231212 135538 582925 711969 639173 438433 -2287 -441397 -619246 -415062 164427
14709 164427 662993 677905 468796 412554 523069 672091 842948 995963 968588 602261
14699 602261 -148221 -1009155 -1626939 -2123695 -2623500 -2804532 -2596584 -2156657 -1463079 -677949
14689 -677949 -21850 533573 1068851 1543426 1813518 1619534 998232 407684 235909 468020
14679 468020 749601 708989 411568 176219 -50480 -424161 -762093 -984686 -1145424 -1121518
14669 -1121518 -840360 -467701 -235224 -224275 -429650 -542652 -261095 223514 688652 1129711
14659 1129711 1481398 1684957 1824801 1954613 2165387 2656415 3314674 3704458 3626925 3363793
14649 3363793 3271772 3336170 3288606 2888073 2179692 1763025 2204127 3240258 4110218 4522465
14639 4522465 4559444 4323995 4000418 3659227 3293962 2996656 2954915 3034716 2927263 2727364
14629 2727364 2706412 2714674 2630911 2610474 2657959 2595470 2540770 2547125 2443157 2098117 1689693
14618 1689693 1604069 1795211 1948237 2014408 1772233 856251 -396889 -1540943 -2721801
14609 -2721801 -3825628 -4324910 -3958124 -3037185 -2148454 -1656343 -1600048 -1657369 -1362113 -773630
14599 -773630 -554069 -1212825 -2427422 -3406801 -3723653 -3453368 -2923292 -2500831 -2093942
14590 -2093942 -1377607 -565220 -239438 -683868 -1648384 -2521294 -2988099 -3286285 -3444285
14581 -3444285 -3264137 -2798881 -2334215 -1956262 -1598123 -1335059 -1269203 -1421198 -1780591 -2203451
14571 -2203451 -2288610 -1809471 -957634 115742 1171331 1647759 1442259 1146176 1221881
14562 1221881 1582212 1925884 2077361 2098253 2190171 2333941 2417337 2610483 2949747 2962715
14552 2962715 2369111 1591044 1146972 1090119 1287537 1478952 1471219 1359835 1399791 1707102
14542 1707102 2165840 2657747 3010064 2955617 2491241 1993510 1587493 1057296 486636 243444
14532 243444 334286 541131 792759 1106814 1386491 1409137 952989 149427 -394119 -205223
14522 -205223 501308 1067744 1416380 1807400 2197389 2451019 2541661 2399809 2065690 1772723
14512 1772723 1710955 1960149 2344565 2604126 2677309 2700459 2650226 2253748 1331353 67088
14502 67088 -941523 -1400714 -1476315 -1241580 -717032 -145076 157419 74547 -228924 -494407
14492 -494407 -717703 -1020678 -1430002 -1880351 -2159470 -2379011 -2813172 -3277752 -3451446 -3426468
14482 -3426468 -3381106 -3246907 -3086143 -3040411 -2952165 -2549276 -2056782 -1708515 -1371274 -935679
14472 -935679 -612412 -788642 -1539489 -2519786 -3237170 -3389624 -2932205 -2180659 -1545046 -1117574
14462 -1117574 -921414 -818299 -634867 -320589 30504 506140 1235868 1971622 2523605
14453 2523605 3035938 3495035 3598028 3465316 3463334 3335181 2690755 1631057 347495
14444 347495 -942183 -1908653 -2256887 -1912666 -1026143 148474 1283261 2018875 2070619
14435 2070619 1633213 1170972 770062 267841 -231940 -356155 -106939 160873 335656
14426 335656 508784 661755 659327 480715 445927 683183 892256 894446 831210 901896 1109149
14415 1109149 1417402 1653724 1535789 1092994 508356 -216939 -983260 -1541028 -1675738
14406 -1675738 -1312975 -569143 269505 861133 1121521 1182972 1132373 894699 517124 120246
14396 120246 -74511 -42420 175728 417499 503821 567013 906822 1560949 2255501 2810486
14386 2810486 3139368 3032175 2332305 1246747 224580 -381684 -699503 -917809 -973905
14377 -973905 -1021169 -1254631 -1586327 -1842375 -1831189 -1530260 -1067419 -722051 -848198 -1203108
14367 -1203108 -1135626 -434657 434834 1052882 1374023 1500252 1488995 1454014 1630703 1907161
14357 1907161 2022830 1967535 1930921 1926502 1741857 1252204 764214 640203 860802 1215068
14347 1215068 1515062 1755526 1956837 1988242 1900429 2087669 2639858 3047355 2775112 1925336
14337 1925336 1176944 1142707 1679777 2184306 2375071 2281889 2140447 2049752 1831770 1562949
14327 1562949 1455340 1493433 1622464 1822117 2093465 2402275 2571155 2493194 2227988 2058332
14317 2058332 2159058 2215171 2034774 1784011 1548056 1341978 1216245 1131881 863065 405271
14307 405271 -123223 -598297 -722612 -306278 521173 1473422 2367498 3066831 3323743 2956428
14297 2956428 2156423 1093109 -81076 -1126455 -2031814 -2659586 -2976319 -3203310 -3270908
14288 -3270908 -2860645 -1991553 -953197 46795 676061 708552 324739 -108284 -401769
14279 -401769 -577950 -707778 -937604 -1393573 -1863227 -1966410 -1601642 -1003442 -444412 -120179
14269 -120179 -16927 -48201 -265354 -712066 -1209706 -1405132 -958633 118868 1363619
14260 1363619 2458933 3231578 3458940 3181387 2655479 2004492 1420023 1097851 762286
14251 762286 -3336 -1047826 -1807004 -1803400 -1178160 -590400 -311372 -63302 314088 731181
14241 731181 1091634 1261400 1012412 417136 -45865 -31586 461364 1060118 1461436 1791865
14231 1791865 2338602 3015332 3411680 3449209 3526595 3848045 4196300 4414152 4484169 4328252
14221 4328252 3907710 3203497 2352527 1745132 1757660 2077501 1971440 1366029 874064 728664
14211 728664 558805 289211 277184 678423 1237133 1670252 1862949 1752268 1351094 834494
14201 834494 309432 -151670 -252778 151559 693793 926986 812398 500402 5048 -496633
14191 -496633 -573797 -112567 410851 645261 810515 1079227 1262525 1131538 827225 651911
14181 651911 587178 284447 -370861 -948001 -1117351 -979235 -771381 -614518 -499135 -434334
14171 -434334 -295020 9460 179126 -9550 -349719 -528576 -392870 -105826 -98807 -503640
14161 -503640 -864522 -1148842 -1642193 -2183821 -2540275 -2657571 -2742135 -2876640 -2715685 -1964071
14151 -1964071 -819963 484726 1686280 2528378 2992643 3215755 3379702 3523478 3428445
14142 3428445 2930457 2048960 1121492 614298 403478 97261 -309167 -757104 -1182905
14133 -1182905 -1438793 -1369797 -949376 -453223 -2057 397498 846681 1314447 1677136 1933466
14123 1933466 1908569 1441142 692462 3161 -542828 -941682 -1109966 -976136 -651652 -285253
14113 -285253 157106 614156 981903 1082636 700612 -117542 -1002220 -1673117 -2077288 -2177020
14103 -2177020 -2016736 -1686864 -1161411 -608994 -223655 -39215 54661 71725 -69803 -258859
14093 -258859 -351814 -479397 -926776 -1546496 -1805624 -1373092 -425817 615300 1221918 1053569
14083 1053569 432822 -157841 -561906 -702364 -403250 330199 1109980 1466556 1293928
14074 1293928 994709 948388 989604 852159 709968 840845 1157614 1350197 1201455 964511
14064 964511 914448 914762 871494 916415 1083985 1208819 1137268 1103371 1350947 1927213 2716764
14053 2716764 3326689 3375747 2974547 2373425 1675769 1239863 1356994 1850302 2062023 1669845
14043 1669845 1109159 676389 251737 -227329 -621141 -858591 -912263 -771810 -619986 -637438
14033 -637438 -830305 -1167198 -1492006 -1314511 -721949 -251899 5641 184640 270165 242662
14023 242662 206151 282629 503592 805555 1319164 1982654 2257926 1795831 939959 131143
14013 131143 -367322 -436500 -475449 -969698 -1598081 -1673412 -1101432 -254006 438733 871837
14003 871837 1097631 1020837 582973 169888 102335 230332 357402 501374 859196 1650750
13993 1650750 2680424 3363627 3405592 2864215 2003033 1163715 549967 347883 435020 623683
13983 623683 940834 1208953 1233301 1195404 1116321 937532 873405 934316 982101 951673 841280
13972 841280 788036 992599 1405838 1704510 1780033 1758446 1629048 1419872 1321337 1420043
13962 1420043 1622384 1753813 1829327 2020886 2211019 2094904 1630432 1009068 440132 1953
13952 1953 -309020 -451870 -525843 -697474 -910154 -1052309 -1249549 -1524875 -1780427 -1896246
13942 -1896246 -1908540 -1845983 -1660553 -1401924 -1041358 -617989 -234199 211315 775288 1437047
13932 1437047 2144741 2738286 3097553 3129576 2853489 2329688 1673172 1086111 632893 184069
13922 184069 -403291 -733912 -428362 153245 440359 407850 370110 248226 -73616 -403429
13912 -403429 -543235 -498139 -376570 -205406 -91128 -363883 -1072786 -1786320 -2351573 -2794893
13902 -2794893 -2795636 -2271139 -1684240 -1552858 -1762855 -1921396 -1957584 -1771667 -1182175 -297077
13892 -297077 580366 1302889 1988570 2560001 2742432 2544448 2306763 2169030 1935224 1669811
13882 1669811 1485080 1187763 763175 415351 205807 236287 579496 1067951 1324796 1154135
13872 1154135 677638 -43834 -832490 -1447484 -1730439 -1669190 -1372161 -926499 -326960 423635
13862 423635 1198254 1795420 2005502 1615816 771386 8342 -351354 -464789 -639892 -1098440
13852 -1098440 -1665403 -2132101 -2561524 -2896557 -2948322 -2593464 -1893760 -1193029 -884010 -1052188
13842 -1052188 -1227245 -971246 -332843 473167 1153136 1614694 1975108 2355186 2791791
13833 2791791 3175634 3446157 3361635 2555895 1198067 -11693 -569962 -458151 78424
13824 78424 702724 1150116 1090104 491603 -17117 -139773 -187140 -355317 -610682 -688579
13814 -688579 -365003 182955 680538 988054 1137103 983467 379218 -297876 -686635 -819058
13804 -819058 -806500 -672757 -461452 -158567 197177 588751 1193136 2055286 2629910 2392477
13794 2392477 1588199 724969 -18468 -616210 -934321 -909648 -706386 -488325 -120622 382400
13784 382400 730949 927308 1255599 1632598 1730117 1664794 1811425 2234570 2981990 4044894
13774 4044894 4824578 4934600 4597290 4060361 3357103 2560686 1900349 1307780 871160
13765 871160 837121 1154510 1633231 2209437 2888537 3458752 3613842 3377707 3002884 2636021
13755 2636021 2353766 2140678 1944440 1685493 1326299 938330 755543 792366 878250 997749
13745 997749 1216907 1576003 1941940 2059198 1913019 1584870 1107203 683888 406523 21652
13735 21652 -507967 -832171 -618731 119181 926754 1378705 1547670 1486671 1311451 1365115
13725 1365115 1606178 1737704 1548762 1061696 679329 454197 50979 -514723 -945341
13716 -945341 -982509 -561085 29381 421291 680416 1041280 1407714 1724516 1977484 1903615
13706 1903615 1615987 1223632 748897 465391 413222 503069 824340 1239325 1478125 1522266
13696 1522266 1448627 1335805 1052767 761155 796173 1037158 1407333 1860449 2281204 2712065
13686 2712065 2866008 2539383 2056922 1650703 1257060 940386 830811 805704 591885 164864
13676 164864 -212363 -406694 -545202 -570958 -424296 -219949 -6468 240688 655315 1132142
13666 1132142 1342659 1236081 1059977 864117 629650 501684 470208 271600 -162558 -559411
13656 -559411 -626321 -570297 -923440 -1600956 -2093748 -2138589 -1864685 -1335013 -640237 79444
13646 79444 944627 1837733 2468725 2812627 2954957 3006710 2899159 2637532 2399619 2348674
13636 2348674 2464544 2505653 2241176 1769110 1402788 1308347 1501319 1950566 2527273 2894412
13626 2894412 2877415 2663247 2269113 1724862 1331723 1251994 1501035 2106988 2848569 3381664
13616 3381664 3575022 3565007 3638304 3772189 3724259 3649248 3768130 3864799 3961922 4337634
13606 4337634 5135436 6077793 6784929 7239219 7637114 7990885 7983652 7647842 7346709 7125163
13596 7125163 6974537 6971834 7042268 7201057 7442335 7454659 7121591 6981571 7289613 7609696
13586 7609696 7679329 7749838 8117681 8654716 9026158 9271966 9446187 9357156 9083930 8959948
13576 8959948 9110518 9114807 8503293 7341576 6171278 5466889 5082811 4597029 4065523
13567 4065523 3776776 3747809 3919585 4322488 4612057 4623070 4492300 4450293 4707608 5059882
13557 5059882 5320656 5562629 5821210 6106800 6257393 6158638 5907705 5517637 4828926 3924923
13547 3924923 3422206 3641726 4259811 4893161 5339654 5398971 5132614 4843862 4632598 4444005
13537 4444005 4282575 3962731 3464726 2954675 2605442 2621262 2914211 3213581 3251934 3094391
13527 3094391 3023308 3202113 3542065 3751706 3783846 3713264 3521651 3390013 3576649 4208134
13517 4208134 5000187 5611584 6156300 6666534 7111063 7666970 8348282 8965489 9330245
13508 9330245 9442476 9556351 9827411 10189084 10640582 11111514 11385963 11332627 11134392 10932757
13498 10932757 10688386 10467266 10180580 9522312 8613508 8023484 7998276 8288642 8480514
13489 8480514 8382466 8146067 7846808 7450727 6852713 6045913 5305850 4876845 4594941 4165686
13479 4165686 3566144 3005814 2730977 2887397 3249443 3343149 3021773 2366433 1822006 1783097
13469 1783097 2102228 2594144 3120087 3396129 3465876 3495081 3348964 3124122 3070984 3085997
13459 3085997 3001236 2703951 2197948 1736991 1669175 1800721 1685219 1381554 1159783 1178542
13449 1178542 1469817 1816282 2098103 2595052 3467646 4503808 5378942 5982924 6244881
13440 6244881 6182717 6006708 5760426 5577845 5813441 6650370 7830162 8658482 8734251 8215036
13430 8215036 7488269 6893565 6590153 6688969 7001693 7233488 7458109 7842905 8184422 8294640
13420 8294640 8336263 8502410 8868338 9297697 9714468 10299777 10907285 11143310 10764210 9939119
13410 9939119 9156824 8673993 8327909 8080441 7988126 7848451 7593132 7233952 6707715 6040877
13400 6040877 5240290 4389903 3709907 3361001 3349995 3530948 3976882 4882745 6022316
13391 6022316 6917658 7401724 7720459 8027684 8324295 8754157 9311549 9919116 10613423
13382 10613423 11181644 11260844 10821947 10045687 9270210 8741165 8568888 8668078 8652878 8371633
13372 8371633 8093114 7922804 7677809 7289598 6815946 6382227 6207727 6246670 6226533 5896804
13362 5896804 5279240 4661878 4204142 3885674 3803147 3972743 4257770 4578182 4876382 4994519
13352 4994519 4756939 4447978 4416310 4612165 4831121 4956128 5143448 5506737 5846027 5990985
13342 5990985 5945846 5662084 5118695 4428212 3870726 3661996 3712492 3694796 3534115 3418277
13332 3418277 3485069 3746874 4003565 4200861 4561973 4994484 5151122 5279903 5716093 6161990
13322 6161990 6563680 7171629 7730611 7722396 6979959 5948203 5112268 4448355 3671941 2969373
13312 2969373 2756797 2960436 3166735 3116221 3056725 3321372 3781981 4088143 4162729 4269044
13302 4269044 4565293 4952129 5197789 5260820 5230364 5093646 4875617 4716234 4704285 4749611
13292 4749611 4629058 4177699 3508802 2921207 2367987 1761324 1379955 1539935 2196179
13283 2196179 2948307 3517081 3932986 4387334 4857194 5150183 5312049 5626549 6231616
13274 6231616 6959426 7584849 8037142 8243135 8246591 8203617 8295812 8693538 9269842 9704291
13264 9704291 9717465 9282429 8498475 7731624 7447673 7592960 7851398 8236261 8811587 9280976
13254 9280976 9485650 9618722 9835222 9839175 9429264 8873703 8540011 8692113 9261336 9763066
13244 9763066 9890991 9979953 10167822 9981274 9254285 8389291 7841837 7836299 8453027 9538532
13234 9538532 10565734 11246609 11609157 11713052 11689637 11632850 11590899 11547091 11422289 11127626
13224 11127626 10845287 10854530 10995127 10863884 10374229 9897850 9583800 9398861 9320991 9319909
13214 9319909 9356761 9384396 9364999 9311291 9298767 9465716 9856237 10265116 10554743 10622831
13204 10622831 10461093 10419220 10776764 11319203 11916205 12545695 13177390 13821562 14518681
13195 14518681 15138608 15375899 15261278 15025174 14824628 14828544 15060990 15393522 15736225 15829940
13185 15829940 15412008 14702857 14081155 13582992 13151407 12857648 12785859 12756668 12523117 12164172
13175 12164172 12097407 12459922 12906008 13104686 13059645 12957466 12859711 12869966 13032714 13182336
13165 13182336 13224492 13196988 13149619 13047785 13007073 13224989 13642666 14177366 14876125 15673020
13155 15673020 16386457 16800380 16898809 16900599 16933131 17039098 17124172 17104100 16834171 16407726
13145 16407726 16227867 16362355 16653586 17121621 17808682 18514802 19055663 19386771 19543831
13136 19543831 19639928 19808344 20030731 20122093 19934755 19454749 18755048 18067077 17632357 17421760
13126 17421760 17150990 16753296 16392121 16097152 15912134 16072237 16685316 17522080 18316520
13117 18316520 18981435 19553421 20141960 20775585 21362703 22077715 22962392 23710660 24229716
13108 24229716 24449338 24453733 24598382 24943959 25221758 25299197 25268275 25309926 25847245 26834328
13098 26834328 27743490 28144074 27962504 27596873 27412374 27348340 27204292 26799018 26121171
13089 26121171 25368679 24763698 24548923 24706572 24949562 25107320 25302108 25732601 26480339
13080 26480339 27370972 28036325 28404372 28717597 29054885 29224637 29151436 29017202 28890606
13071 28890606 28882401 29117871 29576724 30123879 30594235 30794207 30756546 30867684 31355813 32173428
13061 32173428 33219002 34205507 34943444 35585240 36333064 37127903 38069205 39254785 40358788
13052 40358788 41106120 41563241 41860794 42099063 42437483 42812937 43059970 43234196 43626250
13043 43626250 44495253 45709848 46734566 47283722 47532674 47698109 47747715 47666423 47700796
13034 47700796 47915695 48350001 49112222 50216912 51654983 53114566 54335564 55235898 55589423
13025 55589423 55458721 55045889 54416620 53913952 53876673 54313888 55236154 56672665 58353417
13016 58353417 59985199 61368427 62586314 63797552 64799827 65509090 66251647 67308199
13008 67308199 68667894 70423268 72655818 75294006 78053834 80576174 82906337 85376265
13000 85376265 88281796 91614791 95051967 98297978 101457353 104777112 108278484 111992287
12992 111992287 116370617 121594459 127426714 133865011 141017733 148920236 157713422 167643680
12984 167643680 178934110 191722628 206603551 224244120 244995535 269105038 296514527
12977 296514527 326623750 358448395 390369312 419193620 439937681 446980396 437339682
12970 437339682 412973525 379528406 343176092 308404161 277560730 251295577 229290011
12963 229290011 211101032 196118130 183426849 172156757 161755182 152083296 143397953
12956 143397953 136034283 129826721 124533059 120167505 116335719 112607522 108917134 105201180
12948 105201180 101569796 98251891 95508967 93447336 91802788 90188227 88511305 86821023
12940 86821023 85124162 83628713 82483091 81567106 80620909 79689257 78976218 78520876 78150076
12931 78150076 77728833 77512060 77946041 78956878 79944241 80626068 81062948 81461537 82098207
12922 82098207 83136675 84624838 86604728 88996806 91635914 94330518 97002491 99730985
12914 99730985 102353915 104633862 106465531 108090096 109848497 111813657 113913645 116310940
12906 116310940 119485280 123473837 127956409 132941715 138727585 145403311 152843929 161127136
12898 161127136 170930881 182858797 196878220 212973652 231430686 252599461 276889399
12891 276889399 304416074 334806993 367180378 399263711 426659398 443397170 444324872
12884 444324872 428222996 398796529 362423149 325180663 291155083 261852696 237139033
12877 237139033 216493723 199264276 184394718 170901438 158604073 147794541 138573754
12870 138573754 130641945 123510375 117034175 111408188 106523545 102231177 98584255 95434397
12862 95434397 92329110 89136847 86157543 83521977 81007272 78256390 75337964 72756450
12854 72756450 70783104 69323705 68414860 67967838 67491247 66837261 66236855 65755564 65414555
12845 65414555 65311519 65263555 65103341 64957041 64656404 64025945 63321765 62906762 62939073 63392748
12835 63392748 64288445 65545781 66663975 67460579 68327550 69512318 71025346 72906621
12827 72906621 75022335 77258264 79686381 82354893 85271050 88301999 91407176 94732008
12819 94732008 98608686 103202287 108347315 114218924 121080383 128818474 137432197 147094232
12811 147094232 157908137 170019791 183902486 200105390 219071423 241244476 266691146
12804 266691146 295039927 325459930 356332448 385026863 407510043 418639161 414379284
12797 414379284 394566508 363500995 327347803 291366838 258935901 231216240 207678698
12790 207678698 187500798 170278010 155706854 142983739 131345427 120714127 111353630
12783 111353630 103421208 96843756 91272444 86089642 80967080 75811041 70816526 66390047
12775 66390047 62526886 59054355 55954418 53061190 50160642 47161630 44278173 41735260
12767 41735260 39245511 36734126 34427934 32230417 30038993 28011209 26281000 24901272
12759 24901272 23883990 23157716 22701470 22237073 21490563 20348405 18808517 17179535 15815599
12750 15815599 14802754 14070145 13528312 13195471 13072374 13024178 12910229 12753325 12593837
12741 12593837 12307637 11661966 10565627 9332721 8442519 8065469 7940637 7833825 7766812
12732 7766812 7689396 7576732 7469176 7334277 7142857 7050915 7207797 7501859 7704549 7658296
12722 7658296 7373753 6926231 6331906 5657774 5033752 4581415 4379648 4229985 4043946
12713 4043946 3768029 3692265 4181818 4925143 5519118 5824858 5757268 5503370 5335869 5210991
12703 5210991 4943330 4426162 3804413 3409436 3391888 3633237 3964975 4165722 4190166 4116445
12693 4116445 4016936 4023772 4149536 4436369 4840158 4941847 4676345 4547448 4833606 5292106
12683 5292106 5482558 5294594 4999137 4769743 4713573 5016847 5464144 5561058 5050495 4166884
12673 4166884 3389518 2942100 2723618 2506518 2094093 1366276 575316 -75432 -531790
12664 -531790 -629350 -466479 -237424 125300 835319 1720331 2439064 2873930 3129863 3306761
12654 3306761 3483855 3676944 3804020 3835209 3835148 3714416 3323799 2762199 2229842 1825704
12644 1825704 1759307 2175944 2798633 3381065 3905994 4274961 4467394 4508844 4332011 3965653
12634 3965653 3488228 2908168 2180960 1543895 1308284 1425113 1661246 1981303 2375311
12625 2375311 2831457 3253232 3423955 3418911 3516664 3804700 4029354 4003052 3779889 3407835
12615 3407835 3254410 3697455 4391540 4773704 4721602 4434122 4172745 4226491 4584662 4814190
12605 4814190 4630635 4034272 3189300 2544437 2320713 2227526 2066114 2015070 2371675 3141156
12595 3141156 3972148 4466418 4340172 3726026 3084656 2642316 2507403 2633418 2748792
12586 2748792 2836195 2870549 2676644 2468520 2447373 2402128 2007897 1432690 1077398 1073703
12576 1073703 1105502 821776 399084 147306 15575 -224527 -663024 -1251298 -1851207 -2288542
12566 -2288542 -2401856 -2201172 -1838496 -1291425 -513450 360720 1171188 1794159 2158011
12557 2158011 2195211 1988436 1838261 1855796 1942173 2098310 2232677 2170432 1821130 1344942
12547 1344942 931552 546593 250083 110491 108123 333658 862680 1389634 1558577 1462262
12537 1462262 1225747 867349 380382 -242911 -704800 -649203 -114946 463904 687086 524534
12527 524534 303731 234351 192982 136726 274364 778496 1632304 2498280 3044914 3383676
12517 3383676 3697046 3947708 4012491 3832254 3330868 2764100 2543312 2494636 2072062 1248840
12507 1248840 483156 18099 -211699 -504008 -982407 -1468276 -1757337 -1597161 -870858
12498 -870858 172024 1334412 2590350 3711472 4340987 4358841 3803284 2866597 1915146
12489 1915146 1151131 619461 283080 -113506 -746606 -1475046 -2044770 -2311160 -2184985
12480 -2184985 -1700334 -847915 519249 1973093 2717661 2712076 2501899 2364901 2370311 2430175
12470 2430175 2235165 1654993 884393 185833 -263089 -402360 -331783 -261502 -123285 398753
12460 398753 1113685 1712319 2107484 2264783 2465456 2858002 3328007 3830094 4296806 4650521
12450 4650521 4793028 4689996 4429133 4081006 3614841 3186843 3176902 3588965 4136636 4760490
12440 4760490 5341754 5557448 5186097 4379527 3539783 2807193 1956274 1060410 492396
12431 492396 195289 -9896 131289 879694 1912146 2708312 3197648 3552638 3767530
12422 3767530 3696712 3459899 3515865 4144907 5018633 5444496 5388952 5191420 4992531 4840634
12412 4840634 4648760 4205985 3609249 3167429 3093393 3208878 3169093 3003498 2849580 2676966
12402 2676966 2534670 2573488 2728912 2743735 2383881 1524794 543050 93163 232258 404340
12392 404340 500308 773223 1183996 1697087 2251022 2551975 2484343 2214366 1932278 1714618
12382 1714618 1525733 1428594 1622911 2055457 2401502 2407468 2116648 1835580 1835668 2079811 2437632
12371 2437632 2863534 3313058 3561554 3478777 3237582 2977656 2746422 2703092 2873682 3069897
12361 3069897 3160643 3279009 3636222 4213240 4640215 4636722 4383129 4091549 3523907 2303897
12351 2303897 812766 -154656 -378899 -167144 235169 759610 1152250 1124558 981557
12342 981557 1153184 1545204 1752807 1561253 1218239 1033555 980818 744144 160989 -438751
12332 -438751 -905444 -1339081 -1504962 -1285398 -935572 -662622 -471607 -113279 658862 1633716
12322 1633716 2429084 2805403 2655848 2014180 1143870 571792 706086 1246131 1701496
12313 1701496 1951072 1912484 1777013 1885895 2179563 2385157 2491991 2791746 3409349 3801370
12303 3801370 3497255 2697414 1901570 1560724 1737785 2098340 2372661 2570708 2938034
12294 2938034 3676268 4436678 4846671 5051734 5213352 5120060 4581152 3862850 3356926 3120605
12284 3120605 3105855 3223004 3270295 3323187 3608610 4113319 4784839 5621947 6538622 7340411
12274 7340411 7975514 8597670 9176656 9667570 10333514 11169108 11896031 12196574 11872958
12265 11872958 11235130 10480800 9755852 9127154 8451020 7646991 6753927 5841994 4921677
12256 4921677 4027088 3328541 3013925 3138597 3570610 4156169 4604909 4568082 4051045 3496498
12246 3496498 3229480 3233908 3351971 3402540 3284635 3084081 2996426 3303056 3847847 4199267
12236 4199267 4213384 3939854 3513317 2983040 2364850 1878900 1854977 2197610 2495840 2548363
12226 2548363 2260032 1653257 1022965 461461 -101753 -416248 -263167 137701 367422
12217 367422 320324 202589 -47167 -413651 -524184 -344669 -85780 220649 441436 383609
12207 383609 215788 62300 -312356 -898053 -1231058 -933425 -46754 956477 1582164
12198 1582164 1758170 1691847 1437971 1023686 740662 1069555 2101694 3395996 4230500
12189 4230500 4025121 3108224 2225281 1803533 1824900 1996485 2089894 1991437 1595144 798038
12179 798038 -213439 -1013943 -1421416 -1452233 -1128388 -600236 80651 877028 1668494 2284888
12169 2284888 2674050 2866564 2757548 2263763 1446486 547671 -269335 -867681 -1040270
12160 -1040270 -727101 -99299 473472 807927 958158 882566 680224 512737 519101 849511
12150 849511 1351051 1689741 1949017 2372261 2990360 3509651 3664842 3589294 3326508 2704304
12140 2704304 1653353 541977 69565 547854 1467439 2142782 2472347 2670404 2861131
12131 2861131 3029575 3162153 3358696 3662886 3907152 3881928 3676198 3457351 3250020 3099326
12121 3099326 3134057 3269881 3286004 3066202 2459781 1661717 1146206 1283390 1912946 2263845
12111 2263845 2020092 1599102 1290194 821761 211998 121542 711039 1481041 1919381 1985718
12101 1985718 2056082 2389113 2876525 3211551 3106990 2433334 1298976 35636 -1108750
12092 -1108750 -2023012 -2587386 -2794907 -2750554 -2560127 -2284661 -2159851 -2336789 -2650277 -2918737
12082 -2918737 -3111122 -3257311 -3398783 -3395461 -3094413 -2515178 -1715983 -712294 257173 775044
12072 775044 761717 360382 -72271 -104115 88574 149836 263127 584821 871418 1112281
12062 1112281 1425237 1747885 1856752 1828462 1805026 1508970 861187 88389 -574633 -1007353
12052 -1007353 -1075870 -726087 -192082 64305 -239960 -898832 -1473818 -1683576 -1480065 -1020176
12042 -1020176 -501797 -106635 22156 -17549 -35556 -79407 -211447 -494386 -785658 -748218
12032 -748218 -539116 -422508 -462389 -555012 -399836 268876 1164524 1731596 1821270 1660535
12022 1660535 1554530 1458043 1306821 1144015 1020637 1001054 961489 895337 873592 685011
12012 685011 411386 289724 207639 134345 133513 377288 997871 1768296 2607324 3448898
12002 3448898 4043257 4308952 4352308 4266022 4094446 3869876 3548112 2983556 2180254 1370743
11992 1370743 735126 141810 -425680 -990287 -1601046 -1994069 -1989647 -1771109 -1479577 -1280483
11982 -1280483 -1436167 -1845742 -2016901 -1545890 -667601 95914 563226 736852 796517 928474
11972 928474 1418334 2463225 3713134 4712219 5250391 5315124 5001956 4369961 3452607
11963 3452607 2624020 2187399 1935995 1475328 743012 243502 337638 751341 1130806 1283506
11953 1283506 1236727 1303691 1565772 1969806 2492602 3040247 3495075 3964137 4572064 5215575
11943 5215575 5780683 6009101 5560394 4497278 3410186 2780131 2654334 2763076 2764652
11934 2764652 2604337 2417986 2331527 2386990 2429505 2296398 2116368 2054802 2257553 2930451
11924 2930451 3709869 3970533 3606110 3018320 2653343 2509128 2219323 1479780 519460
11915 519460 -88570 -54481 357768 796148 1156424 1264608 1051027 580933 84662 119603
11905 119603 984762 2283621 3349065 3876669 3951489 3609328 3083433 2689010 2478908
11896 2478908 2348980 2146484 1813164 1299591 683235 190533 -203504 -524519 -596857 -293954
11886 -293954 266005 833091 1307772 1703011 2032068 2176569 2095108 1827168 1302561 605601
11876 605601 162250 250511 744327 1368410 1808235 1949643 1997410 2119315 2195850 2044661
11866 2044661 1700873 1446905 1219419 866162 700384 1001275 1638311 2292154 2756553
11857 2756553 2921625 2942408 3089091 3286791 3405428 3583412 3779573 3794863 3565848 3072405
11847 3072405 2425340 1833450 1315465 762168 86613 -569584 -900835 -868411 -730138 -515660
11837 -515660 -147520 445465 1247536 2093088 2724541 3009296 3052514 2879799 2610305 2288884
11827 2288884 1911390 1578905 1197891 879178 1037357 1609170 2351666 2924603 2778039
11818 2778039 1898618 825897 -177754 -1169399 -2124440 -2946283 -3534837 -3722035 -3413809
11809 -3413809 -2651913 -1684431 -755734 -5238 321372 125709 -203264 -467723 -915659
11800 -915659 -1566587 -2207851 -2761198 -3160308 -3286958 -3267056 -3138638 -2763465 -2276065 -1868864
11790 -1868864 -1614548 -1640357 -2059569 -2606594 -2790748 -2444536 -1771837 -1231211 -1146020 -1407784
11780 -1407784 -1883679 -2436953 -2770714 -2866037 -2855437 -2459485 -1312248 449717 2183446
11771 2183446 3196929 3638102 4073733 4392706 4196189 3574807 2875861 2379966 2238988
11762 2238988 2288790 2321567 2380297 2571151 2598162 2205363 1591161 1041634 764398 897100
11752 897100 1145990 1193056 1008971 643584 315490 236243 187476 -201869 -979204 -1632213
11742 -1632213 -1878734 -1899752 -1759397 -1607151 -1681512 -2153131 -2947394 -3684662 -4070532 -4076574
11732 -4076574 -3663438 -3054519 -2556884 -1981888 -1069128 -215683 169642 351216 587587
11723 587587 762318 843905 867422 830265 882371 1073561 1223905 1125494 768589 378316
11713 378316 45040 -181350 -137466 240041 830545 1237630 1051006 454883 -39251 -221968
11703 -221968 -194019 -16710 265456 492017 503050 295305 121442 262939 808003 1571553
11693 1571553 2312889 2757449 2770941 2617925 2594097 2828299 3181424 3348846 3113704 2367110
11683 2367110 1380445 741929 582361 653864 868607 1302468 1932839 2531520 2874318 2988268
11673 2988268 3042432 2961734 2766530 2459858 1818972 1033398 414905 -78533 -593471 -1025459
11663 -1025459 -1338546 -1666081 -1814846 -1516040 -1000668 -495834 -92047 120227 267039
11654 267039 503944 697259 753960 823719 878133 907071 1025189 1163727 1166204 1255260 1556643
11643 1556643 1918221 2381688 2728616 2637345 2201649 1577330 906817 245015 -363298 -619586
11633 -619586 -380649 -11615 277317 696642 1215274 1577588 1917718 2212913 2024773 1410539
11623 1410539 871277 511606 63840 -720940 -1640109 -2187827 -2257732 -2062594 -1676683 -1082833
11613 -1082833 -401134 271499 884669 1488230 2025976 2406658 2680288 2850314 2804147 2646064
11603 2646064 2360807 1770521 1032135 645900 1043271 2015054 2843018 3177015 3063134
11594 3063134 2517588 1696396 1022734 807513 990909 1291856 1608564 1887574 2092621
11585 2092621 2245077 2130470 1805727 1542267 1319442 919370 376224 21785 52206 81374
11575 81374 -129340 -382554 -462675 -308148 -94873 -17097 -91337 -229561 -229288 -163620 -294035
11564 -294035 -652528 -1177565 -1822990 -2510991 -2869963 -2437273 -1448811 -611352 -277770 -317650
11554 -317650 -446293 -385955 -11412 378230 512304 449968 255405 -34916 -279285 -315319
11544 -315319 -125816 47434 -150817 -815203 -1466784 -1650327 -1593896 -1619598 -1730036 -1608549
11534 -1608549 -1004349 -403976 -335718 -724920 -1265653 -1854241 -2604098 -3248597 -3341198 -3119018
11524 -3119018 -3052151 -3261794 -3610486 -3759419 -3343822 -2410596 -1303437 -125449 1016262
11515 1016262 1861466 2388509 2693169 2877738 3072524 3289085 3337758 3069218 2622877 2414614
11505 2414614 2757852 3391991 3689834 3512473 3123555 2753831 2385651 1779361 956939
11496 956939 322788 -21519 -383731 -840970 -1053468 -818883 -469547 -567995 -1314583 -2120656
11486 -2120656 -1729381 -36823 1564667 2256667 2184274 1675610 803826 -315045 -1353430
11477 -1353430 -1981467 -1940163 -1316073 -503540 133847 576907 1098998 1686081 2107757 2127047
11467 2127047 1704039 1215456 1112615 1236393 1237789 1024692 650305 298486 81898 15589
11457 15589 31926 149672 398838 511758 241061 -108852 97217 874652 1400438 1395468
11447 1395468 1406304 1763772 2205322 2356348 2170760 1869533 1671842 1567750 1516221 1406657
11437 1406657 1161809 786506 475183 508517 945417 1629776 2355336 2735798 2463037 1790972
11427 1790972 1190007 779519 518368 397549 553825 1082766 1740582 2422975 3160002
11418 3160002 3950214 4810025 5619910 6219648 6481973 6310860 5951386 5819584 6158104
11409 6158104 6998057 8142139 9265171 10229039 11067398 11460311 11191930 10444881 9371879
11400 9371879 8193327 7049542 5938509 4953039 4239665 3752485 3408770 3109588 2678477
11391 2678477 2167966 1854167 1855863 2102069 2467962 2752374 2952374 3189733 3336280 3361556
11381 3361556 3462090 3585710 3511424 3099201 2185975 1008454 -27004 -939152 -1572074
11372 -1572074 -1644944 -1396436 -1053700 -658149 -240589 172726 436414 361814 -25584 -410426
11362 -410426 -390217 -41440 246075 288983 126466 42204 145376 310755 538373 865923
11352 865923 1452193 2328708 3069027 3268618 3029219 2630345 2361870 2382043 2448669 2269541
11342 2269541 1699657 805799 -65689 -596604 -745296 -554166 -211165 19421 258656
11333 258656 674669 1005416 1085423 1110430 1279266 1660745 2086687 2234968 1934147 1415229
11323 1415229 938011 650596 707794 843293 612343 -156505 -1294313 -2365647 -3056076
11314 -3056076 -3199937 -2846741 -2309538 -1908627 -1711702 -1508202 -1200081 -940286 -749141
11305 -749141 -536044 -408287 -356254 -158334 26527 -75963 -422385 -854196 -1120653 -1020998
11295 -1020998 -604746 47954 769624 1319350 1615972 1772519 1870903 1938388 2024480 1975494
11285 1975494 1693662 1226916 671076 37063 -600768 -1128225 -1424144 -1401829 -1195540 -1076963
11275 -1076963 -1037192 -1112699 -1504157 -2018164 -2143110 -1473429 -176947 971225 1446232
11266 1446232 1514305 1657801 1892069 1947930 1700835 1237044 868974 801987 795287 648528
11256 648528 422367 302897 459740 822036 1175734 1467024 1788187 2136458 2303397 2284908
11246 2284908 2229455 2291791 2633814 3179631 3515269 3377695 2978952 2668378 2572634 2702229
11236 2702229 3023751 3290000 3357461 3260785 3013610 2640318 2318221 2145628 2064154 1954539
11226 1954539 1747693 1452769 1121583 729176 276519 -139970 -529853 -970085 -1249444
11217 -1249444 -1199352 -1155369 -1350678 -1564389 -1578937 -1398650 -1092949 -743203 -298883 436715
11207 436715 1387119 2128671 2451985 2314193 1938720 1696794 1625579 1550320 1295034 764059
11197 764059 70939 -510895 -945612 -1269050 -1340548 -1172726 -857524 -512388 -177738 126904
11187 126904 417723 887866 1481161 1747929 1222076 166295 -623253 -704487 -317282 -56007
11177 -56007 -204278 -676262 -1214312 -1528767 -1518622 -1386972 -1316842 -1288067 -1342881 -1520397
11167 -1520397 -1569862 -1325715 -989192 -680821 -223662 365354 916768 1316164 1649355 2066111
11157 2066111 2362127 2129777 1444111 587426 -304394 -911323 -909855 -368942 301369 689626
11147 689626 613978 128688 -312515 -374415 -209228 136052 628592 1000676 1093340 894432
11137 894432 435859 -70821 -360245 -278658 135424 519437 591654 345855 -79680 -342185
11127 -342185 -101883 606450 1272578 1509659 1377539 1241640 1176288 1022504 784118 615167
11117 615167 548460 341401 -249934 -963650 -1343417 -1293272 -934279 -537836 -245036 235561
11107 235561 953955 1741493 2581639 3374545 3871861 3939730 3534715 2818017 2090243 1454159
11097 1454159 1067466 1059104 1195381 1248718 1120690 750514 404954 396567 825517 1401937
11087 1401937 1583094 1126960 451786 147642 391481 872964 1320671 1692833 1988657
11078 1988657 2324594 2665093 2859311 2860352 2854746 2910182 2748797 2261439 1761576 1406389
11068 1406389 993397 526400 234520 49749 -199644 -342848 -129502 333712 708400
11059 708400 787830 801959 1083831 1572027 1995284 2125250 2086254 2032310 1894912 1558173
11049 1558173 1175870 781325 196443 -353256 -477340 -293300 -344539 -743270 -1179540 -1455941
11039 -1455941 -1464146 -1181557 -831925 -596478 -382179 -99013 212169 604049 1060023 1306716
11029 1306716 1068096 487083 -80124 -345022 -260647 15116 130993 -282031 -1204861 -2146301
11019 -2146301 -2744770 -3001109 -3188300 -3465211 -3653424 -3427013 -2672505 -1811121 -1219122
11010 -1219122 -703213 1108 725588 1266334 1576772 1785209 2014755 2320283 2658116
11001 2658116 2781054 2563639 2182637 1924119 1730188 1599358 1683417 1747230 1586723 1411558
10991 1411558 1379963 1339215 905332 -5583 -1041447 -1868153 -2290090 -2155256 -1596772 -1130360
10981 -1130360 -1044685 -1157292 -1186186 -1088535 -1068150 -1204208 -1476649 -1768603 -1956821 -2103879
10971 -2103879 -2152422 -1970456 -1563032 -1059107 -365875 529265 1122475 1110628 896976 946771
10961 946771 1229596 1546781 1893540 2229602 2530796 2856766 3163419 3407830 3419509 2955025
10951 2955025 2117477 1246140 539115 256377 574573 1249777 1840066 2026895 1920743
10942 1920743 1810765 1772011 1636430 1288189 980656 813122 780010 865542 1042921 1262230
10932 1262230 1399375 1475168 1554656 1536129 1513439 1804780 2450127 3123163 3630407 3845262
10922 3845262 3568627 3101015 2721629 2120179 974399 -579778 -1978602 -2746569 -3043573
10913 -3043573 -3171815 -3155685 -2919763 -2444377 -1921591 -1547257 -1389658 -1444254 -1381958 -1022522
10903 -1022522 -553035 -86321 278735 386287 380071 539646 986869 1772203 2642328 3064291
10893 3064291 2712698 2004207 1736496 1936910 2003797 1766037 1586012 1726479 1978067 1979912
10883 1979912 1777740 1544380 1329455 1106365 797085 422989 113821 -109038 -364756
10874 -364756 -865190 -1454267 -1713253 -1535062 -1051809 -475565 -95273 -144407 -502562 -915438
10864 -915438 -1394033 -1868646 -1997203 -1695093 -1161264 -644213 -271901 -228351 -816256 -1655216
10854 -1655216 -2166514 -2314520 -2268894 -2183192 -2274504 -2443643 -2425464 -2395342 -2558366 -2732889
10844 -2732889 -2762895 -2723244 -2716605 -2599565 -2082954 -1266415 -544921 -134613 43857 30164
10834 30164 -341477 -995846 -1535112 -1389123 -708342 -93059 274186 347009 149857 3008
10824 3008 232851 653211 1029646 1386740 1812390 2244597 2230562 1568524 769194 424020
10814 424020 529095 906878 1382068 1613137 1473469 1186150 985723 791543 603941 594034
10804 594034 761471 997891 1227865 1436332 1619182 1634316 1462364 1177887 854067 440832
10794 440832 -126967 -667388 -999672 -1132963 -1094587 -779678 -382507 -303537 -450328 -414221
10784 -414221 -115897 59817 -58153 -67119 501499 1406736 1996407 2006184 1687914 1392910
10774 1392910 1218800 1144005 1038972 739524 457652 438273 484704 403629 348423 449467
10764 449467 515037 551005 743289 1158231 1643632 2120834 2565006 2931099 3247541 3360876
10754 3360876 3286926 3270128 3274546 2911131 2026987 1072020 382989 -183514 -835537 -1388082
10744 -1388082 -1569842 -1504086 -1433133 -1265467 -736094 166281 1257535 2192832 2682439 2813479
10734 2813479 2550120 1848517 1187370 1084150 1464124 2132461 2878779 3293316 3288608 3160678
10724 3160678 3065012 2924874 2651077 2073950 1293752 722026 485764 381357 155001 -310723
10714 -310723 -940811 -1518309 -1897437 -2042399 -1887744 -1612991 -1387686 -1043168 -398515 347115
10704 347115 1001761 1560644 1946212 2060491 2005475 2033527 2274814 2760605 3213940 3106862
10694 3106862 2504050 1982172 1797204 1681277 1490238 1337073 1348808 1435249 1415291 1424683
10684 1424683 1402410 1205251 1139196 1334841 1606016 1767587 1865741 1986504 2136024 2236370
10674 2236370 2248342 2370866 2706013 3274991 3865273 4189223 4288403 4197558 3940296 3649072
10664 3649072 3488403 3479583 3510097 3450697 3183680 2786042 2297628 1569514 630852 -276053
10654 -276053 -945753 -1259940 -1225385 -963757 -573017 20125 735368 1355006 1693070 1680759
10644 1680759 1639277 2040050 2824998 3453249 3568075 3181210 2437481 1560476 975633 943944
10634 943944 1237071 1629890 2144629 2972927 4350387 6177768 8033327 9671305 10855533
10625 10855533 11343499 11131271 10174664 8782847 7446985 6048032 4499221 3258392
10617 3258392 2673556 2481368 2310441 2200996 2210728 2228987 2090779 1668572 1079470 642469
10607 642469 597282 818037 1083477 1468696 2092120 2691721 3046555 3239775 3328417 3176450
10597 3176450 2839032 2599654 2449896 2053607 1294955 524657 7231 -204733 -168910 -14299
10587 -14299 54299 -210869 -752777 -1237323 -1476835 -1490601 -1280715 -1052397 -1099809 -1231931
10577 -1231931 -1084762 -689145 -201387 247413 486382 516383 515437 623403 753262 726391
10567 726391 374791 -323062 -1075444 -1330791 -977863 -499883 -155250 99601 305947 420539
10557 420539 400242 315074 318678 535865 860214 1013754 809892 409847 45812 -69300
10547 -69300 143845 334321 229216 -125208 -477378 -581027 -371655 132004 843547 1606785
10537 1606785 2328201 3013340 3693128 4206764 4135112 3347463 2346712 1543920 1058705
10528 1058705 1027497 1124616 916103 588812 593467 776023 770054 458155 -252380 -1343523
10518 -1343523 -2478942 -3139103 -3135623 -2707246 -2129813 -1741706 -1803807 -2103402 -2314345 -2335644
10508 -2335644 -1999793 -1337160 -532958 371406 1290104 2011491 2414894 2402885 1780267 802042
10498 802042 137001 199547 834763 1463247 1672646 1505726 1138262 606337 -67414 -686415
10488 -686415 -1106219 -1265088 -1041363 -527960 -9514 302796 527065 725550 633378 53265
10478 53265 -691693 -1034594 -696105 228716 1321764 2162639 2530208 2446511 2082266 1497793
10468 1497793 785050 170647 -211582 -381784 -282823 131504 678777 1084969 1148020 986339
10458 986339 851855 803523 764987 597926 173897 -317365 -484205 -305657 -10065 275694
10448 275694 420385 505438 801562 1323543 1771921 1989687 2099974 2159877 2097980 1992541
10438 1992541 1920411 2051490 2348967 2625233 2885202 3071144 3027187 2587745 1790481 889400
10428 889400 168764 -185107 -110073 240007 664501 1218951 1787821 2022585 1796882 1353960
10418 1353960 853113 486803 411908 527560 672141 833672 999058 1152452 1301576 1205358
10408 1205358 735131 531 -518487 -542780 -456343 -644628 -1141306 -1692176 -1988452 -1928185
10398 -1928185 -1589933 -1064996 -484653 -20735 225008 294471 397941 674094 1085407 1243603
10388 1243603 959203 397938 -207868 -589150 -690236 -714343 -803331 -793140 -591794 -279873
10378 -279873 145405 495325 589979 688299 1065139 1511251 1592687 1311904 1016561 896503
10368 896503 1007549 1170612 959264 308443 -438540 -831965 -698941 -163175 454565 667023
10358 667023 309280 -319074 -755258 -822653 -805979 -999564 -1217837 -1215938 -1122090 -937330
10348 -937330 -503127 176650 768250 1262903 1736684 1817230 1527466 1252126 964867 410982
10338 410982 -335376 -944619 -1167865 -1124190 -979185 -736213 -263225 636385 1584418 1780972
10328 1780972 1168821 472502 205933 303905 679117 1117186 1221834 989679 666002 499422
10318 499422 434711 396282 499049 709077 1073489 1389320 1275548 871988 659763 784858
10308 784858 1023645 1149109 1252885 1586664 2142700 2566706 2675822 2589769 2248722 1609614
10298 1609614 947674 383158 -76674 -344613 -362286 -268170 -351569 -575703 -572655 -264553
10288 -264553 125274 525592 946193 1335048 1524996 1457958 1187545 661997 21897 -463919
10278 -463919 -701909 -687127 -738374 -1130993 -1835213 -2624902 -3274951 -3565515 -3450156 -3121286
10268 -3121286 -2705249 -2332314 -2107369 -2015112 -2057158 -2254393 -2502179 -2450554 -1789161 -786729
10258 -786729 -140874 97 -93307 -399002 -656277 -384696 485004 1430337 2046409 2181966
10248 2181966 1973990 1949071 2366472 3009742 3588794 4070409 4399562 4349917 3892770 3325449
10238 3325449 2828945 2295818 1814629 1616994 1605133 1602836 1696657 1859548 1836950 1334377
10228 1334377 406248 -427940 -801510 -808927 -600856 -287540 7014 332254 815494 1476343
10218 1476343 1926737 2018449 2153142 2371437 2288515 1759958 1043278 484645 329185 481773
10208 481773 644833 775996 990753 1226760 1402860 1468760 1244603 769187 284430 -74394
10198 -74394 -251725 -219668 -64579 248356 506404 421158 258737 517170 1157059 1702813
10188 1702813 1992900 2220504 2598102 3102457 3441369 3278789 2660457 2023416 1449263
10179 1449263 904609 526448 372545 368581 421282 433461 301312 -48180 -587664 -1033115
10169 -1033115 -1156182 -1033612 -940966 -955444 -805932 -331859 389233 1078909 1479827 1722719
10159 1722719 1996101 2158942 1869029 1148806 113728 -1017121 -1737317 -1710514 -1168640
10150 -1168640 -652451 -432906 -517731 -728772 -974051 -1276071 -1776931 -2372884 -2549244 -2107372
10140 -2107372 -1374955 -801387 -624421 -681305 -556984 -180649 38410 -320474 -1178323 -1982349
10130 -1982349 -2354068 -2362463 -2241916 -2181547 -2081487 -1684064 -1054233 -352700 333465 823175
10120 823175 1070332 1082218 706791 -44287 -797094 -1203503 -1171471 -812493 -275611 295971
10110 295971 744239 1068150 1431666 1866395 2256645 2413833 2205519 1550753 544263
10101 544263 -474331 -1232525 -1589562 -1523081 -1129274 -664074 -223482 250534 731622 1148857
10091 1148857 1475117 1642716 1492285 958880 251265 -355284 -795988 -1021530 -874527
10082 -874527 -303914 348585 723291 980070 1270696 1318983 953992 484787 429728 894506
10072 894506 1533624 1742336 1212696 246606 -640546 -1026189 -781672 -77724 604157 876091
10062 876091 968046 1211286 1525381 1771337 1849691 1783054 1964858 2721789 3728228 4466308
10052 4466308 4770991 4881557 4912825 4829723 4660559 4312984 3796571 3250161 2660896 2049318
10042 2049318 1785663 2053188 2550952 2784960 2611149 2389273 2190997 1751387 1222539
10033 1222539 977080 958511 934232 975451 1258892 1732949 2255533 2596906 2454959 1894349
10023 1894349 1406475 1401293 1785280 2218883 2381060 2171070 1743628 1236235 941417 990186
10013 990186 1218001 1436886 1756000 2432988 3296549 3977735 4337823 4449018 4303696 3761778
10003 3761778 2957837 2132212 1477966 1242328 1151856 874791 396001 -248948 -829395 -1246199
9993 -1246199 -1650910 -1843911 -1581531 -973768 -465297 -376382 -607843 -1026407 -1433378 -1509634
9983 -1509634 -1120474 -414973 239314 515194 370300 129864 283394 847886 1256423 1141785
9973 1141785 831455 799933 1017964 1192802 1207842 1090232 904981 806933 793558 763845
9963 763845 624652 236047 -202681 -109660 650888 1542508 2071895 2173694 1921454 1526138
9953 1526138 1398224 1752316 2438519 3108015 3250066 2772867 2197908 1975930 2135880 2485901
9943 2485901 2886305 3307012 3699473 3959116 3940149 3523624 2903474 2519826 2344815 2081186
9933 2081186 1761205 1517109 1421943 1363902 1096255 776053 786124 990682 1049941 867646
9923 867646 528107 274419 397583 826876 1115905 943240 185406 -709658 -1061942 -907511
9913 -907511 -445137 273985 1056235 1764594 2364966 2715430 2625954 2231830 1691860 1285796
9903 1285796 1330502 1562064 1571822 1415097 1315806 1122980 688941 190278 -37305 327992
9893 327992 1304221 2320283 2730581 2463069 1916186 1416250 909720 433136 123814 -254267
9883 -254267 -835961 -1508953 -2185084 -2627616 -2695592 -2561764 -2421693 -2438314 -2700214 -3011955
9873 -3011955 -3189976 -3286892 -3150500 -2790485 -2396104 -1901586 -1269738 -792247 -602802 -553751
9863 -553751 -512907 -192090 620751 1463425 1791600 1615382 1370298 1269323 1200796 1261429
9853 1261429 1454942 1524767 1426455 1209532 827778 411659 173508 -7288 -283884 -513030
9843 -513030 -606236 -623696 -503345 -140564 253044 412897 454028 560601 870728 1599108
9833 1599108 2554714 3091235 2957381 2550338 2380960 2508046 2690334 2766998 2847027 3092937
9823 3092937 3369260 3501804 3233523 2399194 1389911 762544 660528 790788 834664 883041
9813 883041 988092 1014748 886765 883357 1144756 1295804 1130614 824394 594286 724483
9803 724483 1235813 1666203 1729888 1612197 1464799 1341479 1247041 1045563 693280 362587
9793 362587 62800 -311530 -742485 -971442 -889789 -723748 -498793 -142136 164674 231633
9783 231633 164188 179973 248361 270190 93276 -446427 -1218998 -1843571 -2278022 -2548871
9773 -2548871 -2567745 -2438620 -2243560 -2018000 -1605845 -1026697 -687109 -605252 -526275 -547764
9763 -547764 -782027 -1048520 -1242582 -1412279 -1516957 -1511803 -1573131 -1821736 -2028749 -1896294
9753 -1896294 -1358012 -604759 58172 308805 146812 58297 371388 827077 1128411 1270006
9743 1270006 1216955 877345 532045 293833 15116 -242472 -408384 -497710 -246983 432030
9733 432030 1248851 1806933 1966911 1978904 2188290 2599728 2757618 2473483 1990146 1466202
9723 1466202 915761 488253 263470 224732 510384 1066440 1578546 2021284 2389150 2414652
9713 2414652 2297905 2317184 2268971 2103784 1929727 1697565 1515283 1576147 1796315 1944067
9703 1944067 2078574 2434685 2820972 3013164 3119789 3081964 2925233 2849790 2848961 2653553
9693 2653553 2254709 1935151 1714969 1380219 1123960 1336665 2036408 2877586 3373026 3442951
9683 3442951 3383438 3348733 3360818 3317431 2985315 2287857 1577910 1177281 923610 673085
9673 673085 521600 529199 865385 1657731 2442314 2593729 2217380 1843958 1640495 1564163
9663 1564163 1666032 1908351 2195728 2408762 2395196 2087294 1721137 1424979 1065358 399103
9653 399103 -717596 -2063966 -3175624 -3625965 -3254557 -2258216 -1011792 231931 1280414
9644 1280414 2062654 2535108 2713816 2755802 2802907 2819375 2630803 2127131 1515853 952600
9634 952600 477070 305822 505081 682142 489806 79590 -394697 -902981 -1346274 -1587549
9624 -1587549 -1416620 -813159 -177372 213483 455405 755820 1331188 2263179 3092293 3332290
9614 3332290 3126045 2881502 2576960 2106397 1652244 1319112 982062 607113 333520 214866
9604 214866 153849 88823 10996 -143552 -371668 -705232 -972229 -936848 -727423 -431150
9594 -431150 -27159 227243 184791 -83983 -528467 -998421 -1261389 -1331252 -1487854 -1756769
9584 -1756769 -1840446 -1574497 -1192878 -821373 -547513 -467486 -508518 -497393 -314891 -66615
9574 -66615 96911 318742 891656 1607458 2040809 1948893 1322143 533807 -2670 -143765
9564 -143765 290357 1216041 2158067 2637447 2532343 2007310 1354105 930861 732655 491546
9554 491546 242068 213390 410014 655417 729987 490677 250512 393616 1036079 1962936
9544 1962936 2698830 2885700 2668488 2427877 2374405 2401827 2457689 2536134 2536450 2479815 2489749
9533 2489749 2633802 2796704 2691298 2167812 1299359 547726 457146 1076303 1807953 2182477
9523 2182477 2218113 2119510 2160591 2529250 3296622 4232394 4827144 4896589 4669296 4333821
9513 4333821 3845432 3161046 2460251 1842426 1335327 1022934 787461 667423 965726 1563613
9503 1563613 2070125 2560450 3238609 3913973 4595245 5497318 6576846 7573495 8376162
9494 8376162 8956306 9022700 8533968 7973862 7534930 7236384 7097814 7009197 6856736 6467171
9484 6467171 5837590 5197636 4738050 4403873 4134116 3840996 3563359 3330698 2949524 2532435
9474 2532435 2260019 1985033 1632176 1174158 469105 -387947 -1208705 -1923347 -2606556 -3203407
9464 -3203407 -3534882 -3671163 -3789337 -3806332 -3473112 -2918490 -2465656 -2098914 -1823778 -1783762
9454 -1783762 -2013993 -2446285 -2941662 -3381754 -3670074 -3805412 -3882327 -3966312 -4069764 -4080429
9444 -4080429 -3802516 -3166843 -2305242 -1446685 -909686 -733417 -598380 -306913 22127 286303
9434 286303 712129 1272137 1319485 604836 -350252 -1025022 -1369965 -1529890 -1642601 -1756558
9424 -1756558 -1793390 -1943785 -2282004 -2423023 -2177775 -1627399 -795125 144104 1026100 1811583
9414 1811583 2338070 2555975 2580560 2465188 2159524 1656789 886902 -222909 -1403943
9405 -1403943 -2240116 -2330681 -1814571 -1267044 -929570 -863949 -1021853 -1137824 -970124 -465169
9395 -465169 311351 1241190 2037279 2478402 2551264 2351351 2082769 1911123 1807106 1672727
9385 1672727 1607824 1831692 2199952 2328131 1975114 1293402 712738 570359 817180 1141084
9375 1141084 1221891 910326 450492 -13976 -403141 -328915 344320 1197285 1872767 2217727
9365 2217727 1941733 1067429 80592 -486713 -525854 -133115 352272 639504 790467 927685
9355 927685 1194227 1617288 1967889 1974599 1789632 1770846 2015642 2315945 2450810 2276011
9345 2276011 1862151 1392587 876136 325671 -253094 -953389 -1626540 -2002694 -1851005 -1143704
9335 -1143704 -252788 394248 755766 1055835 1434963 1778771 1931528 1742964 1167338 448657
9325 448657 -91564 -304820 -397409 -441129 -289411 -111890 -244141 -886086 -1866388 -2750370
9315 -2750370 -3322675 -3514002 -3370246 -3154828 -2852943 -2425291 -1909107 -1151979 -62296
9306 -62296 1187049 2268026 2949694 3331982 3633834 3858024 3744643 3353132 3173666 3249933
9296 3249933 3222403 2988265 2612426 2207565 2067336 2418653 2947356 3061018 2465462 1559624
9286 1559624 1014395 896261 1000353 1245460 1702549 2266595 2615063 2678842 2529790 2249799
9276 2249799 2015088 1779950 1629756 1757621 2089568 2458627 2633602 2471367 1976391 1304987
9266 1304987 738956 484144 536033 813329 1130946 1302490 1340279 1255783 987522 763856
9256 763856 1048907 1738834 2150614 2094881 2065077 2269793 2384585 2037106 1088980 -89790
9246 -89790 -851018 -949964 -655410 -363780 -198114 -56066 99434 207593 293556 456722
9236 456722 608126 721116 955429 1515342 2249948 2588793 2282682 1760942 1361011 1027834
9226 1027834 643751 112127 -415338 -616636 -596683 -696596 -961641 -1148598 -1097169 -789309
9216 -789309 -207078 470490 938716 1133091 1304611 1451387 1397552 1238397 1001528 482302
9206 482302 -155138 -548022 -804247 -1001646 -624085 472596 1644890 2536446 3060372
9197 3060372 2992376 2478499 1940490 1553112 1234838 934601 715669 561328 448548 385632
9187 385632 281735 235703 525696 1065711 1534853 1714615 1792583 1975042 2142783 2190819
9177 2190819 2200632 2342366 2570661 2769542 2805995 2801773 2879013 2704923 2127767 1510503 1270461
9166 1270461 1438723 1771779 2014090 2153182 2196664 2100801 2163343 2630654 3234837 3469845
9156 3469845 3209192 2788149 2469561 2391053 2565781 2874507 3220787 3601955 3804788 3510314
9146 3510314 2719190 1706226 744514 64013 -42067 602766 1570235 2280542 2639675
9137 2639675 2612534 2116490 1504446 1214322 1316569 1519216 1584059 1467204 1362150 1540295
9127 1540295 2016553 2421025 2443742 2246068 2116781 1957663 1715616 1571713 1668489 2014567
9117 2014567 2266699 2067829 1488195 848010 174327 -395347 -523446 -230249 177317 385585
9107 385585 258317 24365 -19652 77009 153622 206281 214535 156047 181359 245164 42477
9096 42477 -229088 -123009 457814 1187596 1570834 1443835 1218843 1311495 1682137 1977426
9086 1977426 2005629 1804128 1435636 976165 575710 460585 617939 716313 391303 -418149
9076 -418149 -1301176 -1824277 -1765476 -1241500 -747286 -527249 -361771 -173084 -107511 -84429
9066 -84429 242211 688551 616623 64885 -419135 -649953 -768784 -842573 -822131 -606667
9056 -606667 -450927 -650911 -970176 -1012830 -741721 -397487 -16529 548575 1405305 2366790
9046 2366790 3058710 3160702 2748804 2229998 1841704 1428811 858337 230394 -471414 -1109891
9036 -1109891 -1331051 -1113372 -539584 79871 387802 414343 456276 797022 1282874 1648856
9026 1648856 1986918 2345842 2511480 2402583 2188958 2104943 2238097 2510396 2875649 3010154
9016 3010154 2512796 1441509 216182 -772566 -1344947 -1571393 -1515294 -1042797 -310688
9007 -310688 193388 291437 130927 -144444 -533746 -1143024 -1952566 -2751035 -3192600 -3189046
8997 -3189046 -2878443 -2268301 -1636047 -1216534 -922588 -764859 -918082 -1508890 -2332541 -2868820
8987 -2868820 -2874567 -2544785 -2183472 -1911538 -1621083 -1319284 -984680 -282687 886507 2064917
8977 2064917 2975834 3643385 4101918 4319014 4215715 3961137 3463404 2428126 1190727
8968 1190727 272248 -154163 11056 611245 1420043 2192628 2619264 2663959 2575676 2548976
8958 2548976 2622726 2731021 2648585 2327970 1945595 1689163 1354415 859297 684690 1067608
8948 1067608 1696314 2191945 2335334 2042696 1515912 1228052 1428961 1743337 1597329 855175
8938 855175 -170003 -994632 -1503700 -1949831 -2254613 -2324982 -2235567 -1904527 -1360477 -735824
8928 -735824 -191877 165664 429213 657945 622131 141141 -562275 -1104975 -1350973 -1381420
8918 -1381420 -1297586 -941133 -149381 953853 1961927 2312757 1809619 764497 -342152
8909 -342152 -1213664 -1657018 -1585597 -1113528 -304287 789766 1744209 2109778 1928707 1566016
8899 1566016 1331648 1267953 1090432 603649 67978 -457244 -1012409 -1308439 -1337182 -1385083
8889 -1385083 -1390327 -1072703 -441477 173055 461551 446462 376221 204746 -86937 -293938
8879 -293938 -235861 -47259 -49213 -373694 -885693 -1347499 -1587233 -1467719 -1124755 -776200
8869 -776200 -338220 283572 859323 1011053 912545 1020999 1354364 1535921 1305138 835839
8859 835839 504662 445639 619629 882726 923604 563772 -223956 -1284545 -2207110 -2695846
8849 -2695846 -2889278 -2840444 -2641461 -2582294 -2466798 -1941449 -1189301 -501617 115961 613458
8839 613458 1178636 2146362 3371253 4367238 4933110 5045312 4586641 3652410 2662760 2033638
8829 2033638 1726387 1478693 1157438 800519 557389 625158 809788 524384 -192987 -965584
8819 -965584 -1715216 -2149964 -1975033 -1198410 -8181 1293249 2270568 2668205 2739130 2690174
8809 2690174 2674711 2954784 3460210 3813613 3854669 3634633 3063140 2110303 1127111 390049
8799 390049 -361420 -1376546 -2452775 -3156242 -3322157 -3090503 -2604824 -2093165 -1827104
8790 -1827104 -1845175 -1933542 -2075126 -2197691 -2101536 -1820712 -1562193 -1425117 -1275999 -1012721
8780 -1012721 -832818 -816441 -773104 -679642 -652758 -768536 -942832 -1015044 -896278 -593605
8770 -593605 -189213 235084 550364 566230 256719 -80243 -199365 -217969 -311301 -344643
8760 -344643 -56436 603724 1389273 1958159 2133812 1788133 994130 339235 102015 -113657
8750 -113657 -410420 -502009 -116249 707253 1538772 2081984 2348587 2300061 1875760 1069849
8740 1069849 143299 -603133 -1076131 -1181511 -1007100 -686198 -244007 320096 884482 1243912
8730 1243912 1432855 1613521 1782643 2015747 2281328 2352646 2034780 1421995 871282 507705
8720 507705 107341 -574274 -1199673 -1379667 -1430301 -1714299 -2108851 -2448523 -2615483 -2404650
8710 -2404650 -1716968 -872679 -315544 -5620 172042 235492 394548 559574 464505 96163
8700 96163 -255331 -353652 -421322 -709143 -1015051 -843443 -273920 144685 247466 80430
8690 80430 -240935 -572100 -699031 -425578 212747 902995 1420117 1804774 2016272 1889171
8680 1889171 1536307 1183435 1041312 1013183 919925 790143 663973 657631 934663 1457679
8670 1457679 1967251 2174172 2135327 2024746 1689329 1209384 1055153 1351736 1703531 1806979
8660 1806979 1696658 1627824 1671738 1651779 1463460 1404924 1665085 2018207 2170519 2031480
8650 2031480 1693946 1299467 970170 707165 415807 234705 391739 606316 448332 175340
8640 175340 43871 -153409 -418771 -513125 -300382 165019 727474 1062779 968304 520867
8630 520867 36540 66018 790210 1794062 2746395 3513324 3768633 3517817 3140078 2765988
8620 2765988 2296657 1853751 1718739 1775533 1655221 1330574 958348 586377 90429 -523550
8610 -523550 -1132910 -1601991 -1815889 -1907648 -2097905 -2300177 -2189517 -1631092 -921580 -398107
8600 -398107 -49623 288556 581203 721233 842054 1004035 1104654 1400487 1971956 2306978
8590 2306978 2148511 1886078 1893505 2109079 2281992 2169046 1952124 1915544 2002732 2188353
8580 2188353 2395738 2325297 1897896 1300395 787891 418732 121614 -163077 -281984 -123129
8570 -123129 108537 327762 517490 533240 498968 624392 954572 1304352 1500912 1590868
8560 1590868 1616622 1355561 791088 491868 690292 740555 198119 -680104 -1467080 -1728486
8550 -1728486 -1350942 -727806 -95171 536745 1015537 1294919 1458807 1536142 1579666 1824063
8540 1824063 2389563 2962658 3132704 2910734 2663789 2580309 2514007 2283716 1924092 1441822
8530 1441822 653133 -353141 -1191249 -1727528 -2107574 -2330977 -2374215 -2308977 -2198393 -2090378
8520 -2090378 -1947956 -1664330 -1371712 -1325221 -1424018 -1391767 -1015854 -222830 664797 1357501
8510 1357501 1948753 2408658 2418240 1973943 1662139 1828793 2180909 2359819 2314972 2178908
8500 2178908 1957617 1669595 1261939 713671 369818 538331 1004572 1282636 1360043 1294953
8490 1294953 957654 377194 -249667 -711148 -859471 -760418 -509311 -45448 525435 989830
8480 989830 1308501 1639957 1927550 1976526 1784283 1623609 1906146 2666950 3272460 3265709
8470 3265709 2723148 1950841 1314572 904217 361997 -289886 -493614 -87797 504964 1096733
8460 1096733 1855064 2677161 3104115 3013303 2805641 2764137 2803118 2720293 2506331 2337207
8450 2337207 2424795 2780710 3091062 3213243 3310742 3437207 3521410 3342102 2837699 2150287
8440 2150287 1328560 533530 68928 268208 972815 1496089 1713942 1870668 1986932 2040015
8430 2040015 2002706 1715575 1348010 1335204 1642554 2074596 2313824 2207559 1956873 1782378
8420 1782378 1873628 1856505 1269704 491828 74083 104219 442010 848274 1114822 1023337
8410 1023337 578126 172561 186386 451957 725823 1111618 1578601 1919318 2074660 2024868
8400 2024868 1762315 1367957 1091660 996737 1027270 1305408 1749881 2277439 2799073 3139910
8390 3139910 3310503 3325336 3011417 2219768 1140451 183227 -456907 -781782 -760345 -444632
8380 -444632 169808 1022757 2026965 2883239 3233566 3051521 2491846 1820543 1392561 1275446
8370 1275446 1167857 879249 498621 252542 439585 1231176 2148655 2530503 2268228 1759429
8360 1759429 1192523 606857 37181 -560561 -852953 -509404 247279 858398 1140924 1287107
8350 1287107 1543169 1789057 1680733 1293950 1122009 1209776 1195023 995037 799435 654789
8340 654789 501500 421623 564531 804974 895286 890292 881115 896821 973002 1059188 931836
8329 931836 644185 596608 897302 1280926 1574982 1872260 2068749 2013837 1958231 2120765
8319 2120765 2500325 2772342 2721361 2529607 2305256 1999175 1654722 1342114 1236757 1469046
8309 1469046 2022853 2778145 3599125 4330684 4734881 4753362 4719747 4868518 5104135 5365191
8299 5365191 5818388 6501547 7252683 7903400 8542522 9539408 10706137 11474979 11509066 10811968
8289 10811968 9634226 8357983 7141040 5887839 4852076 4347671 4495756 5094603 5655469
8280 5655469 5938991 6154467 6415565 6606195 6611760 6444031 6342780 6308811 5939945 5025580
8270 5025580 3892068 2985647 2481554 2335142 2466443 2929091 3651304 4248020 4479653
8261 4479653 4541921 4716617 4946492 5034346 5110017 5178207 4936417 4363765 3798251 3399846
8251 3399846 3051794 2699516 2441997 2224742 1917551 1472379 1006892 743268 584004 456041
8241 456041 400407 344523 420510 728934 924513 829724 691834 710608 883907 1189851 1629576
8230 1629576 1886480 1591088 744672 -206286 -747649 -888636 -1046487 -1411128 -1699297 -1819359
8220 -1819359 -1839483 -1894640 -1890259 -1434071 -698849 -296789 -441173 -776653 -900575 -789526
8210 -789526 -633476 -502013 -474712 -665120 -836166 -780260 -672656 -648073 -680878 -765145 -946027
8199 -946027 -1306105 -1617406 -1632125 -1494166 -1502999 -1757300 -2004986 -2067991 -2041479 -1883135 -1372265
8188 -1372265 -554771 219004 709990 1025721 1325029 1592749 1789548 2041194 2366875 2474539
8178 2474539 2183412 1494975 541344 -325144 -810885 -936523 -846197 -542366 115102 1203797
8168 1203797 2398492 3190249 3317045 2897632 2244546 1726842 1577249 1754608 2095024
8159 2095024 2278904 2006662 1243604 319887 -65943 185009 678994 979954 879402 728173
8149 728173 888076 1286691 1611965 1935279 2449903 3030267 3670226 4370422 4884745 5000906
8139 5000906 4797380 4392151 3787509 3176894 2599038 1891481 1119448 556103 328015 285280
8129 285280 205455 -26928 -215584 -130488 151880 244771 -12648 -370797 -571180 -522049
8119 -522049 -125796 399499 900556 1539985 2215922 2679665 3019028 3447627 3749713 3768792
8109 3768792 3782772 3859676 3645392 2819621 1790125 1247128 1300128 1586917 1726686 1810738
8099 1810738 2175437 2675283 2881069 2884096 2837373 2521819 1881387 1236847 866482 767744
8089 767744 1031276 1722673 2384082 2651016 2859123 3452416 4283304 4911997 5106718 5067525
8079 5067525 4914920 4461809 3945385 3833521 4128538 4583709 4779996 4379808 3450560 2381827
8069 2381827 1580931 1216943 1264618 1713423 2505091 3408773 4086131 4449746 4651256 4711341
8059 4711341 4773705 5159132 5770228 6306817 6763266 7315678 7975132 8846155 9937815 11127508
8049 11127508 12410550 13442201 13947264 14094270 13944957 13511829 12944524 12396963 11743943
8040 11743943 10740160 9221159 7311894 5413639 3817997 2630375 1856226 1447478
8032 1447478 1403256 1664650 1988314 2238033 2449694 2513235 2388484 2392008 2728484 3379107
8022 3379107 4125157 4612677 4682451 4280261 3398836 2308299 1317152 445612 -206843 -584445
8012 -584445 -860210 -1077824 -1137210 -825587 -226405 369236 745817 806940 736737 880992
8002 880992 1328334 1637315 1511972 1182083 831078 334494 -461183 -1419372 -2164425 -2557547
7992 -2557547 -2582057 -2297678 -1855443 -1376036 -1147005 -1290531 -1588877 -1808607 -1665004 -1122557
7982 -1122557 -413334 14659 -188383 -775511 -1050756 -651844 116778 909156 1492345 1699772
7972 1699772 1673404 1711702 1908958 2109748 2197072 2169425 1953737 1675047 1555765 1543466
7962 1543466 1435097 1335020 1504859 2027673 2694164 3260455 3564132 3532261 3358625 3342095
7952 3342095 3339995 3315079 3682866 4364143 4911840 5040886 4631687 3952186 3374421 2928042
7942 2928042 2301444 1478977 904815 712357 584880 338544 -25220 -390129 -539462 -355565
7932 -355565 145394 928600 1886263 2716122 3179017 3274074 3129523 2791310 2289358 1860792
7922 1860792 1671169 1627844 1697953 1784493 1808628 1852985 1727610 1210428 660850 402041
7912 402041 269172 83045 46479 286541 703620 1300732 1848327 2072275 2053486 1907269
7902 1907269 1655757 1527284 1606747 1712376 1582125 1350601 1290961 1161403 759352 344108
7892 344108 245962 356922 618614 1135114 1531346 1391016 815962 213295 129235 831852
7882 831852 2021022 3028104 3320374 2986918 2466449 2028559 1668633 1280518 852046
7873 852046 504663 543466 1040030 1657538 2073883 2266344 2303312 2233942 2236334 2519307 3136308
$$ [...]
##END NTUPLES=NMR SPECTRUM
##END=
