##TITLE=C13_Ser 2188-EA
 CDCl3+DMSO-d6, 2230000sc

 6.9.2024
##JCAMPDX= 6.0         $$ Bruker NMR JCAMP-DX V2.0
##DATA TYPE= NMR SPECTRUM
##DATA CLASS= NTUPLES
##ORIGIN= UXNMR, Bruker Analytische Messtechnik GmbH
##OWNER= root
$$ XWIN-NMR		Version 3.5
$$ Fri Sep  6 13:39:50 2024 Russian Standard Time (UT+4h)  she@DPX200
##.OBSERVE FREQUENCY= 50.327896
##.OBSERVE NUCLEUS= ^13C
##.ACQUISITION MODE= SIMULTANEOUS
##.ACQUISITION SCHEME= undefined
##.AVERAGES= 22301
##.DIGITISER RES= 17
##SPECTROMETER/DATA SYSTEM= spect
##.PULSE SEQUENCE= zgpg30
##.SOLVENT NAME= CDCl3
##.SHIFT REFERENCE= (INTERNAL, CDCl3, 0, 222.565)
##AUDIT TRAIL= $$ (NUMBER, WHEN, WHO, WHERE, WHAT)
$$ ##TITLE= Audit trail, XWIN-NMR		Version 3.5
$$ ##JCAMPDX= 5.01
$$ ##ORIGIN= Bruker BioSpin GmbH
$$ ##OWNER= she
$$ F:/spectra/data/she/nmr/c13/1/pdata/1/auditp.txt
$$ ##AUDIT TRAIL=  $$ (NUMBER, WHEN, WHO, WHERE, WHAT)
(   1,<2024-09-06 13:38:22.78 +0400>,<she>,<DPX200>,
      <created by zg, POWCHK disabled, PULCHK disabled
       terminated by command 'halt'
       configuration hash MD5:
       00 E9 B6 7A A2 85 ED C7 34 08 36 98 17 FE 4E 26
       data hash MD5: 32K
       C1 C7 0C 7E 9C 14 50 62 29 60 D3 29 89 17 88 52>)
(   2,<2024-09-06 13:38:26.96 +0400>,<she>,<DPX200>,
      <Start of raw data processing
       efp BC_mod = 2 LB = 2 FT_mod = 6 PKNL = 1 PHC0 = -534.1624 PHC1 = 24.58855 SI = 32K 
       data hash MD5: 32K
       89 68 FA 5E 3A 78 30 8B 58 2A 7E BC C4 D0 E4 DC>)
(   3,<2024-09-06 13:38:29.98 +0400>,<she>,<DPX200>,
      <abs ABSG = 5 
       data hash MD5: 32K
       C9 6A CD 1D C0 70 5C 6E D6 55 3F 3F 91 07 52 EF>)
(   4,<2024-09-06 13:38:59.73 +0400>,<she>,<DPX200>,
      <pk PHC0 = 0.9711876 PHC1 = -2.000008 
       data hash MD5: 32K
       9B F3 6A 0B 49 02 91 76 D3 A5 C8 39 A8 BD D7 21>)
(   5,<2024-09-06 13:39:03.03 +0400>,<she>,<DPX200>,
      <abs ABSG = 5 
       data hash MD5: 32K
       7E BC 73 9C EA 5E 21 DF 22 A3 69 F0 31 D3 96 48>)
$$ ##END=
$$ 
$$ hash MD5
$$ FB 64 E9 2B 42 8E 3D AC 0E DA 94 23 01 C9 33 5D
##$RELAX= 
##$RELAX= 
##$RELAX= 
##$RELAX= 
##$RELAX= 
##$RELAX= 
##$RELAX= 
##$RELAX= 
$$ Bruker specific parameters
$$ --------------------------
##$DU= <F:/spectra>
##$EXPNO= 1
##$NAME= <c13>
##$PROCNO= 1
##$TYPE= <nmr>
##$USER= <she>
##$AMP= (0..31)
100 100 100 100 100 100 100 100 100 100 100 100 100 100 100 100 100 100 
100 100 100 100 100 100 100 100 100 100 100 100 100 100 
##$AQSEQ= 0
##$AQ_mod= 1
##$AUNM= <au_zg>
##$AUTOPOS= <>
##$BF1= 50.322709
##$BF2= 200.13
##$BF3= 50.322709
##$BF4= 500.13
##$BF5= 500.13
##$BF6= 500.13
##$BF7= 500.13
##$BF8= 500.13
##$BYTORDA= 1
##$CFDGTYP= 0
##$CFRGTYP= 5
##$CHEMSTR= <none>
##$CNST= (0..31)
1 1 145 1 1 1 1 1 1 1 1 1 1 1 1 1 1 1 1 1 1 1 1 1 1 1 1 1 1 1 1 1 
##$CPDPRG= <waltz16>
##$CPDPRG1= <>
##$CPDPRG2= <waltz16>
##$CPDPRG3= <>
##$CPDPRG4= <mlev>
##$CPDPRG5= <mlev>
##$CPDPRG6= <mlev>
##$CPDPRG7= <mlev>
##$CPDPRG8= <mlev>
##$CPDPRGB= <>
##$CPDPRGT= <>
##$D= (0..31)
$$ [...]
##$SUBNAM4= <"">
##$SUBNAM5= <"">
##$SUBNAM6= <"">
##$SUBNAM7= <"">
##$SUBNAM8= <"">
##$SUBNAM9= <"">
##$SW= 239.972175391363
##$SWIBOX= (0..15)
0 1 3 0 0 0 0 0 0 0 0 0 0 0 0 0 
##$SW_h= 12077.2946859903
##$TD= 32768
##$TD0= 1
##$TE= 0
##$TE2= 300
##$TE3= 300
##$TEG= 300
##$TL= (0..7)
120 120 120 120 120 120 120 120 
##$TP= (0..7)
150 150 150 150 150 150 150 150 
##$TP07= 0
##$TPNAME0= <>
##$TPNAME1= <>
##$TPNAME2= <>
##$TPNAME3= <>
##$TPNAME4= <>
##$TPNAME5= <>
##$TPNAME6= <>
##$TPNAME7= <>
##$TPOAL= (0..7)
0.5 0.5 0.5 0.5 0.5 0.5 0.5 0.5 
##$TPOFFS= (0..7)
0 0 0 0 0 0 0 0 
##$TUNHIN= 0
##$TUNHOUT= 0
##$TUNXOUT= 0
##$USERA1= <user>
##$USERA2= <user>
##$USERA3= <user>
##$USERA4= <user>
##$USERA5= <user>
##$V9= 5
##$VALIST= <valist>
##$VCLIST= <CCCCCCCCCCCCCCC>
##$VD= 0
##$VDLIST= <DDDDDDDDDDDDDDD>
##$VPLIST= <PPPPPPPPPPPPPPP>
##$VTLIST= <TTTTTTTTTTTTTTT>
##$WBST= 1024
##$WBSW= 4
##$XGAIN= (0..3)
0 0 0 0 
##$XL= 0
##$YL= 0
##$YMAX_a= 35064784
##$YMIN_a= -125272220
##$ZGOPTNS= <>
##$ZL1= 120
##$ZL2= 120
##$ZL3= 120
##$ZL4= 120
##$ABSF1= 222.5654
##$ABSF2= -17.4314
##$ABSG= 5
##$ABSL= 3
##$ALPHA= 0
##$AQORDER= 0
##$ASSFAC= 0
##$ASSFACI= 0
##$ASSFACX= 0
##$ASSWID= 0
##$AUNMP= <proc_1d>
##$AZFE= 0.1
##$AZFW= 0.5
##$BCFW= 0
##$BC_mod= 2
##$BYTORDP= 0
##$COROFFS= 0
##$CY= -3
##$DATMOD= 1
##$DC= 0
##$DFILT= <>
##$DTYPP= 0
##$F1P= 0
##$F2P= 0
##$FCOR= 0.5
##$FTSIZE= 32768
##$FT_mod= 6
##$GAMMA= 0
##$GB= 0
##$INTBC= 1
##$INTSCL= 4.134877e-10
##$ISEN= 128
##$LB= 2
##$LEV0= 0
##$LPBIN= 0
##$MAXI= 10000
##$MC2= 0
##$MEAN= 0
##$ME_mod= 0
##$MI= 0.1934396
##$NCOEF= 0
##$NC_proc= 1
##$NLEV= 6
##$NOISF1= 120.0001
##$NOISF2= 80.00006
##$NSP= 0
##$NTH_PI= 0
##$NZP= 0
##$OFFSET= 222.5654
##$PC= 1.4
##$PHC0= -533.1912
##$PHC1= 22.58854
##$PH_mod= 1
##$PKNL= yes
##$PPARMOD= 0
##$PSCAL= 0
##$PSIGN= 0
##$REVERSE= no
##$SF= 50.3227345484362
##$SI= 32768
##$SIGF1= 140
##$SIGF2= 120
##$SINO= 11.81781
##$SIOLD= 32768
##$SREGLST= <13C.CDCl3>
##$SSB= 0
##$STSI= 32768
##$STSR= 0
##$SW_p= 12077.2946859903
##$SYMM= 0
##$S_DEV= 0
##$TDeff= 32768
##$TDoff= 0
##$TI= <>
##$TILT= no
##$TM1= 0
##$TM2= 0
##$TOPLEV= 0
##$USERP1= <user>
##$USERP2= <user>
##$USERP3= <user>
##$USERP4= <user>
##$USERP5= <user>
##$WDW= 1
##$XDIM= 32768
##$YMAX_p= 406184288
##$YMIN_p= -3675510
$$ End of Bruker specific parameters
$$ ---------------------------------
##NTUPLES= NMR SPECTRUM
##VAR_NAME=  FREQUENCY,     SPECTRUM/REAL,   SPECTRUM/IMAG
##SYMBOL=    X,             R,               I
##VAR_TYPE=  INDEPENDENT,   DEPENDENT,       DEPENDENT
##VAR_FORM=  AFFN,          ASDF,            ASDF
##VAR_DIM=   32768,         32768,           32768
##UNITS=     HZ,            ARBITRARY UNITS, ARBITRARY UNITS
##FACTOR=    0.368581032318806, 1,           1
##FIRST=     11200.0995020947, 0,            0
##LAST=      -877.195183895579, 0,           0
##MIN=       -877.195183895579, -3675510,    0
##MAX=       11200.0995020947, 406184288,    0
$$ Real data points
##PAGE= N=1
##DATA TABLE= (X++(R..R)), XYDATA
$$ [...]
15950H04048r0130J0184N4421k5927n4999n2707p8165q9852j27097j02216o3232
$$ 804048 713918 724102 778523 752596 697597 644890 566725 476873 349776 247560 184328
15939A84328p0976r2997r9505j1859J18023J45089J00511k0287j75035k55884
$$ 184328 113352 20355 -79150 -91009 27014 172103 272614 252327 77292 -178592
15929a78592l13099l38677l97749l96570j88152J37082M22571N84085N73842M14445
$$ -178592 -491691 -830368 -1228117 -1624687 -1812839 -1675757 -1253186 -669101 -95259 319186
15919C19186J82520k0374j62843j93789n8280J18600J65544O8278m6486k41723
$$ 319186 501706 481332 318489 124700 66420 185020 350564 418842 372356 130633
15909A30633m68485n44713m43451k22620j13812j75331k12621r9943P5500J76548
$$ 130633 -337852 -882565 -1326016 -1548636 -1662448 -1837779 -2050400 -2150343 -2074843 -1898295
15899a898295J64025O848j41947l8893K53251M36995M58562M37182L49269J87184
$$ -1898295 -1734270 -1727422 -1869369 -1908262 -1655011 -1218016 -759454 -322272 26997 214181
15889B14181J08161J01511O2465K6426K4369l3589j44483m3676K58348L86153
$$ 214181 322342 423853 486318 512744 537113 503524 359041 315365 573713 959866
15879I59866K19420J9633j15315j72765p1860M1661l2945j83520k24846j89657
$$ 959866 1179286 1198919 1083604 910839 838979 880640 847695 664175 439329 249672
15869B49672j34752k3025O4181J78788K87205K31598Q6396j8346l4980O695n2781
$$ 249672 114920 91895 156076 334864 622069 853667 940063 921717 886737 893432 840651
15858H40651j83049k14145j96394j90926q3457J61258L87575M52304K64789m9635
$$ 840651 657602 443457 247063 56137 -27320 133938 521513 973817 1238606 1188971
15848A188971k58887k77647k47411k66229k61534j81289n6964j926j4811M5238
$$ 1188971 930084 652437 405026 138797 -122737 -304026 -360990 -362916 -377727 -332489
15838c32489K02674L24107L24279J69388r480j65957l68074n03923m98573l15589
$$ -332489 -129815 194292 518571 687959 678479 512522 144448 -359475 -858048 -1173637
15828a173637N8239L32169L24606K26323J67341Q0714m367m7526p3860k7833P3198
$$ -1173637 -1115398 -783229 -458623 -232300 -64959 15755 11388 -36138 -109998 -137831 -64633
15817f4633J78778J46538q1035k89730k77156j39212l1636K5954J55823L36757
$$ -64633 114145 260683 179648 -110082 -387238 -526450 -558086 -532132 -376309 -39552
15807c9552K45517n3590k41271l68991m75180m91478l58175j33735J9664P3610
$$ -39552 205965 152375 -88896 -457887 -933067 -1424545 -1782720 -1916455 -1896791 -1823181
15797a823181P4772J41567K50911K52611K08524J47793J12105J08064K7756n6360
$$ -1823181 -1748409 -1606842 -1355931 -1103320 -894796 -747003 -634898 -526834 -499078 -555438
15787e55438p8183k3626J01745K06548J98584J31162J00206K9432o7876q0861
$$ -555438 -633621 -657247 -555502 -348954 -150370 -19208 80998 110430 42554 -38307
15777c8307k7167L5859P4834J18025J65730R8972j58170l58871k61987j9159J79661
$$ -38307 -65474 -29615 45219 163244 328974 427946 269776 -89095 -351082 -370241 -190580
15766a90580L18182K88450R346k58152l52155l17997k17458j68456k28929l02630
$$ -190580 127602 416052 425398 167246 -184909 -502906 -720364 -888820 -1117749 -1420379
15756a420379k21148j1966R7733J64571K08440Q9088n2655O4582L52529L54691
$$ -1420379 -1641527 -1653493 -1555760 -1391189 -1182749 -1093661 -1146316 -1081734 -729205 -374514
15746c74514N4798j17040r5179r8465k9130K0020r4278k38680k89389k58720k55553
$$ -374514 -319716 -436756 -531935 -630400 -659530 -639510 -733788 -972468 -1261857 -1520577 -1776130
15735a776130l02083k79842j21844M8313J50955L56195N43143M76939K37276P9708
$$ -1776130 -2078213 -2358055 -2479899 -2431586 -2280631 -1924436 -1381293 -904354 -667078 -587370
15725e87370P4462O507j20224j34515o5039l5970L2641J29361K06614L19667L78801
$$ -587370 -512908 -506401 -626625 -761140 -826179 -862149 -829508 -700147 -493533 -173866 204935
15714B04935K61103J50533J96862K02349J00507O0231k6244k12349l62008l48965
$$ 204935 466038 616571 813433 1015782 1116289 1176520 1150276 937927 575919 226954
15704B26954j04229J34705K08231J37049J02676K47281L50338J96445j44672m03924
$$ 226954 122725 257430 465661 602710 705386 952667 1303005 1499450 1354778 950854
15694I50854l79697k29128k78020m59372m47070k29337N441J75262J92605K3262
$$ 950854 571157 342029 64009 -395363 -842433 -1071770 -1066329 -891067 -698462 -675200
15684f75200j02981M6908K47176K82029K06706L7178q7032R583J69626K50761
$$ -675200 -778181 -731273 -484097 -202068 4638 41816 -45216 -35633 133993 384754
15674C84754K64053J77680j8947j15408K9535K69290K79743L5591j23870j32171
$$ 384754 648807 826487 807540 692132 721667 990957 1270700 1306291 1182421 1050250
15664A050250j11018q4125j14255k30678l34675k33856J2594R4207Q8832J93222
$$ 1050250 939232 855107 740852 510174 175499 -58357 -45763 48444 137276 330498
15654C30498J68469j21965k55256j09615M0773M2397M6343P7059r620r9023p4609
$$ 330498 498967 377002 121746 12131 52904 95301 141644 218703 209083 110060 35451
15643C5451o4505j8868J58614K06615J5574j92493k22379j92779k05068j03380
$$ 35451 -29054 -47922 110692 317307 332881 140388 -81991 -274770 -479838 -583218
15633e83218J04418K48240K37423J17466k0519j60583k79745l50250k37852m6653
$$ -583218 -478800 -230560 6863 124329 103810 -56773 -336518 -686768 -924620 -971273
15623i71273J09680K65910L04233L08577L40831K47173k0098k35034k04658n5612
$$ -971273 -861593 -595683 -291450 17127 357958 605131 585033 349999 145341 89729
15613H9729N4603R7384J01100M7920j23391l83998m66648k04691P4097J12371
$$ 89729 144332 241716 342816 390736 267345 -116653 -583301 -787992 -713895 -601524
15603f01524O8393R1828J49562J23487Q4482L621j50098j62574j7887M8440l3482
$$ -601524 -533131 -441303 -291741 -168254 -83772 -80151 -230249 -392823 -410710 -362270 -395752
15592c95752r0723j0065J66340L51173L80186J98709r5025k99962j97270J06511
$$ -395752 -486475 -496540 -330200 20973 401159 599868 504843 204881 7611 114122
15582A14122L25222K93913J09507Q157K1915M7107m0449k49553m05987l93018
$$ 114122 439344 733257 842764 850921 872836 919943 879494 629941 223954 -169064
15572a69064l63347m32246l69189q2305J66800J69854l4105j98687j36805Q4091
$$ -169064 -532411 -964657 -1333846 -1416151 -1249351 -1079497 -1113602 -1312289 -1449094 -1365003
15562a365003K41834J60526l5645j81180j91627l7468J47768L28188M03140K88567
$$ -1365003 -1123169 -962643 -998288 -1179468 -1371095 -1408563 -1260795 -932607 -529467 -240900
15552b40900L6757j66472k01747j08705K014K4994M265P8107J29736J1918j80504
$$ -240900 -204143 -370615 -572362 -681067 -679053 -654059 -649794 -571687 -441951 -430033 -610537
15541f10537j94376L0739J96425J25007n4893j81640k17238r4084J58094L43374
$$ -610537 -804913 -774174 -577749 -452742 -507635 -689275 -906513 -1000597 -842503 -499129
15531d99129L95094L58676K49587J71197O3659n0852j24063j74824j33347o5708
$$ -499129 -104035 254641 504228 675425 739084 688232 564169 389345 255998 190290
15521A90290p9440j06529l5614J48022K74450K56322J45210R738j53068l24547
$$ 190290 110850 4321 -31293 116729 391179 647501 792711 802449 649381 324834
15511C24834l05624j35504n9113K5468J73515K11267P9036l3552R324J26012K20138
$$ 324834 19210 -116294 -175407 -149939 23576 234843 313879 280327 289651 415663 635801
15500F35801J96507R2078O1228L5370q279N4846J95710K59896K44925K29774J77714
$$ 635801 832308 924386 985614 1020984 1012705 1067551 1263261 1523157 1768082 1997856 2175570
15489B175570k5800l02430m96617n25201m31657m12013m13506k32057O780J38166
$$ 2175570 2149770 1847340 1350723 825522 393865 -18148 -431654 -663711 -656931 -518765
15479e18765K06461L39146N07526N62730L90909R0268p3175o8662o7489j7966
$$ -518765 -312304 26842 534368 1097098 1488007 1578275 1505100 1436438 1368949 1350983
15469A350983J00468R9702m7145k37009l78261m24524l79203k57950m1983K01351
$$ 1350983 1451451 1551153 1504008 1266999 888738 464214 85011 -172939 -214922 -13571
15459a3571K40436J26741K0627j51303l27492l01085p2434J89574L59115L33737
$$ -13571 226865 353606 374233 222930 -104562 -405647 -478081 -288507 70608 404345
15449D04345J56261k5319o7942k075o275k60301n96488o41961m05413j94618r4056
$$ 404345 560606 535287 467345 465270 458995 198694 -397794 -1039755 -1445168 -1639786 -1733842
15438a733842j4720L0737Q1685J82331L21994N10761O25034N50626L04230j00133
$$ -1733842 -1748562 -1717825 -1636140 -1453809 -1131815 -621054 3980 554606 858836 758703
15428G58703m32396m28960j81960j3130r5317k66831l87517l10232j6922K48081
$$ 758703 326307 -102653 -284613 -297743 -393060 -659891 -1047408 -1357640 -1374562 -1126481
15418a126481L89066L46061J69902k4941j84054l15450k81505J5601K27567J88933
$$ -1126481 -737415 -391354 -221452 -246393 -430447 -745897 -1027402 -1011801 -784234 -595301
15408e95301O4618p628q2787j45095k0478J64615J55238J62017L37985L99620
$$ -595301 -530683 -538311 -621098 -766193 -786671 -622056 -466818 -304801 33184 432804
15398D32804K90869N9934k30253l00800j66225q7028q7234p3218j457P9237j8021
$$ 432804 723673 783607 553354 252554 86329 -699 -87933 -161151 -162608 -83371 -101392
15387a01392j84960k37796j55195j0190J8671o7279q0458L101L2613o3737j00489
$$ -101392 -286352 -524148 -679343 -689533 -670862 -738141 -818599 -815498 -782885 -846622 -947111
15376i47111l5316k411P1890K80580N12468N69153M21588K10542j4780k50506
$$ -947111 -982427 -984838 -912948 -632368 -119900 449253 870841 1081383 1066603 816097
15366H16097m88511o68832p66929p13274m12365J1672K24753J81569R6499J02733
$$ 816097 327586 -341246 -1108175 -1821449 -2233814 -2222142 -1997389 -1815820 -1719321 -1616588
15356a616588K29041L47584L56097J98628o476j28155j63982r5764J6814J72705
$$ -1616588 -1387547 -1039963 -683866 -485238 -491714 -619869 -783851 -879615 -862801 -690096
15346f90096L90063N77150N53659K61631q7969l55237m75098l86507j69088j36112
$$ -690096 -300033 277117 830776 1092407 1004438 649201 174103 -212404 -381492 -517604
15336e17604k81423k98020j29385Q4194J95676J59856R5438R1337L7387j15186
$$ -517604 -799027 -1097047 -1226432 -1142238 -946562 -786706 -691268 -599931 -562544 -677730
15326f77730j90052j14855o6016l3060J24484K53727K17638R4204O31O7822L39874
$$ -677730 -867782 -982637 -1048653 -1081713 -957229 -703502 -485864 -391660 -391029 -323207 16667
15315A6667M98560K85548k5896k53848l42147l26153l25745k62648k6499K72953
$$ 16667 515227 800775 774879 521031 178884 -147269 -473014 -735662 -762161 -489208
15305d89208L93810M00651M27720M26383L06467R1519p7184j10933r0306j58897
$$ -489208 -95398 305253 732973 1159356 1465823 1557342 1480158 1369225 1278919 1120022
15295A120022k55804k71835j76839j4825J54566K28916P6365j25971k45002l57295
$$ 1120022 864218 592383 415544 400719 555285 784201 860566 734595 489593 132298
15285A32298m46006m11819k90916j66576r0745J256J60516J26668q5683j66235
$$ 132298 -313708 -725527 -1016443 -1183019 -1273764 -1272508 -1111992 -985324 -1071007 -1237242
15275a237242O1962L54239M19529L06796J26824Q0620J65432J55119L4618o4968
$$ -1237242 -1175280 -821041 -401512 -94716 32108 112728 278160 433279 467897 402929
15265D02929j60573k06872p4484J37943K20438J41851K3651m5124j52705k63845
$$ 402929 242356 35484 -39000 98943 319381 461232 484883 439759 287054 23209
15255B3209k64092j8715K81585K80698J38014Q3444O7824K3352j14712k55666
$$ 23209 -240883 -259598 21987 302685 440699 524143 591967 615319 500607 244941
15245B44941k07369r3970m4807j8721J0165J6427n848Q7346J55249Q3822M1418
$$ 244941 37572 -56398 -101205 -119926 -109761 -93334 -99182 -11836 143413 227235 268653
15234B68653N3586K6709o5350k34259k54586o1272n2615k30219j69697J35425
$$ 268653 322239 348948 283598 49339 -205247 -266519 -319134 -549353 -719050 -583625
15224e83625J91101k839l6956P2082J10563Q3111J7451M5187J88561L23429L84057
$$ -583625 -392524 -395363 -432319 -360237 -249674 -166563 -149112 -103925 84636 408065 792122
15213G92122L35890K64160K42396J91449N7702j18928l82175o00189p17768o43261
$$ 792122 1128012 1392172 1634568 1826017 1883719 1764791 1382616 782427 64659 -578602
15203e78602k84461J23429L26105J77893j35389k31416j15143J6393J21813J40040
$$ -578602 -863063 -739634 -413529 -235636 -371025 -602441 -717584 -701191 -579378 -439338
15193d39338R7577J20771K16704K32913J80933J21944O6833M0716N6418N5881
$$ -439338 -341761 -220990 -4286 228627 409560 531504 598337 639053 695471 751352
15183G51352P3315K07358K59651O9472j06878j89722l80119o43341o49436l44045
$$ 751352 824667 1032025 1291676 1361148 1254270 1064548 684429 41088 -608348 -952393
15173i52393q2063q3303j22903K0432K13010L06439L73148M06888K65779J31122
$$ -952393 -1034456 -1117759 -1240662 -1220230 -1007220 -700781 -327633 79255 345034 476156
15163D76156Q5625p9466k56881k02541k624J65586L00241L04862R0949j44422
$$ 476156 561781 482315 225434 22893 20269 185855 486096 790958 881907 737485
15153G37485k55391l08815k98303k34532j96707j57953r2312k7733j08n843j0457
$$ 737485 482094 173279 -125024 -359556 -556263 -714216 -806528 -834261 -834369 -840212 -850669
15142h50669P2578K43136L70863L66618K75493J91515P4423p3536r0498O3652
$$ -850669 -778091 -534955 -164092 202526 478019 669534 743957 670421 579923 643575
15132F43575J78077J04732K953l1694k9343n9573j14913j14735j33237l37438
$$ 643575 821652 926384 929337 897643 868300 808727 693814 579079 445842 108404
15122A08404o06551o08053l25090N697K46108K46157Q4483k0659o3150j5961P9149
$$ 108404 -498147 -1106200 -1431290 -1425593 -1179485 -933328 -848845 -869504 -932654 -948615 -869466
15111h69466J33390K05818L18072K87951R5405j34566k72958l18662l50598l40043
$$ -869466 -736076 -530258 -212186 75765 171170 36604 -236354 -555016 -905614 -1245657
15101a245657k66666p7256K56728M98779M80923L62866K56261L3397l29909m74872
$$ -1245657 -1512323 -1589579 -1332851 -834072 -353149 9717 265978 299375 -30534 -505406
15091e05406j88796J86825L49547K68587l4452l74843m57516l58802k95533k14347
$$ -505406 -694202 -507377 -157830 110757 76305 -298538 -756054 -1114856 -1410389 -1624736
15081a624736j35383j2663K24313L94911M38833M41307L41682J24881l7968O208
$$ -1624736 -1760119 -1772782 -1548469 -1153558 -714725 -273418 68264 193145 155177 161385
15071A61385N4265q8430k91989l02682j55319n0542r763M482N9678O5414j35340
$$ 161385 215650 127220 -164769 -467451 -622770 -673312 -683075 -678593 -618915 -553501 -688841
15060f88841m09569m71825k79721m1497L4720N684R6377K37832K31101J87057
$$ -688841 -1098410 -1570235 -1849956 -1891453 -1856733 -1851049 -1754672 -1516840 -1285739 -1098682
15050a098682J96962K10628J91502K01136K03789J01312o1414j90358k85534l52112
$$ -1098682 -901720 -691092 -499590 -298454 -94665 6647 -54767 -245125 -530659 -882771
15040h82771k43529K8214L30852M54399K84900K3823j82167l63994m52541l73559
$$ -882771 -1126300 -1098086 -767234 -312835 -27935 -4112 -186279 -550273 -1002814 -1376373
15030a376373j31145J20423K13690K04555J58511J60799K58339L33747K91838
$$ -1376373 -1507518 -1387095 -1173405 -968850 -810339 -649540 -391201 -57454 234384
15021B34384J88800M9500m0905p3056j70377k73662k63490j80507o2831J4209
$$ 234384 423184 472684 431779 358723 188346 -85316 -348806 -529313 -592144 -577935
15011e77935J5498l6761j22284j17133J02863L63240M40348L51033K56659J64995
$$ -577935 -562437 -599198 -721482 -838615 -735752 -372512 67836 418869 675528 840523
15001H40523k2235k94696m25357k72067r3076o4263j03942j47536j42735R900
$$ 840523 818288 523592 98235 -173832 -266908 -331171 -435113 -582649 -725384 -715484
14991g15484J76002K32455K32990J94350R2532j51137l97047m45680l57095k97927
$$ -715484 -539482 -307027 -74037 120313 212845 61708 -335339 -781019 -1138114 -1436041
14981a436041j41320K43003N44980N46621L58549K00011J25911J23714K05309
$$ -1436041 -1577361 -1334358 -789378 -242757 115792 315803 441714 565428 770737
14972G70737K32821J01194q4653j19796n8609o0558j08000j48192j50134r3465
$$ 770737 1003558 1104752 1020099 900303 841694 781136 673136 524944 374810 281345
14962B81345o7230o8962k290J1384j17457k57585k44278o1310R0503R2205L6777
$$ 281345 214115 145153 142863 154247 36790 -220795 -465073 -526383 -435880 -343675 -306898
14951c06898O0510J95322L13252K50317J14206J20588J99613J77046O3083q8518
$$ -306898 -246388 -51066 262186 512503 626709 747297 946910 1123956 1187039 1098521
14941A098521j51285r9988j3727Q4816N7551j31884k51834j89891j13606j17201
$$ 1098521 947236 847248 833521 918337 975888 844004 592170 402279 288673 171472
14931A71472j21217j34787j47825j16652k5063J17949J37469Q7611O1716M7943
$$ 171472 50255 -84532 -232357 -349009 -374072 -256123 -118654 -31043 30673 78616
14921G8616L7122k3379j34996k70836l91338l88065k46885q6340J4133R5437K02944
$$ 78616 115738 92359 -42637 -313473 -704811 -1092876 -1339761 -1426101 -1411968 -1316531 -1113587
14910a113587K94458L72249M26698L42116J52036j31665l67093l61438p9139J48277
$$ -1113587 -819129 -446880 -20182 321934 473970 342305 -24788 -386226 -465365 -317088
14900c17088K477k03028r1931J13623J51038M2788j1677K01524M39865M22309
$$ -317088 -314611 -517639 -609570 -495947 -344909 -302121 -313798 -112274 327591 749900
14890G49900K51651K00090K45057K27072J13385j41965m09544m20351k01141o0274
$$ 749900 1001551 1201641 1446698 1673770 1787155 1645190 1235646 815295 614154 553880
14880E53880p2697n3379L3480J22225Q6346j9316q5204k02053l30392l78095l32970
$$ 553880 481183 427804 461284 583509 669855 650539 565335 363282 32890 -345205 -678175
14869f78175k08436k8591J95010L89611L84560K26051J14789Q4222J24880K24196
$$ -678175 -886611 -915202 -720192 -330581 53979 280030 394819 479041 603921 828117
14859H28117J96589p9681l16815l57635l46656k71574j27272m5545n7836q7454
$$ 828117 1024706 945025 628210 270575 -76081 -347655 -474927 -520472 -578308 -665762
14849f65762j19821o2589N6559J31060J34806J56033J65021J5862j81906j57196
$$ -665762 -785583 -848172 -791613 -660553 -525747 -369714 -204693 -188831 -370737 -527933
14839e27933l9911M1046J32781K21424K39666J28695l9416k20111l10228k45592
$$ -527933 -567844 -526798 -394017 -172593 67073 195768 156352 -63759 -373987 -619579
14829f19579k13730k83966k62617k4532K57787M08348L69353K23492J26828O0871
$$ -619579 -833309 -1117275 -1379892 -1404424 -1146637 -738289 -368936 -145444 -18616 42255
14819D2255q6132k12598o5996K37250L82221K74678L8890j14792j93479l06630
$$ 42255 -43877 -256475 -322471 -85221 297000 571678 610568 495776 302297 -4333
14809d333l43720k01328K3269J10852j9915k00964j53237L5933L7644r2027j63503
$$ -4333 -348053 -549381 -526112 -415260 -435175 -636139 -789376 -753443 -715799 -807826 -971329
14798i71329j89100j10384L0959J9990q4953j17103p4991O4166J29603R7036J46546
$$ -971329 -1160429 -1270813 -1239854 -1219864 -1304817 -1421920 -1496911 -1432745 -1303142 -1206106 -1059560
14787a059560J99932J21112L6106J5636k7081p2576l9606o7501k77439l76600
$$ -1059560 -859628 -738516 -702410 -686774 -713855 -786431 -826037 -893538 -1170977 -1547577
14777a547577j30775J20451k5695l45525l57169j01775J32496J62348p530r219
$$ -1547577 -1678352 -1557901 -1583596 -1929121 -2286290 -2388065 -2255569 -2093221 -2100751 -2109970
14767b109970K33240M52559N24673M81133L59297J40046j16076k90480l55689
$$ -2109970 -1876730 -1424171 -899498 -418365 -59068 80978 -35098 -325578 -681267
14758f81267l45611l73476m47256l84053j61346J57838M57385N69921M45165L49609
$$ -681267 -1026878 -1400354 -1847610 -2231663 -2393009 -2235171 -1777786 -1207865 -762700 -413091
14748d13091L77226L53836L34884L50673L18198K65972R1919k52963n12640m94473
$$ -413091 -35865 317971 652855 1003528 1321726 1587698 1679617 1426654 914014 419541
14738D19541l52921k61806j08309J04304J56040N1517K6653N5203o7163k55017
$$ 419541 66620 -195186 -303495 -199191 -43151 8366 35019 90222 23059 -231958
14728b31958l22753k61326j82021q4893M4430P6188P1002J22466J59906J19903
$$ -231958 -554711 -816037 -998058 -1082951 -1038521 -962333 -891331 -768865 -608959 -489056
14718d89056k313k06212k25449M0656L23865M40558L27550J22040N5219P0086
$$ -489056 -491369 -697581 -923030 -882374 -558509 -117951 209599 331639 386858 456944
14708D56944P6856M1798n435k6530q9666j41281j22922j43247j79290q6228j5305
$$ 456944 533800 575598 570163 543633 453967 312686 189764 46517 -132773 -219001 -234306
14697b34306j67606m15996m54349k70097m6047J68434K93270K85079J88674M9750
$$ -234306 -401912 -817908 -1272257 -1542354 -1588401 -1419967 -1126697 -841618 -652944 -603194
14687f03194J3628O3499M5078p4189j27436m5712Q7046K6448k02349k36693l326
$$ -603194 -589566 -526067 -480989 -555178 -682614 -728326 -641280 -614832 -817181 -1053874 -1057200
14676a057200K94814N06397M92946K34921l10n0508m1928m1520k0894m9804j68174
$$ -1057200 -762386 -255989 236957 471878 471568 421060 379132 337612 316718 266914 98740
14665I8740k22484j57576m7208N0415j3886r4578q6896j25963k08058k19007j26843
$$ 98740 -123744 -281320 -328528 -278113 -291999 -386577 -473473 -599436 -807494 -1026501 -1153344
14654a153344n3928j21900k02149j56810o8659m4028j02633r4445J09827L56368
$$ -1153344 -1207272 -1329172 -1531321 -1688131 -1756790 -1800818 -1903451 -1997896 -1888069 -1531701
14644a531701L64989J92353J48696J60628P5229k4268p1724q6186l4493L5657
$$ -1531701 -1166712 -974359 -825663 -665035 -589806 -614074 -685798 -771984 -806477 -770820
14634g70820k6287k08668l30386l01082j15057J09362K87607K95079J06740J5785
$$ -770820 -797107 -1005775 -1336161 -1637243 -1752300 -1642938 -1355331 -1060252 -953512 -937727
14624i37727P3429R9420R1128J8210j60509k30868j50319o7577j9074R6801L04114
$$ -937727 -864298 -764878 -673750 -655540 -816049 -1046917 -1197236 -1264813 -1283887 -1187086 -882972
14613h82972M90161M49140J89809q2080j76432j09962l6681j07832j89201r4701
$$ -882972 -392811 56329 246138 164058 -12374 -122336 -159017 -266849 -456050 -550751
14603e50751L2400J28556K27511L27604L19418J26387j65403l25784k22124M9432
$$ -550751 -518351 -389795 -162284 165320 484738 611125 445722 119938 -102186 -52754
14593e2754K19949J73795Q9072M0404o1699j99482k89986l53371l53061j80861
$$ -52754 167195 340990 430062 470466 408767 209285 -80701 -434072 -787133 -967994
14583i67994P7988K09069J71952L0056j941N7837j414j92390l31586l17867j72067
$$ -967994 -890006 -680937 -508985 -478929 -480870 -423033 -424447 -616837 -948423 -1266290 -1438357
14572a438357O932J25339K09063L07251L68771L08345J62980L3505o8756j00081
$$ -1438357 -1431425 -1306086 -1097023 -789772 -421001 -112656 50324 83829 15073 -85008
14562h5008r5224j78251k90889k67255m2249J66791K26904J68805Q1671O7567
$$ -85008 -180232 -358483 -649372 -916627 -958876 -792085 -565181 -396376 -314705 -247138
14552b47138N3988k1197p0638j05984k43170l79117l67457k75377j47213o03L8673
$$ -247138 -193150 -214347 -284985 -390969 -634139 -1013256 -1380713 -1656090 -1803303 -1803906 -1765233
14541a765233M3917M2848K0751Q5405K39432L11655K01359M7381J0620N4258L2165
$$ -1765233 -1721316 -1678468 -1657717 -1572312 -1332880 -1021225 -819866 -772485 -761865 -707607 -675442
14530f75442K1005J53217K99289L28110K22289p0684l35564k96054N665K62382
$$ -675442 -654437 -501220 -201931 126179 348468 277784 -57780 -353834 -348169 -85787
14520h5787J56324j65241k98047j21333K16565L81061K63950Q3640L4853K7793
$$ -85787 70537 -94704 -392751 -514084 -297519 83542 347492 431132 465985 493778
14510D93778l1465J05217M01110N06011M11671K68235R9183k00390m69618m39625
$$ 493778 462313 567530 968640 1474651 1886322 2154557 2253740 2053350 1583732 1144107
14500A144107k08644l1461K6738l4438o2024O5745J80948J47946l4203k69173
$$ 1144107 935463 904002 930740 896302 834278 900023 1080971 1228917 1194714 925541
14490I25541m18529l00686r3877j02403k51354k38097m7002J50311K77806K20815
$$ 925541 507012 206326 112449 10046 -241308 -479405 -526407 -376096 -98290 122525
14480A22525N010j75496k11907j09846Q6949K59008K74238J34177n0453j84714
$$ 122525 127535 -47961 -259868 -369714 -282765 -23757 250481 384658 334205 149491
14470A49491k59019k12833l7394J42036K70602K61250J42288P5020J7149o4797
$$ 149491 -109528 -322361 -359755 -217719 52883 314133 456421 531441 548590 483793
14460D83793j43207j50241p9703l4645P3383J82233J26431n479j44633k26982
$$ 483793 340586 190345 110642 75997 149380 331613 458044 452565 307932 80950
14450H0950q5557P6805N9448n303R440J9121o2953j38044q1404J11159L73035
$$ 80950 -4607 72198 131646 126343 135783 154904 91951 -46093 -127497 -16338 356697
14439C56697N12850M35980K41796L9908j00499j53216k43722m99336o67628n84874
$$ 356697 869547 1305527 1547323 1587231 1486732 1333516 1089794 590458 -77170 -662044
14429f62044m42330k42573J1502R9935P352j13253P562L12828N17529N06219L08738
$$ -662044 -1104374 -1346947 -1335445 -1235510 -1228158 -1341411 -1333849 -1021021 -503492 2727 311465
14418C11465Q7123l3551o2511l7211K6853O6196L5329l4158j13571j84634k06981
$$ 311465 398588 365037 302526 265315 292168 358364 393693 359535 245964 61330 -145651
14407a45651j77063j37772n8562J04400K28009J82295j3252k22865k84234k07458
$$ -145651 -322714 -460486 -519048 -414648 -186639 -4344 -17596 -240461 -524695 -732153
14397g32153q2756K7217Q994j21601j92817j19677j3833O6426J75091L30402M02862
$$ -732153 -814909 -787692 -778698 -900299 -1093116 -1212793 -1226626 -1160200 -985109 -654707 -251845
14386b51845K93290O9306j31747k35894k80068k31060m8957R7082O9390l4206
$$ -251845 41445 110751 -20996 -256890 -536958 -768018 -816975 -719893 -650503 -684709
14376f84709m4724M0069R0771k9202k10700k73045j45668J21587K99761L39267
$$ -684709 -729433 -689364 -598593 -627795 -838495 -1111540 -1257208 -1135621 -835860 -496593
14366d96593K21798Q3546N4988M2541J2280l2519j22485k79360l92135l41136
$$ -496593 -274795 -191249 -136261 -93720 -81440 -113959 -236444 -515804 -907939 -1249075
14356a249075j85925j04282q8189J04234L52482L80143K57667O7819j76904l61100
$$ -1249075 -1435000 -1539282 -1627471 -1523237 -1170755 -790612 -532945 -465126 -642030 -1003130
14346a003130l34824m1242L76505N82530N00737K43523j9065j29197L3512K87854
$$ -1003130 -1337954 -1379196 -1002691 -420161 80576 324099 305034 175837 209349 497203
14336D97203L29787J69148j4664j75798l18663l32860j78006q427l2669k26435
$$ 497203 826990 996138 981474 805676 487013 154153 -23853 -32280 -64949 -291384
14326b91384m52467n11984l19607M7725L88217M29684K01060J3126l3787K212
$$ -291384 -743851 -1255835 -1575442 -1527717 -1139500 -709816 -508756 -495630 -529417 -527205
14316e27205J17068J68584L2056k15681l51077k70249N6349L65016L62650Q5775
$$ -527205 -410137 -241553 -209497 -425178 -776255 -1046504 -990155 -625139 -262489 -176714
14306a76714k29742l08204j29968J99679N01231N45359K57253r759m7707j5716
$$ -176714 -406456 -714660 -844628 -644949 -143718 401641 658894 649135 601428 585712
14296E85712l2173l0356q546n0851j49858k32239k63496k25376j75722j32253
$$ 585712 553539 523183 514637 463786 313928 81689 -181807 -407183 -582905 -715158
14286g15158m8701Q1698K38715K83776R1068j27323j39074o125J65199L43308
$$ -715158 -763859 -682161 -443446 -159670 -68602 -195925 -334999 -341124 -175925 167383
14276A67383M50940M18392K05980o3316j78248j11052m4870j58272l59504l90593
$$ 167383 618323 1036715 1242695 1179379 1001131 890079 845209 686937 327433 -63160
14266f3160j61996J2155P2743N4017j38637k48730m7663J96355J96983L4641k5899
$$ -63160 -225156 -213001 -140258 -86241 -224878 -473608 -521271 -324916 -127933 -93292 -119191
14255a19191J42322L50753L94358K97171J02070o3569j46139k32082k69608k34245
$$ -119191 23131 373884 768242 1065413 1167483 1103914 957775 725693 456085 221840
14245B21840j95530n433K29332J55338q9940j32385J4653L9717l2706q4610k49589
$$ 221840 26310 20877 250209 405547 315607 183222 197875 237592 204886 120276 -129313
14234a29313m83439n15099l18374j45045k5655Q1105M6754p2800P616K36894L85284
$$ -129313 -612752 -1127851 -1446225 -1591270 -1616925 -1535820 -1489066 -1561866 -1554250 -1317356 -932072
14223i32072L08270M1745k21993k58012j82413j50660J9881K48580L42746L22712
$$ -932072 -623802 -582057 -804050 -1062062 -1244475 -1395135 -1375254 -1126674 -783928 -461216
14213d61216K41819J42272O126k26521l83208l25972j65251m1891K4692K7640
$$ -461216 -219397 -77125 -70999 -297520 -680728 -1006700 -1171951 -1213842 -1189150 -1161510
14203a161510j03414k30796k33864j98727j88936j47813N8843K77390L85114L34398
$$ -1161510 -1264924 -1495720 -1729584 -1928311 -2117247 -2265060 -2206217 -1928827 -1543713 -1209315
14193a209315J95493J45958R6266k2007p4601Q895O7311q0292k92050m05521l52166
$$ -1209315 -1013822 -867864 -771598 -793605 -868206 -859311 -792000 -872292 -1164342 -1569863 -1922029
14182a922029q7750J17009Q4240M6287K24038M73036M92291K40183j52787l78900
$$ -1922029 -2009779 -1892770 -1808530 -1762243 -1538205 -1065169 -572878 -332695 -485482 -864382
14172h64382k70858m6365N7251j2211j53517j37670p138J16551K22102J41019
$$ -864382 -1135240 -1181605 -1124354 -1136565 -1290082 -1427752 -1434890 -1318339 -1096237 -955218
14162i55218l6841p8224j4048J34832K95436K77857J51479K9221O9880K99941
$$ -955218 -992059 -1070283 -1084331 -949499 -654063 -376206 -224727 -195506 -125626 174315
14152A74315L54698J76186m6513k47681l24476k50072o8122J74934K62894J54940
$$ 174315 529013 705199 658686 411005 86529 -163543 -231665 -56731 206163 361103
14142C61103N5308j5445r4057r8954m6419k8134L5544K17862L53100J69718j32967
$$ 361103 416411 400966 306909 207955 161536 133402 168946 386808 739908 909626 776659
14131G76659j41094O0586J68892Q8395p0342k02357l45173m84863l44477N2078
$$ 776659 635565 696151 865043 953438 883096 680739 335566 -149297 -493774 -441696
14121d41696M22976N17894K94657q8367l75711m17767l80257k78531m505L16923
$$ -441696 -18720 499174 793831 705464 329753 -88014 -468271 -746802 -751307 -434384
14111d34384M10576K60700O1027j34545l48043l88303j80409o6025j70001k23690
$$ -434384 -23808 236892 297919 163374 -184669 -572972 -753381 -819406 -989407 -1213097
14101a213097j39135m7306O0017J44517J47782J09522Q1006J27516K15880K89953
$$ -1213097 -1352232 -1399538 -1339521 -1195004 -1047222 -937700 -856694 -729178 -513298 -223345
14091b23345L03136K34309J15661L1579k4085j41830k93967l19522j86378L3049
$$ -223345 79791 314100 429761 461340 437255 295425 1458 -318064 -504442 -471393
14081d71393J86930J30948L3543N3910L9753J3661N9833P6606L2410K939P2848
$$ -471393 -284463 -153515 -119972 -66062 -26309 -12648 47185 123791 156201 159140 231988
14070B31988K9806k20056m05213l83791j72374Q8472K26906K35045J92373J04325
$$ 231988 261794 41738 -363475 -747266 -919640 -831168 -604262 -369217 -176844 -72519
14060g2519N8408O4122M7135P2552J11363P8664m6150j59227k68946l10319j44375
$$ -72519 -14111 50011 97146 169698 281061 359725 313575 154348 -114598 -424917 -569292
14049e69292R6372K04190J82890K03198L41778M55457L47005O5609j26516k03335
$$ -569292 -472920 -268730 -85840 117358 459136 914593 1261598 1327207 1200691 997356
14039I97356k61676l29954m05693l85222l07871k71141j95215o9079M8182J97707
$$ 997356 735680 405726 33 -385189 -693060 -964201 -1159416 -1228495 -1180313 -982606
14029i82606L30340L53008K84603K44793J86432K1948m8439O1544O5695o9928
$$ -982606 -652266 -299258 -14655 230138 416570 438518 390079 451623 517318 447390
14019D47390j81367k90619l80856l52938j64360J8711l5259k37369k79375o4844
$$ 447390 266023 -24596 -405452 -758390 -922750 -904039 -939298 -1176667 -1456042 -1520886
14009a520886K37399L99133M14242L20632K23917J97435J93829K50905L24880
$$ -1520886 -1283487 -884354 -470112 -149480 74437 271872 465701 716606 1041486
14000A041486L44303K00501j09491m40688p63472q72284n21192O9282N72618P59916
$$ 1041486 1385789 1586290 1476799 1036111 272639 -599645 -1120837 -1051555 -478937 280979
13990B80979O15409L31271p351k18293k75942k72481k25860j42683K1273K63328
$$ 280979 896388 1227659 1220308 1002015 726073 453592 227732 85049 106322 369650
13980C69650L71221K08783o7932k69603l84644m35773l86703j36183J57615K36613
$$ 369650 740871 949654 881722 612119 227475 -208298 -595001 -731184 -573569 -336956
13970c36956O0563r4880K3596K37099K06693j07303m70941o21582m02876r3699
$$ -336956 -276393 -371273 -347677 -110578 96115 -11188 -482129 -1103711 -1506587 -1600286
13960a600286Q0531J34142O2348m5900l8641N5876J49521K69418L45537J62750
$$ -1600286 -1519755 -1385613 -1323265 -1369165 -1407806 -1351930 -1202409 -932991 -587454 -424704
13950d24704j12530k35141k18306o0624J18557J38185J04946M5721j3605K2809
$$ -424704 -537234 -772375 -990681 -1051305 -932748 -794563 -689617 -643896 -657501 -634692
13940f34692K8686r8145j02427Q1272J54173K5223p0603L1454R3616L0891n3171
$$ -634692 -606006 -704151 -806578 -725306 -571133 -545910 -616513 -585059 -491443 -460552 -513723
13929e13723j28560j13426p6688j93172l16248k15030J10837M01093M26888J87152
$$ -513723 -642283 -755709 -832397 -1025569 -1341817 -1556847 -1446010 -1044917 -618029 -430877
13919d30877j70197l56357l91076l63736j72506J17038L63530N47347N53953L24540
$$ -430877 -601074 -957431 -1348507 -1712243 -1884749 -1767711 -1404181 -856834 -302881 21659
13909B1659J07285M9343j5391j29945j47059l3075J90571M12897L82139J70699
$$ 21659 128944 178287 162896 32951 -114108 -147183 43388 456285 838424 1009123
13899A009123Q7626J93132L10470K02051q7264k78833k75581k33937k17111j07097
$$ 1009123 1096749 1289881 1600351 1802402 1715138 1436305 1160724 926787 709676 602579
13889F02579J33080K84070K17393M8966j82245l80234m33872m13082l30907j82528
$$ 602579 735659 1019729 1237122 1286088 1103843 723609 289737 -123345 -454252 -636780
13879f36780q1206j79082m37777n71515l95382l7173K36816L48382M08138M57294
$$ -636780 -717986 -897068 -1334845 -1906360 -2301742 -2338915 -2102099 -1753717 -1345579 -888285
13869h88285L36308J64977Q5409J9577m6661j6815M1532k1810r6989l8883n6247
$$ -888285 -551977 -387000 -301591 -282014 -328675 -345490 -303958 -325768 -422757 -461640 -517887
13858e17887k36901l90271m31921l21694p0165J80098L59042M21398L90591L24477
$$ -517887 -754788 -1145059 -1576980 -1898674 -1968839 -1788741 -1429699 -1008301 -617710 -293233
13848b93233K11568O4170n9564o7798j4480K9555K2382J2065j8347o2174n6516
$$ -293233 -81665 -17495 -77059 -144857 -159337 -129782 -107400 -95335 -113682 -175856 -232372
13837b32372n0336K4804Q6835O727j35878k95272l74327l68675l39829k68757
$$ -232372 -282708 -257904 -171069 -164342 -300220 -595492 -969819 -1338494 -1678323 -1947080
13827a947080j70790q6009j8586N2606J11752K43174M35702M92264L24605K6949
$$ -1947080 -2117870 -2203879 -2222465 -2169859 -2058107 -1814933 -1379231 -886967 -562362 -535413
13817e35413j98205k35324q0058J24266J66756J10975O8469J379l0054L7625R0258
$$ -535413 -733618 -968942 -1049000 -924734 -757978 -647003 -578534 -577155 -607209 -569584 -479326
13806d79326M5704q490K522P2915J37480L3140j69279k25512j83379j05546j5020
$$ -479326 -433622 -442112 -439590 -366675 -229195 -196055 -365334 -590846 -774225 -879771 -894791
13795h94791r0615l96086o93867p05589l65132Q8101L48342M18665M02639L28736
$$ -894791 -985406 -1381492 -2075359 -2780948 -3146080 -3057979 -2709637 -2290972 -1888333 -1559597
13785a559597K45292K06088J72362L5751j19118j27636K9516K53269L31547K21075
$$ -1559597 -1314305 -1108217 -935855 -900104 -1019222 -1146858 -1117342 -864073 -532526 -311451
13775c11451Q7651Q6927J41382O7818j80691l99854l56800j78408j20518j47871
$$ -311451 -223800 -136873 4509 72327 -108364 -508218 -865018 -1043426 -1163944 -1311815
13765a311815r9350O3581K86837L78780K93797J56580J20091J33497J25547J15692
$$ -1311815 -1411165 -1347584 -1060747 -681967 -388170 -231590 -111499 21998 147545 263237
13755B63237J64157K34946K01510M8684o4689p6059r8099j89270k68700l23659
$$ 263237 427394 662340 863850 912534 847845 771786 673687 484417 215717 -107942
13745a07942m18082m36601k66022L857J63304K67707L64485L74304L41876K97403
$$ -107942 -526024 -962625 -1228647 -1224790 -1061486 -793779 -429294 -54990 286886 584289
13735E84289J55263K7816J3111J4096r9719k75931k58517j24655j94807l82344
$$ 584289 739552 767368 780479 794575 694856 418925 160408 35753 -159054 -541398
13725e41398m09090k88180j68844q7141j8239N0820P0678p5585k85351k96140
$$ -541398 -950488 -1238668 -1407512 -1494653 -1512892 -1462072 -1391394 -1466979 -1752330 -2048470
13715b048470m8290J50442J62838J22564K6613k3603M5513N8938O3835J81389
$$ -2048470 -2096760 -1946318 -1783480 -1660916 -1634303 -1657906 -1612393 -1553455 -1489620 -1308231
13705a308231K78623K90748K08775P3633l1964n3639J7931M5338m7676m9465R6891
$$ -1308231 -1029608 -738860 -530085 -456452 -488416 -542055 -524124 -478786 -526462 -575927 -479036
13694d79036J47334Q6673R6463J56950J0318l70637o47742o07283l20659m6796
$$ -479036 -331702 -245029 -148566 8384 18702 -351935 -999677 -1606960 -1927619 -1974415
13684a974415N7861J48911K80744L65604L33150K19266J49956J05806P0429J00900
$$ -1974415 -1916554 -1767643 -1486899 -1121295 -788145 -568879 -418923 -313117 -242688 -141788
13674a41788J38449J31582J20511M9132j31465k98557k62900l8002J96073K38818
$$ -141788 -3339 128243 248754 297886 166421 -132136 -395036 -433038 -236965 1853
13664A853P7769j53826k84660l10431l41387k67588q7855L799o8747r2425N2281
$$ 1853 79622 -74204 -358864 -669295 -1010682 -1278270 -1366125 -1362326 -1431073 -1523498 -1471217
13653a471217K83847M25200M22377L02006N3836j99254l26226k97663k60150k67468
$$ -1471217 -1187370 -762170 -339793 -37787 16049 -183205 -509431 -807094 -1067244 -1334712
13643a334712k24614j36722J8725K48454L97695L48118J51032L7834P7666J20167
$$ -1334712 -1559326 -1696048 -1677323 -1428869 -1031174 -683056 -532024 -494190 -416524 -296357
13633b96357O7334j8657k9552J04106L03079L44837K09252m1065k34242k23261
$$ -296357 -229023 -247680 -277232 -173126 129953 474790 684042 642977 408735 185474
13623A85474o1491Q1109j2000k36375k76374r4752J04402J58031Q6703j969n4487
$$ 185474 123983 205092 193092 -43283 -319657 -414409 -310007 -151976 -65273 -67242 -121729
13612a21729p1257J9527K43410L42711J87383j4405j06344j65648l17682m56566
$$ -121729 -192986 -173459 69951 412662 600045 585640 479296 313648 -4034 -460600
13602d60600l71214j43122M8035J79326K25502R2011r8138j84253j83045n3838
$$ -460600 -831814 -974936 -926901 -747575 -522073 -430062 -528200 -712453 -895498 -949336
13592i49336J17595J89507J82613P3029K6144J25629J81744J15527P3817K08870
$$ -949336 -831741 -642234 -459621 -386592 -360448 -234819 -53075 62452 136269 345139
13582C45139L58037L15555J03773n5076l2157J10783P6213j90822m03345l13753
$$ 345139 703176 1018731 1122504 1067428 1035271 1146054 1222267 1031445 628100 314347
13572C14347j15095o2637N3240L15413M03340K36546L0456n9033q1349j16259
$$ 314347 199252 136615 189855 505268 908608 1145154 1175610 1116577 1035228 918969
13562I18969j17076j11187j62718j69581j7483K18981L51636K94275K66675L20762
$$ 918969 801893 690706 527988 358407 340924 559905 911541 1205816 1472491 1793253
13552A793253K50938Q4795m4331k12261l84892k93415l0706J12342O8560j14761
$$ 1793253 2044191 2128986 2084655 1872394 1487502 1194087 1163381 1275723 1344283 1229522
13542A229522k74605k42033j56630r8400m5588L4321Q0480l6907j67804j98773
$$ 1229522 954917 712884 556254 457854 412266 446587 527067 490160 322356 123583
13532A23583k10074j69333q3531o9458r1981k2310J45012K86302K95074J51175
$$ 123583 -86491 -255824 -339355 -408813 -500794 -523104 -378092 -91790 203284 354459
13522C54459q0028k50912k18253r669J62793J64131K0634j33554j35093J6257
$$ 354459 274431 23519 -194734 -204403 -41610 122521 143155 9601 -125492 -109235
13512a09235J90898L01734K81727J65740J3561j75344l02281k56600k00235k90196
$$ -109235 81663 383397 665124 830864 844425 669081 366800 110200 -90035 -380231
13502c80231l60708k72386q5311J7735n5622k49464l14787O398L86400M35997
$$ -380231 -740939 -1013325 -1098636 -1080901 -1136523 -1385987 -1700774 -1694376 -1307976 -871979
13492h71979K29125o145j16414j38414j47965k19071l26243l01358n0515J91670
$$ -871979 -642854 -648999 -765413 -903827 -1051792 -1270863 -1597106 -1898464 -1948979 -1757309
13482a757309J86958k0667k52346k60940n7739J27048J59060R0241J8489N6524
$$ -1757309 -1570351 -1591018 -1843364 -2104304 -2162043 -2034995 -1875935 -1785694 -1767205 -1710681
13472a710681J34108J87599K32746K74235K87643J25189k05032m63737m10997
$$ -1710681 -1576573 -1388974 -1156228 -881993 -594350 -469161 -674193 -1137930 -1548927
13463a548927p0420L61493O10031M46951J32943q3544j73239o3987J63711K48922
$$ -1548927 -1619347 -1257854 -647823 -200872 -67929 -151473 -324712 -388699 -224988 23934
13453B3934M9606k33369k96238j15499J3860J4061J3883K8252m1751j20821q7754
$$ 23934 73540 -159829 -456067 -571566 -557706 -543645 -529762 -501510 -543261 -664082 -751836
13442g51836O6266K12661J74561K416J3874K17350K57648N5176j05115j11113
$$ -751836 -685570 -472909 -298348 -295932 -282058 -64708 192940 248116 143001 31888
13432C1888m7822M3563R9036O335j29026j19320m1600O2560K01228K22709J56701
$$ 31888 -15934 27629 126665 133000 3974 -115346 -156946 -94386 106842 329551 486252
13421D86252J54901K71025L49454K63788P6145j24643k45295j85773k9673N7556
$$ 486252 641153 912178 1261632 1525420 1601565 1476922 1231627 1045854 1016181 1073737
13411A073737M5440O236m0283o6991j29298j75329m5683J76912K78455J16868
$$ 1073737 1119177 1125413 1085130 1018139 888841 713512 667829 844741 1123196 1240064
13401A240064j51843k71932k43566k43742k28204j43650j072J85707L09746L15764
$$ 1240064 1088221 816289 572723 328981 100777 -42873 -43945 141762 451508 767272
13391G67272L36552M38619M25231K75011J72853O1611k2640l2576j47847k77295
$$ 767272 1103824 1542443 1967674 2242685 2415538 2477149 2454509 2421933 2274086 1996791
13381A996791l24924l44067l39426l00960j92896N996J20131P9637J52232L28879
$$ 1996791 1671867 1327800 988374 687414 494518 500514 620645 700282 852514 1181393
13371A181393K72861n5193l77276m73395l94036k22333k5019O6853J78415L60194
$$ 1181393 1454254 1399061 1021785 548390 154354 -67979 -92998 -26145 152270 512464
13361E12464M27386L88554L29989K66870M9387j69934q8814K16594L87713L29445
$$ 512464 939850 1328404 1658393 1925263 1974650 1804716 1715902 1932496 2320209 2649654
13351B649654J23918p0109j28775j96245k86875j67362L9068J1750j37122j64305
$$ 2649654 2773572 2703463 2574688 2378443 2091568 1924206 1963274 1975024 1837902 1673597
13341A673597j33143j77708k33204k58685k41776j72534p3961J54185L71460K47804
$$ 1673597 1540454 1362746 1129542 870857 629081 456547 382586 536771 908231 1156035
13331A156035J0791j5478p885r7822j67222j26958q6899n0358J7288P7167J78797
$$ 1156035 1166826 1151348 1143463 1045641 878419 751461 664562 614204 631492 708659 887456
13320H87456K83862K95477L10352L63735L12849J63722k4215j96610l00186l14411
$$ 887456 1171318 1466795 1777147 2140882 2453731 2617453 2593238 2396628 2096442 1782031
13310A782031k07619q8403j0512p023k19477n22175o57550n24470k47869m9561
$$ 1782031 1574412 1486009 1475497 1468474 1248997 726822 69272 -455198 -703067 -752628
13300g52628J33468L22134K79678J28826L5971k5934m4370m5095n3508p6043j07401
$$ -752628 -619160 -297026 -17348 111478 147449 121515 77145 32050 -21458 -97501 -204902
13289b04902j98427l43342m29890l54161j00217J99594M94056P88103Q80935Q05554
$$ -204902 -403329 -746671 -1176561 -1530722 -1630939 -1431345 -937289 -149186 731749 1537303
13279A537303O68809M44746L65735M02653L26232O8800j77027k45479k90921l67038
$$ 1537303 2206112 2650858 3016593 3419246 3745478 3814278 3637251 3391772 3100851 2733813
13269B733813l72422l25698l34887l34769j84698M9752Q3793j57781l08755k21034
$$ 2733813 2361391 2035693 1700806 1366037 1181339 1231091 1314884 1157103 848348 627314
13259F27314n8414J9576J9461N9778J23599J34522K1825k0358J17323K37159J66976
$$ 627314 568900 588476 607937 667715 791314 925836 947661 927303 1044626 1281785 1448761
13248A448761r6358k74455k19498o0167J4170j00107j66847n0612J5156l5218
$$ 1448761 1352403 1077948 858450 798283 812453 712346 545499 494887 510043 474825
13238D74825J1065J24038J58975K34042L51100L32887J86630Q3403L8379J5323
$$ 474825 485890 609928 768903 1002945 1354045 1686932 1873562 1956965 1995344 2010667
13228B010667P1829J74673K45962K85556L38149L95509L51229K43366R5892j71683
$$ 2010667 2082496 2257169 2503131 2788687 3126836 3522345 3873574 4116940 4212832 4041149
13218D041149l82491m44401l72866j97065m4116N8544Q8445J19258J11413K8905
$$ 4041149 3658658 3214257 2841391 2644326 2600210 2658754 2747199 2866457 2977870 3006775
13208C006775M2646Q9641m5022k10830k31986r4170M3028P1949k3159j38678k25877
$$ 3006775 3049421 3139062 3094040 2883210 2651224 2557054 2600082 2672031 2648872 2510194 2284317
13197B284317k40749j5083L26080M36311L27473J93266O7847j1236j6795M0669
$$ 2284317 2043568 2028485 2354565 2790876 3118349 3311615 3379462 3368226 3351431 3392100
13187C392100j0246k13895k89944j43504M2917J11654K45840M81436N43777K77295
$$ 3392100 3381854 3167959 2878015 2734511 2777428 2889082 3134922 3616358 4160135 4437430
13177D437430j79816m72572m81863l11062q860K18791K18752J89803K30141K48946
$$ 4437430 4257614 3785042 3303179 2992117 2983257 3202048 3420800 3610603 3840744 4089690
13167D089690K51852L74144M30425J93684j72387l56376k28964R9868L34836L36929
$$ 4089690 4341542 4715686 5146111 5339795 5167408 4811032 4582068 4681936 5016772 5353701
13157E353701L83574N35377N04848L19373K60418L15482L05431K84505L25643
$$ 5353701 5737275 6272652 6777500 7096873 7357291 7672773 7978204 8262709 8588352
13148H588352M05061N49693O03575M94528L24693J70016J45357K32881K69815
$$ 8588352 8993413 9543106 10146681 10641209 10965902 11135918 11281275 11514156 11783971
13139A1783971K49048K14169K00214K62890L99502N06597O00291P50636Q23856
$$ 11783971 12033019 12247188 12447402 12710292 13109794 13616391 14216682 14967318 15791174
13130A5791174P20305N83340N63822P19539J027719J294932J393475J402124J481489
$$ 15791174 16511479 17094819 17658641 18378180 19405899 20700831 22094306 23496430 24977919
13121B4977919J537307J512811J568154J867757K278875K511818K523817K426073
$$ 24977919 26515226 28028037 29596191 31463948 33742823 36254641 38778458 41204531
13113D1204531K417367K655026L004899L318161L689916M087512M412703M676292
$$ 41204531 43621898 46276924 49281823 52599984 56289900 60377412 64790115 69466407
13105F9466407M974615N439169O109416P002907Q183879R550156J1103321J2984769
$$ 69466407 74441022 79880191 85989607 92992514 101176393 110726549 121829870 134814639
13097A34814639J5221837J7793952K0654716K3479020K5761343K6586399K4027724
$$ 134814639 150036476 167830428 188485144 211964164 237725507 264311906 288339630
13090B88339630J5764433J290352j5685150k8902871l4682989l3865083k9499386
$$ 288339630 304104063 305394415 289709265 260806394 226123405 192258322 162758936
13083A62758936k4240634j9524028j5668959j2578510j0194476q369435o906184
$$ 162758936 138518302 118994274 103325315 90746805 80552329 72182894 65276710
13076F5276710n732115m923589m325098l750877l173067k525471j851518j284024
$$ 65276710 59544595 54621006 50295908 46545031 43371964 40846493 38994975 37710951
13068C7710951q87112o89451n67339k95518N9354L79853O25607P31974P84672
$$ 37710951 36823839 36134388 35567049 35271531 35330885 35710738 36336345 37068319 37852991
13059C7852991Q79967J111900J514309J926977K176919K251795K252860K434013
$$ 37852991 38732958 39844858 41359167 43286144 45463063 47714858 49967718 52401731
13051E2401731K763301L130956L484774L858070M388751M892496N304848N740246
$$ 52401731 55165032 58295988 61780762 65638832 70027583 74920079 80224927 85965173
13043H5965173O278538P040685Q048297R241332J0659433J2327106J4317975J6773961
$$ 85965173 92243711 99284396 107332693 116574025 127233458 139560564 153878539 170652500
13035A70652500J9777294K3392999K7485906L1783119L5831400L8078418L5277796
$$ 170652500 190429794 213822793 241308699 273091818 308923218 347001636 382279432
13028C82279432K3181151P23705k4874308m2344615m7019169m2496958l4403846
$$ 382279432 405460583 406184288 381309980 338965365 291946196 249449238 215045392
13021B15045392k6271150j9221014j3533125r328104o217746l636639j406025
$$ 215045392 188774242 169553228 156020103 146691999 140474253 136837614 135431589
13014A35431589M60604K092130L835693N971649Q401922J1052731J3948400J6969372
$$ 135431589 135892193 137984323 141820016 147791665 156193587 167246318 181194718 198164090
13006A98164090K0028766K3137815K5876188K6841161K3379861J2721770m693500
$$ 198164090 218192856 241330671 267206859 294048020 317427881 330149651 325456151
12999C25456151k3098430l5231782l8523137l5525065l0059028k4538206j9826822
$$ 325456151 302357721 267125939 228602802 193077737 163018709 138480503 118653681
12992A18653681j6001779j2897047j0397635q432947p047188o124289n236144
$$ 118653681 102651902 89754855 79357220 70924273 63877085 57752796 52516652
12985E2516652m354679l744978l311175k898430k533982k140138j677525j281735
$$ 52516652 48161973 44416995 41105820 38207390 35673408 33533270 31855745 30574010
12977C0574010j198516j311990j282945j073885r22418r04405q45740o04137l77473
$$ 30574010 29375494 28063504 26780559 25706674 24784256 23879851 23034111 22429974 22052501
12968B2052501l04793l43988m38901m57807l66856k96353k62254j44293N9799
$$ 22052501 21747708 21403720 20964819 20507012 20140156 19843803 19581549 19437256 19497055
12959A9497055K69797M27734N52225O12922N57002M68541M11801L53968K54043
$$ 19497055 19766852 20194586 20746811 21359733 21916735 22385276 22797077 23151045 23405088
12950B3405088K18521M28362R51074J508650J763766J732854J616505J565660
$$ 23405088 23623609 24051971 25003045 26511695 28275461 30008315 31624820 33190480
12942C3190480J612353J656943J672347J724478J801336J948117K219094K556008
$$ 33190480 34802833 36459776 38132123 39856601 41657937 43606054 45825148 48381156
12934D8381156K896376L329876L757626M072788M286177M419169M646057M995836
$$ 48381156 51277532 54607408 58365034 62437822 66723999 71143168 75789225 80785061
12926H0785061N533189O369424P459277Q637894J0060453J1981761J4233844J6641886
$$ 80785061 86318250 92687674 100146951 108784845 118845298 130827059 145060903 161702789
12918A61702789J9332946K2205393K4673905K6067376K5122804J9500268P372308
$$ 161702789 181035735 203241128 227915033 253982409 279105213 298605481 305977789
12911C05977789r537791k5300345l4334006l5704915l2199537k6995409k1838098
$$ 305977789 296439998 271139653 236805647 201100732 168901195 141905786 120067688
12904A20067688j7394170j3932256j1470137r723692q229404o805073n590405
$$ 120067688 102673518 88741262 77271125 67547433 59318029 52512956 46922551
12897D6922551m645974l940052l395256k888204k351197k012027j969022j984818
$$ 46922551 42276577 38336525 34941269 32053065 29701868 27689841 25720819 23736001
12889B3736001j866527j514727j116180r64374j079325j179133j179065j214543
$$ 23736001 21869474 20354747 19238567 18274193 17194868 16015735 14836670 13622127
12881A3622127j187860r28395n83158l91318m49768n55284n34801l74249j89581
$$ 13622127 12434267 11505872 10922714 10531396 10081628 9526344 8991543 8617294 8427713
12872H427713j62852j72142l7997J25913M5638j83097l43473l92698m12824n45477
$$ 8427713 8264861 8092719 8054722 8180635 8226273 8043176 7699703 7307005 6894181 6348704
12862F348704o83625o66683n43421m01963l26602k24579j07743q6314j72328k63010
$$ 6348704 5665079 4998396 4454975 4053012 3726410 3501831 3394088 3307774 3135446 2872436
12852B872436k38420j39745o3698k3450N5473K46562M34105N01317M32977K11047
$$ 2872436 2634016 2494271 2430573 2407123 2462596 2709158 3143263 3644580 4077557 4288604
12842D288604j8388p7981q9499j44796j38652P910K64173M64946L90607L2021
$$ 4288604 4270216 4192235 4102736 3957940 3819288 3827198 4091371 4556317 4946924 4978945
12832D978945k66116k57319j57103j15919q5517p5107j45193k69335k09181N195
$$ 4978945 4712829 4455510 4298407 4182488 4096971 4021864 3876671 3607336 3398155 3403350
12822C403350Q0004l4786j18987k8855L9706j37704l65406l74824k15138j7275
$$ 3403350 3483354 3448568 3329581 3300726 3340432 3202728 2837322 2462498 2247360 2230085
12812B230085J20984K43257L18287J01654k02468l28036k85646r4050J0987r5399
$$ 2230085 2351069 2594326 2912613 3014267 2811799 2483763 2198117 2104067 2115054 2019655
12802B019655j27445J523J5166o6918o251J77946K45237J59429M0811j56770k06644
$$ 2019655 1892210 1893733 1908899 1841981 1835730 2013676 2258913 2418342 2459153 2302383 2095739
12791B095739q0355j17974l52226n61578n96030m69159l32259k46974j56330j10176
$$ 2095739 2015384 1897410 1545184 983606 387576 -81583 -413842 -660816 -817146 -927322
12781i27322J8858K91622L13048J11402K2385M5228N0975k913O4908K39083L04388
$$ -927322 -908464 -616842 -303794 -192392 -170007 -124779 -73804 -76717 -11809 227274 531662
12770E31662J68168N531l0725P319P4139Q9434J7900K1155O1099k7616q3802l3865
$$ 531662 699830 705361 674636 681955 756094 845528 863428 884583 945682 918066 834264 800399
12758H00399L5890J49869K89413M22244M66778L12324L7649j11728j01627r5921
$$ 800399 836289 986158 1275571 1697815 2164593 2476917 2514566 2402838 2301211 2205290
12748B205290j62703j73490o2657O6369J19701J24882N8345k0037m1400m6492
$$ 2205290 2042587 1869097 1806440 1872809 1992510 2117392 2175737 2155700 2114300 2067808
12738B067808r0330j39177j47728q6884J29937L92511M45415J90234j65844l76462
$$ 2067808 1977478 1838301 1690573 1603689 1733626 2126137 2571552 2761786 2595942 2219480
12728B219480m07409l85800l32099j88802n1793p1314j70650j94112o0519Q4486
$$ 2219480 1812071 1426271 1094172 905370 853577 782263 611613 417501 356982 441468
12718D41468J43168J82071R7583l6104j10925j48173j70421j17327n623l9272
$$ 441468 584636 766707 864290 828186 717261 569088 398667 281340 275717 236445
12708B36445j71908j38758j6451l5323j16707j04190q411M2627J52053L29969
$$ 236445 64537 -74221 -90672 -125995 -242702 -346892 -355303 -312676 -160623 169346
12698A69346L61740K01886O360n0069Q239K8703M1027K9461o7169j22388m9850
$$ 169346 531086 732972 739332 689263 697502 726205 767232 796693 729524 607136 557286
12687E57286J06112J58354J06903N6642O204k5259j1634L1300M7450j525q5931
$$ 557286 663398 821752 928655 985297 991501 966242 954608 985908 1033358 1031833 945902
12676I45902j39423j58444j05707J5084Q9522O8089L9338m0422k05139l31486
$$ 945902 806479 648035 542328 557412 646934 715023 754361 713939 508800 177314
12666A77314k29383R6098L94505M32219J99524m8975k31734m22749m66817k26744
$$ 177314 -52069 44029 438534 870753 1070277 1021302 789568 366819 -99998 -326742
12656c26742P8683J81481M2496j46685k15607j12541L5054N4496K0167L9834J37542
$$ -326742 -248059 -66578 -24082 -170767 -386374 -498915 -463861 -409365 -389198 -349364 -211822
12645b11822L27517M77541M03830O3776k89905l36502q2976J82148K20858J18113
$$ -211822 115695 593236 997066 1060842 770937 434435 351459 533607 754465 872578
12635H72578J1316m0711l2734o999n8416j05357j15947j47143j79335j94703j26797
$$ 872578 883894 843183 810449 803450 745034 639677 523730 376587 197252 2549 -124248
12624a24248o5666j38541k25445j31912J34996M52170N48633K99298n2657j70656
$$ -124248 -189914 -328455 -553900 -685812 -550816 -98646 449987 749285 696628 525972
12614E25972p8573J496K9492K8615o8078j06171j6278Q5253K31715L71102L58293
$$ 525972 447399 448895 478387 507002 438924 332753 316475 401728 633443 1004545 1362838
12603A362838K35178R1488j5607j68141l47003l65749k24126p3864l3736m6939
$$ 1362838 1598016 1689504 1673897 1505756 1158753 793004 568878 495014 461278 414339
12593D14339q667L2151M7624N7759K1267q6677k09630k59047k04941o0949N0123
$$ 414339 405672 437823 485447 543206 564473 477796 268166 9119 -195822 -256771 -206648
12582b06648R7635J56408J68319N7730j09077k21485k35368j04366J21442L03469
$$ -206648 -109013 47395 215714 273444 164367 -57118 -292486 -396852 -275410 28059
12572B8059L28781K48544K00691J74213J06915L0064m1725p4648p1075j9311J21390
$$ 28059 356840 605384 806075 980288 1087203 1117267 1075542 1000894 929819 910508 1031898
12561A031898J86435L8802j27257j22388q6777j27679j41803m2797L2134J1357
$$ 1031898 1218333 1257135 1129878 1007490 920713 793034 651231 608434 640568 651925
12551F51925J7811O7229L6504J4006j2329j09574j83628k15788j84652j3746K57882
$$ 651925 669736 736965 773469 787475 775146 665572 481944 266156 81504 67758 325640
12540C25640L59718K05509R6778R3632N5017J5976o7337k62348m17928l09383
$$ 325640 685358 890867 987645 1081277 1136294 1152270 1084933 822585 404657 95274
12530I5274l1677J46339K03559K08891R2559r5571k55224k68544q3932J28008
$$ 95274 63597 209936 413495 622386 714945 619374 364150 95606 11674 139682
12520A39682J76027J05045J15050J69800K14004K18077J26690l6556k37587k70055
$$ 139682 315709 420754 535804 705604 919608 1137685 1264375 1227819 990232 720177
12510G20177l4895R6366j00354l37661m31644m63809m03728k96994k34345j18018
$$ 720177 685282 781648 681294 343633 -88011 -551820 -955548 -1252542 -1486887 -1604905
12500a604905P4134J90819J18733j396M0498J08692J27272K77631M32893L35795
$$ -1604905 -1530771 -1339952 -1221219 -1222615 -1182117 -1073425 -946153 -668522 -235629 100166
12490A00166J01212p5352j29416k03O1824p2090k48989m36918n60264m96651k79650
$$ 100166 201378 126026 -3390 -3593 58231 -13859 -262848 -699766 -1260030 -1756681 -2036331
12479b036331o1998J33627K19056J56582Q0381P4516J89743L76133M71932M74236
$$ -2036331 -2098329 -1964702 -1745646 -1589064 -1508683 -1434167 -1244424 -868291 -396359 77877
12469G7877L60476J45139o5020k54247l80409l95387k96286j97712o8866J20641
$$ 77877 438353 583492 518472 264225 -116184 -511571 -807857 -1005569 -1074435 -953794
12459i53794J52621J20082J80552K28278J82696J03819J95994L82174N09502N07322
$$ -953794 -801173 -681091 -500539 -272261 -89565 14254 210248 592422 1101924 1609246
12449A609246L40699Q8220j69194l02616l11793l19847l14339k06618k6114J71968
$$ 1609246 1949945 2038165 1868971 1566355 1254562 934715 620376 413758 387644 559612
12439E59612K05493N7840j00376k49637k95271j74335j16586k61887l47849k25197
$$ 559612 765105 822945 722569 472932 177661 3326 -113260 -375147 -722996 -948193
12429i48193r3593m6807O2628L39801N41889L39822j12392l59069k02181N9626
$$ -948193 -1041786 -1088593 -1025965 -686164 -144275 195547 83155 -275914 -478095 -418469
12419d18469K16418L06879K61473N8895j34295j82276j49287j16191p1034N4544
$$ -418469 -202051 104828 366301 425196 290901 108625 -40662 -156853 -227887 -173343
12409a73343J76298J95839Q8992j23631k05456j09877o0295j40179k32967j68719
$$ -173343 2955 198794 287786 164155 -41301 -151178 -211473 -351652 -584619 -753338
12399g53338k811O0647P6320J12463J13709J35973J40181L6381j78877l46102
$$ -753338 -756149 -695502 -619182 -506719 -393010 -257037 -116856 -80475 -259352 -605454
12389f05454l64540k72022j18328R0116L15484M80919N46201M76557K01112q2469
$$ -605454 -969994 -1242016 -1360344 -1270228 -954744 -473825 72376 548933 750045 667576
12379F67576j23855p9885j49110l25510l76886j77327J21980L69749N01143O01432
$$ 667576 543721 463836 314726 -10784 -387670 -564997 -443017 -73268 427875 1029307
12369A029307O55908N57134L13647k3351l50310m49250l03439r7828j2700n4853
$$ 1029307 1685215 2242349 2555996 2532645 2182335 1733085 1429646 1331818 1319118 1264265
12359A264265o1022j7628m6992j10625r6018l6830m5872j05200j79141k05724
$$ 1264265 1203243 1185615 1138623 1027998 931980 895150 849278 744078 564937 359213
12349C59213j20874j1795K9095O9333K01553L36696L54653J53548j82282l91355
$$ 359213 238339 226544 255639 324972 526525 863221 1217874 1371422 1189140 797785
12339G97785k91919M748J42198L5568n2422k7516l4899j22892k60626l20804k19321
$$ 797785 505866 510614 652812 688380 635958 608442 573543 450651 190025 -130779 -350100
12328c50100m7285P5170J8192r4989j0645J70140K21169J77258J02323O2535J1912
$$ -350100 -397385 -322215 -304023 -399012 -409657 -239517 -18348 158910 261233 323768 335680
12317C35680k246R2335J62320J07051N1086K6004m8156o6607j4109l6069q7749
$$ 335680 333434 425769 588089 695140 746226 772230 724074 657467 643358 607289 519540
12306E19540j89668k44010j43684o9236k3038J21497L09690L49689J99123n0355
$$ 519540 329872 85862 -57822 -127058 -150096 -28599 281091 630780 829903 779548
12296G79548k38948k53641o4727J92894L65431M55282M39937K15741j32977l08211
$$ 779548 540600 286959 222232 415126 780557 1235839 1675776 1891517 1758540 1450329
12286A450329k02570l7334J6961j1365n0760m1180Q1096J47030O2904r5884k70985
$$ 1450329 1247759 1210425 1227386 1216021 1165261 1124081 1205177 1352207 1415111 1319227 1048242
12275A048242l98406m89742l75740o2893J15860J53685K01372K03708J33584m305
$$ 1048242 649836 160094 -215646 -278539 -162679 -8994 192378 396086 529670 525365
12265E25365k42246l65105l62867m41142n27956m74004k42895m538P2100J44338
$$ 525365 283119 -81986 -444853 -885995 -1413951 -1887955 -2130850 -2135388 -2063288 -1918950
12255a918950K65649L98977M28892K61545Q9951M9448K1740j34830k55369j65716
$$ -1918950 -1653301 -1254324 -825432 -563887 -473936 -424488 -402748 -537578 -792947 -958663
12245i58663k0181j6122q3266j15194j44815j26768N2185K17784J63978n694k1220
$$ -958663 -978844 -994966 -1078232 -1193426 -1338241 -1465009 -1412824 -1195040 -1031062 -1036756 -1057976
12234a057976J02452J70900K35485L39375M09649L62959J57944o1717j70548k55898
$$ -1057976 -955524 -784624 -549139 -209764 199885 562844 720788 659071 488523 232625
12224B32625k73569j53510m2812r1362k19322j47560M6784J81848K49554K26233
$$ 232625 -40944 -194454 -237266 -328628 -547950 -695510 -648726 -466878 -217324 8909
12214H909J08655J0105M4290K40639M14937L67626J68773K5670M1079N3779k7759
$$ 8909 117564 127669 171959 412598 827535 1195161 1363934 1389604 1430683 1484462 1456703
12203A456703l6415R5276J31195j74969n26482o15159n54756l28598K4884K50695
$$ 1456703 1420288 1515564 1646759 1471790 945308 330149 -224607 -553205 -528321 -277626
12193b77626K85883R9060n6969k3758R84L1986J20447K44394L36357L57902K07042
$$ -277626 8257 107317 50348 26590 27574 59560 180007 424401 760758 1118660 1325702
12182A325702j19483l86251m25768k44423o327J29986P7920j27180k72422k11439
$$ 1325702 1206219 819968 394200 149777 143450 273436 351356 224176 -48246 -259685
12172b59685j25320k06325k93708j97403p6622r728J45685J72566J1473n4078
$$ -259685 -385005 -591330 -885038 -1082441 -1159063 -1168791 -1023106 -850540 -839067 -893145
12162h93145N7203K46137L76134M50740M42046K31048p089j32564j76921k06053
$$ -893145 -835942 -589805 -213671 237069 679115 910163 903074 770510 593589 387536
12152C87536k85051l92908m21345l42762j39045J29586K89051L17236K29410J16581
$$ 387536 102485 -290423 -711768 -1054530 -1193575 -1063989 -774938 -457702 -228292 -111711
12142a11711J24002K46210L65273L71121K27716L5065q9388j48997k85402m51672
$$ -111711 12291 258501 623774 994895 1222611 1257676 1168288 1019291 733889 282217
12132B82217m85762m22813l04497j22831L497O7640Q4073P7457J14553J06813
$$ 282217 -203545 -626358 -930855 -1053686 -1050189 -982549 -898476 -821019 -706466 -599653
12122e99653q391o8329l932Q8512J16517K0957o4418q6992j48520j26551R1054
$$ -599653 -608044 -676373 -680305 -591793 -475276 -454319 -518737 -605729 -754249 -880800 -789746
12111g89746K62638J75360j8760j60825k13949j93059k20147k40227j87397j24305
$$ -789746 -527108 -351748 -370508 -531333 -745282 -938341 -1158488 -1398715 -1586112 -1710417
12101a710417n8105n281L155R709Q2081K78051N17190O60310O31733M07405J49317
$$ -1710417 -1768522 -1773803 -1770648 -1760939 -1678858 -1400807 -883617 -223307 408426 815831 965148
12090I65148j08961m07592n64212m78410k36208k454P2232J50083L03384M20720
$$ 965148 856187 448595 -115617 -594027 -830235 -832689 -760457 -610374 -306990 113730
12080A13730L82347K04585L8448o4345k31529l88787l54095j79292K6806J93097
$$ 113730 496077 700662 739110 674765 443236 54449 -299646 -478938 -452132 -259035
12070b59035K61306K79533L08094L18111K92579J58914K4721n5495p1376o7607
$$ -259035 2271 281804 589898 908009 1200588 1359502 1384223 1328728 1257352 1189745
12060A189745j37471k63737l43769k53416p5058K8348O2607P2876J27404J93102
$$ 1189745 1052274 788537 444768 191352 116294 144642 207249 280125 407529 600631
12050F00631J36683M221LO1728K2286M2472J92890K38658J41063p0518k63781
$$ 600631 737314 741535 741538 803266 825552 868024 1060914 1299572 1440635 1370117 1106336
12039A106336l26608l45520k48887l2987J19206O1479o2731p2383k0588L4072
$$ 1106336 779728 434208 185321 152334 271540 333019 270288 197905 177317 211389
12029B11389O7563n9197k37440l05728l00872k29041j04082Q2082K39178K75599
$$ 211389 278952 219755 -17685 -323413 -624285 -853326 -957408 -875326 -636148 -360549
12019c60549K34612J15685J1374m0534n9075K4283K06504L57649L39946J11952
$$ -360549 -125937 -10252 1122 -39412 -98487 -74204 132300 489949 829895 941847
12009I41847j79267k62274k51933l23058k96390j31658K3769J73267K01944L8128
$$ 941847 762580 500306 248373 -74685 -371075 -502733 -478964 -305697 -103753 -65625
11999f5625j54049j56819P8551K59646K86641K34402J96788K24212K68266K93503
$$ -65625 -219674 -376493 -297942 -38296 248345 482747 679535 903747 1172013 1465516
11989A465516K39031L9010j41665j58955j20578j36040j74506k06254j94993j63630
$$ 1465516 1704547 1743557 1601892 1442937 1322359 1186319 1011813 805559 610566 446936
11979D46936j69388j2403L83033O11312M34477P0348j96564l01627l44598l83712
$$ 446936 277548 265145 648178 1259490 1693967 1764315 1567751 1266124 921526 537814
11969E37814l60389j93282J4977P6750j0077j08177j57686j43207q1504j14743
$$ 537814 177425 -15857 -880 75870 65793 -42384 -200070 -343277 -424781 -539524
11959e39524j76063q3339o906n4808r5582k1193J34846K89839L38376K24774J09970
$$ -539524 -715587 -798926 -805832 -860640 -956222 -977415 -842569 -552730 -214354 10420 120390
11948A20390O5968m4049j49037j88749k15546j51396K7157K34945L53060K48664
$$ 120390 186358 142309 -6728 -195477 -411023 -562419 -535262 -300317 52743 301407
11938C01407r889j48748o6732J28562K23524O8404O264K26172M34485M01741J83538
$$ 301407 291518 142770 76038 204600 428124 496528 502792 728964 1163449 1565190 1748728
11927A748728m6319j64848k70020l49323l22625k33820k04840k72135l07765k56848
$$ 1748728 1702409 1537561 1267541 918218 595593 361773 156933 -115202 -422967 -679815
11917f79815j86213l1103J89366K94660J98798j1371j37290j76274k05260k03106
$$ -679815 -866028 -897131 -707765 -413105 -214307 -225678 -362968 -539242 -744502 -947608
11907i47608m9372J23306J77897K53936K85985K49468K78292L12968K61716O5160
$$ -947608 -996980 -873674 -695777 -441841 -155856 93612 371904 684872 946588 1011748
11897A011748k45371m86153m70513l41447k32601j20349j2734O6243J42455K33138
$$ 1011748 766377 280224 -190289 -531736 -764337 -884686 -897420 -831177 -688722 -455584
11887d55584K71540K62093K28982J14614n8055k22375l27129l40541l16056k33567
$$ -455584 -184044 78049 307031 421645 363590 141215 -185914 -526455 -842511 -1076078
11877a076078j17274m2673j3267Q601Q4608J80313J83097J56834J92542J20885
$$ -1076078 -1193352 -1236025 -1249292 -1240691 -1156083 -975770 -792673 -635839 -443297 -322412
11867c22412j97637m43730k81585L8746K28539L37115K65960N1005j69097k92822
$$ -322412 -520049 -963779 -1245364 -1206618 -978079 -640964 -375004 -323999 -493096 -785918
11857g85918k26881k3972J93827K89601K35276R7504P557L2526P5525L3960j01837
$$ -785918 -1012799 -1036771 -842944 -553343 -318067 -220563 -213006 -180480 -104955 -70995 -172832
11846a72832j41389j09124m3070L7696Q64n8489o820j2498q8803p1108p5961j05739
$$ -172832 -314221 -423345 -466415 -428719 -427855 -486344 -493164 -505662 -594465 -665573 -741534 -847273
11834h47273M8464K60485K76610K25185K03491J20842o5379k81826l18123k05538
$$ -847273 -798809 -538324 -261714 -36529 166962 287804 222425 -59401 -377524 -583062
11824e83062q0706l213M0498k1096k30685l61846j71350J95871M41164N00315
$$ -583062 -663768 -666981 -626483 -647579 -878264 -1240110 -1411460 -1215589 -774425 -274110
11814b74110N04020M75558L97735K37285l4065k30512k79625l09984k57253m4110
$$ -274110 229910 705468 1103203 1340488 1306423 1075911 796286 486302 229049 184939
11804A84939K41872M19844L27823Q5160j01211k52566l01647k21405k60960l66002
$$ 184939 426811 846655 1174478 1259638 1158427 905861 604214 382809 121849 -244153
11794b44153k91661j16096M1119K11750K34252J06779J9528J1224K7294J1270
$$ -244153 -535814 -651910 -610791 -399041 -164789 -58010 -38482 -27258 36 11306
11784A1306j07564k23657k39881k25906k82111l33345k56443n7053R1233K05205
$$ 11306 -96258 -319915 -559796 -785702 -1067813 -1401158 -1657601 -1714654 -1623421 -1418216
11774a418216K18957R9456J22318L33716M40358K83696l6110k33985j73415N3847
$$ -1418216 -1199259 -1099803 -977485 -643769 -203411 80285 44175 -189810 -363225 -309378
11764c09378K43047K26569J17051R7133J68443J39234O860m8701k0806m2862j26830
$$ -309378 -66331 160238 277289 374422 542865 682099 688959 640258 619452 576590 449760
11753D49760j96196k22949k13889j95844j26102j07795k15197k30027r0765J07484
$$ 449760 253564 30615 -183274 -379118 -505220 -613015 -828212 -1058239 -1149004 -1041520
11743a041520J84760R1206P458J24289K48653J97772M5898j67162l13330k31195
$$ -1041520 -856760 -765554 -758096 -633807 -385154 -187382 -141484 -308646 -621976 -853171
11733h53171J835K0280j17642j66303j30944q3269l7136q0984j12278n4700p791
$$ -853171 -851336 -831056 -948698 -1115001 -1245945 -1329214 -1366350 -1447334 -1559612 -1614312 -1622103
11722a622103J11702K28419J86380R8689Q8016J26038J12859K4833p9181l8647
$$ -1622103 -1510401 -1281982 -1095602 -996913 -908897 -782859 -670000 -645167 -724348 -762995
11712g62995J37146K51643L09546L08865J11052j63073l02058l09774k35583j16671
$$ -762995 -625849 -374206 -64660 244205 355257 192184 -109874 -419648 -655231 -771902
11702g71902j31663k16024j66347n3476J17485K99607L19014J83306k3977j24012
$$ -771902 -903565 -1119589 -1285936 -1339412 -1221927 -922320 -603306 -420000 -443977 -567989
11692e67989n3961N045P4924K11335K50846J44009M8879o3717k56902l54912l41392
$$ -567989 -621950 -616905 -541981 -330646 -79800 64209 113088 49371 -207531 -562443 -903835
11681i03835l43486l32059k77139k19571k24573l28324m43121l90396m9405N06682
$$ -903835 -1247321 -1579380 -1856519 -2076090 -2300663 -2628987 -3072108 -3462504 -3511909 -3005227
11671c005227Q03375O58552L83402K24797J60649O1138q8813k32066k88313k44262
$$ -3005227 -2201852 -1543300 -1159898 -935101 -774452 -713314 -802127 -1034193 -1322506 -1566768
11661a566768j55090j27986j67765j10412R3642J44530M154q6765l0659J54628
$$ -1566768 -1721858 -1849844 -2017609 -2128021 -2034379 -1889849 -1885695 -1972460 -2003119 -1848491
11651a848491L41433M31458M39232L48729K35982J94541J27611J0349o0886m7791
$$ -1848491 -1507058 -1075600 -636368 -287639 -51657 142884 270495 280844 219958 172167
11641A72167N2901J53331J59341k342k29495l76020m75653l87328j23290K1667
$$ 172167 225068 378399 537740 535398 305903 -70117 -545770 -933098 -1056388 -1034721
11631a034721J6730p8999k68738m73957m36578p7578L27372N17302M77587M64754
$$ -1034721 -1017991 -1096990 -1365728 -1839685 -2276263 -2353841 -2026469 -1509167 -1031580 -566826
11621e66826M70478L11373O7871j50980k17018j04387L3493J02052N2491M7183
$$ -566826 -96348 215025 282896 131916 -85102 -189489 -155996 -53944 -1453 45730
11611D5730J40180J44025J55154L05849L57060J89570R290j10148k31663k91940
$$ 45730 185910 329935 485089 790938 1147998 1337568 1346858 1236710 1005047 713107
11601G13107l00798l04643l08269l25819j91812J06555K73045J90495J2316n2820
$$ 713107 412309 107666 -200603 -526422 -718234 -611679 -338634 -148139 -135823 -188643
11591a88643k9906n3298j05852n5974M0277Q7462N1586K5658J00197J87638K04960
$$ -188643 -218549 -271847 -377699 -433673 -393396 -305934 -254348 -228690 -128493 59145 264105
11580B64105J20590Q679M1423K25906K52919R2443N3651J6580r7783j79042l17467
$$ 264105 384695 393374 434797 660703 913622 1006065 1059716 1076296 978513 799471 482004
11569D82004l60883k36897q7330P60l644m1354N1510K04141J89185K5192j25353
$$ 482004 121121 -115776 -203106 -202346 -205990 -247344 -195834 8307 197492 222684 97331
11558I7331j42711o3392p9202j80035k25111k00384j13180K4877J55087K06106
$$ 97331 -45380 -108772 -187974 -368009 -593120 -793504 -906684 -881807 -726720 -520614
11548e20614J32923k9683j39359m4900J60566K61044K31070K19671K01781R4970
$$ -520614 -387691 -417374 -556733 -601633 -441067 -180023 51047 270718 472499 567469
11538E67469o1108k22384l12789k16501m5932J13839K58651L39092L38399K30130
$$ 567469 506361 283977 -28812 -245313 -291245 -177406 81245 420337 758736 988866
11528I88866L7162j52967k49647j57380J11523L93819M68474K50929o4623j53254
$$ 988866 1026028 873061 623414 466034 577557 971376 1439850 1690779 1626156 1472902
11518A472902l9242J0675j30715k07260m3859N3385K3402k5475j04294k00472
$$ 1472902 1433660 1444335 1313620 1106360 1062501 1115886 1139288 1113813 1009519 809047
11508H09047k82845k28745j5298J59139K07785J33817l2627j08310k7876J07696
$$ 809047 526202 297457 282159 441298 649083 782900 750273 641963 614087 721783
11498G21783K47422J83707n9337j09536Q3365K60443L23732K52531J64165R5502
$$ 721783 969205 1152912 1093575 984039 1067404 1327847 1651579 1904110 2068275 2163777
11488B163777k7826j75785k83458m19079n77428o09950l14568J13285L06393K74127
$$ 2163777 2135951 1960166 1676708 1257629 680201 70251 -244317 -131032 175361 449488
11478D49488J09449j93920l61384k84575j46975m0760P5862J32032N3285k5995
$$ 449488 558937 365017 3633 -280942 -427917 -468677 -392815 -260783 -207498 -233493
11468b33493q1553j76794k32861j78832j61950k44020k26856r7648l1314q2530
$$ -233493 -315046 -491840 -724701 -903533 -1065483 -1309503 -1536359 -1634007 -1665321 -1747851
11458a747851K6186L88513O18321M95853K42930O7435q6257k44055m06656m45502
$$ -1747851 -1721665 -1333152 -714831 -218978 23952 91387 5130 -238925 -645581 -1091083
11448a091083k23384P0037L37912N12850L94015J96846J00623M5068l3421j46312
$$ -1091083 -1314467 -1244430 -906518 -393668 347 197193 297816 342884 309463 163151
11438A63151j74673j90813l46661l61135k0001L20110L24134R5050j48221l52963
$$ 163151 -11522 -202335 -548996 -910131 -930132 -610022 -285888 -190838 -339059 -692022
11428f92022m87426m29564j81093N9168J78757L04919M69419N03538L44438J10553
$$ -692022 -1179448 -1609012 -1790105 -1730937 -1552180 -1247261 -777842 -274304 70134 180687
11418A80687q0197j82268r4565J30935K34879K17871J59433P8866N7518M1186
$$ 180687 100490 -81778 -176343 -45408 189471 407342 566775 645641 703159 744345
11408G44345q6742k36151k86907j98849P182J72712J36200l6086o0875r026J369
$$ 744345 657603 421452 134545 -64304 -57122 115590 251790 215704 154829 145803 147172
11397A47172M0106M9509m5277o7529L7909J01424J06183J5648j44890k88566k62928
$$ 147172 187278 236787 191510 123981 161890 263314 369497 385145 240255 -48311 -311239
11386c11239j01209o0887j30799j45722m6979K7728q27n0334r5396j72907k81963
$$ -311239 -412448 -473335 -604134 -749856 -796835 -769107 -769934 -820268 -915664 -1088571 -1370534
11375a370534l44393k61624K1073K81509K58215O6674j19520k21708j69312Q2120
$$ -1370534 -1714927 -1976551 -1955478 -1673969 -1415754 -1349080 -1468600 -1690308 -1859620 -1777500
11365a777500M66954P91634Q50137O27242L78587K20332J9704j58118r6972J52519
$$ -1777500 -1310546 -518912 331225 958467 1337054 1557386 1577090 1418972 1322000 1474519
11355A474519L31915L38207K35677O8658q9906j52244j63438j96862k40674j84347
$$ 1474519 1806434 2144641 2380318 2448976 2359070 2206826 2043388 1846526 1605852 1421505
11345A421505o5851m1358p9105p6799n4491m9408P6813J51136J9708j64038k63943
$$ 1421505 1355654 1314296 1235191 1158392 1103901 1054493 1131306 1282442 1302150 1138112 874169
11334H74169k09539j51856k04798k91628l35798l16645k52686j33583j48041l18263
$$ 874169 664630 512774 307976 16348 -319450 -636095 -888781 -1022364 -1170405 -1488668
11324a488668l54697j59715J12840K94224K89232K43981K23811J77626J39108
$$ -1488668 -1843365 -2003080 -1890240 -1596016 -1306784 -1062803 -838992 -661366 -522258
11315e22258O7542j7706j13688k55887k03356J4346R5775J31947J63644J14878
$$ -522258 -454716 -472422 -586110 -841997 -1045353 -1031007 -935232 -803285 -639641 -524763
11305e24763P3131M5710K7445J31703K93961K82584J22111j26867l84178m76747
$$ -524763 -451632 -405922 -378477 -246774 47187 329771 451882 325015 -59163 -535910
11295e35910m30940k09915N8517J94117K58357K87427K62070K41289K68457K37140
$$ -535910 -966850 -1176765 -1118248 -924131 -665774 -378347 -116277 125012 393469 630609
11285F30609K16687K31390J38917m8106l80937p85789r29969o42201j66936J78215
$$ 630609 847296 1078686 1217603 1169497 788560 2771 -927198 -1569399 -1736335 -1558120
11275a558120L32551L10719J95484K9232j82420l43406l59289k31186j04020k5455
$$ -1558120 -1225569 -914850 -719366 -690134 -872554 -1215960 -1575249 -1806435 -1910455 -1935910
11265a935910J30468L21826L14716J93290K47602L63461L63957J95924j38349
$$ -1935910 -1805442 -1483616 -1168900 -975610 -728008 -364547 -590 195334 56985
11256E6985l17624k33916q1217R1135J44517L8359n7688j00343p5834P2222K92342
$$ 56985 -260639 -494555 -575772 -484637 -340120 -301761 -359449 -459792 -535626 -463404 -171062
11245a71062M01286L25151K30416K31517J64238l6997k65742l61453l37415l04551
$$ -171062 230224 555375 785791 1017308 1181546 1144549 878807 517354 179939 -124612
11235a24612k40040j57402l7221K00190M00700M18812K54847j0332j44653q2346
$$ -124612 -364652 -522054 -559275 -359085 41615 460427 715274 704942 560289 477943
11225D77943p222m1833j24537j95814r2343J16160J78289Q7902p429r6827j31818
$$ 477943 470721 428888 304351 108537 16194 132354 310643 398545 391116 294289 162471
11214A62471r9106r7649j50055k38063k68162j58795m3170m6664j2341J04368
$$ 162471 63365 -34284 -184339 -422402 -690564 -849359 -892529 -939193 -951534 -847166
11204h47166J26431k465j04608j00736r9482o3264L7333M1638N280J38816J99608
$$ -847166 -720735 -723200 -827808 -928544 -1028026 -1091290 -1053957 -1012319 -1007039 -868223 -668615
11193f68615J5905k20897k73744o9230J49196J32247q1732j80360o1085M3778
$$ -668615 -652710 -873607 -1147351 -1216581 -1067385 -935138 -1016870 -1197230 -1258315 -1214537
11183a214537Q0938J60679J69735N6080k6749N3252K20220K88974K51380Q5608
$$ -1214537 -1133599 -972920 -803185 -747105 -773854 -720602 -500382 -211408 39972 125580
11173A25580q0059j35757j35768m5701J02706J90595J18833j4538j0493K1319
$$ 125580 45521 -90236 -226004 -271705 -168999 21596 140429 125891 115398 136717
11163A36717q0389k22278k50771q6569J30763J83240J92683K41324K89602K76395
$$ 136717 56328 -165950 -416721 -503290 -372527 -189287 3396 244720 534322 810717
11153H10717J25599k9065j09542j41698k4141J99725L37231K73175J7109k45094
$$ 810717 936316 907251 797709 656011 631870 831595 1168826 1442001 1459110 1214016
11143A214016l74494l36414j58714M6702J81523K08990J53225J74458K33868J33775
$$ 1214016 839522 503108 344394 391096 572619 781609 934834 1109292 1343160 1476935
11133A476935k2782k0703k0096l8123J9524K0070m0606K958J4240k31788m10447
$$ 1476935 1454153 1433450 1413354 1375231 1394755 1414825 1374219 1377177 1391417 1159629 749182
11122G49182k92722j64815q1750O2292Q4190r6323k29967l14707l96244l43593
$$ 749182 456460 291645 209895 272187 356377 260054 30087 -284620 -680864 -1024457
11112a024457r2387K30646M21802M18024K74449J2045k42984k78971p1043J41551
$$ -1024457 -1116844 -886198 -464396 -46372 228077 240122 -2862 -281833 -352876 -211325
11102b11325K07806Q0214k54142n26463m98515l47603j90160M4499K57902L89065
$$ -211325 -3519 76695 -177447 -703910 -1202425 -1550028 -1740188 -1695689 -1437787 -1048722
11092a048722L93809K82856J86676J67917J60052J38110P4615m4405r3588j23079
$$ -1048722 -654913 -372057 -185381 -17464 142588 280698 355313 310908 217320 94241
11082I4241k15452k90830k70042j93651j40028o9786P3726J80390K07125K29829
$$ 94241 -121211 -412041 -682083 -875734 -1015762 -1085548 -1011822 -831432 -624307 -394478
11072c94478K25629J73615J08833N8755K4526J1383j4750q4180q7751N9008K01324
$$ -394478 -168849 4766 113599 172354 196880 208263 193513 109333 21582 80590 281914
11061B81914K46441J68933M6898j62278l97334m03584j63452J36683K49220O3803
$$ 281914 528355 697288 744186 581908 184574 -219010 -382462 -245779 3441 67244
11051F7244k43817k98093J7128L55880L97292P4694k49050k52922k8845J73478
$$ 67244 -176573 -474666 -457538 -101658 295634 370328 121278 -131644 -160489 12989
11041A2989K78845K97989J93674M5202q1052j70264k11934j18317N3796J12398
$$ 12989 291834 589823 783497 828699 747647 577383 365449 247132 300928 413326
11031D13326J60673J74485Q4268P8690J15509O445k20339l40924l34632k42602
$$ 413326 573999 748484 832752 911442 1026951 1033396 813057 472133 137501 -105101
11021a05101j14379L0162J44141J4576l10057m31932l27964j48933o351O3963
$$ -105101 -219480 -189318 -45177 -30601 -340658 -772590 -1100554 -1249487 -1255838 -1191875
11011a191875J63364K87138L17351J38435j36677k17708n4035J78408K50098K05340
$$ -1191875 -1028511 -741373 -424022 -285587 -422264 -639972 -694007 -515599 -265501 -60161
11001f0161J96485J84871J02256N3938O9501l6104k80674m91460m37763k17699
$$ -60161 136324 321195 423451 477389 546890 510786 230112 -261348 -699111 -916810
10991i16810n9441R8645L29355M53793L37860J09309n427j9356j03211k59473
$$ -916810 -976251 -877606 -548251 -94458 243402 352711 347284 327928 224717 -34756
10981c4756l38027l00166j57089J50558M86504N34596K84131K4741j9564N2632
$$ -34756 -372783 -672949 -830038 -679480 -192976 341620 625751 650492 630928 683560
10971F83560P8174P1700J49341K31017K15542P8202j81518m06637m27086l13879
$$ 683560 761734 833434 982775 1213792 1429334 1507536 1326018 919381 492295 178416
10961A78416k47810j83633l2561J15556J40624j1513k64401l59674j97024O1641
$$ 178416 -69394 -253027 -285588 -170032 -29408 -40921 -305322 -664996 -862020 -800379
10951h00379K84909L99419L88256K86535J25291P0303J31975L0204k16257l15453
$$ -800379 -515470 -116051 272205 558740 684031 754334 886309 916513 700256 384803
10941C84803j82360J8422J13355M5024j88967l99500l93523k13853L2061K26867
$$ 384803 202443 220865 334220 379244 190277 -209223 -602746 -816599 -784538 -557671
10931e57671L12171K58999O3830k00855l74538l45671l07097l56740k94043n4804
$$ -557671 -245500 13499 77329 -123526 -498064 -843735 -1150832 -1507572 -1801615 -1856419
10921a856419J35213J72873N9515j25343k05819j91925j34890o804R4402Q6104
$$ -1856419 -1721206 -1548333 -1488818 -1614161 -1819980 -2011905 -2146795 -2153599 -2059197 -1973093
10911a973093J0339j7659M6777J14690K45187M45848N43652M85113L53060K60192
$$ -1973093 -1962754 -1980413 -1933636 -1818946 -1573759 -1127911 -584259 -99146 253914 514106
10901E14106J36137p9738k29780j87943M9165L26532M37648K51380j5304r0941
$$ 514106 650243 570505 340725 152782 201947 528479 966127 1217507 1202203 1111262
10891A111262l0528N3102J04229Q9046k1325k00141l28099k81751m1852K29319
$$ 1111262 1080734 1133836 1238065 1327111 1305786 1105645 777546 495795 453943 683262
10881F83262L12502J13444k83141n57463n59018m74205l62225k71346j68878k6270
$$ 683262 995764 1109208 826067 268604 -290414 -764619 -1126844 -1398190 -1567068 -1593338
10871a593338M0078N5865R1451J13084J09064J19395J36346J43139J06275m6960
$$ -1593338 -1553260 -1497395 -1405944 -1292860 -1183796 -1064401 -928055 -784916 -678641 -725601
10861g25601j76586j39426j889K11212L54088L35709L05733K86350J94102J83107
$$ -725601 -902187 -1041613 -1043502 -832290 -478202 -142493 163240 449590 643692 826799
10851H26799K36887P9633k09688m48333n52008m51677k72043k23004l36342l67990
$$ 826799 1063686 1143319 933631 485298 -66710 -518387 -790430 -1013434 -1349776 -1717766
10841a717766j53307J29725K82491L83202L75757J95050L8339J5263L0431P0402
$$ -1717766 -1871073 -1741348 -1458857 -1075655 -699898 -504848 -466509 -451246 -420815 -350413
10831c50413J28665P9913j16240l76929n78371o30262m50332p9614L01206M81290
$$ -350413 -221748 -141835 -258075 -635004 -1213375 -1843637 -2293969 -2373583 -2072377 -1591087
10821a591087L52960Q5887m3404m0336o8699p1510J02489L14864L97015L21166
$$ -1591087 -1238127 -1152240 -1195644 -1235980 -1304679 -1376189 -1273700 -958836 -561821 -240655
10811b40655J87358P6926M5184J87262M39540N21033K89285M9628l8847r0543
$$ -240655 -53297 23629 68813 256075 695615 1216648 1505933 1555561 1516714 1426171
10801A426171j35325j54945j63120k23100k84409k60703j98753r7032J06135K55915
$$ 1426171 1290846 1135901 972781 749681 465272 204569 5816 -91216 14919 270834
10791B70834J40101j3900O9168L47083N82912O75674O29744L30523j56204m67096
$$ 270834 410935 397035 466203 813286 1396198 2071872 2701616 3032139 2875935 2408839
10781B408839m31324k09626M5004R8830p9259j86059j6103L10873N05560L88797
$$ 2408839 1977515 1767889 1812893 1911723 1832464 1646405 1630302 1941175 2446735 2835532
10771B835532N5669k09618l31917l29831j51003M4126M3121m9466p7606q3237
$$ 2835532 2891201 2681583 2349666 2019835 1868832 1912958 1956079 1906613 1829007 1745770
10761A745770j24429k02681l02488k94044q1438J18438J11910N3720Q2470J35315
$$ 1745770 1621341 1418660 1116172 822128 740690 859128 971038 1024758 1107228 1242543
10751A242543Q4844l4605j03448m6770L6810J7571M640J55593L80206M60946L43586
$$ 1242543 1327387 1292782 1189334 1142564 1179374 1196945 1201585 1357178 1737384 2198330 2541916
10740B541916O6095j97994k89781k99531k82808k49103j85671q2896n7888j88889
$$ 2541916 2608011 2410017 2120236 1820705 1537897 1288794 1103123 1020227 962339 773450
10730G73450l05670k48102j42157o0281P1091K31738M07517N49479N03495L21569
$$ 773450 467780 219678 77521 17240 88331 320069 727586 1277065 1780560 2102129
10720B102129K31995K66418K83843K09542P0553j19038k27990j54411J5343P1803
$$ 2102129 2334124 2600542 2884385 3093927 3164480 3045442 2817452 2663041 2678384 2750187
10710B750187j9503j14977j48629p3955J12447L52939M21264K89737J42080J45870
$$ 2750187 2730684 2615707 2467078 2393123 2505570 2858509 3279773 3569510 3711590 3857460
10700C857460K11151K24504K13127Q9373j69903m94539o92742n56749j82455Q9475
$$ 3857460 4068611 4293115 4506242 4595615 4425712 3931173 3238431 2681682 2499227 2588702
10690B588702J33804J45321K42261L62357L65249L21330K63844R6846m510Q9237
$$ 2588702 2722506 2867827 3110088 3472445 3837694 4159024 4422868 4519714 4515204 4604441
10680D604441K09295K32462K06298J32992M3187J34748K55287J41280k5026p889
$$ 4604441 4813736 5046198 5252496 5385488 5428675 5563423 5818710 5959990 5934964 5927075
10670E927075R3829N1811j25701k61606l14149l37620l02507k50094j79357k3720
$$ 5927075 6020904 6072715 5947014 5685408 5371259 5033639 4731132 4481038 4301681 4277961
10660D277961J27111K25706K75909J60226o6230k31945l51463l95199l00159k13614
$$ 4277961 4405072 4630778 4906687 5066913 5000683 4768738 4417275 4022076 3721917 3508303
10650C508303k54442k90946k23043j60398k05034k42818k20882j58600p2893k4890
$$ 3508303 3253861 2962915 2739872 2579474 2374440 2131622 1910740 1752140 1679247 1654357
10640A654357r7542k19570j73138k5299j33o3269o8011O6227K92846M67210N27179
$$ 1654357 1556815 1337245 1164107 1138808 1138675 1075406 1007395 1073622 1366468 1833678 2360857
10629B360857M23630J80181n0801j42600j93942k63982j94627J3761J77139K13174
$$ 2360857 2784487 2964668 2913867 2771267 2577325 2313343 2118716 2132477 2309616 2522790
10619B522790J99210J52872J54624K40367K88290J93259P525n9624O9513L07100
$$ 2522790 2722000 2874872 3029496 3269863 3558153 3751412 3758937 3699313 3768826 4075926
10609D075926N89041R22812J289223J548396J556280J302875P94612M8868p17966
$$ 4075926 4664967 5587779 6877002 8425398 9981678 11284553 12079165 12128033 11410067
10600A1410067j180417j266472j101499q37138n87462l35249k11334k81024k86117
$$ 11410067 10229650 8963178 7861679 7024541 6437079 6101830 5890496 5609472 5323355
10591E323355k94406m52841o35259o47888m32956j87879o7230N9306K07467K39663
$$ 5323355 5028949 4576108 3940849 3292961 2860005 2672126 2604896 2664202 2871669 3111332
10581C111332J98558R055l12922n22996n33186l80713j28244J42776L39210M88984
$$ 3111332 3309890 3318945 3006023 2483027 1949841 1569128 1440884 1583660 1922870 2411854
10571B411854N91611M45483P1056j52971j28479j3441K00032L75603K97933Q6087
$$ 2411854 3003465 3448948 3520004 3367033 3238554 3225113 3425145 3800748 4098681 4184768
10561D184768j11310k82953m15140m12914l54384k97503k30455j88545r8794M9943
$$ 4184768 4073458 3790505 3375365 2962451 2608067 2310564 2080109 1891564 1792770 1842713
10551A842713K38788L63518L31942J61876k3951o8875Q441R5654K56867M09141
$$ 1842713 2081501 2445019 2776961 2938837 2914886 2846011 2854452 2950106 3206973 3616114
10541C616114L04100l0732l52491m24178l50818k81190j03468J30313K14860J88663
$$ 3616114 3920214 3889482 3536991 3112813 2761995 2480805 2377337 2507650 2722510 2911173
10531B911173J63722J48055J79471K02818O1259j73106l09804k46795j08481m8216
$$ 2911173 3074895 3222950 3402421 3605239 3666498 3493392 3183588 2936793 2828312 2780096
10521B780096o6408R04K77068M49620L64862K41850K76545L46825K46088k308
$$ 2780096 2713688 2714592 2991660 3441280 3806142 4047992 4324537 4671362 4917450 4915142
10511D915142j49991j32908j43907l22371n21296n47237n01874m93070n08286
$$ 4915142 4765151 4632243 4488336 4165965 3644669 3097432 2595558 2102488 1594202
10502A594202n29331m70031k95167j61076j74781j58664N5981K75221L54820M31456
$$ 1594202 1064871 594840 299673 138597 -36184 -194848 -138867 136354 491174 922630
10492I22630M95800N27370N77100M75703J91521j87348n95406q73451p13494j54543
$$ 922630 1418430 1945800 2522900 2998603 3190124 3002776 2407370 1533919 820425 665882
10482F65882L02020L64595J36091j23370p8607K77710N72165N88296L13750o4562
$$ 665882 967902 1332497 1468588 1345218 1266611 1544321 2116486 2704782 3018532 2953970
10472B953970k47804k39617k13091j71830o3614J71709M48925N26597L87986K50573
$$ 2953970 2706166 2466549 2253458 2081628 2018014 2189723 2638648 3165245 3553231 3803804
10462C803804J11264r6398j78521j49475k05516l03890l01481j71760r8086j95208
$$ 3803804 3915068 3818670 3640149 3490674 3285158 2981268 2679787 2508027 2409941 2214733
10452B214733k36509j02917N7865J77004J41222P9855M1943j04173k30861k36721
$$ 2214733 1978224 1875307 1933172 2110176 2251398 2331253 2373196 2269023 2038162 1801441
10442A801441k04730q4185j5611j78796l61392k90819l8308J32650J54184Q5809
$$ 1801441 1596711 1512526 1496915 1318119 956727 665908 627600 760250 914434 1000243
10432A000243P7155J33199J58890J49742K07039L69901N19491N70884O25750O99384
$$ 1000243 1077398 1210597 1369487 1519229 1726268 2096169 2615660 3186544 3812294 4511678
10422D511678O96252M62609J37225j08062k91503l22675k58518k74326l01830
$$ 4511678 5207930 5670539 5807764 5699702 5408199 5085524 4827006 4552680 4250850
10413D250850k83146k91551k37047j15128M456J43490K22402M9895k59804m20708
$$ 4250850 3967704 3676153 3439106 3323978 3328434 3471924 3694326 3744221 3484417 3063709
10403C063709k99489l8237J23742J52826J75569K95413K88023p121k71803k93523
$$ 3063709 2764220 2725983 2849725 3002551 3178120 3473533 3761556 3754435 3482632 3189109
10393C189109k17862k35165k85282k64477j61897q1401j09287k20803k74730k28279
$$ 3189109 2971247 2736082 2450800 2186323 2024426 1943025 1833738 1612935 1338205 1109926
10383A109926j89715j33115k324O8595O6939J05862J56865J54357J47270K30798
$$ 1109926 920211 787096 784772 853367 920306 1026168 1183033 1337390 1484660 1715458
10373A715458L81678M66224L29063J55754K37084N49630P13059O23320N34805
$$ 1715458 2097136 2563360 2892423 3048177 3285261 3834891 4547950 5171270 5706075
10364E706075M61121K47416j5308j10352j44573j64659L7577M02989P00896Q92823
$$ 5706075 6167196 6414612 6399304 6288952 6144379 5979720 6017297 6420286 7121182 8014005
10354H014005R63226R89588J072294J121136R60754L99686m08463j028200j319458
$$ 8014005 8977231 9966819 11039113 12160249 13121003 13520689 13112226 12084026 10764568
10345A0764568j345776j135189q30679o29197n75317n40877m30491m19418n41818
$$ 10764568 9418792 8283603 7452924 6823727 6248410 5707533 5277042 4857624 4315806
10336D315806o46382o53143l98066p3127l4049k45635m85601n60141l21451N5353
$$ 4315806 3669424 3016281 2618215 2545088 2511039 2265404 1779803 1219662 898211 953564
10326I53564K77645K12256K578j03500j17022j20875p4598o906K588o8980j22560
$$ 953564 1231209 1443465 1446043 1342543 1225521 1104646 1030048 1023142 1025730 956750 834190
10315H34190o8638K1374J7328j13902k32373k12687j19606r9695j16782j06441
$$ 834190 765552 786926 804254 690352 457979 245292 125686 25991 -90791 -197232
10305a97232j10288p1468Q712J1717k6215j2503J0497o1317j24393k0295J03714
$$ -197232 -307520 -378988 -370276 -358559 -384774 -397277 -386780 -448097 -572490 -592785 -489071
10294d89071R0812n265L4933K01278K40487J18990N7044J73021L53187L82365
$$ -489071 -398259 -403524 -368591 -167313 73174 192164 249208 422229 775416 1157781
10284A157781K16540m3600k00898j91951j41535j33132k14187k87977l10720k86599
$$ 1157781 1374321 1330721 1129823 937872 796337 663205 449018 161041 -149679 -436278
10274d36278j52497Q638J38320J71190J30230J59278K54177K82166J21217l5842
$$ -436278 -588775 -580137 -441817 -270627 -140397 18881 273058 555224 676441 640599
10264F40599l6700R0570K13970K19249J44271K9552j48334l55944m48636l37874
$$ 640599 603899 694469 908439 1127688 1271959 1301511 1153177 797233 348597 10723
10254A0723j14847Q3640J15408m1654j88831k46704k19960p7908O8406J11349
$$ 10723 -104124 -20484 94924 53270 -135561 -382265 -602225 -680133 -611727 -500378
10244e00378J06515R9138K24004M05490L40539J39770J93j6090L0191J8563j8
$$ -500378 -393863 -294725 -70721 334769 675308 815078 815271 799181 829372 847935 847917
10233H47917j07439l07534l24681j21611J05417K67682K85223K21480Q5914j49514
$$ 847917 740478 432944 108263 -13348 92069 359751 644974 866454 952368 802854
10223H02854k98067k27697P023K41097L05064J79674N7372M7903N4612o0387j95927
$$ 802854 504787 277090 284113 525210 830274 1009948 1067320 1115223 1169835 1109448 913521
10212I13521k56965l08836k88525j49812k4722K9871O4738P003j20230j40111
$$ 913521 656556 347720 59195 -90617 -115339 -85468 -20730 -13727 -133957 -274068
10202b74068m0718J07542K37151K07796P0267K9599K0167j44273l35252k26757
$$ -274068 -314786 -207244 29907 237703 307970 337569 357736 213463 -121789 -348546
10192c48546J58991M42325M80800M39529L98541K47587n3048k25484k19386j87114
$$ -348546 -189555 252770 733570 1173099 1571640 1819227 1766179 1540695 1321309 1134195
10182A134195j91181k70213l76796m03967l77299l65701l34290j51024Q1878J06430
$$ 1134195 943014 672801 296005 -107962 -485261 -850962 -1185252 -1336276 -1254398 -1147968
10172a147968k1922j00470k6896J13746J91857J51710Q172r6782j28813j77546
$$ -1147968 -1169890 -1270360 -1297256 -1183510 -991653 -839943 -831771 -928553 -1057366 -1234912
10162a234912j94416o4754J48030L10318M08078N06141O10960N60735K58033o4033
$$ -1234912 -1429328 -1494082 -1346052 -1035734 -627656 -121515 489445 1050180 1308213 1244180
10152A244180j98725k51546k47945j78813j61667j58725k0313J39591J69840J30133
$$ 1244180 1045455 793909 545964 367151 205484 46759 26446 166037 335877 466010
10142D66010M7665m9223j25075k37963l47402l10495j96643r2318k3633o1534
$$ 466010 513675 464452 339377 101414 -245988 -556483 -753126 -845444 -869077 -930611
10132i30611p4828m1690j37740k70360k20557J2512J64942J39483P7526J74182
$$ -930611 -1005439 -1047129 -1184869 -1455229 -1675786 -1663274 -1498332 -1358849 -1281323 -1107141
10122a107141M64790N53623K28176j13062k50812k29017p9290J08072K08355J82614
$$ -1107141 -642351 -88728 139448 26386 -224426 -453443 -532733 -424661 -216306 -33692
$$ [...]
##END NTUPLES=NMR SPECTRUM
##END=
