##TITLE=C13_Ser 2066-NEA
 CDCl3, 22400 sc

 12.2.2024
##JCAMPDX= 6.0         $$ Bruker NMR JCAMP-DX V2.0
##DATA TYPE= NMR SPECTRUM
##DATA CLASS= NTUPLES
##ORIGIN= UXNMR, Bruker Analytische Messtechnik GmbH
##OWNER= root
$$ XWIN-NMR		Version 3.5
$$ Tue Feb 13 13:43:48 2024 Russian Standard Time (UT+4h)  she@DPX200
##.OBSERVE FREQUENCY= 50.327896
##.OBSERVE NUCLEUS= ^13C
##.ACQUISITION MODE= SIMULTANEOUS
##.ACQUISITION SCHEME= undefined
##.AVERAGES= 22401
##.DIGITISER RES= 17
##SPECTROMETER/DATA SYSTEM= spect
##.PULSE SEQUENCE= zgpg30
##.SOLVENT NAME= CDCl3
##.SHIFT REFERENCE= (INTERNAL, CDCl3, 0, 222.756)
##AUDIT TRAIL= $$ (NUMBER, WHEN, WHO, WHERE, WHAT)
$$ ##TITLE= Audit trail, XWIN-NMR		Version 3.5
$$ ##JCAMPDX= 5.01
$$ ##ORIGIN= Bruker BioSpin GmbH
$$ ##OWNER= she
$$ F:/spectra/data/she/nmr/c13/1/pdata/1/auditp.txt
$$ ##AUDIT TRAIL=  $$ (NUMBER, WHEN, WHO, WHERE, WHAT)
(   1,<2024-02-13 13:40:09.15 +0400>,<she>,<DPX200>,
      <created by zg, POWCHK disabled, PULCHK disabled
       terminated by command 'halt'
       configuration hash MD5:
       00 E9 B6 7A A2 85 ED C7 34 08 36 98 17 FE 4E 26
       data hash MD5: 32K
       52 CA 65 B3 72 E3 8B B5 69 9C 84 41 69 A0 A6 2E>)
(   2,<2024-02-13 13:40:13.25 +0400>,<she>,<DPX200>,
      <Start of raw data processing
       efp BC_mod = 2 LB = 2 FT_mod = 6 PKNL = 1 PHC0 = -378.6081 PHC1 = 26.21886 SI = 32K 
       data hash MD5: 32K
       9F E5 89 C8 B1 52 2A 89 23 31 84 BB 2F 45 DF 44>)
(   3,<2024-02-13 13:40:25.51 +0400>,<she>,<DPX200>,
      <abs ABSG = 5 
       data hash MD5: 32K
       47 AC 5B CC 88 D4 07 64 8E 6B 18 42 A4 62 A5 F4>)
(   4,<2024-02-13 13:41:13.50 +0400>,<she>,<DPX200>,
      <pk PHC0 = -2.309788 PHC1 = 11.4 
       data hash MD5: 32K
       06 61 3C 7B 10 9C 32 84 65 FA D1 01 A0 94 80 95>)
(   5,<2024-02-13 13:41:17.25 +0400>,<she>,<DPX200>,
      <abs ABSG = 5 
       data hash MD5: 32K
       9F D8 5E 6B 16 E6 DB 46 42 5F 1F 58 E5 0D E9 E7>)
(   6,<2024-02-13 13:42:04.87 +0400>,<she>,<DPX200>,
      <pk PHC0 = 23.78779 PHC1 = -30.6 
       data hash MD5: 32K
       0B 57 6C F8 E0 29 B4 83 62 52 F1 B1 7B 53 98 7B>)
(   7,<2024-02-13 13:42:08.85 +0400>,<she>,<DPX200>,
      <abs ABSG = 5 
       data hash MD5: 32K
       A0 A7 7A F4 5A B6 B9 CD 1D D5 69 0A A7 DC 48 DA>)
(   8,<2024-02-13 13:42:56.29 +0400>,<she>,<DPX200>,
      <pk PHC0 = -14.66225 PHC1 = 19.8 
       data hash MD5: 32K
       A1 35 81 9B 24 4D B4 D7 09 1F C9 CF 55 CF 59 C5>)
(   9,<2024-02-13 13:42:59.56 +0400>,<she>,<DPX200>,
      <abs ABSG = 5 
       data hash MD5: 32K
       98 08 1F 33 5C A3 CA 37 E9 F7 67 DA 38 B4 41 88>)
$$ ##END=
$$ 
$$ hash MD5
$$ CB 22 F4 AE E0 6E 99 05 12 56 CA E3 42 2C 7F D1
##$RELAX= 
##$RELAX= 
##$RELAX= 
##$RELAX= 
##$RELAX= 
##$RELAX= 
##$RELAX= 
##$RELAX= 
$$ Bruker specific parameters
$$ --------------------------
##$DU= <F:/spectra>
##$EXPNO= 1
##$NAME= <c13>
##$PROCNO= 1
##$TYPE= <nmr>
##$USER= <she>
##$AMP= (0..31)
$$ [...]
##$SUBNAM4= <"">
##$SUBNAM5= <"">
##$SUBNAM6= <"">
##$SUBNAM7= <"">
##$SUBNAM8= <"">
##$SUBNAM9= <"">
##$SW= 239.972175391363
##$SWIBOX= (0..15)
0 1 3 0 0 0 0 0 0 0 0 0 0 0 0 0 
##$SW_h= 12077.2946859903
##$TD= 32768
##$TD0= 1
##$TE= 0
##$TE2= 300
##$TE3= 300
##$TEG= 300
##$TL= (0..7)
120 120 120 120 120 120 120 120 
##$TP= (0..7)
150 150 150 150 150 150 150 150 
##$TP07= 0
##$TPNAME0= <>
##$TPNAME1= <>
##$TPNAME2= <>
##$TPNAME3= <>
##$TPNAME4= <>
##$TPNAME5= <>
##$TPNAME6= <>
##$TPNAME7= <>
##$TPOAL= (0..7)
0.5 0.5 0.5 0.5 0.5 0.5 0.5 0.5 
##$TPOFFS= (0..7)
0 0 0 0 0 0 0 0 
##$TUNHIN= 0
##$TUNHOUT= 0
##$TUNXOUT= 0
##$USERA1= <user>
##$USERA2= <user>
##$USERA3= <user>
##$USERA4= <user>
##$USERA5= <user>
##$V9= 5
##$VALIST= <valist>
##$VCLIST= <CCCCCCCCCCCCCCC>
##$VD= 0
##$VDLIST= <DDDDDDDDDDDDDDD>
##$VPLIST= <PPPPPPPPPPPPPPP>
##$VTLIST= <TTTTTTTTTTTTTTT>
##$WBST= 1024
##$WBSW= 4
##$XGAIN= (0..3)
0 0 0 0 
##$XL= 0
##$YL= 0
##$YMAX_a= 137251460
##$YMIN_a= -118652781
##$ZGOPTNS= <>
##$ZL1= 120
##$ZL2= 120
##$ZL3= 120
##$ZL4= 120
##$ABSF1= 222.7558
##$ABSF2= -17.24104
##$ABSG= 5
##$ABSL= 3
##$ALPHA= 0
##$AQORDER= 0
##$ASSFAC= 0
##$ASSFACI= 0
##$ASSFACX= 0
##$ASSWID= 0
##$AUNMP= <proc_1d>
##$AZFE= 0.1
##$AZFW= 0.5
##$BCFW= 0
##$BC_mod= 2
##$BYTORDP= 0
##$COROFFS= 0
##$CY= -3
##$DATMOD= 1
##$DC= 0
##$DFILT= <>
##$DTYPP= 0
##$F1P= 0
##$F2P= 0
##$FCOR= 0.5
##$FTSIZE= 32768
##$FT_mod= 6
##$GAMMA= 0
##$GB= 0
##$INTBC= 1
##$INTSCL= 4.134877e-10
##$ISEN= 128
##$LB= 2
##$LEV0= 0
##$LPBIN= 0
##$MAXI= 10000
##$MC2= 0
##$MEAN= 0
##$ME_mod= 0
##$MI= 0.1934396
##$NCOEF= 0
##$NC_proc= 0
##$NLEV= 6
##$NOISF1= 120.0001
##$NOISF2= 80.00006
##$NSP= 0
##$NTH_PI= 0
##$NZP= 0
##$OFFSET= 222.7558
##$PC= 1.4
##$PHC0= -371.7924
##$PHC1= 26.81886
##$PH_mod= 1
##$PKNL= yes
##$PPARMOD= 0
##$PSCAL= 0
##$PSIGN= 0
##$REVERSE= no
##$SF= 50.3227249666721
##$SI= 32768
##$SIGF1= 140
##$SIGF2= 120
##$SINO= 11.81781
##$SIOLD= 32768
##$SREGLST= <13C.CDCl3>
##$SSB= 0
##$STSI= 32768
##$STSR= 0
##$SW_p= 12077.2946859903
##$SYMM= 0
##$S_DEV= 0
##$TDeff= 32768
##$TDoff= 0
##$TI= <>
##$TILT= no
##$TM1= 0
##$TM2= 0
##$TOPLEV= 0
##$USERP1= <user>
##$USERP2= <user>
##$USERP3= <user>
##$USERP4= <user>
##$USERP5= <user>
##$WDW= 1
##$XDIM= 32768
##$YMAX_p= 461515457
##$YMIN_p= -7298061
$$ End of Bruker specific parameters
$$ ---------------------------------
##NTUPLES= NMR SPECTRUM
##VAR_NAME=  FREQUENCY,     SPECTRUM/REAL,   SPECTRUM/IMAG
##SYMBOL=    X,             R,               I
##VAR_TYPE=  INDEPENDENT,   DEPENDENT,       DEPENDENT
##VAR_FORM=  AFFN,          ASDF,            ASDF
##VAR_DIM=   32768,         32768,           32768
##UNITS=     HZ,            ARBITRARY UNITS, ARBITRARY UNITS
##FACTOR=    0.368581032318806, 1,           1
##FIRST=     11209.6787745874, 0,            0
##LAST=      -867.615911402871, 0,           0
##MIN=       -867.615911402871, -7298061,    0
##MAX=       11209.6787745874, 461515457,    0
$$ Real data points
##PAGE= N=1
##DATA TABLE= (X++(R..R)), XYDATA
$$ [...]
15666A167145k47174l56166j99876K3715Q4914O1715j3315k23193k42071m257
15656E1437J2172k25062m24489m36955k40193L6725J54690L1132j78198k31642
15646a450383q1290L27662P90371Q72148L36361k97889l63217j89019k23342j88006
15636d66604r016n3103l95547o00988n10340m18484l84913k29464j25813j33256
15626c327528m9254K73636M49886J57951m8868K24683M68693L40002K24806K55905
15616a030088K40534K44502L39839M12946J69408o9448Q9470K13785K06004J87116
15606A004068j28364o01556p73869o71198l25459J4421K13659M63645O19921N45477
15596C60745L41011J53263R9834K80289M60809M59373L99987K71573q8428l86525
$$ y = [1167145, 919971, 563805, 363929, 387644, 472558, 534273, 520958, 297765, 55694, 51437, 63609, -161453, -585942, -1022897, -1263090, -1226365, -1071675, -1040543, -1218741, -1450383, -1531673, -1204011, -413640, 458508, 794869, 496980, 133763, -55256, -278598, -466604, -475620, -528723, -924270, -1525258, -2035598, -2454082, -2838995, -3068459, -3194272, -3327528, -3376782, -3103146, -2653260, -2495309, -2544177, -2319494, -1850801, -1510799, -1285993, -1030088, -789554, -545052, -205213, 207733, 377141, 307693, 397163, 610948, 816952, 1004068, 875704, 274148, -499721, -1170919, -1496378, -1481957, -1268298, -804653, -184732, 360745, 701756, 855019, 954853, 1235142, 1695951, 2155324, 2555311, 2826884, 2738456, 2351931]
15586B351931l94355m06918m72692l99626k09213k09553k70347m9068K82386K88922
15576E11467q6128l17680k83043k51547j74500r1208l24431n05637k80386j31049
15566a934142k54431l92162k51675J82194P22529Q46015J92719n77722p21677
15557b188352m66307l05411m46548n29455l05731J3107L47855N90482P10146O11237
15547a968977K47985M3416J90210L36627K29757J50707L09908N74113P85484N54237
15537A453467q9107p05540r60254o80173k84964K7394K33616Q2752k86468l01029
15527a510306N4843K58525J70043j5237p0076L1042K37092K75514r9168p65394
15517a433122j061741o45477P1266M33358J66602q0905K86289Q25510R63464P27817
$$ y = [2351931, 1957576, 1550658, 1077966, 678340, 469127, 259574, -10773, -59841, 222545, 511467, 425339, 107659, -175384, -426931, -601431, -692639, -1017070, -1522707, -1803093, -1934142, -2188573, -2580735, -2832410, -2650216, -1927687, -1081672, -888953, -1466675, -2188352, -2654659, -2960070, -3406618, -3936073, -4241804, -4228697, -3880842, -3290360, -2580214, -1968977, -1720992, -1677576, -1487366, -1150739, -920982, -770275, -460367, 113746, 899230, 1453467, 1364360, 658820, -301434, -981607, -1266571, -1239177, -1005561, -922809, -1209277, -1510306, -1455463, -1196938, -1026895, -1042132, -1112208, -1081166, -844074, -568560, -667728, -1433122, -2494863, -3140340, -3069074, -2635716, -2469114, -2550019, -2263730, -1438220, -474756, 253061]
15507B53061K95981o8158k57769k08461j54885l08471l67106l4124L01466K36816
15497c11650J0747l3069j92413m41971m75263k81154Q068K73111M16445L72627
15487f54522L86903M56934L68399P2809k26924k86984j41460o9538J03934L94705
15477D04256L78763l7108n31575p31782m82212m4868J11112l9555j69801k3560
15467a166330K69003M64575N66458M57978J33202j37101k83139j67192K1278O6034
15457B24766k934q8529P2111K83134J22010k68363n62129n57183j61545L77714
15447e60948O77150P96144N99649M330k82881J38756N75409P40195R10053P75025
15437D372882l587q97712j335324j269196r31622o56798m40345k07790P0450J47431
$$ y = [253061, 549042, 480884, 223115, 14654, -140231, -448702, -815808, -849932, -548466, -311650, -300903, -333972, -526385, -968356, -1443619, -1724773, -1716705, -1443594, -1027149, -654522, -267619, 189315, 557714, 630523, 403599, 116615, -24845, -94383, 9551, 404256, 783019, 745911, 214336, -517446, -999658, -1044526, -933414, -972969, -1142770, -1166330, -897327, -432752, 133706, 591684, 724886, 587785, 304646, 137454, 158732, 224766, 221832, 133303, 205414, 488548, 610558, 342195, -219934, -777117, -938662, -560948, 116202, 912346, 1511995, 1516325, 1233444, 1372200, 1947609, 2687804, 3597857, 4372882, 4369295, 3471583, 2136259, 867063, -64559, -721357, -1161702, -1369492, -1299042, -1151611]
15427a151611N5638J13031M098l49893n79032n93297k36402M92839J031208J006891
15417b06530M77241k18402o40493m76787R9936N42852N69349L91729L96481N34725
15407A470101N42224K40542l41098p44935o83905l36329L7118L99897O34057N48936
15397A766608L44839J68344N0305o3215k42798m92125q48824j116959r54343n33129
15387a921297k30271Q9692N39413P03358N13048L13548J67511J9241q1717j48289
15377c5763k34978l53158l71401k66468j92305j35425j4836L9998o043j66391
15367a736770l28369j39517M13993Q48663R35497O27360J53066k85884m97909
15358i870l70112j63373n4037p2713j99984j80310K3025O4098j63862m15210m74556
$$ y = [-1151611, -1095973, -982942, -978844, -1328737, -1907769, -2501066, -2737468, -2244629, -1213421, -206530, 270711, 52309, -588184, -1064971, -965035, -422183, 147166, 538895, 935376, 1470101, 2012325, 2252867, 1911769, 1166834, 482929, 146600, 183718, 583615, 1217672, 1766608, 2111447, 2279791, 2330096, 2266881, 2024083, 1531958, 683134, -433825, -1388168, -1921297, -2151568, -2061876, -1522463, -819105, -306057, 7491, 175002, 194243, 112526, -35763, -270741, -623899, -995300, -1261768, -1454073, -1589498, -1604334, -1564336, -1570379, -1736770, -2065139, -2204656, -1790663, -942000, -6503, 620857, 773923, 488039, -9870, -379982, -543355, -597392, -670105, -870089, -1050399, -1027374, -963276, -1127138, -1542348, -2016904]
15347b016904k24929J67157L02099L61036L24957J85589L06917N02810M23752
15338C32484J32718r2292j26273Q9003L05808J51008k54108m59039l58416j50644
15328d29751J32604J83946j06420j85283J26727M20628L00050P842r7292k23379
15318A29672l31572k18405N5501J54492n8885l27006m46750n19993o31532n47032
15308b741510l67633k34147j24425N0406L46514O24295O56882N16985M00700L62501
15298e09432M44157N02564L50268Q1647o7771j20544j87949m65544r09866j029037
15288a911507n93669R1287P44077J008488O10657J98899K96635M32003L90706
15279A267576K90555O7597j74415o3610K18186K17266l3464m27473p02325o63292
$$ y = [-2016904, -2241833, -2074676, -1772577, -1411541, -1086584, -900995, -594078, -91268, 332484, 465202, 372910, 246637, 335640, 641448, 792456, 538348, 79309, -279107, -429751, -297147, -113201, -219621, -404904, -278177, 142451, 442501, 450343, 353051, 129672, -201900, -420305, -364804, -210312, -269197, -596203, -1042953, -1562946, -2194478, -2741510, -3109143, -3343290, -3467715, -3417309, -3070795, -2446500, -1789618, -1272633, -871933, -509432, -65275, 437289, 787557, 869204, 801433, 680889, 492940, 27396, -882470, -1911507, -2505176, -2413889, -1669812, -661324, -50667, 148232, 444867, 876870, 1267576, 1558131, 1625728, 1451313, 1387703, 1605889, 1823155, 1789691, 1362218, 659893, -3399]
15269c399l68239j26410j88208n11796o62314j16096P53294J032409P15264M20118
15259I44623K70280K04161N7952k53325m81843m54032m32611n80446o36596l18025
15249a679862J79995M08581J84695J4509L8443j50278k59090M9766M38197L74886
15239d00158R2349J4783N5472N0304l6084l69242p47387o71171k44173J23751
15229b131556J50687R2178L09795N22781L98327J16809M3861K4882q1608R3615
15219d60229M70632O14473N82606K85440j95915l56046k63312j02716r816j52986
15209D12131m17246o72030q29311p12797m04979K0755M33268O24392P23546P85778
15199c6493N73604O5257n02921p93044n70893O8542N54557L50622k72132o82392
$$ y = [-3399, -371638, -498048, -686256, -1198052, -1860366, -1976462, -1223168, -190759, 524505, 944623, 1214903, 1419064, 1477016, 1223691, 741848, 287816, -144795, -725241, -1361837, -1679862, -1499867, -1091286, -906591, -892082, -853639, -1003917, -1263007, -1213241, -775044, -400158, -307809, -293026, -237554, -187250, -223334, -592576, -1339963, -2011134, -2255307, -2131556, -1980869, -1888691, -1578896, -1056115, -657788, -540979, -497118, -472236, -553844, -460229, 10403, 624876, 1207482, 1492922, 1297007, 940961, 677649, 574933, 565117, 412131, -5115, -677145, -1506456, -2219253, -2624232, -2603477, -2170209, -1545817, -822271, -36493, 537111, 602368, 99447, -693597, -1264490, -1195948, -641391, -290769, -562901, -1245293]
15189a245293p10213l92700K59603P03125M58199k4157j11029J69878M27100O38225
15179A72738P31769N34345L05628J00435q7659j45403k19399k41007j14568k7544
15169A009335Q3040K16620K54693K28475J41130l9905q9915L0182K01588L08409
15159B343652L27549M03365M81057L49329m4656m71299o66990n10497k65230k49407
15149A696873m69979o19014n56296m76837m90396m18085k54986q3664J37252J11527
15139a423605j56875k92039k50654r7448j9795j51504j42072K75842P23701P37016
15129g97433M31137Q8228k59673m38857l16982K5767K72348L75563L62495O6725
15119a90682k09811k94465l37757k16913K9214O0055L5823O5742J83353K79359
$$ y = [-1245293, -1955506, -2348206, -2088603, -1385478, -927279, -951436, -1062465, -892587, -465487, 172738, 904507, 1438852, 1744480, 1844915, 1757256, 1611853, 1392454, 1151447, 1036879, 1009335, 1092375, 1308995, 1563688, 1792163, 1933293, 1893388, 1803473, 1833655, 2035243, 2343652, 2671201, 3074566, 3555623, 3904952, 3860296, 3388997, 2722007, 2211510, 1946280, 1696873, 1226894, 607880, 51584, -425253, -915649, -1333734, -1588720, -1672384, -1535132, -1423605, -1580480, -1872519, -2123173, -2220621, -2240416, -2391920, -2533992, -2258150, -1534449, -797433, -366296, -278068, -537741, -976598, -1293580, -1267813, -995465, -619902, -257407, -190682, -400493, -694958, -1032715, -1249628, -1220414, -1160359, -1124536, -1058794, -875441, -596082]
15109e96082P6935k02652k61227o4620J76754J02684k70155n00232l14057K12320
15099a640332O45153O45381K76304j50048l34839j56473K36499M73898M43612
15090D39155K94887J44041J9414j24619k63102k91761j34832J04580J98260K22925
15080F08948L07296L76159L31195k2377o34869r27498p28418l28187j8284N8080
15070i77955Q5069K66321N28629N37007L20304K67602K93122J65513J01441J13452
15060A700505r5042l39773m36945l93042j11084L08611M71812J51296k45676k93853
15050G16809r9462P2771J71350J81433L3773j89780l34626k20280J12362L88566
15040H32916N39290M56456Q4371k86033k77740K94839Q33324Q98303N59653K802
$$ y = [-596082, -519147, -721799, -983026, -1047646, -870892, -768208, -1038363, -1538595, -1852652, -1640332, -995179, -349798, -73494, -223542, -558381, -714854, -478355, -4457, 439155, 734042, 878083, 897497, 772878, 509776, 218015, 83183, 187763, 386023, 608948, 916244, 1292403, 1623598, 1601221, 966352, 38854, -689564, -1017751, -1036035, -977955, -892886, -626565, -97936, 439071, 759375, 1026977, 1320099, 1485612, 1587053, 1700505, 1605463, 1265690, 828745, 435703, 324619, 633230, 1105042, 1256338, 1010662, 716809, 617347, 690118, 861468, 1042901, 1076674, 886894, 552268, 331988, 444350, 832916, 1372206, 1828662, 1913033, 1627000, 1349260, 1644099, 2477423, 3375726, 3935379, 3938181]
15030C938181m82679p96884r41645r69068q65883o57685l27779J72527O48275
15021b82640J011953J115753O68833j6468k93677k2630L26795J65071n06684j016281
15011A150025r50747m73998Q0691M52358N81954M77343J35071j41918k30717k02927
15001H77135p6933K7251R256j46832k20792o3755K87988N67023L88171o2705k96003
14990A289804l21270k02165m7369j10911j78594Q952K46041K66235J01014j5703
14980A036034N8953J24390J40840J54406K54522M22725M06376M9381m02474p12885
14970A532268r45467r82845q27683n03346k3460L63438N37763N01373L53075K16102
14960B21218J85401L38925N33354K19424m35988q22387p81688l10127J86597M09883
$$ y = [3938181, 3455502, 2658618, 1716973, 747905, -117978, -775663, -1103442, -930915, -282640, 729313, 1845066, 2513899, 2497431, 2203754, 2181124, 2507919, 2672990, 2166306, 1150025, 199278, -274720, -194029, 258329, 840283, 1317626, 1452697, 1310779, 1080062, 877135, 800202, 827453, 836709, 689877, 469085, 405330, 693318, 1260341, 1648512, 1585807, 1289804, 968534, 766369, 719000, 608089, 429495, 438447, 684488, 950723, 1051737, 1036034, 1094987, 1219377, 1360217, 1514623, 1769145, 2191870, 2598246, 2647627, 2245153, 1532268, 586801, -396044, -1223727, -1727073, -1750533, -1387095, -849332, -347959, 5116, 221218, 406619, 745544, 1278898, 1498322, 1062334, 239947, -541741, -851868, -665271, -255388]
14950b55388M09833K28506M5924J477P4087J30678N4614p7147r4748j07071l70243
14939D0522o33042n92956k86646K20327O40959P07655L81100l3121k98562o99062
14929e52826j128367j023131m76381J9088K10914J81333P6878l535J13620K31529
14919b350878O7951k64152m33295l42062j55018j79405k55059j04569J80904M10774
14909c424809M16620K02370n8560j32765m9298J06346M49600R40944J195107J096186
14899G41741P75216K54392k42488l82030j29236M4401j41473n21949q18405p69380
14889a189211j84156P47364J301369J027041M18186J18590n411k01196l85171
14880A647405m24049m61046o67173o49083k55383l3223j63677k84726l57128l70139
$$ y = [-255388, 154445, 382951, 428875, 430352, 504439, 635117, 689731, 612584, 517836, 410765, 40522, -592520, -1185476, -1472122, -1251795, -610836, 96819, 477919, 444798, 146236, -552826, -1681193, -2704324, -3180705, -3161617, -2950703, -2769370, -2692492, -2696027, -2582407, -2350878, -2282927, -2547079, -2980374, -3322436, -3477454, -3656859, -3911918, -4016487, -3835583, -3424809, -3008189, -2805819, -2864379, -2997144, -3046442, -2940096, -2490496, -1549552, -354445, 741741, 1516957, 1771349, 1528861, 1146831, 1017595, 1061996, 920523, 398574, -419831, -1189211, -1373367, -626003, 675366, 1702407, 2120593, 2239183, 2233772, 2032576, 1647405, 1223356, 762310, 95137, -553946, -809329, -842552, -1006229, -1290955, -1648083, -2018222]
14870b018222j09533K69495M49624L26548k994l41928n74395o06794k88579M11181
14860b485597R84223R35701O31820L56617Q6152j79051k48087p4864J11522K62073
14850C80509L58763M26068M72106L52577Q1234j52106k00032k81283n46384p94719
14840I6733q08862n78557l78529j82990l3927l54915o95366l51625J87989L81403
14830b718646L07025J13352q3402j65952j17627n6742P944K46350M90513M00257
14820a576928J00706o9058K4572K10517K08026M3722j09069k71043m29827n39894
14810b408276m50031j24552k4376j84889j45574J04234K57789K64654K81021M72940
14800a957060O84112N73037K23845O9739J27542J2617k91186m75233n35093n45306
$$ y = [-2018222, -2127755, -1858260, -1408636, -1082088, -1085082, -1427010, -2001405, -2608199, -2896778, -2485597, -1501374, -565673, 66147, 422764, 508916, 329865, 81778, 6914, 118436, 380509, 739272, 1165340, 1637446, 1990023, 2071257, 1919151, 1719119, 1437836, 891452, 96733, -712129, -1290686, -1669215, -1852205, -1886132, -2241047, -2936413, -3288038, -3100049, -2718646, -2411621, -2298269, -2381671, -2547623, -2665250, -2721992, -2714048, -2467698, -1977185, -1576928, -1476222, -1545280, -1520708, -1310191, -1102165, -1058443, -1167512, -1438555, -1868382, -2408276, -2858307, -2982859, -3007235, -3192124, -3337698, -3233464, -2975675, -2711021, -2430000, -1957060, -1272948, -699911, -476066, -406327, -278785, -266168, -557354, -1032587, -1567680, -2112986]
14790b112986l12944P8143K42264K3512m42471q31583q52540n13733j94230K2564
14780d894004K56970M56100P03157J025128J128379Q73126M56350O5817j82460
14771a11437l46047n09043m67398k52668K2277M67119Q22999P34264M24695K05729
14761I90490J42560J64358L26130L98049J42752K0660L873j57279k90738r5807
14751A645048M10663P42186O84775M03690J6774k38853l30304n24952p76485p30327
14741A302215k01080K69734K86110Q1269j96094j64066L41358P77736P16109M12316
14731C625607L35741N18335N31462K65013O437q0492Q779J23773J23607R4295
14721E552557N0004j16069k24131k49477l33381l76235l28501l28747l57293k93831
$$ y = [-2112986, -2425930, -2347787, -2105523, -2082011, -2524482, -3356065, -4208605, -4722338, -4916568, -4894004, -4637034, -4180934, -3477777, -2452649, -1324270, -451144, 5206, 71023, -111437, -457484, -966527, -1433925, -1686593, -1664316, -1197197, -374198, 360066, 784761, 990490, 1133050, 1297408, 1623538, 2021587, 2164339, 2184999, 2188872, 2031593, 1740855, 1645048, 2055711, 2797897, 3482672, 3886362, 3903136, 3664283, 3333979, 2809027, 2032542, 1302215, 1101135, 1370869, 1656979, 1738248, 1542154, 1378088, 1719446, 2497182, 3213291, 3625607, 3961348, 4479683, 5011145, 5276158, 5282595, 5202103, 5210882, 5334655, 5458262, 5552557, 5602561, 5486492, 5262361, 5012884, 4679503, 4303268, 3974767, 3646020, 3288727, 2994896]
14711B994896j36492J73540L96769M97581Q66753J435420J732993J474364N96976
14702A0032800k73738o15449o27405m33922r1467P2785P2293J90440M12631L73082
14692I112050R794k06414K1098L15717K68624J43004K32214L62826L58079K94288
14682A0911280M01746O27813O61410N15771N07365O26400N04332J29133j53694
14673A4731556Q2395P24700J593921K458755L121365L648739M037050M365954
14665C4764435M756956N088297N556620O568896P748161Q607220Q965408Q035753
14657I0091746M826682r13689p656341j2314248j3357116j1940499r612156p244121
14649C1880258n233130l759053k868589k487427k428059k451132k323957k024393
$$ y = [2994896, 2858404, 3031944, 3428713, 3926294, 4793047, 6228467, 7961460, 9435824, 10032800, 9759062, 9143613, 8516208, 8082286, 7990819, 8063604, 8135897, 8326337, 8738968, 9112050, 9121844, 8915430, 8936528, 9252245, 9520869, 9663873, 9896087, 10258913, 10616992, 10911280, 11313026, 11940839, 12602249, 13118020, 13625385, 14251785, 14756117, 14885250, 14731556, 14813951, 15538651, 17132572, 19591327, 22712692, 26361431, 30398481, 34764435, 39521391, 44609688, 50166308, 56735204, 64483365, 73090585, 82055993, 90091746, 94918428, 94004739, 86348398, 74034150, 60677034, 48736535, 39124379, 31880258, 26647128, 22888075, 20019486, 17532059, 15104000, 12652868, 10328911, 8304518]
14641H304518j652511j194620o63197l74262m45538m11139q3153J35235j1226
14632C604107l66222p09654q90281q26660n74362k69356j1250O2733q2315j0070
14622g3330M06029O51551O97473O57822M70364J14625l37920p34238r68718q27858
14612E5800m41100j55418M456J49069L49644O01541Q61258J029951Q63410L90158
14602C708769j15608n87667q96330q14701m69048j83792q9390l0335J89135N78693
14592A289726Q24651P68691N38134J40873k55411n43851p63725q82599q21768
14583B94721o02532m43019l30997k13259j56162j37769J32833O72765R46777O97093
14573H60451J78464N6601M16288N49413K04026n3863p2457j87224l23706j66886
$$ y = [8304518, 6652007, 5457387, 4794190, 4419928, 3974390, 3563251, 3480098, 3615333, 3604107, 3237885, 2528231, 1637950, 811290, 236928, -32428, -43678, 19055, -63260, -73330, 332699, 984250, 1681723, 2339545, 2809909, 2924534, 2586614, 1852376, 883658, 55800, -385300, -540718, -536262, -387193, -37549, 563992, 1425250, 2455201, 3318611, 3708769, 3593161, 3005494, 2109164, 1294463, 825415, 641623, 552233, 521898, 711033, 1289726, 2114377, 2883068, 3421202, 3562075, 3306664, 2762813, 1999088, 1116489, 294721, -307811, -750830, -1081827, -1295086, -1451248, -1589017, -1456184, -783419, 163358, 860451, 1038915, 1095516, 1511804, 2061217, 2265243, 2211380, 2138923, 1951699, 1627993, 1461107]
14563A461107J88831L34172J37953j47941l83146l88178j77029m2057j39774k32696
14553F11242j11826Q1428J93329K09804Q0692j82753m51813o50883p40679n69124
14543a530583j92008R8065K71006M19960M58685M37715N45795M29686k8360l41613
14533E68348k04531J15657K75555J40191j52213j22189K55903K89854k14210o16582
14523C35783n42942k84869j69224k37021l06194l92114n95440o69225m31201k33259
14513c525706j35084Q8779L46731L79019J57764O2458K83534O58105Q04813L75085
14503e04502j79733k57341j02659n3047l7970M012l0190k05633k92480j38783
14493a798326P2356J99579J80965j2972k81774m68204o71077q91366q19476l88695
$$ y = [1461107, 1649938, 1984110, 2122063, 1974122, 1590976, 1202798, 1025769, 983712, 843938, 611242, 499416, 580844, 774173, 983977, 1064669, 881916, 430103, -220780, -961459, -1530583, -1722591, -1624526, -1353520, -933560, -474875, -37160, 508635, 938321, 909961, 568348, 363817, 479474, 755029, 895220, 743007, 620818, 876721, 1166575, 952365, 335783, -207159, -492028, -661252, -898273, -1204467, -1596581, -2192021, -2861246, -3292447, -3525706, -3660790, -3572011, -3225280, -2846261, -2688497, -2626039, -2342505, -1684400, -879587, -504502, -684235, -941576, -1044235, -1097282, -1135252, -1131240, -1161430, -1367063, -1659543, -1798326, -1725970, -1526391, -1345426, -1358398, -1640172, -2108376, -2779453, -3670819, -4490295, -4878990]
14483d878990K01451O70501P85142O01122O73624J001188J081124O81287J56316
14474I72765j38017j85903k42118m47683p07273r60038q44374l24815J64546M62839
14464b250071P13549Q31022Q29512O57123K28823k34999m66809n66763q42446
14455a101059r31169n49744j05058K26552M10732M08734K05754Q5860K76145M38463
14445f34790L67935J53834j25598j62788M9768J18554J29690J71612J75612L53202
14435E97031O26596N47478J8224o43568r23022n28103J42035M90238K86061k19618
14425C93352q00672j182255j119955n37145J54015N24245N85126L35126n9666
14416a707829m81635p60315p58200o08694l17058j41166k99019n08588m31115
$$ y = [-4878990, -4677539, -4007038, -3221896, -2620774, -1947150, -945962, 135162, 816449, 972765, 834748, 648845, 406727, -40956, -748229, -1708267, -2552641, -2877456, -2712910, -2250071, -1536522, -705500, 124012, 781135, 1009958, 774959, 308150, -258613, -1101059, -2032228, -2581972, -2687030, -2460478, -2049746, -1641012, -1435258, -1349398, -1073253, -634790, -266855, -113021, -238619, -401407, -351639, -233085, -103395, 68217, 243829, 597031, 1223627, 1771105, 1789329, 1145761, 222739, -305364, -163329, 326909, 612970, 393352, -407320, -1589575, -2709530, -3246675, -3092660, -2568415, -1983289, -1648163, -1707829, -2189464, -2949779, -3707979, -4316673, -4633731, -4774897, -5073916, -5582504, -6013619]
14407f013619j75506P564K8562m9229J09129M36076P06237P17957M57775K11194
14397c563860J62759K70369L45196L77761L31648J17601k10343n74134p15127
14388c458130l42150K54770O34051O56447L93054J76793K64069L46442J90916
14379h83738K5474j67920l14816k55900o3535J11568J89910q603l92131l51749
14369b111440K23565N57553L85553L38041M30894M29358J11747o49512j308297
14360a592538j519917j194360n24647M2677L21395L25718K11917K29270K71292
14351c429193J60514P4930K24818O01568Q96621R27945O67786K34130k41547n49704
14341d32132m77998j93025n3179k18320l77332k36856J5044O3269j50082j93589
$$ y = [-6013619, -6189125, -6181561, -6152999, -6202228, -6093099, -5657023, -4950786, -4232829, -3775054, -3563860, -3401101, -3130732, -2785536, -2407775, -2076127, -1958526, -2168869, -2743003, -3458130, -3800280, -3545510, -2911459, -2255012, -1861958, -1685165, -1421096, -1074654, -883738, -858264, -1026184, -1341000, -1596900, -1660435, -1548867, -1358957, -1367560, -1759691, -2111440, -1887875, -1330322, -944769, -606728, -175834, 253524, 365271, -284241, -1592538, -3112455, -4306815, -4831462, -4788785, -4467390, -4141672, -3929755, -3700485, -3429193, -3268679, -3193749, -2968931, -2367363, -1470742, -542797, 124989, 359119, 117572, -432132, -910130, -1103155, -1156334, -1374654, -1751986, -1988842, -1973798, -1910529, -2060611, -2254200]
14331b254200n7154q941K06149O40472Q13274N50923K32132J33603J96456J96284
14321F48998m9204l34662l09661k14393l90657o02021n80959l25241m6107M7878
14311b156029N1451J77276L90197K19391k95211n95480o12454o27458o92344p32627
14301d873288o45476m84748k42591J81436P02286R30765P19546M58275J81123
14292c072672l30214p42651o77741j99630M06857P80362R36065R49557P85739
14283a164328M88079P4046n0820O8958j7010m05501q39839q79289n30593K7089
14273c229208M38600O03680P40064Q10844P22950M87168J94542m6082k25562j25246
14263C71750J19613j7290k93298k11928O6764P4233k13988j88679K21904N13326
$$ y = [-2254200, -2311354, -2320295, -2114146, -1473674, -660400, -109477, 122655, 256258, 452714, 648998, 599794, 265132, -44529, -258922, -649579, -1251600, -1832559, -2157800, -2203907, -2156029, -2104578, -1927302, -1537105, -1317714, -1612925, -2208405, -2820859, -3448317, -4140661, -4873288, -5518764, -6003512, -6246103, -6064667, -5362381, -4431616, -3712070, -3253795, -3072672, -3402886, -4145537, -4823278, -5022908, -4616051, -3835689, -2899624, -1950067, -1164328, -676249, -602203, -653023, -584065, -601075, -1006576, -1846415, -2725704, -3256297, -3229208, -2790608, -2186928, -1446864, -636020, 86930, 574098, 768640, 722558, 496996, 371750, 491363, 474073, 180775, -31153, 35611, 109844, -104144, -292823, -70919, 442407]
14253D42407M12192M6330k59530k60348j83768j63184j76479j20057J5810N5672
14243a90955j08018l97958m09902l9775K44458L17394L40144J27808k72559n88947
14233i78310p84821q47048o43637k70975J24849M31710M05435P2195l42288n02398
14223c335288l55756k71336l02973m31987n79771n68791l58059j47364l1240K67470
14213f115095P28091P88498M94213K82793K55807L08647J95371r3841k29280k44625
14203c629421k30646q8454Q0742J35847K41625L09951K56603K60866M00246O30309
14193a632332O21030L14924N7090j24298k89395m73476n62157n38197k79269J45419
14183b760661L85172M31686M24257L48003K88944J71473j39468l32093k58214
$$ y = [442407, 854599, 900929, 641399, 381051, 197283, 34099, -142380, -262437, -246627, -190955, -298973, -696931, -1106833, -1146608, -902150, -584756, -244612, -116804, -389363, -978310, -1763131, -2610179, -3253816, -3524791, -3399942, -2968232, -2562797, -2490602, -2832890, -3335288, -3691044, -3962380, -4265353, -4697340, -5277111, -5845902, -6203961, -6351325, -6382565, -6115095, -5387004, -4598506, -4104293, -3821500, -3565693, -3257046, -3061675, -3155516, -3384796, -3629421, -3860067, -3948521, -3867779, -3731932, -3490307, -3180356, -2923753, -2662887, -2262641, -1632332, -1011302, -696378, -639288, -763586, -1052981, -1526457, -2088614, -2626811, -2906080, -2760661, -2375489, -1943803, -1519546, -1171543, -882599, -711126, -850594, -1182687, -1440901]
14174a440901n3791J24804M3518k58698l84146k63293j25617p4418R1171K64892
14164b076479K64851K45586K42372K63323M05740N40612K72746j99576m07297
14155d48122m11454l31971k97730k89445j39558Q3966J7849q6884K50512N72293
14145a080544N09769L60045J88631l2520k28356l13531q4000M73519R05659Q97040
14135A595712N26470l4310m72267m47855p8137O3120O5699J71660J53460L025
14125A546577q5772j28548k18904l17299l15284j05032J00527P6352l09282p61919
14115e18584o50225k46878P1497K81448M74268P34305P73463L83810O4684J12215
14105A480003m7903m85182n16684j81487J30215L71957M25034K70367J27523j78076
$$ y = [-1440901, -1494692, -1369888, -1326370, -1585068, -1969214, -2232507, -2358124, -2432542, -2341371, -2076479, -1811628, -1566042, -1323670, -1060347, -654607, -113995, 158751, -40825, -448122, -859576, -1191547, -1489277, -1778722, -1918280, -1834314, -1816465, -1903349, -1652837, -1080544, -570775, -210730, -22099, -54619, -282975, -596506, -680506, -206987, 698672, 1595712, 2122182, 2087872, 1615605, 1167750, 1089613, 1152733, 1218432, 1390092, 1543552, 1546577, 1460805, 1332257, 1113353, 796054, 480770, 375738, 476265, 552617, 243335, -518584, -1168809, -1415687, -1344190, -1062742, -588474, 145831, 919294, 1303104, 1367788, 1480003, 1432100, 946918, 430234, 248747, 378962, 750919, 1175953, 1446320, 1573843, 1395767]
14095A395767o97851r12944p92461o19977m49308k01428j05676l2027K69849M76766
14085a669290K92176L557j59451k98086k31886J24895L94338L12278L8716j16387
14075a309140j24695k32575l48829k43964r256K19017K60020J56053l4384j93332
14065a861085k50937j89475m9702K4058o4351l27810l95760j03839N3932j38660
14055c303629k23551j45894j49391r1975K49966O04737N55454L69826K76133K23154
14045a635170J52329Q4275J04705J95171L35715M22481M51008M67927L43734J28726
14035A050901n7923l34778n24932m49212m4489N14569O99284N08808K30964r5651
14025A497541m07195n38569n55043n34730m81103m46758k08803O1178Q4468J80607
$$ y = [1395767, 697916, -215028, -1007489, -1627466, -2076774, -2278202, -2383878, -2415905, -2146056, -1669290, -1377114, -1373557, -1533008, -1831094, -2062980, -1938085, -1543747, -1231469, -1192753, -1309140, -1433835, -1666410, -2015239, -2259203, -2268459, -2049442, -1789422, -1633369, -1667753, -1861085, -2112022, -2301497, -2351199, -2327141, -2391492, -2719302, -3115062, -3218901, -3164969, -3303629, -3527180, -3673074, -3822465, -3914440, -3664474, -3059737, -2504283, -2134457, -1858324, -1635170, -1482841, -1398566, -1293861, -1098690, -762975, -340494, 110514, 578441, 922175, 1050901, 992978, 658200, 133268, -315944, -360433, 154136, 853420, 1362228, 1593192, 1497541, 1090346, 551777, -3266, -537996, -1019099, -1465857, -1674660, -1613482, -1529014, -1348407]
14015a348407N34441P42123P10190O50800N25663K56727j03848k62364l8373K18551
14005A885503J87412j24618o64206j000413q23058m97135l25228k44045j58846
13996a764634k71127n84513o82808l22695K70421O77243P95846P20525M23387
13987g38355J59863K33236N73681P41545N05953j0715o09101q64074m98066J79957
13977c26076P43107Q74951M01085k09335m15896l34171l37501m40204l60384r5337
13967d99761R1586P0752Q104J52786K31400K5618k64836m78727m84022j40490
13957a287590M51686O09707J77991o7152J24912K43049M0582j93600l57937k59482
13947e17834J23208L64113L81275L20077K51702R6518k09046m94396o54118o39219
$$ y = [-1348407, -813966, -71843, 638347, 1289147, 1814810, 2071537, 1967689, 1705325, 1666952, 1885503, 2072915, 1948297, 1284091, 283678, -539380, -1036515, -1361743, -1605788, -1764634, -2035761, -2620274, -3303082, -3625777, -3355356, -2678113, -1882267, -1161742, -738355, -578492, -345256, 228425, 969970, 1475923, 1465208, 856107, -7967, -506033, -326076, 417031, 1291982, 1693067, 1483732, 1067836, 733665, 396164, -44040, -404424, -499761, -408175, -337423, -329319, -176533, 54867, 80485, -184351, -663078, -1147100, -1287590, -835904, -226197, -48206, -115358, 9554, 252603, 293185, 99585, -258352, -517834, -394626, -30513, 350762, 670839, 922541, 1019059, 810013, 315617, -338501, -977720]
13937i77720m02521K4286J86010j45897o82373j000003r44504o65270j56575M69106
13927d295461Q81065Q11247L75741J39917K00855K26623R8406j12155j59739n2404
13917a885905Q2339K03861J11351r533m8749j37398K6382L64338N46049M91996
13907b55269L44124K34041K30351K43485J38435N0994N3432o940k22959l24136
13897D85558l78054o90093p22716j44246L95153M20780J53006j47493k85296p5476
13887i88877K53320L00768r0172n65638o67748l89584L0081M84073P51775P68023
13877a13979L95712m23184j003443q70497m38413r5995J44360K97367L96183M32833
13867a279056L22280J14224m808r7709o1815K15527K99776Q6866N9426J50152
$$ y = [-977720, -1380241, -1355955, -1169945, -1315842, -1998215, -2998218, -3942722, -4607992, -4764567, -4295461, -3414396, -2603149, -2227408, -2087491, -1886636, -1660013, -1561607, -1673762, -1833501, -1885905, -1803566, -1599705, -1488354, -1497887, -1546636, -1684034, -1657652, -1293314, -747265, -255269, 88855, 322896, 553247, 796732, 935167, 986161, 1039593, 1032653, 809694, 485558, 107504, -582589, -1305305, -1449551, -1054398, -633618, -480612, -628105, -913401, -988877, -735557, -434789, -524961, -1090599, -1758347, -2147931, -2117850, -1633777, -882002, -113979, 281733, -141451, -1144894, -2015391, -2453804, -2549799, -2405439, -2108072, -1711889, -1279056, -956776, -842552, -847360, -945069, -1006884, -791357, -491581, -404715, -345289, -195137]
13857a95137j6058l52910n36097n58257m43095r0002L07991O33114O28872K72294
13847c49285j32894m45867n09660l52629m8425J82946K79079L19092L38456L08558
13837d10629J69908J9757m625J39948K62442n522n10689o69518m30876j29712
13827a569516M5946P532K5446L32910Q07438J072292R26143L88847k64649p31451
13817A040938r45200q85371o01730n1969L04093O3393l08875k39620k5049l8748
13807a688138K5528L42998N83428L41317j79609l71363j96015j64585m56931p45830
13797b509200q95676r65053q22758n68150l61140j97297j19816K8076J40262R6046
13787f174706J80484M11879N67496O19654P15551P96855Q62628P65596J57465
$$ y = [-195137, -211195, -564105, -1100202, -1658459, -2101554, -2191556, -1883565, -1250451, -621579, -349285, -482179, -928046, -1437706, -1790335, -1838760, -1655814, -1376735, -1057643, -719187, -410629, -240721, -220964, -225589, -85641, 176801, 171279, -339410, -1008928, -1439804, -1569516, -1523570, -1516038, -1490592, -1157682, -350244, 722048, 1648191, 2037038, 1772389, 1040938, 95738, -789633, -1391363, -1443332, -1139239, -1075846, -1384721, -1624341, -1649390, -1688138, -1662610, -1319612, -736184, -394867, -574476, -945839, -1141854, -1306439, -1763370, -2509200, -3404876, -4369929, -5192687, -5760837, -6121977, -6319274, -6439090, -6411014, -6270752, -6174706, -5994222, -5582343, -5014847, -4395193, -3679642, -2882787, -2020159, -1254563, -1097098]
13778a097098m57582m26080j11744j42326l60718k97418L1131K27616L44249N57751
13768a732219P53690O45716K06015r978J91277K56456j80029o56190r18595j102264
13758b546121j028550n23247P1541L36903K59824J10403J32029L55534N52237
13749b279447N92818M45212K59698J99990J34609j64870n17807o55500m72662
13740b457959k45325l21561l17997k24300k99554l34755j45397q3279l69325m01596
13730e201048J51428P85034R35404Q48610R19444J029341J059609Q00936L18603
13721A647361L566k8867N0273J44260K46878M01752L76079J4674m04986o21254
13711A829736q22506j065605r11389n60618m78243m99305m98278l62876k13268
$$ y = [-1097098, -1554680, -1980760, -2092504, -2234830, -2595548, -2892966, -2861835, -2634219, -2289970, -1732219, -978529, -332813, -126798, -136776, 54501, 310957, 130928, -525262, -1443857, -2546121, -3574671, -4097918, -4026377, -3689474, -3429650, -3319247, -3187218, -2831684, -2279447, -1686629, -1241417, -981719, -781729, -647120, -811990, -1329797, -1985297, -2457959, -2703284, -3024845, -3342842, -3567142, -3866696, -4201451, -4346848, -4430127, -4799452, -5201048, -5049620, -4264586, -3329182, -2480572, -1561128, -531787, 527822, 1328758, 1647361, 1650927, 1622060, 1672333, 1816593, 2063471, 2465223, 2841302, 2855976, 2450990, 1829736, 1007230, -58375, -969764, -1530382, -2008625, -2507930, -3006208, -3369084, -3582352]
13702c582352j76662R2027P04398R05003M13396l8710j56014j35541q794K49619
13692a733630L81576L33101L03641L93605M37082L80185L50056L87061K47392
13683A480069j26809m14880m18117k71301p8708O7342J81367L46504M44041L22555
13673A532063K2653l24374o58116n79632j17685L05674M72040L39095m1980n57700
13663C92038j022140j174794q97622m18272n7709K21421N02825N04295M05080
13654a544878N00138N33317L59201O8365j67856j83532r495N8812k9204p0875
13644d86007j01567O6818N14487O93318M97572K76406J17908O9615R7930j72303
13634A574177p29677q47266l20390L07800N33205K79437k57663n83228m35410
$$ y = [-3582352, -3759014, -3666987, -2962589, -2057586, -1644190, -1682900, -1838914, -1974455, -1983249, -1733630, -1352054, -1018953, -715312, -321707, 115375, 495560, 845616, 1232677, 1480069, 1353260, 938380, 520263, 248962, 170254, 237596, 418963, 765467, 1209508, 1532063, 1554716, 1230342, 572226, -7406, -125091, 180583, 652623, 991718, 949738, 392038, -630102, -1804896, -2702518, -3120790, -3178499, -2957078, -2454253, -1949958, -1544878, -1044740, -511423, -152222, -83857, -251713, -435245, -444740, -385928, -415132, -486007, -587574, -520756, -6269, 687049, 1184621, 1461027, 1578935, 1648550, 1746480, 1574177, 844500, -2766, -323156, -15356, 517849, 797286, 539623, -43605, -479015]
13625d79015k80556k19103K2519K02252K9188l34969m53836k07989Q8618L18826
13615a314065O39128P07942J92825l46513l04064j52014m33397p87798o46520
13606b444476j99523N0073P9182L36199P65577Q27589L96475k23758n21766m33670
13596a368098m38107o22306n77555j64751K69382M25878N21550M53121j09451
13587a610337p95788j116873j083986p64424m10582j30098L27550P05352O91087
13578d188099N16226L08448J45197P0898J73814J93093K2267l5346O6172J68025
13568b559305j2273m68957o16924l33030M0881K73348L45658M44630O82765Q92354
13558a310853Q37756N56524K10682l3146j05008M5243L16514L91534K40417K62969
$$ y = [-479015, -759571, -978674, -956155, -753903, -724715, -1059684, -1513520, -1721509, -1632891, -1314065, -674937, 33005, 225830, -120683, -424747, -576761, -1010158, -1797956, -2444476, -2643999, -2593926, -2514744, -2178545, -1412968, -585379, -188904, -412662, -934428, -1368098, -1806205, -2428511, -3006066, -3170817, -2901435, -2475557, -1954007, -1500886, -1610337, -2406125, -3522998, -4606984, -5371408, -5781990, -5912088, -5584538, -4879186, -4188099, -3671873, -3363425, -3218228, -3147330, -2973516, -2780423, -2758156, -2793502, -2727330, -2559305, -2571578, -3040535, -3657459, -3990489, -3949608, -3676260, -3330602, -2885972, -2203207, -1310853, -473097, 83427, 294109, 260963, 155955, 201198, 517712, 909246, 1149663, 1412632]
13548A412632M00440J94058n7504j45934l30068m74850m48190l38111q2367K91151
13538D21257N28681M73415J24220k75438l20991P3217L78903K64437J0239k02560
13528A475380k74738l3801L66863N45440M29916M77937Q28831J074397P95860
13519E686085J74380k99494n77138p02211q71638j094476r03531m84074k78228
13510F49675P9799N35694O88848Q33811P80438K85170q3716k62854n32468o32819
13500B341578l52791l0637J05645K39756K80123j278l41814k64043J04092K51377
13490B332008p898m20170p35278q53466p56819m68382j59811J56771M60707M93449
13480D1111M49952P02387R67875Q73019N20139J32883j13427j05182n517p3097
$$ y = [1412632, 1813072, 2007130, 1949626, 1803692, 1473624, 998774, 550584, 212473, 130106, 421257, 949938, 1423353, 1547573, 1272135, 951144, 1024361, 1403264, 1667701, 1677940, 1475380, 1200642, 1166841, 1533704, 2079144, 2509060, 2986997, 3815828, 4890225, 5686085, 5860465, 5560971, 4983833, 4281622, 3409984, 2315508, 1411977, 927903, 649675, 729474, 1265168, 1954016, 2787827, 3568265, 3853435, 3769719, 3506865, 2974397, 2341578, 1988787, 1958150, 2063795, 2303551, 2583674, 2582396, 2240582, 1976539, 2080631, 2332008, 2324110, 1903940, 1168662, 315196, -441623, -910005, -1069816, -913045, -452338, 41111, 491063, 1193450, 2161325, 3034344, 3554483, 3687366, 3573939, 3468757, 3463240, 3390143]
13470C390143m01973o95197o53481n44285m80564k48772J29571M85425O44780
13461A625647O83778O46233M47733K27872j27919n98340r52934j097531r60184
13452a05645m92201R0582L26803L44947L52190K90693L05613L66641K72291R4581
13442A846495R1312J91438J28931J58318K84546o5606n87017n46535r0280J73625
13432A585227J31311R292k74979n84042m38087j52L26623N29321N73050O20087
13422B477651P13695O95895N30381K53493j2184j27491n6737l3333k40699m01175
13412C799496l22375l60233o73377p06058j83855K41288L10133L37427L33940
13403B776386J83098J44220L59183L85299j49297o11010n70501l17860j220J40228
$$ y = [3390143, 2988170, 2292973, 1639492, 1095207, 614643, 365871, 495442, 980867, 1625647, 2309425, 2955658, 3403391, 3631263, 3503344, 2905004, 1952070, 854539, -105645, -597846, -507264, -180461, 164486, 516676, 807369, 1112982, 1479623, 1751914, 1846495, 1937807, 2129245, 2258176, 2416494, 2701040, 2635434, 2048417, 1501882, 1411602, 1585227, 1716538, 1725830, 1450851, 866809, 428722, 428570, 755193, 1284514, 1857564, 2477651, 3191346, 3887241, 4417622, 4671115, 4658931, 4531440, 4474703, 4441370, 4200671, 3799496, 3477121, 3116888, 2443511, 1737453, 1553598, 1794886, 2105019, 2442446, 2776386, 2959484, 3103704, 3462887, 3848186, 3698889, 3087879, 2517378, 2199518, 2198298, 2338526]
13393B338526J18632k6463k72603m17323k56065l7295j56349m83812n58050j79991
13383F9207K49174M11054K73594Q6127R4447K45657L77000L34577k3414m47100
13373A670323n94022k93349J30845K95388K42855R1780j53439m25433n71926o33593
13363b40571m89522j13807J18614Q3463N2440L01508O73348O98086K70184k58208
13353A095535l71571j8528L78143M77014L11905J46729k6424k79439n29256n47572
13343F36536j85612N0662K0316P0005L63579O58810O81976N27799L45780K60372
13333C430223K61548J53997J340j10136j96681k01604k58714n59466p17648k94003
13323A508856N14832J045523R26994L31939k41480n61953p24233p38016n45268
$$ y = [2338526, 2457158, 2430695, 2158092, 1740769, 1484704, 1447409, 1291060, 807248, 249198, 69207, 318381, 729435, 1003029, 1089156, 1183603, 1429260, 1806260, 2140837, 2117423, 1670323, 1076301, 782952, 913797, 1209185, 1452040, 1543820, 1390381, 964948, 393022, -240571, -730093, -843900, -725286, -641823, -589383, -287875, 385473, 1083559, 1353743, 1095535, 723964, 705436, 1083579, 1560593, 1872498, 2019227, 1992803, 1713364, 1184108, 636536, 450924, 501586, 521902, 591907, 955486, 1614296, 2296272, 2824071, 3169851, 3430223, 3691771, 3845768, 3847108, 3736972, 3540291, 3338687, 3079973, 2520507, 1802859, 1508856, 2023688, 3069211, 3996205, 4328144, 4086664, 3524711, 2800478, 2062462, 1517194]
13314A517194j80161L54371R96077J314199J191048Q18150K64270k19768k52884
13305E802496j6956O2748j51133o62119r43808o50637j73862K47944O10418P28929
13295D854020N84795N36371N35152K74840j56690l45378m41082o48144n89786
13286D604098k29594j3997r4289j68559j9770K62654N71962P78680P62371O80505
13276G134061K76115n36839j088698j003675m68432K39972N45796J64217j14559
13267E147958K19080N60138M00305O9955n9019j8554j58430m09714m21736k48587
13257E081396j87577l00059k27480K60939P52686Q07428N06166K03915j6168k57816
13247F623430m24030l95473j13370J79033N2227l87002n32923k52005Q6581L80276
$$ y = [1517194, 1337033, 1691404, 2687481, 4001680, 5192728, 6010878, 6275148, 6055380, 5802496, 5785540, 5848288, 5697155, 5035036, 4091228, 3440591, 3266729, 3514673, 4125091, 4854020, 5438815, 5975186, 6510338, 6785178, 6628488, 6283110, 5842028, 5193884, 4604098, 4374504, 4360507, 4266218, 4097659, 4077889, 4340543, 4912505, 5691185, 6453556, 7134061, 7410176, 6873337, 5784639, 4780964, 4312532, 4552504, 5098300, 5262517, 5147958, 5367038, 5927176, 6327481, 6397436, 6338417, 6319863, 6161433, 5751719, 5329983, 5081396, 4893819, 4593760, 4366280, 4627219, 5379905, 6187333, 6693499, 6897414, 6881246, 6623430, 6199400, 5803927, 5690557, 5869590, 5921817, 5534815, 5001892, 4749887, 4836468, 5216744]
13237E216744O85552P39244L65461r0336l16897j42266J70000K50494O0748j35792
13227F802952j63736R9995M93809N13357K96159K24066K93279K33182J25337J08074
13217I026474k692j08898n1248O8977Q8220l1470L3874J92113J79757L22766O72247
13206A0390120P33133N15000K56771k2987j95393j31312J44285J80721N2686j0110
13196A1912914j70846m14660n86288o07348m17460j43581k2714P7670Q6040r8731
13186I614996n7943K40032L37113L12255O43409J121663J029056K82619l49084
13177A3174116l65128n4372J47132m878k99089n70174q30176r44480n58735M10589
13167A0104805J183418J313394J010558N74092L41884L23045K44441j33758m99089
$$ y = [5216744, 5902296, 6641540, 7007001, 6916665, 6599768, 6457502, 6627502, 6877996, 6938744, 6802952, 6639216, 6739211, 7233020, 7746377, 8042536, 8266602, 8559881, 8793063, 8918400, 9026474, 9023782, 8914884, 8863636, 8932613, 9020833, 8989363, 9023237, 9215350, 9395107, 9717873, 10390120, 11123253, 11638253, 11895024, 11872037, 11676644, 11545332, 11689617, 11870338, 11923024, 11912914, 11742068, 11327408, 10741120, 10133772, 9716312, 9572731, 9550017, 9627687, 9713727, 9614996, 9557053, 9797085, 10134198, 10446453, 11089862, 12211525, 13240581, 13523200, 13174116, 12808988, 12754616, 12901748, 12896870, 12597781, 12027607, 11197431, 10252951, 9694216, 10104805, 11288223, 12601617, 13612175, 14186267, 14528151, 14851196, 15095637, 14961879, 14462790]
13158A4462790n98883n67568n54724m96892k88187k27690k95776k45550O2519
13149A1250039N91630J003370J095676Q88537M11065j11438l90250k53186J14016
13140A4599459K48150J69114J00198R2773R9568K74221N46024N62639K52353j92940
13130A6751559m69645l59859j56170K1830L90175P34067P11782N07459M11006
13121A8542204L38327K53037J50385L8488J06745K61956K99736M06131P18687
13112B1115696Q74137P80362P35637O48853K88325q6614r4258K50683N86204P13760
13102B5812785Q49772Q80941O37548L36625m4679l97424m22621j86691n7265l19513
13092B7089478o80566o53643m62089m95903m11771P3490N60898O49159M09376
$$ y = [14462790, 13863907, 13296339, 12741615, 12244723, 11956536, 11728846, 11433070, 11187520, 11250039, 11841669, 12845039, 13940715, 14829252, 15240317, 15128879, 14738629, 14485443, 14599459, 14847609, 15016723, 15116921, 15209694, 15309262, 15583483, 16129507, 16692146, 16944499, 16751559, 16281914, 15922055, 15765885, 15787715, 16177890, 16911957, 17623739, 18131198, 18542204, 18880531, 19133568, 19283953, 19322441, 19429186, 19691142, 19990878, 20397009, 21115696, 21989833, 22770195, 23505832, 24154685, 24443010, 24356396, 24262138, 24512821, 25099025, 25812785, 26662557, 27543498, 28181046, 28517671, 28472992, 28075568, 27652947, 27466256, 27408991, 27089478, 26408912, 25755269, 25293180, 24797277, 24385506, 24458996, 25019894, 25669053, 26078429]
13083B6078429K10714J48185P2931j23910k58531p8135J15491K67879L22288J57367
13073B6912708K378n5185k8182K73142M05425O3424k67898j1880P57470J344990
13063B9396392J322301Q90946N18824M93157R58952J471016J536559J383512J135230
13054C9106889O34248p5509n10607k08680J28066R3641L21919O58544O67251N96036
13044D1411798M48964K93360M23251O57021O59588N72145N67576N73019N79928
13035D6186650P20339R22939P52616N31976O43415O56293M46603L82896N62118
13026E1805845Q70569J347924J724436J759289J681841J664215J757043J691927
13018F4303089J360744R49832P95864R58160J286727J750977K112303K292039
$$ y = [26078429, 26289143, 26437328, 26510259, 26386349, 26127818, 26049683, 26165174, 26433053, 26755341, 26912708, 26915086, 26859901, 26831719, 27104861, 27510286, 27573710, 27305812, 27293932, 28051402, 29396392, 30718693, 31609639, 32128463, 32621620, 33580572, 35051588, 36588147, 37971659, 39106889, 39741137, 39665628, 39155021, 38946341, 39074407, 39168048, 39489967, 40148511, 40815762, 41411798, 41860762, 42154122, 42577373, 43234394, 43893982, 44466127, 45033703, 45606722, 46186650, 46906989, 47829928, 48582544, 49114520, 49757935, 50414228, 50860831, 51243727, 51805845, 52676414, 54024338, 55748774, 57508063, 59189904, 60854119, 62611162, 64303089, 65663833, 66613665, 67409529, 68367689, 69654416, 71405393, 73517696, 75809735]
13010G5809735K327576K407619K827895L221545L074906K611449K275703K112572
13002I6669000K078515K347724K825510L173037L258192L376622L797948M446952
12994A21973500M972656N490823O254991P203844Q382788R965829J1970956J4439316
12986A90654703J7152235J9886672K2788638K5829562K8794600L1565117L3562968
12979C70234495L3793660L0633324K1579389N274589j5798210l5000063m6066956
12972C64650228m7961564m3837100l7467755l1126627k5469229k0625093j6473586
12965A41689274j3060478j0480226q492992o905525n510485m261761l524748l370859
12957H6082200l492120l329709k695470k028745j517083j144292j034068j207511
$$ y = [75809735, 78137311, 80544930, 83372825, 86594370, 89669276, 92280725, 94556428, 96669000, 98747515, 101095239, 103920749, 107093786, 110351978, 113728600, 117526548, 121973500, 126946156, 132436979, 138691970, 145895814, 154278602, 164244431, 176215387, 190654703, 207806938, 227693610, 250482248, 276311810, 305106410, 336671527, 370234495, 404028155, 434661479, 456240868, 461515457, 445717247, 410717184, 364650228, 316688664, 272851564, 235383809, 204257182, 178787953, 158162860, 141689274, 128628796, 118148570, 109655578, 102750053, 97239568, 92977807, 89453059, 86082200, 82590080, 79260371, 76564901, 74536156, 73019073, 71874781, 70840713, 69633202]
12949F9633202j438200j273641q07214m49064l3625N47902Q28573P16106N48077
12940F8272116L50338K34717L14107M33260N54431P77807J127561J509006J697344
12931G5270687J491543R37661L63259M21456J144495J893105K452938K965519
12923H6940663L332957L430431L512749L834328M080056L796793K932163J807240
12915A13667380R73893Q02406R40545J091237J263396J726830K631243L640653
12907A26737583M562021N420057O283004P221171Q386987R889854J2008045J4687411
12899A95196133J7480825J9963260K2451248K5665200K9585613L3109796L5148184
12892C78600259L4628859K9573653J8041489l57752k2281549m0578542m9571849
$$ y = [69633202, 68195002, 66921361, 66114147, 65665083, 65631458, 66179360, 67007933, 67724039, 68272116, 68622454, 68857171, 69171278, 69604538, 70158969, 70936776, 72064337, 73573343, 75270687, 76762230, 77699891, 78063150, 78484606, 79629101, 81522206, 83975144, 86940663, 90273620, 93704051, 97216800, 101051128, 105131184, 108927977, 111860140, 113667380, 114641273, 115443679, 116384224, 117475461, 118738857, 120465687, 123096930, 126737583, 131299604, 136719661, 143002665, 150223836, 158610823, 168500677, 180508722, 195196133, 212676958, 232640218, 255091466, 280756666, 310342279, 343452075, 378600259, 413229118, 442802771, 460844260, 460486508, 438204959, 397626417, 348054568]
12885C48054568m9366664m3706622l6144910k8811115k2726674j8092165j4608584
12878A34597834j1863119r829710q406863p017718n721752n001040m688576m441219
12870G7627837m079886l531176k835385k025313j263754p88394p62952j004928
12862F1336049j238382j369616j170950m96516K32211N05470L72651J74332o0926
12853E8284323j36280M4775j12724o39990r16551o50607k29791O5733K72519M44609
12843E6426016N93486P53150J020865J410828J639526J604574J553710J557771
12835F6559926J675536J776355J824123K025289K139200K091806K094238K220962
12827H2407435K367319K492801K659633K908666L450331M174957M866743N699429
$$ y = [348054568, 298687904, 254981282, 218836372, 190025257, 167298583, 149206418, 134597834, 122734715, 112905005, 104498142, 97480424, 91758672, 86757632, 82069056, 77627837, 73547951, 70016775, 67181390, 65156077, 63892323, 63103929, 62340977, 61336049, 60097667, 58728051, 57557101, 57060585, 57292796, 57798266, 58170917, 58345249, 58284323, 58148043, 58192818, 58080094, 57440104, 56523553, 55872946, 55643155, 55708888, 55981407, 56426016, 57019502, 57772652, 58793517, 60204345, 61843871, 63448445, 65002155, 66559926, 68235462, 70011817, 71835940, 73861229, 76000429, 78092235, 80186473, 82407435, 84774754, 87267555, 89927188, 92835854, 96286185, 100461142, 105327885, 111027314]
12819A11027314O672450P518985Q243568Q976117J0167301J2165433J4749691
12812A79520859J7664445K0863947K4288106K7763675L0912765L3257187L4104921
12805C68375905L2177263K5487842J2301786p019978k7937951m3392035m9511891
12798C10480941m7543880m1149688l3785734k7219591k1681655j7202160j3867932
12791A08030301j1410579r539217q140333p107628o341413n756594n021899m266178
12783E0446460l857230l528218l109503k789465k461793j871500j283872j065199
12775C0479680j114861j143439j005108p20347n78825o61926q19498q75842q25104
12766B2734730j038081j368141j324966r87809n61892k32072k48703m27395l19889
$$ y = [111027314, 117699764, 125218749, 133462317, 142438434, 152605735, 164771168, 179520859, 197185304, 218049251, 242337357, 270101032, 301013797, 334270984, 368375905, 400553168, 426041010, 438342796, 431322818, 403384867, 359992832, 310480941, 262937061, 221787373, 188001639, 160782048, 139100393, 121898233, 108030301, 96619722, 87080505, 78940172, 71832544, 65491131, 59734537, 54712638, 50446460, 46589230, 43061012, 39951509, 37162044, 34700251, 32828751, 31544879, 30479680, 29364819, 28221380, 27216272, 26495925, 25917100, 25255174, 24435676, 23559834, 22734730, 21696649, 20328508, 19003542, 18015733, 17453841, 17221769, 16973066, 16545671, 16225782]
12757A6225782j11516j66055l67899m09960k55261l09583m06431j65818M0748
12748A4074007L4968R3091J29556O5171j9506j81588m45836n93653o42990n86458
12738A1926762m13414k59107r1992J99139M22484M84679M90145K04395l66089
12729A2597002o04395l34667j77769l84129o96212q04941o37908l97950k27882
12720H331149m1522O5520M432j668r0545m87030q43581r34004q73951o13240k32090
12709D283470J83631M81849L37718K8261J36131M79124M05221J92445M49648P49080
12699G726578M10317j04986k56143l37138m62271m88639n54352n51273j73575
12690E208518K98348N14562M51660K4246m73202n66299k51535q3475j96812n9431
$$ y = [16225782, 16114266, 15948211, 15580312, 15170352, 14915091, 14605508, 14199077, 14033259, 14074007, 14108975, 14202066, 14331622, 14396793, 14377287, 14195699, 13749863, 13156210, 12513220, 11926762, 11513348, 11254241, 11162249, 11361388, 11783872, 12268551, 12758696, 12963091, 12597002, 11992607, 11657940, 11480171, 11096042, 10399830, 9594889, 8956981, 8559031, 8331149, 8289627, 8355147, 8359579, 8357911, 8267366, 7780336, 6936755, 6002751, 5128800, 4515560, 4283470, 4467101, 4948950, 5286668, 5314929, 5451060, 5930184, 6335405, 6527850, 6977498, 7726578, 8136895, 8031909, 7775766, 7438628, 6976357, 6487718, 5933366, 5382093, 5208518, 5506866, 6021428, 6473088, 6497334, 6024132, 5457833, 5206298, 5122823, 4926011, 4866580]
12680D866580L32001M95462J49162l76039n20471j83323L10948M02921J13940
12671E591181k2433m864j9645M4661J25861K89118O29993O85027K01202k08483
12661G311618k04702q606K45624L43384J29308k33290n71690p90323o93446l24724
12651E203153J28293M52513L84610p16m31749p44813p22959k99852L6661N9571
12641D064712o7626k15612k50720O6218M93760N64577L85195L07995L95663M82918
12631F227080L80255O1186k10604l11764l74937m77005o41691q17717r01052o25525
12621B308226l0282M25783M79201L03870J28279n5078j41071p4369p5549k21916
12611C047094l54882k96688M847K37199J49291k1210M8492L69678O86974O47237
$$ y = [4866580, 5198581, 5694043, 5843205, 5467166, 4946695, 4763372, 5074320, 5477241, 5591181, 5568748, 5563884, 5544239, 5588900, 5714761, 6003879, 6633872, 7318899, 7520101, 7311618, 7106916, 7098310, 7343934, 7687318, 7816626, 7583336, 7011646, 6221323, 5527877, 5203153, 5331446, 5783959, 6168569, 6167853, 5736104, 4991291, 4268332, 3968480, 4005141, 4064712, 3997086, 3781474, 3530754, 3596972, 4090732, 4655309, 5040504, 5348499, 5744162, 6227080, 6607335, 6668521, 6457917, 6146153, 5771216, 5294211, 4652520, 3834803, 2933751, 2308226, 2277944, 2703727, 3182928, 3486798, 3615077, 3559999, 3418928, 3344559, 3269010, 3047094, 2692212, 2395524, 2400371, 2637570, 2786861, 2765651, 2814143, 3183821, 3870795, 4518032]
12601D518032M65786K68852M7146k24004m93945n79744n98486o18033m56783k27274
12591B101547m2609J72992K49426L547j63525j56436j38577o3361J27937J52024
12581B242965k07200n19409l72114l9119J31863K78176M26780M59173L77163J17653
12571B895931j56396j97437L3114L37115L12301K50628M04638L63399K6109k57732
12561D011670k52830p055J67397J03952o0533j22031m2590J95907M20389L55454
12551D769730L3402q1388J21962M43158P13942O59390K83863N4904J10765J28516
12541G238244O8973N2766j08608k46631j31111J91754N56023P36240P72299O97728
12531I827677M79270P9188l42001n05347m24559l74582k82263j9144J96791K59961
$$ y = [4518032, 4983818, 5252670, 5299816, 5075812, 4581867, 4002123, 3403637, 2785604, 2328821, 2101547, 2058938, 2231930, 2481356, 2484903, 2321378, 2164942, 2026365, 1963004, 2090941, 2242965, 2035765, 1516356, 1144242, 1105123, 1236986, 1515162, 1941942, 2401115, 2778278, 2895931, 2739535, 2542098, 2575212, 2912327, 3224628, 3475256, 3879894, 4243293, 4269402, 4011670, 3758840, 3751785, 3919182, 4023134, 3962601, 3840570, 3797980, 3993887, 4414276, 4769730, 4803132, 4721744, 4843706, 5286864, 6000806, 6660196, 6944059, 6998963, 7109728, 7238244, 7307217, 7359983, 7251375, 7004744, 6873633, 7065387, 7621410, 8357650, 9129949, 9827677, 10306947, 10386135, 10044134, 9538787, 9114228, 8739646, 8457383, 8438239, 8635030, 8894991]
12521H894991K83842K85340J35703k60437n49187o21682o43038o94755q95014
12512E935763r52035o34217k54706j30452j64337J0387M85415Q43387R26105O99863
12502F765173q8295q46949r69534p46192n65810o24623p02831n66742k47916Q8743
12492A495024L52221M53320M27327L10051M9800j11691M3939L42962N73077P08343
12482D644373P51436O97483N27922J31145n32043j185238j362053j144695q55226
12473A673104m53310J26110M17671J54162k30793k84905k51918k63077R950L35047
12463A232041M78752N76427O15334M22967J67446n8275j00824J31482M24435N06280
12453D396065K73319j7658Q2578K83385J97505j2035j18016k28680l88038l88473
$$ y = [8894991, 9178833, 9464173, 9599876, 9339439, 8790252, 8168570, 7525532, 6830777, 5935763, 4983728, 4349511, 4094805, 3964353, 3800016, 3810403, 4295818, 5139205, 6065310, 6765173, 6676878, 5829929, 4860395, 4114203, 3548393, 2923770, 2220939, 1654197, 1406281, 1495024, 1847245, 2300565, 2727892, 3037943, 3087743, 2976052, 3019991, 3362953, 3936030, 4644373, 5395809, 6093292, 6621214, 6752359, 6220316, 5035078, 3673025, 2528330, 1673104, 1219794, 1345904, 1763575, 1917737, 1686944, 1402039, 1150121, 887044, 896994, 1232041, 1710793, 2287220, 2902554, 3325521, 3492967, 3434692, 3333868, 3465350, 3889785, 4396065, 4669384, 4651726, 4734304, 5017689, 5215194, 5203159, 5085143, 4856463, 4468425, 4079952]
12443D079952j11720J36852K5649l30009o82259o48779j45957M08864M50546J64328
12433C347467j23116l14136l39227j72569K01222O46131Q95996R92203R61767
12424F095738N75922J32119p3797l43396o91287o67052k33660J92197L13493J84514
12414E484791j50675o74656j035934p89421j910N38051N98417O34378P94495Q08359
12404F205895N69070J71347k60389m09854k06204M2030K49009K98640O8717j25574
12394F602687j41867n06477r85094o93590L1732M82888O72044N29009j2279m15158
12384E563895m34393j19079L31298M11639O9183j04461r3258j70153l64769n83582
12374D506320n68431j92328L45328O70813N97907K99286l8515l39713l15989J51651
$$ y = [4079952, 3968232, 4105084, 4130733, 3800724, 3118465, 2469686, 2323729, 2732593, 3183139, 3347467, 3224351, 2910215, 2570988, 2398419, 2599641, 3245772, 4141768, 5133971, 6095738, 6671660, 6803779, 6729982, 6386586, 5695299, 5028247, 4794587, 4986784, 5300277, 5484791, 5334116, 4659460, 3623526, 2834105, 2832195, 3370246, 3968663, 4603041, 5397536, 6205895, 6774965, 6946312, 6685923, 6276069, 6069865, 6111895, 6360904, 6659544, 6728261, 6602687, 6460820, 5954343, 4969249, 4275659, 4307391, 4790279, 5462323, 5991332, 5979053, 5563895, 5129502, 5010423, 5341721, 5753360, 5822543, 5718082, 5624824, 5454671, 5089902, 4506320, 3937889, 3745561, 4090889, 4761702, 5359609, 5658895, 5620380, 5280667, 4964678, 5116329]
12364E116329P57601R22450M66528j64076o46322r10803r56471q74053o47942
12355C063241k95925N1456M24910O25271O08729O21095O02316N61157O50023P18603
12345G630876N56106K94979J21762m723m4531k15462m72383l19261P2790J46085
12335G766238m341M262J26472K81964M13548M11020K62159o0356l41591l11076
12325H548299k14140l87386m13237k7484N04291P21642M10373N890k48523k47712
12315H652013J06183N38935O80236N86073M83113K63402p3151j76897R9729L81914
12305A1541550N88165P96754J018796J233497J190822R69460Q42531Q44987J001150
12296B0027712R16069O79598Q29890J195037J546483J681531J484914J404357
$$ y = [5116329, 5873930, 6796380, 7262908, 7098832, 6452510, 5541707, 4585236, 3711183, 3063241, 2767316, 2818772, 3243682, 3868953, 4477682, 5098777, 5701093, 6262250, 6912273, 7630876, 8186982, 8481961, 8603723, 8599000, 8554469, 8339007, 7866624, 7547363, 7620153, 7766238, 7761897, 7766159, 7892631, 8174595, 8588143, 8999163, 9261322, 9200966, 8859375, 8548299, 8334159, 7946773, 7533536, 7506052, 8010343, 8731985, 9142358, 9148248, 8899725, 8652013, 8758196, 9297131, 9977367, 10563440, 11046553, 11309955, 11236804, 11059907, 11159636, 11541550, 12129715, 12926469, 13945265, 15178762, 16369584, 17339044, 18181575, 19026562, 20027712, 20943781, 21623379, 22453269, 23648306, 25194789, 26876320, 28361234, 29765591]
12288B9765591J729031K271202K641770K932161L690410M921716O336962P791669
12280F2080512R070818J0087086J0876049J0830511Q795163L656335m592643j2665405
12272I8138426j6555595j5950234j3064353j0192927q028021o091231m385880
12265B3870185l323918k801121k323548j626251p88398j67591k50926p82067j215991
12256A0590374j154481o35767j75920j59844m42696p15694q51906p85389n47624
12247E121053k21599o3802j86005m89548r79107j253653r52785m40833j9574K54529
12237G68676L03710K90483J37492k11186m10898l13212L5607M77162Q37132R49796
12227B864762Q46502O18101K56988n8635k66316l98379m33749l97729k85093k24784
$$ y = [29765591, 31494622, 33765824, 36407594, 39339755, 43030165, 47951881, 54288843, 62080512, 71151330, 81238416, 92114465, 102944976, 111740139, 115396474, 110803831, 98138426, 81582831, 65632597, 52568244, 42375317, 34347296, 28256065, 23870185, 20546267, 17745146, 15421598, 13795347, 13006949, 12839358, 12588432, 11806365, 10590374, 9435893, 8800126, 8624206, 8464362, 8021666, 7305972, 6454066, 5668677, 5121053, 4899454, 4835652, 4649647, 4160099, 3180992, 1927339, 974554, 533721, 514147, 768676, 1072386, 1362869, 1500361, 1289175, 878277, 565065, 600672, 1077834, 1914966, 2864762, 3711264, 4329365, 4586353, 4527718, 4261402, 3863023, 3429274, 3031545, 2746452, 2521668]
12217B521668k46956o8370K33662K73590R4514j49494k90456m68391n58457l48629
12207I92681j0842L26345N84053P15900M77682o2610m23127l20742Q8042M03276
12197B770658M30924K79292K11071L72110P20423Q46500O95633L60917q2393m02028
12187F203107p31665p99891m33848r7169l4264j32150j06844P592j315j38551
12177C735002k13633j20712J0623J86365J97749l08342r58176j072508p69394
12168F86974m37630k70873k09007k3044K54329L27761K15176K02736L65623N82217
12158A694262N54018J90563M477K25297M46333L96386K62846Q2450q3659l4831
12148C738142J6742k33686o22773p80110p91340n51461o5346K63848K76681M8054
$$ y = [2521668, 2274712, 2206342, 2440004, 2713594, 2808108, 2658614, 2368158, 1899767, 1341310, 992681, 981839, 1308184, 1892237, 2608137, 3085819, 3023209, 2600082, 2279340, 2367382, 2770658, 3201582, 3480874, 3691945, 4064055, 4784478, 5630978, 6326611, 6687528, 6605135, 6203107, 5471442, 4671551, 4237703, 4140534, 4106270, 3974120, 3867276, 3874868, 3873553, 3735002, 3521369, 3400657, 3411280, 3597645, 3795394, 3487052, 2528876, 1456368, 686974, 249344, -21529, -230536, -253580, 749, 328510, 543686, 746422, 1112045, 1694262, 2248280, 2438843, 2443320, 2668617, 3114950, 3511336, 3774182, 3856632, 3772973, 3738142, 3754884, 3521198, 2898425, 2118315, 1326975, 775514, 710168, 974016, 1250697, 1298751]
12138A298751j25700j42389j33755j20134j93631k96428k98395l50047m32785
12129g94513m12533j53122K68800O10276N29250J37463j90460k61844m066K05898
12119f4851M8737k95279m18123j89722J83727N66806Q10989Q07937N54951Q8562
12109B093734m52442p47162n87038j64513m6371j53003l13324n34147l08074L79902
12099h32438Q11144Q19840P72864O70140L17640j44174m15589n05146p11610p78787
12089C884m15174n1482j51971l68659k77413m307M4847J52678P32899J184231
12079H49533J002445M12071j47931m50950l92794j1983p0228o43720q19392n17192
12069g90141k08694L2604L86285N66840L46914j03125n68079p99749n41036o2370
$$ y = [1298751, 1173051, 1030662, 896907, 776773, 583142, 286714, -11681, -361728, -794513, -1207046, -1360168, -1091368, -481092, 48158, 185621, -4839, -266683, -270749, -64851, -16114, -311393, -729516, -919238, -735511, -168705, 642284, 1450221, 2005172, 2093734, 1641292, 894130, 307092, 142579, 96208, -56795, -370119, -904266, -1212340, -832438, -21294, 798546, 1571410, 2241550, 2559190, 2415016, 1999427, 1494281, 782671, 3884, -411290, -462772, -614743, -983402, -1260815, -1265122, -1220275, -1067597, -334698, 849533, 1851978, 2264049, 2116118, 1665168, 1272374, 1260391, 1190163, 546443, -272949, -790141, -998835, -966231, -579946, -13106, 333808, 230683, -337396, -1137145, -1678181, -1740551]
12059a740551R213j92693j58584J21906N03526P36163P53121O57996O18886O35895
12049A944878M13892O1188m4843k6797Q1331K58674K01721j20335l31332j73086
12039B265291R7630O7680j29725k03689j33522j57961k67664k54456j73187k49491
12029H60906n23097p85826q11465n77776j18497L96099O89602Q03453Q81959Q79885
12019A695243O68669L01175n8115l42864m13433l54225m33066o00943o26365n64831
12009g28755l56356j50399j04521j36079j18973J52831N05857O31816O56456Q12309
11999A164186R93043R90693M86857k17262n95103o99738o98140m61443J29002
11990A092095O69865R19845P25206K43376r6680m03030p75285j017727q95281
$$ y = [-1740551, -1731338, -1924031, -2082615, -1960709, -1457183, -721020, 32101, 690097, 1308983, 1944878, 2358770, 2419958, 2375115, 2348318, 2429649, 2688323, 2890044, 2769709, 2438377, 2265291, 2362921, 2430601, 2300876, 2097187, 1963665, 1805704, 1538040, 1283584, 1110397, 860906, 337809, -448017, -1259482, -1837258, -1955755, -1559656, -870054, -66601, 815358, 1695243, 2363912, 2665087, 2606972, 2264108, 1850675, 1496450, 1063384, 462441, -163924, -728755, -1085111, -1235510, -1340031, -1476110, -1595083, -1442252, -936395, -304579, 351877, 1164186, 2157229, 3147922, 3634779, 3417517, 2822414, 2122676, 1424536, 963093, 1092095, 1761960, 2681805, 3407011, 3650387, 3553707, 3150677, 2375392, 1357665, 462384]
11981D62384m39739Q2785L83635K40530n5545k04488l68435m70540m28429l12792
11971a110634l5353L45342O72853P44085P36267P80456Q24968R22414P26912J21048
11961D728358n76570j054171j185065r62752m67687j14559O8711M23644P58205
11952A618114P77144N40161K96236J54865J24113K15217K66346K4844m16131p86910
11942B813999r71202p74073m35190j80705J35019M38634N10936L81432L45788
11933B264638M13408K80907n143k24943l62072l51361j43269K61155N47457M13474
11923C094251L7518k08379m8112M03390O62222N89039M05828P3886l81711p68852
11913C859080r59933q54959m61593Q959J88393j61268m09671j61548n5054j56694
$$ y = [462384, 22645, 105430, 489065, 729595, 674050, 469562, 101127, -369413, -797842, -1110634, -1145987, -800645, -127792, 616293, 1352560, 2133016, 2957984, 3880398, 4607310, 4728358, 4151788, 3097617, 1912552, 949800, 482113, 367554, 436265, 859909, 1618114, 2395258, 2935419, 3231655, 3386520, 3510633, 3725850, 3992196, 4017040, 3600909, 2813999, 1842797, 1068724, 633534, 452829, 587848, 1026482, 1537418, 1918850, 2264638, 2678046, 2958953, 2953810, 2728867, 2366795, 2015434, 1872165, 2133320, 2680777, 3094251, 3131769, 2923390, 2875278, 3278668, 3940890, 4529929, 4935757, 5009643, 4627932, 3859080, 2899147, 2044188, 1582595, 1591554, 1779947, 1618679, 1209008, 1047460, 992406, 835712]
11903H35712j88069j49977r0821m6537Q8445K88758N14927O87401O20715L70628
11893B931182J73968N3809j39807l37049m23643l67543k83638j81596J3623K39227
11883A678533L52374J78899j45516l74462l83260k8590L99055M57077K05183K0727
11873B360020N6315J13707J129j30201j87040j71779l2540K29334M31275L34288
11863C004508Q8188j39216k89457k86719k36846l01747m90475n45579k99351R7401
11853F00707L81882N01058M22502J70440j16343l03764m75691m92270m18430k96390
11843b6299k69558l89367k42137J07325J97275Q9882O2570J12287K21039L40912
11833B03929M31462M50934L80055K68224M63314P28999M85665j15372n22209p01209
$$ y = [835712, 647643, 497666, 406845, 360308, 448753, 737511, 1252438, 1939839, 2560554, 2931182, 3105150, 3158959, 3019152, 2682103, 2258460, 1890917, 1607279, 1425683, 1439306, 1678533, 2030907, 2209806, 2064290, 1689828, 1306568, 1277978, 1677033, 2134110, 2339293, 2360020, 2416335, 2530042, 2531171, 2400970, 2213930, 2042151, 2009611, 2238945, 2670220, 3004508, 3092696, 2953480, 2664023, 2377304, 2140458, 1838711, 1348236, 802657, 503306, 600707, 982589, 1483647, 1906149, 2076589, 1960246, 1656482, 1180791, 688521, 270091, -26299, -295857, -685224, -927361, -820036, -622761, -532879, -470309, -358022, -136983, 203929, 635391, 1086325, 1466380, 1734604, 2197918, 2926917, 3412582, 3297210, 2775001, 2073792]
11823B073792q49752p67771k85588J18639m6492o25263q80801o48642l62623k91819
11813b566320m08963m66268j96101K95180M89305L44938K45606K90120M56035
11804a516468N88879N07248K08186j35318l10931k31104P1204L17796M34875N64906
11794D99273N32901K49443o8103k01146J4805M16578N24710J30939m00258m63964
11784A235178k56817k76449n65338q96704r83865o52422r429L76925J39606l20225
11774b209540n99771n95029k94587J13586K24357P8904K10482M95562O93704P15129
11764a167203O17878O58880P43283O17572M86611N09100M44644P4261l66209o38296
11754A980521q23766j013627p22701n06624j202281j898670j741260q52711J90791
$$ y = [2073792, 1224040, 456269, 170681, 289320, 242828, -382435, -1263236, -1911878, -2274501, -2566320, -2975283, -3441551, -3637652, -3342472, -2853167, -2508229, -2262623, -1972503, -1516468, -927589, -420341, -212155, -347473, -658404, -889508, -818304, -500508, -65633, 499273, 1032174, 1281617, 1213514, 1012368, 1027173, 1443751, 1968461, 2099400, 1699142, 1235178, 978361, 701912, 136574, -760130, -1743995, -2396417, -2405846, -2028921, -1889315, -2209540, -2809311, -3404340, -3698927, -3585341, -3360984, -3282080, -3071598, -2576036, -1882332, -1167203, -549325, 109555, 852838, 1470410, 1957021, 2466121, 2910765, 2985026, 2618817, 1980521, 1156755, 143128, -579573, -1086197, -2288478, -4187148, -5928408, -6781119, -6590328]
11745f590328P12747O00370L46267L26659M67466N70871N48478M56615N04027
11736b056828N87564L94948J53590J08979O1663o2598J9660L15256M63077N15088
11726E00399M54222J80759k6777j5664R3793K9239j78765j42872L26025Q30799
11716B051158P48629J82191l92242p95297q80073o39469l53765k45203k59314
11707e83385j84477j60656k18176j35193J17209L25034L50083L73084M84803M43265
11697H11591K40809k7842k93175m54891m31403l15099k18740j07269q2622j73944
11687a052585k16397J46201P32204Q65590N92705L60257J87236M2035P2399J3608
11677A743253k22372k73923o8320J94973L36573K72886J8999l91748o05224l19052
$$ y = [-6590328, -5877581, -5277211, -4930944, -4604285, -4136819, -3565948, -3017470, -2560855, -2056828, -1469264, -1074316, -920726, -811747, -750084, -812682, -793022, -477766, -14689, 500399, 954621, 1135380, 1108603, 1092939, 1186732, 1215971, 1037206, 894334, 1220359, 2051158, 2799787, 2981978, 2589736, 1794439, 914366, 274897, -78868, -324071, -583385, -767862, -928518, -1146694, -1281887, -1164678, -839644, -489561, -116477, 368326, 811591, 1052400, 1024558, 731383, 276492, -154911, -470010, -688750, -796019, -878641, -1052585, -1268982, -1122781, -390577, 475013, 1067718, 1427975, 1615211, 1657246, 1729645, 1743253, 1520881, 1246958, 1178638, 1373611, 1710184, 1983070, 2002069, 1610321, 1005097, 686045]
11667F86045n6542r5794k09813k12702k17130l11822l16641r8259J35602P6354
11657f20702m3484N3444J61006l3442l18453m05120l20212p4205K76573N74950
11647g49645O98953O10245M26493K55594j70413o55368p84145o69736l28798m3839
11637a410659l5047j71147l45839n75842p16007n71485l34153l01983m38739m69261
11627e370162j71224K51484M32322M03117J42036j93694k72197k54341l21835
11618e354494k93478m4489M32970R10923J122543R95437O54643M78394L45518
11609g52033L4126j42032n0401o7176k31601k01258K2810J35030J27864P4682
11599a049989Q8327J85195J24515j37593m63049o17758m76720l32789m38858n18956
$$ y = [686045, 629503, 533709, 323896, 111194, -105936, -417758, -734399, -832658, -697056, -620702, -664186, -610742, -449736, -483178, -801631, -1206751, -1526963, -1601168, -1324595, -749645, -50692, 559553, 986046, 1241640, 1071227, 415859, -368286, -1038022, -1366820, -1410659, -1445706, -1616853, -1962692, -2538534, -3254541, -3826026, -4160179, -4462162, -4900901, -5370162, -5541386, -5289902, -4857580, -4454463, -4312427, -4506121, -4778318, -5032659, -5354494, -5647972, -5692461, -5259491, -4348568, -3226025, -2230588, -1575945, -1097551, -752033, -717907, -859939, -910340, -977516, -1209117, -1410375, -1387565, -1252535, -1124671, -1049989, -961662, -776467, -651952, -789545, -1252594, -1870352, -2347072, -2679861, -3118719, -3637675]
11589c637675k57634P0073J43216J9323j06750q6752P4651M84446Q26393P26605
11579a744104L95547J31593o5489k79534n53740q01076r14273p49495m09403j35134
11569e125108K46803O96923R78930R92496P63202L57282O8173J13526J11310O1951
11559g34512R7369K15866M54559N89705L82801M5723l52890q07427r11496n81646
11549a601948l4208K78712N4726l21054k43957K31035N96770N67254M55371L55942
11539C38643K31146J47962j27285n01231l82835L7535J74424J74567L12019N68839
11529I73784P76931O36141N9173o38724j154248j250548p84899k44172j0627M2364
11519a594825J788J20815N87601R82591R52433P28343N11297K47846r5119m23982
$$ y = [-3637675, -3895309, -3825236, -3682020, -3662697, -3769447, -3856199, -3781548, -3297102, -2470709, -1744104, -1348557, -1216964, -1282453, -1561987, -2115727, -2916803, -3831076, -4580571, -4989974, -5125108, -4878305, -4181382, -3202452, -2209956, -1446754, -1089472, -1021299, -907773, -796463, -734512, -637143, -421277, 33282, 622987, 1005788, 1051511, 698621, -108806, -1020302, -1601948, -1636156, -1357444, -1302718, -1623772, -1867729, -1636694, -1039924, -472670, -17299, 338643, 569789, 717751, 590466, 89235, -293600, -256065, -81641, 92926, 404945, 973784, 1750715, 2386856, 2446029, 1807305, 653057, -597491, -1382390, -1626562, -1637189, -1594825, -1593037, -1472222, -884621, 97970, 1050403, 1778746, 2290043, 2537889, 2442770, 2018788]
11509B018788n30724l88320k10590j919J99667J05368l10785n75457l33257R9733
11499G2504L42488M11875L98746L67918K04438k94045o71600m98632k90551m17670
11489c74529n66041o24552m17215M2409L51305M93048N67915N76749L95474K30137
11479F74700K19682J66012j19736k69488j85092k73886m81851n10181k41668K02759
11469h18749K85832l5643k97761m56721o09053n33936k20282r310J21855N25103
11459b048665J322294K257118K377805J423535L34803o18602j209404j027301
11451B811583n22453m32054o73584o61302l12375j3762O4195J82538L21298L97835
11441A161919N19102P22264P81294N28495J50273m244L4984j37915n11753o40669
$$ y = [2018788, 1488064, 1099744, 889154, 887235, 1086902, 1192270, 881485, 306028, -27229, 72504, 414992, 826867, 1225613, 1593531, 1797969, 1503924, 832324, 333692, 43141, -374529, -940570, -1565122, -1982337, -1939928, -1588623, -1095575, -527660, 49089, 444563, 674700, 894382, 1060394, 940658, 671170, 486078, 212192, -269659, -779840, -1021508, -818749, -532917, -568560, -866321, -1323042, -1932095, -2466031, -2686313, -2695623, -2573768, -2048665, -726371, 1530747, 3908552, 5332087, 5666890, 5048288, 3838884, 2811583, 2289130, 1857076, 1183492, 522190, 209815, 196053, 260248, 442786, 764084, 1161919, 1681021, 2403285, 3184579, 3713074, 3863347, 3859103, 3894087, 3756172, 3244419, 2603750]
11431B603750m43080k12542o5387j34755l62995m22478m8265L57933J73611k42517
11421A203275l14379l3728L51515M78526J95560k39516k37888J15612J21603j72688
11411A467892k65039j42451q4335k56121n65569p28519o35836k04447K94752M74727
11401f44946K78821j09420m44756l69039J04413L73772L14304J10016r4746P3182
11391d08399K28078j0647j42987J27717M37911N32753N75640O77379O80191L62363
11381C059999j35914m50169k91283J27754M02480L79702K7975l88742l85089l7769
11371B308944P6365j26241l00883l42031j88929J9568N0268j40361m28405n14070
11361D14225k84682J25990M37565N11542N19842N11399K12668k19024k89187q9949
$$ y = [2603750, 2160670, 1948128, 1882741, 1747986, 1384991, 962513, 914248, 1272181, 1445792, 1203275, 888896, 855168, 1206683, 1685209, 1880769, 1641253, 1403365, 1518977, 1640580, 1467892, 1202853, 1060402, 976067, 719946, 154377, -574142, -1209978, -1414425, -1119673, -644946, -366125, -475545, -920301, -1289340, -1184927, -811155, -496851, -386835, -481581, -408399, -180321, -190968, -333955, -206238, 231673, 764426, 1340066, 2017445, 2697636, 3059999, 2924085, 2473916, 2182633, 2310387, 2712867, 3092569, 3120544, 2731802, 2346713, 2308944, 2385309, 2259068, 1958185, 1616154, 1427225, 1446793, 1497061, 1356700, 928295, 414225, 129543, 255533, 693098, 1204640, 1724482, 2235881, 2448549, 2229525, 1940338, 1850389]
11351A850389j23110m09515n94126o88807p29111n31580k51302m2147Q1177P9706
11341a358426J07934K37775K99762J15058k72624n54489m12969M6349N38907Q61328
11331c91395P19740K90170q0612l51992m57745m16631l64629k32834J8699O3353
11321a203876k39857m82873l64821p0056J48977K47476L30751M23869L54463K06189
11311f49758K59874K55048m2859l07379j12116L51944N87021M54577K56208J20340
11301A172900R2444M6430j25481k60171q9824K11328K13544k13566o69217o65001
11291b86614k82212J12400M44892P52900Q11997O17711K99120q0375l71187o92737
11281A325895r41097p56520l54904j23547R0642K47577J95480N4215j67449k10175
$$ y = [1850389, 1727279, 1317764, 723638, 34831, -694280, -1225860, -1477162, -1519309, -1438132, -1358426, -1250492, -1012717, -712955, -597897, -870521, -1425010, -1837979, -1791630, -1252723, -391395, 328345, 618515, 537903, 185911, -271834, -688465, -1053094, -1285928, -1267229, -1203876, -1443733, -1926606, -2291427, -2361483, -2212506, -1965030, -1634279, -1210410, -855947, -649758, -389884, -134836, -177695, -485074, -597190, -245246, 341775, 796352, 1052560, 1172900, 1265344, 1311774, 1186293, 926122, 836298, 1047626, 1261170, 1047604, 378387, -286614, -568826, -456426, -11534, 741366, 1553363, 2171074, 2470194, 2389819, 2018632, 1325895, 384798, -371722, -726626, -850173, -759531, -511954, -316474, -262259, -429708, -639883]
11271f39883J44995N07305M31237L4441k70787j81961J61365L68119L09221J28898
11261I92950L913l5545m9255n8863j31562m01532p79621j013205q74203l57273
11251b704196O7355J64609Q1236k01760m89013m50052P1777N36837N74366L75637
11241a973204K16368K88712K25967q9082j31766J88237L31500K07301J54770K03665
11231c77532K18067J89995Q2284k9158k7623L8756M3315O083J31992M04629M33030
11220A113838J20624k37289l64143l66926l78775l92829l93817k49644j71828
11211a320789l69581n07386k69275L13813P19069N61579J85237n4191j74090o6748
11201i82362K22855L99969N13739O64966N82665K22609J53757M96708O80568M09937
$$ y = [-639883, -494888, 12417, 443654, 478095, 207308, 25347, 186712, 554831, 864052, 992950, 996863, 961318, 912063, 853200, 721638, 320106, -459515, -1472720, -2346923, -2704196, -2636841, -2472232, -2390996, -2592756, -3081769, -3531821, -3460044, -2923207, -2348841, -1973204, -1756836, -1468124, -1242157, -1331239, -1463005, -1274768, -943268, -735967, -581197, -377532, -159465, 30530, 112814, 83656, 56033, 94789, 138104, 144187, 276179, 680808, 1113838, 1234462, 997173, 633030, 266104, -112671, -505500, -899317, -1148961, -1320789, -1690370, -2197756, -2467031, -2153218, -1434149, -872570, -687333, -741524, -915614, -982362, -759507, -359538, 154201, 819167, 1401832, 1624441, 1778198, 2274906, 2955474, 3365411]
11191C365411k15357o85780o72170l63643k16146l04720l14548k45054k53115
11182I4878l65839m51437n38059n25611l45661J970M28071N92596N17116M61922
11172a30054J67571j13123K78025P62834N95275N1031l26607l78044m29672m01934
11162G5302o6166L57648N43249K96402j46207m77345n43387l71210p7251J93863
11152b15102J76037P5270J82871L88806M06727J38701j39180k88994l10193k85232
11142A29711k02943l9989j6681j74814j79188m9158k4525k28099m78401l75237
11132a639324M7688L15062K13390J98361N28709O89865N50954L27825K28393K54939
11122A715862R0219j24506l15255l96152l40394k62208k22575k84930m18287m54300
$$ y = [3365411, 3150054, 2464274, 1792104, 1428461, 1212315, 907595, 593047, 347993, 94878, -270961, -722398, -1260457, -1786068, -2131729, -2129759, -1701688, -1109092, -591976, -130054, 37517, -75606, 202419, 965253, 1560528, 1611559, 1284952, 906908, 477236, 75302, 9136, 366784, 910033, 1206435, 1060228, 582883, 39496, -331714, -408965, -215102, -39065, 36205, 219076, 607882, 1014609, 1153310, 1014130, 725136, 414943, 129711, -73232, -113221, -129902, -304716, -483904, -533062, -557587, -785686, -1264087, -1639324, -1591636, -1276574, -1063184, -864823, -336114, 353751, 904705, 1232530, 1460923, 1715862, 1806081, 1681575, 1366320, 970168, 629774, 367566, 144991, -139939, -558226, -1012526]
11112a012526m33108l53296r3646L44641Q16153J001437Q14060M88252K08432
11103A780399k7439j57066j29199k32304n51457o64387l93430j97471k70431k61868
11093a104653L1145L14970L26407J33650p4781j26146o1471j08129m68384p27125
11083a864517n04762o9340J70052J18070J0198k0996Q9980K86706N13644P49940
11073e21025P83615N88874K23350j36627k83370k88325l07078p7870L56506P10960
11063A049010N80730m5890n11085n75757n21683l26369K279J37828J10319K23515
11053A22897L11347L37653N39934O63253L17263j92839m09627k63589l0567m83
11043A395242P6329L17072L42478J54625J53787K37078J26841j48434m68840o46879
$$ y = [-1012526, -1445634, -1798930, -1892576, -1547935, -731782, 269655, 1083715, 1571967, 1780399, 1752960, 1595894, 1466695, 1234391, 682934, 18547, -374883, -572354, -842785, -1104653, -1073508, -758538, -432131, -298481, -373262, -499408, -560879, -669008, -1137392, -1864517, -2369279, -2438619, -2268567, -2150497, -2140299, -2161295, -2071315, -1784609, -1270965, -521025, 262590, 851464, 1074814, 938187, 654817, 366492, 59414, -18456, 338050, 1049010, 1629740, 1583850, 1072765, 497008, -24675, -351044, -348765, -210937, -100618, 122897, 434244, 771897, 1311831, 1975084, 2292347, 2099508, 1689881, 1426292, 1395725, 1395242, 1471571, 1788643, 2131121, 2285746, 2439533, 2676611, 2803452, 2655018, 2186178, 1539299]
11033A539299n30211k50953R5782L97602N43568L81253l2206j45012R9399L41889
11023B440410L90111J97908j37609k60313j31760j77102l75236m35649l71637
11014A139123l7934L44351K56353q6436j37396R8605L98513M09372J77357J86771
11004B748679L69175L30084K30993J78270P4359k0404k70000m88082l40496L408
10994B815986K19037J34661J55572K70391p1711p42845j261515j364068j097052
10985i41544n21760L9881J83390J46839L16478M50253K32745j63603k56704J64762
10975c49263O04993M54953N3803o6607K9897K00959K41606Q9367n0769o639O3302
10964A265602M1415J33961J86230L7097l57608p82196q81189p47667n89611m08146
$$ y = [1539299, 1009088, 758135, 853917, 1251519, 1795087, 2176340, 2144134, 1999122, 2098521, 2440410, 2830521, 3028429, 2890820, 2630507, 2498747, 2321645, 1946409, 1510760, 1139123, 1101189, 1445540, 1701893, 1615457, 1478061, 1576666, 1975179, 2384551, 2561908, 2748679, 3117854, 3447938, 3678931, 3857201, 3931560, 3911156, 3641156, 3153074, 2812578, 2815986, 3035023, 3169684, 3325256, 3595647, 3523936, 2781091, 1519576, 155508, -941544, -1463304, -1423423, -1240033, -1093194, -776716, -326463, -93718, -257321, -514025, -349263, 255730, 710683, 764486, 697879, 727776, 928735, 1170341, 1259708, 1208939, 1202300, 1265602, 1307017, 1440978, 1627208, 1664305, 1306697, 524501, -356688, -1104355, -1693966, -2102112]
10954b102112j39068R5655J73768Q1984K4426K55335L01682q25k71859k89885
10944a870899j52307P1406M34913P34109P41524N37994K55286q7077l89915o01611
10934c26577o17323m97280l12294j38625j62244j33436J62777L93361M44438L71134
10924h16069J95453J42100Q8930k34504l11624O3497K33869K32704K49548K23326
10914F7230J24241j07111k65413l69841n36332m95298l48465l19482j72350L2766
10904b390055J87418M11338P19711R25453Q26218N03219J30754k53415m81012
10895E79629k96606N6551J17821q5626k94129l96725k58965L9552K17069J15650
10885b05779j53224k88089l90986m94826k68244R0991J90177j00832m21955l95973
$$ y = [-2102112, -2241180, -2145525, -1971757, -1889773, -1865347, -1610012, -1308330, -1309155, -1581014, -1870899, -2023206, -1951800, -1516887, -782778, -41254, 496740, 752026, 664949, 275034, -326577, -943900, -1441180, -1753474, -1892099, -2054343, -2187779, -2025002, -1631641, -1187203, -816069, -620616, -478516, -389586, -624090, -935714, -872217, -638348, -405644, -156096, 67230, 191471, 84360, -181053, -550894, -1087226, -1582524, -1930989, -2250471, -2422821, -2390055, -2202637, -1791299, -1071588, -146135, 680083, 1183302, 1314056, 1060641, 579629, 283023, 339574, 457395, 371769, 77640, -319085, -578050, -538498, -321429, -205779, -359003, -647092, -1038078, -1532904, -1801148, -1710157, -1519980, -1620812, -2042767, -2438740]
10875b438740j72604J05493K88674K40795k61l38965n34739m64949j91659K01618
10865c305337N21008N04422J43387j37415k8730J07713L2118N0866J56015P6967
10855a878986J44371L61190M20127K99498O3891m5501M0870J57503J36004j93002
10845d94035m39882j42564L59352N06417L72088L44129L75821K12640m8105j87532
10835H58329m21154p78862p49833m14927k76364l10340l22791j82259M7915K42681
10825b307605J88252j7567l0013K90555P14240P06451L65210R0717j45806j59160
10815c04726n9822m1940M9336J33996Q4386m8991k96081o33493o32727j18548
10805a868610M54437N92513M26896L34865M13608N19353L90499J73742m8325l87636
$$ y = [-2438740, -2611344, -2505851, -2217177, -1976382, -1976643, -2315608, -2850347, -3315296, -3506955, -3305337, -2784329, -2279907, -2136520, -2273935, -2302665, -2194952, -2162834, -2111968, -1955953, -1878986, -1734615, -1373425, -953298, -653800, -589909, -635410, -594540, -437037, -301033, -494035, -933917, -1076481, -717129, -210712, 161376, 505505, 881326, 1093966, 1045861, 858329, 437175, -341687, -1091520, -1506447, -1782811, -2093151, -2415942, -2598201, -2550286, -2307605, -2119353, -2136920, -2166933, -1876378, -1162138, -455687, -90477, 240, -145566, -304726, -364548, -406488, -357152, -223156, -138770, -187761, -483842, -1117335, -1750062, -1868610, -1414173, -821660, -394764, -59899, 353709, 873062, 1263561, 1437303, 1388978, 1001342]
10795A001342o30978o46158m80654j59799J60372J93589Q2992J19936N8716k24630
10785e25272k99681n2013J08870O5190P7446R1110p526p7980n8732o473J50252
10774e34809R1406j55386l17823l27823l00531l95103m33432l49739k36270k3041
10764b982551J94504J78549N484o8350O4288J93777L38417L05045J72881M61245
10754a136711Q51733Q59073N62228J41812j10485k57161n89351r26884p94104
10745a399850k40939J91500L89143L78893P9858j49235r8455p3573j70759k09903
10735a303320j34695J07034L30417M67329N54236L88678K20497R6217k05769n10052
10725A0572o97209p70334n91200l30268k17475p4818M7368k1164n720K84783O25636
$$ y = [1001342, 370364, -275794, -756448, -916247, -755875, -562286, -479294, -359358, -300642, -525272, -824953, -876966, -768096, -702906, -625460, -534350, -541876, -619856, -678588, -685061, -534809, -443403, -598789, -916612, -1244435, -1544966, -1940069, -2373501, -2723240, -2959510, -2982551, -2788047, -2609498, -2604014, -2672364, -2608076, -2414299, -2075882, -1770837, -1597956, -1136711, -284978, 574095, 1136323, 1278135, 1167650, 910489, 321138, -605746, -1399850, -1640789, -1449289, -1060146, -681253, -601395, -750630, -849085, -922658, -1093417, -1303320, -1438015, -1330981, -1000564, -533235, 21001, 409679, 630176, 726393, 520624, 10572, -686637, -1456971, -2048171, -2378439, -2595914, -2670732, -2623364, -2644528, -2650248, -2365465, -1739829]
10714a739829O04709L27401J35178J97241L24954K72079N0943k84881m85793m15349
10704a013347l80403l56166k04191j26073j29805k16936o2914K89158L28851k1326
10694a893152l24414l93715j50646L43275O17943N26984L27883K67250L22677
10685c55915L41254J73976j04595k06786j58357o7696J8028J04397L23678N30983
10675E98967M71976K30037l2977p0891J57990L95136J72463n04754r64275q20895
10665c67223l38774J31981M39552O85354P34541L39435j56823l91566m06820l04608
10655C65049j47085o9229j36099l89763n21869l00175N2133J77796J44634K13883
10645f10725L67957M87693N15309L36612o3259l15050o1810L50977L98506J44692
$$ y = [-1739829, -1135120, -807719, -672541, -475300, -150346, 121733, 172676, -112205, -597998, -1013347, -1393750, -1749916, -1954107, -2080180, -2209985, -2426921, -2489835, -2200677, -1871826, -1893152, -2217566, -2611281, -2761927, -2418652, -1800709, -1273725, -945842, -678592, -355915, -14661, 159315, 54720, -152066, -310423, -378119, -360091, -255694, 67984, 598967, 1070943, 1300980, 1268003, 1197112, 1355102, 1750238, 1922701, 1417947, 453672, -367223, -705997, -574016, -134464, 550890, 1285431, 1624866, 1468043, 1076477, 669657, 365049, 217964, 148735, 12636, -377127, -898996, -1199171, -1147038, -969242, -824608, -610725, -242768, 244925, 760234, 1096846, 1033587, 718537, 656727, 1007704, 1406210, 1550902]
10635A550902k0340k8559k00065m10864k01164R8710J49866L74710O77040N33182
10625B523418J04241k83987n21054n59377m29789l40740m01223n08348m01625
10616h18484j11991q1429k90760m60667l63312j39443j39448j43252N7709N7259
10606b433818o8038j31070k26126k12288n900K20206L16355L76543L69584K06841
10596a587711R9004K12967J99817O9184r0533l05419n39167p21152o46454k77412
10586c586876J26469M28447N39741M43841K08102J02381K84232L45664L37922
10577g70077N75826O42928L37718J29827J04909K12066L55780L10028J47687r8573
10567A948119k43109j99986k77667l99424m44596m86732l46072J58490O89561
$$ y = [1550902, 1530562, 1502003, 1301938, 891074, 689910, 788620, 938486, 1313196, 1990236, 2523418, 2627659, 2343672, 1822618, 1263241, 833452, 492712, 91489, -416859, -818484, -930475, -1011904, -1302664, -1763331, -2126643, -2266086, -2405534, -2548786, -2491077, -2433818, -2501856, -2632926, -2859052, -3071340, -3077240, -2857034, -2540679, -2164136, -1794552, -1587711, -1488707, -1275740, -1075923, -1006739, -1097272, -1402691, -1941858, -2663010, -3309464, -3586876, -3460407, -3031960, -2492219, -2048378, -1840276, -1737895, -1453663, -1107999, -770077, -194251, 448677, 786395, 916222, 1021131, 1233197, 1588977, 1899005, 2046692, 1948119, 1705010, 1505024, 1227357, 827933, 383337, -103395, -449467, -290977, 398584]
10558C98584O42048q055m07613l73845m16950m08177J57753Q56256R72194O34212
10548B046407K91737M1328j02328r7945j49561l02828l68397k44030K2014J67357
10538A303754k65708j041125j287411q35258j21723L86757M14856J67520j3763
10529a292101m6184N2129K17177K11281J12010J28357K75931N39236P13709O10190
10519A521735M51382N30445O52162N57012K378p02406j011871j040487j045425
10510h5075q97222m71283j9288N2228n0307J09603M69824P09200P21661O15512
10500A154853M97431K79726q9551m80488n82446k07718J85706K06961J05562J99827
10490A269863K65566J26787j29492l41881l31817j68424m0612j75677n65770p35459
$$ y = [398584, 1040632, 1032577, 624964, 251119, -165831, -574008, -416255, 440001, 1412195, 2046407, 2338144, 2379472, 2277144, 2179199, 2029638, 1726810, 1358413, 1114383, 1136397, 1303754, 1038046, -3079, -1290490, -2125748, -2247471, -1860714, -1445858, -1278338, -1292101, -1338285, -1286156, -1068979, -857698, -745688, -617331, -341400, 197836, 911545, 1521735, 1973117, 2503562, 3155724, 3712736, 3715114, 3012708, 2000837, 960350, -85075, -982297, -1453580, -1472868, -1420640, -1470947, -1361344, -891520, -182320, 539341, 1154853, 1652284, 1932010, 1842459, 1361971, 779525, 571807, 757513, 964474, 1070036, 1269863, 1535429, 1662216, 1532724, 1190843, 859026, 690602, 649990, 474313, -91457, -826916]
10480h26916m78327k16407j43109J28106O57227Q35626O03427L35327J55318J40298
10470A190570K03893N917l82054p46005r48519q05453m19963J849L09425L91553
10460a198787K51807J01331R1840K89891M44320M65391L62929K83578N06727O49184
10450B248211N40106M38999L98733P9288n34097q51528p62095q07670j204933
10441d54986j382463r70724l86190j22907r8135j05401j42169r7339K488k7019
10431c784845k53448m94623k97606K23867P04564J149303J418293J270356P98417
10422G34278L15811K5644k3375J00744J11190j9565j73720l73971m92539k78533
10412g4036J36100L39915M32056N21647L12701k01019o54397n99889j52168J85592
$$ y = [-826916, -1305243, -1521650, -1664759, -1536653, -879426, -43800, 559627, 894954, 1050272, 1190570, 1394463, 1400380, 1018326, 272321, -676198, -1481651, -1901614, -1899765, -1590340, -1198787, -946980, -845649, -753809, -463918, -19598, 445793, 808722, 1092300, 1599027, 2248211, 2788317, 3227316, 3626049, 3705337, 3171240, 2319712, 1557617, 749947, -454986, -1837449, -2808173, -3194363, -3317270, -3415405, -3520806, -3662975, -3760314, -3757826, -3784845, -4038293, -4532916, -4830522, -4606655, -3902091, -2752788, -1334495, -64139, 734278, 1050089, 1075733, 1052358, 1153102, 1264292, 1244727, 1071007, 697036, 204497, -74036, 62064, 401979, 834035, 1355682, 1668383, 1467364, 812967, 213078, 60910, 246502]
10402B46502J60907j79051m27611n93433p07738n66998l11704j64910K1514M16936
10392b105586N08115J81813p6944j25443P8133M39107N89872L40533j57506n68064
10382h95970p49528q48452p78936m74027r1074K20715K41819l2092j43014J41368
10372c409191M76217N49752L61152K32898M26088P77484Q53567N13056k7874m52027
10362C01122m34894j76498m3419o2069k00562k69412l67945m17256j36256K97250
10352a509939N69628M37979J37270J57765M58087N78382K11192k20427j82598
10343F37339O3263J31991J68401L56736M55004L70166J42995j28415k17899j22590
10333A856991k00340m45990m39732k20400J19794M02405L70395l0872n97438r70521
$$ y = [246502, 407409, 228358, -199253, -792686, -1500424, -2067422, -2379126, -2544036, -2522522, -2105586, -1597471, -1415658, -1492602, -1618045, -1539912, -1100805, -510933, -170400, -327906, -895970, -1645498, -2493950, -3272886, -3746913, -3837987, -3617272, -3375453, -3407545, -3550559, -3409191, -2932974, -2383222, -2022070, -1789172, -1363084, -585600, 267967, 781023, 753149, 301122, -133772, -310270, -353689, -415758, -616320, -885732, -1253677, -1670933, -1807189, -1509939, -940311, -502332, -365062, -207297, 250790, 829172, 1040364, 819937, 637339, 700602, 832593, 1000994, 1357730, 1812734, 2182900, 2325895, 2197480, 1979581, 1856991, 1656651, 1210661, 770929, 550529, 670323, 1072728, 1443123, 1412251, 814813, -155708]
10323a55708r02696l74049K21024O09023P13758M55479J5591j67738j0979K3132
10313D26837q0370q0028N8752J62133K69302L06725J43662l2364j03138k10584
10303H60927l89275m79626k88886J22393L67063N30587N39111K75547k2362k22441
10293A293038k61111k11022k94163o23987q56403p09765k43271L49484O61694
10284h95506O91153N98244L29169l6048l52880k92886J75358P11243Q36645M28103
10274B192595J34336K28138L82562K06719l01520n94071k87584K20689L15193
10265B497057O2004k17369m66387p31713j054180j180597q64334k57399J21746
10256b091172J63165J87472R6544k30232m62273o13335o81085l70221L21213Q54137
$$ y = [-155708, -1058404, -1432453, -1211429, -602406, 111352, 566831, 582422, 414684, 403705, 426837, 346467, 266439, 325191, 487324, 756626, 1063351, 1207013, 1174649, 1071511, 860927, 471652, -7974, -296860, -174467, 192596, 723183, 1262294, 1537841, 1515479, 1293038, 1031927, 820905, 526742, -97245, -953648, -1663413, -1906684, -1557200, -895506, -204353, 393891, 723060, 687012, 334132, 41246, 216604, 927847, 1764492, 2192595, 2326931, 2555069, 2937631, 3144350, 2842830, 2248759, 1961175, 2181864, 2497057, 2559061, 2341692, 1875305, 1143592, 89412, -1091185, -1955519, -2212918, -2091172, -1928007, -1740535, -1643991, -1874223, -2336496, -2949831, -3630916, -4001137, -3679924, -2825787]
10246b825787R08883Q86539J027562R09543M65317K45878L48919L88988L08929
10237B664771L63826M66175M28937K58326n1085n19447j003620j130267q01304
10228F76312m54609l67498o48428r67017q40685k18116M95556P32234M63118J66174
10218i62959J51287J27933N4198P6670K34134M16690L33977j74180p13116p90619
10208a245985m29280J20142L89284J28208l23463m85940j07372M86558O93066
10199g74782N10840M8718p45177j208606r26360l27726J26698M09226N34088L77242
10189a975839J58514P2870J25640J84582K88728L60268L24028K91913L81219M17885
10179F29808J53049j94562l25859k79375r5011j67624l83846k83059j1965J7985
$$ y = [-2825787, -1916904, -1030365, -2803, 906740, 1372057, 1617935, 1966854, 2355842, 2664771, 3028597, 3494772, 3923709, 4182035, 4130950, 3611503, 2607883, 1477616, 676312, 221703, -145795, -794223, -1761240, -2601925, -2820041, -2324485, -1592251, -1129133, -962959, -811672, -683739, -629541, -552871, -318737, 97953, 431930, 257750, -455366, -1245985, -1675265, -1555123, -1165839, -1037631, -1361094, -1847034, -1954406, -1467848, -774782, -263942, -215224, -960401, -2169007, -3095367, -3423093, -3296395, -2887169, -2353081, -1975839, -1817325, -1744455, -1618815, -1434233, -1145505, -785237, -461209, -169296, 211923, 629808, 782857, 588295, 262436, -16939, -111950, -279574, -663420, -946479, -958444, -940459]
10169i40459j1474J37672L73062M77198L46395J40421R1874J26150j04626m19767
10159B16446l40194J40008N16142M97095M05093K63185m799j80379j19873J93203
10149A585927M67021N42326M97434K76559m4991k09634M5304M62189M12540j43744
10139C890931n77353n71003m75920l72903j65652k2103r7529k48143l79090m31945
10129E49290j47085K72817K22675k05185m33232l38271r3912R0833M2926k86467
10119c25611p27004r09299o45721m09268m68051n19801l76505m3209K82290N13962
10109c628217P09393Q67534Q29607O00941M22409K67808J89212R3560p2410l9161
$$ y = [-940459, -951933, -814261, -441199, 35999, 382394, 522815, 614689, 740839, 636213, 216446, -123748, 16260, 532402, 1029497, 1434590, 1697775, 1692976, 1512597, 1392724, 1585927, 2052948, 2595274, 3092708, 3369267, 3324276, 3114642, 3159946, 3622135, 4034675, 3890931, 3313578, 2742575, 2266655, 1893752, 1728100, 1705997, 1608468, 1360325, 981235, 549290, 402205, 675022, 897697, 692512, 259280, -78991, -172903, -82070, -39144, -325611, -1052615, -1961914, -2607635, -3016903, -3484954, -4004755, -4381260, -4424469, -4142179, -3628217, -2918824, -2051290, -1221683, -620742, -198333, 69475, 258687, 352247, 279837, 240676]
$$ [...]
##END NTUPLES=NMR SPECTRUM
##END=
