##TITLE=C13_Ser 2065-NEA
 CDCl3, 23100 sc

 6.2.2024
##JCAMPDX= 6.0         $$ Bruker NMR JCAMP-DX V2.0
##DATA TYPE= NMR SPECTRUM
##DATA CLASS= NTUPLES
##ORIGIN= UXNMR, Bruker Analytische Messtechnik GmbH
##OWNER= root
$$ XWIN-NMR		Version 3.5
$$ Wed Feb  7 13:39:31 2024 Russian Standard Time (UT+4h)  she@DPX200
##.OBSERVE FREQUENCY= 50.327896
##.OBSERVE NUCLEUS= ^13C
##.ACQUISITION MODE= SIMULTANEOUS
##.ACQUISITION SCHEME= undefined
##.AVERAGES= 23101
##.DIGITISER RES= 17
##SPECTROMETER/DATA SYSTEM= spect
##.PULSE SEQUENCE= zgpg30
##.SOLVENT NAME= CDCl3
##.SHIFT REFERENCE= (INTERNAL, CDCl3, 0, 222.646)
##AUDIT TRAIL= $$ (NUMBER, WHEN, WHO, WHERE, WHAT)
$$ ##TITLE= Audit trail, XWIN-NMR		Version 3.5
$$ ##JCAMPDX= 5.01
$$ ##ORIGIN= Bruker BioSpin GmbH
$$ ##OWNER= she
$$ F:/spectra/data/she/nmr/c13/1/pdata/1/auditp.txt
$$ ##AUDIT TRAIL=  $$ (NUMBER, WHEN, WHO, WHERE, WHAT)
(   1,<2024-02-07 13:36:43.35 +0400>,<she>,<DPX200>,
      <created by zg, POWCHK disabled, PULCHK disabled
       terminated by command 'halt'
       configuration hash MD5:
       00 E9 B6 7A A2 85 ED C7 34 08 36 98 17 FE 4E 26
       data hash MD5: 32K
       FF 95 34 DB 6A 3B AA CB 3A 77 2A 5B 03 B1 64 57>)
(   2,<2024-02-07 13:37:30.75 +0400>,<she>,<DPX200>,
      <Start of raw data processing
       efp BC_mod = 2 LB = 2 FT_mod = 6 PKNL = 1 PHC0 = -377.1764 PHC1 = 23.53753 SI = 32K 
       data hash MD5: 32K
       F4 53 48 56 CC 40 65 2E D1 6A F6 AF 00 FA 8D 4F>)
(   3,<2024-02-07 13:37:33.98 +0400>,<she>,<DPX200>,
      <abs ABSG = 5 
       data hash MD5: 32K
       0B EC E8 48 33 90 57 DF F7 78 DE B4 41 5B F6 76>)
(   4,<2024-02-07 13:37:55.79 +0400>,<she>,<DPX200>,
      <pk PHC0 = 3.130706 PHC1 = 0 
       data hash MD5: 32K
       D1 88 A9 7A 86 1E E0 51 5D 92 EE 0C DB 67 BB D2>)
(   5,<2024-02-07 13:37:58.85 +0400>,<she>,<DPX200>,
      <abs ABSG = 5 
       data hash MD5: 32K
       94 DE FC 00 84 51 3B DA 3A E8 A6 B4 7E 2F DB B5>)
(   6,<2024-02-07 13:38:32.32 +0400>,<she>,<DPX200>,
      <pk PHC0 = -0.8628531 PHC1 = 1.999997 
       data hash MD5: 32K
       2E A5 69 A9 FB AA 5E 96 62 30 DA F4 61 1F 65 77>)
(   7,<2024-02-07 13:38:35.68 +0400>,<she>,<DPX200>,
      <abs ABSG = 5 
       data hash MD5: 32K
       A7 36 DB B9 BA EF 40 D7 8C B1 8A 50 22 EB 02 8F>)
$$ ##END=
$$ 
$$ hash MD5
$$ 6C 01 08 00 4F 93 65 8E 87 0E 74 E1 EE CE 1E 70
##$RELAX= 
##$RELAX= 
##$RELAX= 
##$RELAX= 
##$RELAX= 
##$RELAX= 
##$RELAX= 
##$RELAX= 
$$ Bruker specific parameters
$$ --------------------------
##$DU= <F:/spectra>
##$EXPNO= 1
##$NAME= <c13>
##$PROCNO= 1
##$TYPE= <nmr>
##$USER= <she>
##$AMP= (0..31)
100 100 100 100 100 100 100 100 100 100 100 100 100 100 100 100 100 100 
100 100 100 100 100 100 100 100 100 100 100 100 100 100 
##$AQSEQ= 0
##$AQ_mod= 1
##$AUNM= <au_zg>
##$AUTOPOS= <>
##$BF1= 50.322709
##$BF2= 200.13
##$BF3= 50.322709
##$BF4= 500.13
##$BF5= 500.13
##$BF6= 500.13
##$BF7= 500.13
##$BF8= 500.13
##$BYTORDA= 1
##$CFDGTYP= 0
##$CFRGTYP= 5
##$CHEMSTR= <none>
$$ [...]
##$SUBNAM4= <"">
##$SUBNAM5= <"">
##$SUBNAM6= <"">
##$SUBNAM7= <"">
##$SUBNAM8= <"">
##$SUBNAM9= <"">
##$SW= 239.972175391363
##$SWIBOX= (0..15)
0 1 3 0 0 0 0 0 0 0 0 0 0 0 0 0 
##$SW_h= 12077.2946859903
##$TD= 32768
##$TD0= 1
##$TE= 0
##$TE2= 300
##$TE3= 300
##$TEG= 300
##$TL= (0..7)
120 120 120 120 120 120 120 120 
##$TP= (0..7)
150 150 150 150 150 150 150 150 
##$TP07= 0
##$TPNAME0= <>
##$TPNAME1= <>
##$TPNAME2= <>
##$TPNAME3= <>
##$TPNAME4= <>
##$TPNAME5= <>
##$TPNAME6= <>
##$TPNAME7= <>
##$TPOAL= (0..7)
0.5 0.5 0.5 0.5 0.5 0.5 0.5 0.5 
##$TPOFFS= (0..7)
0 0 0 0 0 0 0 0 
##$TUNHIN= 0
##$TUNHOUT= 0
##$TUNXOUT= 0
##$USERA1= <user>
##$USERA2= <user>
##$USERA3= <user>
##$USERA4= <user>
##$USERA5= <user>
##$V9= 5
##$VALIST= <valist>
##$VCLIST= <CCCCCCCCCCCCCCC>
##$VD= 0
##$VDLIST= <DDDDDDDDDDDDDDD>
##$VPLIST= <PPPPPPPPPPPPPPP>
##$VTLIST= <TTTTTTTTTTTTTTT>
##$WBST= 1024
##$WBSW= 4
##$XGAIN= (0..3)
0 0 0 0 
##$XL= 0
##$YL= 0
##$YMAX_a= 137766317
##$YMIN_a= -124556754
##$ZGOPTNS= <>
##$ZL1= 120
##$ZL2= 120
##$ZL3= 120
##$ZL4= 120
##$ABSF1= 222.624
##$ABSF2= -17.3728
##$ABSG= 5
##$ABSL= 3
##$ALPHA= 0
##$AQORDER= 0
##$ASSFAC= 0
##$ASSFACI= 0
##$ASSFACX= 0
##$ASSWID= 0
##$AUNMP= <proc_1d>
##$AZFE= 0.1
##$AZFW= 0.5
##$BCFW= 0
##$BC_mod= 2
##$BYTORDP= 0
##$COROFFS= 0
##$CY= -3
##$DATMOD= 1
##$DC= 0
##$DFILT= <>
##$DTYPP= 0
##$F1P= 0
##$F2P= 0
##$FCOR= 0.5
##$FTSIZE= 32768
##$FT_mod= 6
##$GAMMA= 0
##$GB= 0
##$INTBC= 1
##$INTSCL= 4.134877e-10
##$ISEN= 128
##$LB= 2
##$LEV0= 0
##$LPBIN= 0
##$MAXI= 10000
##$MC2= 0
##$MEAN= 0
##$ME_mod= 0
##$MI= 0.1934396
##$NCOEF= 0
##$NC_proc= 1
##$NLEV= 6
##$NOISF1= 120.0001
##$NOISF2= 80.00006
##$NSP= 0
##$NTH_PI= 0
##$NZP= 0
##$OFFSET= 222.646
##$PC= 1.4
##$PHC0= -374.9085
##$PHC1= 25.53753
##$PH_mod= 1
##$PKNL= yes
##$PPARMOD= 0
##$PSCAL= 0
##$PSIGN= 0
##$REVERSE= no
##$SF= 50.3227304928848
##$SI= 32768
##$SIGF1= 140
##$SIGF2= 120
##$SINO= 11.81781
##$SIOLD= 32768
##$SREGLST= <13C.CDCl3>
##$SSB= 0
##$STSI= 32768
##$STSR= 0
##$SW_p= 12077.2946859903
##$SYMM= 0
##$S_DEV= 0
##$TDeff= 32768
##$TDoff= 0
##$TI= <>
##$TILT= no
##$TM1= 0
##$TM2= 0
##$TOPLEV= 0
##$USERP1= <user>
##$USERP2= <user>
##$USERP3= <user>
##$USERP4= <user>
##$USERP5= <user>
##$WDW= 1
##$XDIM= 32768
##$YMAX_p= 482378997
##$YMIN_p= -3952949
$$ End of Bruker specific parameters
$$ ---------------------------------
##NTUPLES= NMR SPECTRUM
##VAR_NAME=  FREQUENCY,     SPECTRUM/REAL,   SPECTRUM/IMAG
##SYMBOL=    X,             R,               I
##VAR_TYPE=  INDEPENDENT,   DEPENDENT,       DEPENDENT
##VAR_FORM=  AFFN,          ASDF,            ASDF
##VAR_DIM=   32768,         32768,           32768
##UNITS=     HZ,            ARBITRARY UNITS, ARBITRARY UNITS
##FACTOR=    0.368581032318806, 1,           1
##FIRST=     11204.1544567457, 0,            0
##LAST=      -873.140229244636, 0,           0
##MIN=       -873.140229244636, -3952949,    0
##MAX=       11204.1544567457, 482378997,    0
$$ Real data points
##PAGE= N=1
##DATA TABLE= (X++(R..R)), XYDATA
$$ [...]
15916a604514K72801M48745N44003M44839J62238j42413l05279k66650m8412J53496
15906c41146J87555Q4274o5749j72528j69360r3027k5261L4225O2743K8788l6858
15895e06344p1065j25578j21008P9995L40752M53454M52710L02799J9030j56323
15885F68422j62762j65917k10378j77928o0489J57119L44239K59567j1079j11915
15875E28879J5910K07070L18759L15166K57164J59498r94k00335l57895m44028
15865G99194m36652l36953k27473j70803j89725k31866j95612j40586r7400L2409
15855a195467J57271J87527J90535K39512K70893K40270J21744O4171J41602K37440
15845F55498K26283O6435j17660j54112j84814l11576k87881j28442j33509l05684
$$ plain form
15916 -1604514 -1331713 -882968 -338965 105874 268112 125699 -179580 -446230 -494642 -341146
15906 -341146 -153591 -69317 -135066 -307594 -476954 -569981 -595242 -561017 -498274 -469486 -506344
15895 -506344 -577409 -702987 -823995 -744000 -403248 50206 502916 805715 824745 668422
15885 668422 505660 339743 129365 -48563 -109052 48067 392306 651873 640794 528879
15875 528879 544789 751859 1070618 1385784 1642948 1802446 1801452 1601117 1243222 799194
15865 799194 362542 25589 -201884 -372687 -562412 -794278 -989890 -1130476 -1227876 -1195467
15855 -1195467 -1038196 -850669 -660134 -420622 -149729 90541 212285 276456 418058 655498
15845 655498 881781 948216 830556 676444 491630 180054 -107827 -236269 -369778 -675462
15835f75462l24026j53432o9594o0794O6645L11578M25350K85809J56162J46200
15825A08436R6141p3214j97213q8343N4140K0099q2178l1050J81401K86650K45860
15814E20729J59143J15690J94529L27805L29279J02883j90428l91824m48401l77985
15804C41420k36263j30630L0395K80418N16298O02132M39003M5511k87857l31806
15794A268621k71118k15639j44045n7088r961K4596Q4497O2422k4267J8168K05355
15783I41541L08060K05132M4993j00493k49356l82037l62324k38172j52123j47579
15773a32358j17806o8885j23414j47575m3091R2689J23098O0220Q5822J79826
15763i1474J48446L9495j27327k94234k33934K404J56203J85763K48448L72350
$$ plain form
15835 -675462 -999488 -1152920 -1222514 -1283308 -1216663 -905085 -479735 -193926 -37764 108436
15825 108436 204577 131363 -65850 -154193 -100053 -79954 -162132 -193182 -11781 274869 520729
15814 520729 679872 795562 990091 1317896 1647175 1750058 1559630 1167806 719405 341420
15804 341420 105157 -25473 4922 285340 801638 1403770 1842773 1888284 1600427 1268621
15794 1268621 997503 781864 637819 580731 570770 595366 679863 742285 718018 736186 941541
15783 941541 1249601 1454733 1499726 1399233 1149877 767840 405516 167344 15221 -132358
15773 -132358 -250164 -319049 -442463 -590038 -633129 -540440 -417342 -357122 -271300 -91474
15763 -91474 56972 96467 -30860 -325094 -559028 -556624 -400421 -214658 33790 406140
15753D06140M86556N13243L43362Q9983j15699k58065l19350k66141j61512j65509
15743E53008j39420k6014M5757J01585P4086J9834P5766R1827P793q8707j07209
15732F08306j003J10398P656j70789k08195k12710k80987k62800j31910p6051
15722f18085k5744J78154M10252M85159L27542J20562m204j61154l03378k90633
15712A18471j30094J42341L37331L96536L49408R5196k18722l90994l85196k18118
15702I6159Q6R1471J18131K37185K14435l1638j63847j26320j15350l6286J00872
15691C84898J05831j8073j03866j02023n8675M8123J64564K14538J88911J26989
15681I51217K1337j20644k68542l12059j67110M3546J69855J45569j481k00904
$$ plain form
15753 406140 892696 1405939 1749301 1839284 1723585 1465520 1146170 880029 718517 553008
15743 553008 413588 387574 433331 534916 609002 628836 704602 796429 804222 715515 608306
15732 608306 607303 717701 725357 554568 346373 133663 -147324 -410124 -542034 -618085
15722 -618085 -643829 -465675 -55423 429736 757278 877840 873636 712482 409104 118471
15712 118471 -11623 130718 468049 864585 1213993 1309189 1090467 699473 314277 96159
15702 96159 96245 187716 305847 543032 757467 725829 561982 435662 320312 284026 384898
15691 384898 490729 472656 368790 266767 208092 256215 420779 635317 824228 951217
15681 951217 972554 851910 583368 271309 104199 147745 317600 463169 461688 260784
15671B60784l48896l03533l0168L10335L83658J68907n8808j20922R735J19814
15661C90906L5241o7906n6192K9165J15383O2225j02616k29830k23411n8496J55203
15650D9672K66377L17299L11306J81651Q6684J17785J2999l02291n09395l70922
15640A61165m4400J55093K07978J96434J68172J09239L3703q7027k42476l41196
15630C16685k97652j25022M4653J42280J02608o9050j90037k25725k34237j75070
15620g10567o4625L8385J34835K62591L69307L99041L38885K72623J64527r1527
15610A113475l50070m36760m16485m04150m27787l98103k36064k4669J92548M11583
15600i76482N00171L90206J99420L4014j82980m04302m53246k87830j259K57401
$$ plain form
15671 260784 -88112 -391645 -421813 -111478 272180 441087 382279 261357 271092 390906
15661 390906 426147 358241 302049 331214 446597 508822 406206 176376 -47035 -105531 49672
15650 49672 316049 633348 944654 1126305 1212989 1330774 1343773 1041482 532087 161165
15640 161165 116765 271858 479836 676270 844442 953681 987384 900357 657881 316685
15630 316685 19033 -105989 -61336 80944 183552 114502 -75535 -301260 -535497 -710567
15620 -710567 -775192 -736807 -601972 -339381 29926 428967 767852 1040475 1205002 1113475
15610 1113475 763405 326645 -89840 -493990 -921777 -1319880 -1555944 -1580613 -1388065 -976482
15600 -976482 -476311 -86105 113315 147329 -35651 -439953 -893199 -1181029 -1182288 -924887
15590i24887L51583K43447J19084J20660J69292J83438J10184r7480k47180j57945
15580a29804j8100m7332k08566k85219j06806K1162j27657l27337l14245r4360
15570a638264N4621J5057m5914J3931K9588l8842J3994J71940K68161K76507K07348
15559f71873J14938J4548q6515m7398Q6718J46799J56933R2871r0737k42068j94239
15548g20023P1660K14890R3969j451K4507R214k1951J42422M18825M57473K74378
15537I63913J77170J76201P0766p9005j25870j60968l03892m96245m96928k96692
15527e71550j47949j21983j36857j79598l42223m92200k95773N5195K36151L25377
15517a671410M69909O04812N09588K29811r2307l20991l53676k14613K2188K29670
$$ plain form
15590 -924887 -573304 -329857 -210773 -90113 79179 262617 372801 275321 28141 -129804
15580 -129804 -147904 -195236 -403802 -689021 -795827 -774665 -902322 -1229659 -1543904 -1638264
15570 -1638264 -1583643 -1568586 -1614500 -1600569 -1570981 -1609823 -1595829 -1423889 -1155728 -879221 -671873
15559 -671873 -556935 -542387 -628902 -676300 -589582 -442783 -285850 -192979 -283716 -525784 -720023
15548 -720023 -648363 -433473 -339504 -340955 -316448 -307234 -329185 -186763 232062 689535 963913
15537 963913 1141083 1317284 1388050 1309045 1183175 1022207 718315 222070 -274858 -571550
15527 -571550 -719499 -841482 -978339 -1157937 -1500160 -1992360 -2288133 -2232938 -1996787 -1671410
15517 -1671410 -1201501 -596689 -87101 142710 50403 -270588 -624264 -838877 -816689 -587019
15507e87019K97705L16344L07619J47379j16051k51602j70894j09633j83638k08142
15497e57932j28266O116J58663K93423K64364L8302L905K73425N25622O03694
15487A481316N34353K85489K8755j61343l20539m04957l85275k45335j20363j13858
15477E78243j67011j72332o2528J1244j09215k87104l13847j76374N2373K95578
15467c50973K86639J09366K4941q427j03230j36994j18238k21260l14298k26420
15457a058894K951J90945K64686L16995K64253L1685k38358k29458J38925M03686
15447H7416L27150P7891r9905j06492J1975R8418P6082m2322k29108l36936k56350
15436c92181M1565L36808M50609L74680J76901J00944K24013K69312Q9360j61768
$$ plain form
15507 -587019 -289314 27030 334649 482028 365977 114375 -56519 -166152 -349790 -557932
15497 -557932 -686198 -680082 -521419 -227996 36368 74670 78575 352000 877622 1481316
15487 1481316 2015669 2301158 2329913 2168570 1848031 1443074 1057799 812464 692101 578243
15477 578243 411232 238900 176372 187616 78401 -208703 -522550 -698924 -646551 -350973
15467 -350973 -64334 45032 69973 61546 -41684 -178678 -296916 -518176 -832474 -1058894
15457 -1058894 -1055943 -864998 -600312 -283317 -19064 12621 -225737 -455195 -316270 87416
15447 87416 414566 492457 392552 286060 298035 396453 472535 430213 201105 -135831 -392181
15436 -392181 -350616 -13808 436801 811481 988382 1089326 1313339 1582651 1672011 1510243
15426A510243l03907k82192j58160J3803J05443R883j20136m0344J88884L03549
15416A227066K57461J35075n2527k11627k25930k40302k46778j1328L27810N75964
15406A534884O27805M33352R3818j95810l46719l31432j81437j37989k54014l36360
15396I06098l72239m12537k73945l7942L6694L0940R6755J23586N8316J4802L9216
15385B09744J01766J12388q3386k91246k04298M2397J87052K24886J33701q8714
15375C44290k15087j07052R4643J17435q4127k52367k64506j96918k469K12551
15365c53607K77231K31468J09478n7117j82851k05321n5448J04266J38295P5066
15355H1460N6842J63925K48948J38711j77505m11460l87168j93206m0961q9447
$$ plain form
15426 1510243 1206336 924144 765984 779787 885230 895113 774977 734633 923517 1227066
15416 1227066 1484527 1619602 1567075 1355448 1129518 889216 642438 631110 958920 1534884
15406 1534884 2162689 2596041 2689859 2494049 2147330 1815898 1634461 1496472 1242458 906098
15396 906098 533859 121322 -152623 -190565 -153871 -122931 -26176 97410 155726 170528 209744
15385 209744 311510 423898 340512 49266 -155032 -112635 74417 299303 433004 344290
15375 344290 129203 22151 116794 234229 150102 -102265 -366771 -563689 -566158 -353607
15365 -353607 -76376 155092 264570 207453 24602 -180719 -236167 -131901 6394 81460
15355 81460 138302 302227 551175 689886 512381 100921 -286247 -479453 -520414 -609861
15345f09861k40217j99474R999J49624J92678J46939K6467m3192l8730K686M7078
15334e56003L9918L9557L6966n1266j07064p6403n2943o9492q118O8040J18n3618
15322g90308j6972O7064K16766L28785K90330J55002N3473K6700O4643J29944
15312E25427P4579j14282l80968m96342k80125M0675K08852J66870k7780j85033
15302d68127k32640j65667L6460J67038J62934J51428J36674O9816n849p4857
15292b22790k47654l96686l49750k40863j80948j50418M249K28239L39915L54340
15282h62366K75456J21093M7850J29874K18679J42147n8191j66233j50338p4264
15272c76293N4098J93682J56356p1391k49781k94578k11970n2730J14894K27843
$$ plain form
15345 -609861 -850078 -1049552 -1039553 -889929 -697251 -550312 -523845 -567037 -605767 -603081 -556003
15334 -556003 -516085 -476528 -439562 -490828 -597892 -674295 -727238 -796730 -804848 -736808 -736690 -790308
15322 -790308 -807280 -740216 -523450 -194665 95665 250667 304140 330840 395483 525427
15312 525427 600006 485724 104756 -391586 -671711 -631036 -422184 -255314 -283094 -468127
15302 -468127 -700767 -866434 -829974 -662936 -500002 -348574 -211900 -142084 -147933 -222790
15292 -222790 -470444 -867130 -1216880 -1457743 -1638691 -1789109 -1784860 -1556621 -1216706 -862366
15282 -862366 -586910 -465817 -417967 -288093 -69414 72733 14542 -151691 -302029 -376293
15272 -376293 -322195 -128513 27843 -43548 -293329 -587907 -799877 -852607 -737713 -509870
15262e09870J75245P7952J42304L06646L55181K67187J22163l850r5917j31579
15252G05462j90311k71528k42734q1780R3185J35390Q0420n338r2716j97564k00834
15241b68348j5822K13455L20070L37578L66117L17713L09634L68921L09132K08757
15231B467207J23573l6290k58801m08640m41168l67548k51739k04637k06234j78071
15221B37652j08201q0487p6074k0201K368n9597r3202N0367K79024L98770L44502
15210H74921J28798k8965K9092P3474k796l8632o3752j18732j83995k73682l26431
15199F9300k48644j49416j16118q8593n6206K016L6595L8214K4794k174J5211
15188d75021J21667K22419J27159j04398k07051r3049M8520Q6923P1854K3929
$$ plain form
15262 -509870 -334625 -256673 -114369 192277 547458 814645 936808 932958 837041 705462
15252 705462 515151 243623 889 -80891 12294 147684 228104 222766 130050 -67514 -268348
15241 -268348 -284170 -70715 249355 586933 953050 1270763 1580397 1949318 2258450 2467207
15231 2467207 2590780 2554490 2295689 1887049 1445881 1078333 826594 621957 415723 237652
15221 237652 129451 48964 -27110 -47311 -44943 -104540 -197742 -147375 131649 530419 874921
15210 874921 1003719 974754 1003846 1077320 1074524 1035892 972140 853408 669413 395731 69300
15199 69300 -179344 -328760 -444878 -533471 -589677 -587661 -551066 -512852 -488058 -490232 -475021
15188 -475021 -353354 -130935 -3776 -108174 -315225 -408274 -359754 -272831 -200977 -177048
15178a77048O2552K39586L27295J56012j38582l18529l61006l38151k63872j24876
15168i36619Q2063K85288M25535M47673K82341k1090j48344m6179l8870j43330
15158A88468r2457R4376K61369L53025K73118J60415K07902K57972J69221K6816
15148A900225r7842k31127l27641l34111k92146j92686j20614j99016k80793k19168
15138c94919n8283L0155j00094k30286r9675J91882L52691L43217K94896K37569
15128E67153Q0663j90742l45002l88587l50455j11318K03379M01677L64948J11784
15118C43500j91459l35043k28548L8705K22124J86660K8314j47463k73817l02645
15108f59672l37570l92221k50385l7199Q2967J61930J29281n0306j77522j70674
$$ plain form
15178 -177048 -114496 125090 452385 608397 469815 151286 -209720 -547871 -811743 -936619
15168 -936619 -854556 -569268 -143733 303940 586281 565191 416847 370668 331798 188468
15158 188468 96011 190387 451756 804781 1077899 1238314 1446216 1704188 1873409 1900225
15148 1900225 1802383 1571256 1243615 909504 617358 424672 304058 105042 -175751 -394919
15138 -394919 -453202 -423047 -523141 -753427 -853102 -661220 -308529 34688 329584 567153
15128 567153 647816 457074 112072 -276515 -626970 -738288 -534909 -133232 231716 343500
15118 343500 152041 -183002 -411550 -372845 -150721 35939 64253 -83210 -357027 -659672
15108 -659672 -997242 -1389463 -1639848 -1677047 -1594080 -1432150 -1302869 -1353175 -1530697 -1701371
15098a701371r3657l7673j5699l7953p6633m5672O9731J24424O0408N4589J42508
15087a556998J72577R4901J59556L70729M24169K38316m6088l15877m37322m48482
15077a344519m57118l59600j22114J01410K62387L43978K67210R4716N1534Q9230
15067a072886J06275J55431K78817M28981M33629K85121J89413J19339r1524k53194
15057E79402j29105J5843r3001k30876k29748j01005k8108r7481j44305l7795
15047d96179R6948N3642j0952P4443J24317K2064p0500L210J27506J70197J29618
15036B24314O4749m7104j69803j57353q8518j19401j66317j33799j15829j69209
15026h78270j24967m7871r1175k15621k85581j33263J12213J79249J21130J26747
$$ plain form
15098 -1701371 -1795028 -1832701 -1848400 -1886353 -1962986 -2008658 -1938927 -1814503 -1754095 -1699506 -1556998
15087 -1556998 -1384421 -1289520 -1129964 -759235 -335066 -96750 -142838 -458715 -896037 -1344519
15077 -1344519 -1801637 -2161237 -2283351 -2181941 -1919554 -1575576 -1308366 -1213650 -1162116 -1072886
15067 -1072886 -966611 -811180 -532363 -103382 330247 615368 804781 924120 832596 579402
15057 579402 450297 466140 373139 142263 -87485 -188490 -216598 -314079 -458384 -496179
15047 -496179 -399231 -345589 -356541 -282098 -157781 -135717 -206217 -203007 -75501 94696 224314
15036 224314 289063 241959 72156 -85197 -173715 -293116 -459433 -593232 -709061 -878270
15026 -878270 -1003237 -1051108 -1142283 -1357904 -1643485 -1776748 -1664535 -1485286 -1364156 -1237409
15016a237409J26311Q6748J6706n0326o3584r5729j34002m8117J58057L60545
15006h80800M48528L76818K09508P9410m3589j35575j08045p9004j01116j35750
14996c69615j21973m9254n0059j55342k66052k91406k87397k92801k38496j57946
14986b280341j56205j66608J1345K99245L91675K59811Q9744l3957p3299o6683
14976a725273j05220j39157j15916q9549j0192J67095L18584L01719K12082J37494
14966a048333J02838J78594K99582L48977L50372L52195L03840J97345O9540p0447
14956A084503j62853j94467j45639J3573J19775qk70917l91969k89084j41587
14946c78673K5153K39271L32618K86219K89550L55373K77764Q2760m1179j36053
$$ plain form
15016 -1237409 -1111098 -1024350 -1007644 -1057970 -1121554 -1217283 -1351285 -1399402 -1241345 -880800
15006 -880800 -432272 -55454 154054 233464 189875 54300 -53745 -132749 -233865 -369615
14996 -369615 -491588 -540842 -590901 -746243 -1012295 -1303701 -1591098 -1883899 -2122395 -2280341
14986 -2280341 -2436546 -2603154 -2591809 -2292564 -1900889 -1641078 -1551334 -1585291 -1658590 -1725273
14976 -1725273 -1830493 -1969650 -2085566 -2175115 -2185307 -2018212 -1699628 -1397909 -1185827 -1048333
14966 -1048333 -945495 -766901 -467319 -118342 232030 584225 888065 1085410 1154950 1084503
14956 1084503 921650 727183 581544 595117 714892 714884 443967 51998 -237086 -378673
14946 -378673 -353520 -114249 218369 504588 794138 1149511 1427275 1510035 1468856 1332803
14936A332803l21461m99540m29270k64838k42939k27597j12990J0816K0944l3501
14926g67573N267K09659L47435J88609p449Q8623K98882L97516L90476J59584
14916A311029j32191k13392j96330j69667j36943j25142j64142j58122p5433m5822
14906a06155m3644J8357J09365K34446L13788K79726J80495k5267k69323l38124
14896C53664j74343R6363K64090K06202L0292j63648l02790l19430j94772M6097
14886a58275K33651J94456j4170k43510l35924l10436k94877k78914k40683j65122
14876a613804k4531L4740j11060j46078O5758K15714R2282q4722K458K67502M69769
14865h31972M33084J94806p3111k43638k47392r3223Q1848L8293j59474k50482
$$ plain form
14936 1332803 1011342 511802 82532 -182306 -425245 -652842 -765832 -755016 -734072 -767573
14926 -767573 -762306 -552647 -205212 -16603 -24052 64571 363453 760969 1151445 1311029
14916 1311029 1178838 965446 769116 599449 462506 337364 173222 15100 -60333 -106155
14906 -106155 -149799 -131442 -22077 212369 526157 805883 986378 961111 691788 353664
14896 353664 179321 275684 539774 745976 776268 612620 309830 -9600 -204372 -158275
14886 -158275 75376 269832 255662 12152 -323772 -634208 -929085 -1207999 -1448682 -1613804
14876 -1613804 -1638335 -1603595 -1714655 -1860733 -1794975 -1579261 -1486979 -1571701 -1569243 -1301741 -831972
14865 -831972 -398888 -204082 -277193 -520831 -768223 -861446 -779598 -741305 -900779 -1151261
14855a151261k18834j04791J7748J70521L67319L95921K64695J08451R6759K49282
14845A95810L75642L57830K21899J34435Q3662j01788l64134n31478m89302k59375
14835c76799n5502L357q581M3321J36672J48963J07081R4478J51471K06047J44970
14824E95478R0313J06817k7119k20353k15028o49L61904N94389M37063P3427j96341
14813A599901k58072j53822M1011J98216J43152r1320k62795k59348k09711k45710
14803E01502l01442k05446M6133K18643K15656J63368J04885J02486J66664J25354
14793A137803l2102j02259j83353l57153l52029j10692J56735L25969K62059k1377
14783G23601l94205o39408n38161j95855J73486L96876L04590R9711J29777L31108
$$ plain form
14855 -1151261 -1370095 -1474886 -1457138 -1286617 -919298 -523377 -258682 -150231 -53472 195810
14845 195810 571452 929282 1151181 1285616 1369278 1267490 903356 371878 -117424 -376799
14835 -376799 -432301 -428944 -437525 -394204 -257532 -108569 -1488 92990 244461 450508 595478
14824 595478 685791 792608 765489 545136 330108 329459 691363 1285752 1722815 1796242 1599901
14813 1599901 1341829 1188007 1229018 1427234 1570386 1479066 1216271 956923 747212 501502
14803 501502 200060 -5386 40747 259390 475046 638414 743299 845785 1012449 1137803
14793 1137803 1105701 1003442 820089 462936 110907 215 156950 482919 744978 723601
14783 723601 329396 -310012 -848173 -1044028 -870542 -473666 -169076 -69365 60412 391520
14773C91520L98447K65066J6187k18697j53251K00362M94123N14834L88273K71333
14763B568197J86270J70119J36631Q384k32462m59995m62887k45644k7250K4150
14753A665513m7823j46804k73625m33892n10134l33891o8127L4379k8712j53474
14743b96590k65486k55599Q616L83565N46841M57388K45276o9528l58211l93624
14733B648k50402j32036k0061L710P816J90846M25983M44512K41211Q268q7891
14722H34604k0556M2594N7328J12022J98094J80147J14801O6575J5033J3563Q1208
14711A695413J63039K28941L04299L67337L12269N4282k52734l92313l30016j37907
14701B012610O8811K25771L38920K88513J78829K17575K83338K76414K34635J57842
$$ plain form
14773 391520 789967 1055033 1071220 852523 699272 899634 1393757 1908591 2296864 2568197
14763 2568197 2754467 2924586 3061217 3069601 2837139 2377144 1914257 1668613 1641363 1665513
14753 1665513 1617690 1470886 1197261 763369 253235 -80656 -148783 -114404 -143116 -296590
14743 -296590 -562076 -817675 -809059 -425494 121347 578735 824011 754483 396272 2648
14733 2648 -247754 -379790 -399851 -396141 -388325 -197479 228504 673016 914227 922495 834604
14722 834604 814048 856642 913970 1025992 1224086 1404233 1519034 1585609 1600642 1614205 1695413
14711 1695413 1858452 2087393 2391692 2759029 3071298 3125580 2872846 2480533 2150517 2012610
14701 2012610 2081421 2307192 2646112 2934625 3113454 3331029 3614367 3890781 4125416 4283258
14691D283258J35351K02266K85390L31168M53252O12827P14523P78828Q74547
14682H671410J012504J048060J104006J400809J743913J927854J981796K007846
14674B0898198K200007K604753L112650L760211M648248N719201P032554Q670184
14666E8646006J0368652J1631185J1627785Q934107K724535n327988j1557509
14659H7046773j3754501j2820755j0759476q716295o975964n655749m600069l639219
14651B0124745k903700k333193j725547j212418r21461p87707p75487q52866r14190
14642G698176q41850o72449n89171n62000n04281m61198m93043n36869m55851
14633B581464k33893l4897O3970J09877L9684j80620m29292n78333n44174l31706
$$ plain form
14691 4283258 4418609 4620875 4906265 5237433 5690685 6303512 7018035 7796863 8671410
14682 8671410 9683914 10731974 11835980 13236789 14980702 16908556 18890352 20898198
14674 20898198 23098205 25702958 28815608 32575819 37224067 42943268 49975822 58646006
14666 58646006 69014658 80645843 92273628 101207735 103932270 98604282 87046773
14659 87046773 73292272 60471517 49712041 40995746 34019782 28364033 23763964 20124745
14651 20124745 17221045 14887852 13162305 11949887 11028426 10240719 9465232 8612366 7698176
14642 7698176 6856326 6183877 5594706 5032706 4528425 4067227 3574184 3037315 2581464
14633 2581464 2347571 2312674 2376644 2486521 2526205 2345585 1916293 1337960 793786 462080
14623D62080m5851J96978K40388O5036r1557q4112j375J9035Q1492K06551K63562
14612A312227L12209L45764L19377J75073l9166j97602l39742m33272m58345m26692
14602E69831l51936k17715o416J39339J36956J9070l0542O5238J00707k769r5554
14591C26209q2780k8180J0466O2994J65063K27752J51841O8867J18642K87400
14581A308274M79910N75774M62949L01110K15334P1727j23278k28916j99054j78896
14571B684934k05492j97729j75068j69035j61423n9393Q0583J30877J39360O4389
14561B132003j39204l12462l73318l27143j85261j7258R5926J56101J89262J37043
14551A355689L6650L7979J08362R7796N4428P4660J75619K08597L7053j27218
$$ plain form
14623 462080 416229 613207 853595 918631 827074 742962 741587 760622 842114 1048665 1312227
14612 1312227 1624436 1970200 2289577 2464650 2425484 2227882 1888140 1454868 996523 569831
14602 569831 217895 180 -6236 133103 270059 289129 258587 323825 424532 421763 326209
14591 326209 243429 215249 225715 288709 453772 681524 833365 902232 1020874 1308274
14581 1308274 1788184 2363958 2826907 3128017 3343351 3415078 3291800 3062884 2863830 2684934
14571 2684934 2479442 2281713 2106645 1937610 1776187 1716794 1797377 1928254 2067614 2132003
14561 2132003 1992799 1680337 1307019 979876 794615 777357 873283 1029384 1218646 1355689
14551 1355689 1392339 1430318 1538680 1636476 1690904 1765564 1941183 2149780 2186833 2059615
14541B059615j34568r8690j06911j25871j16422n6826O6004J77436J07194q8751
14531A682210k29122k76989l18339l31410j48682K41276M73797M02532J29891
14522A625164j72664k80079j60915j06408j42959q7916M455J2664m2486n6610
14512E92246q063N413j13556k38487k73383k73722j62707J46302M46596M48157
14502E68796K29022O265j19887r3881m3930j2792L5082q9070k94619l50309l69602
14491e34925l70185k81697n4695K04978L03106L05467L42863L22123K16571J02798
14481E56404k0852j05620p2870K4285J75986K56719J83508J63488K61860L19513
14471A742421K38002j3104l44449m59748l63924j92184J5824K39370M20478M25145
$$ plain form
14541 2059615 1925047 1826357 1719446 1593575 1477153 1420327 1486331 1663767 1770961 1682210
14531 1682210 1453088 1176099 857760 526350 377668 618944 1092741 1495273 1625164
14522 1625164 1452500 1172421 1011506 905098 762139 674223 678678 691342 648856 592246
14512 592246 584183 589596 476040 237553 -35830 -309552 -472259 -325957 120639 568796
14502 568796 797818 804083 684196 590315 546385 533593 568675 479605 184986 -165323 -534925
14491 -534925 -905110 -1186807 -1241502 -1036524 -733418 -427951 -85088 237035 453606 556404
14481 556404 535552 429932 357062 381347 557333 814052 997560 1161048 1422908 1742421
14471 1742421 1980423 1967319 1622870 1163122 799198 607014 622838 862208 1282686 1707831
14461A707831K25593L181p4822j1165M9495O9665P1758l1923j70317j60467m9679
14450A629150q8488k98616m83633l90747j84256j42336j55721j1623K08860K65176
14440C47766P9775j87113l16302k34173j7035J27875J05118L6242q252L4127P9235
14429D7263N4817P54N5277J68600J47529P9909R065r2325j81110k23910j59650
14418i3781P9530L11912L37632K16822P2625k5815j85423l20047l13652l00030
14408b20227l03591j53499M2753P6310Q305j2982J36013L40476M10545L13073
14398F37176Q3899j36183j80272q3451J6944P1696Q9617Q1468M8613M7195J2252
14387F88954j07513j92689j90453r5242P7777J76059o869l39195m62602l08973
$$ plain form
14461 1707831 1933424 1936605 1861783 1850618 1900113 1969778 2041536 2009613 1839296 1678829 1629150
14450 1629150 1540662 1242046 758413 367666 183410 41074 -114647 -126270 82590 347766
14440 347766 427541 240428 -75874 -310047 -327082 -199207 -94089 -57847 -66099 -31972 47263
14429 47263 102080 102834 158111 326711 474240 554149 563214 470889 289779 65869 -93781
14418 -93781 -14251 297661 635293 852115 924740 898925 713502 393455 79803 -220227
14408 -220227 -523818 -677317 -634564 -558254 -549949 -562931 -426918 -86442 324103 637176
14398 637176 721075 584892 404620 321169 338113 409809 499426 580894 629507 676702 688954
14387 688954 581441 388752 198299 103057 180834 356893 350024 10829 -451773 -760746
14377g60746l7472J08144M5251q3993k43146l48687l11305j66297j4577N4754
14367a758074R4269J38733J70681K18527L35524M70872M81454L39919Q4466j54937
14357D21434j97299m0289m4653k80014l48446j94330m9435M1165P1502j4632j47113
14346g82110j68097q7793j08294j03697J08505K33724R9911l5618M23J06293J10515
14335f26238m4203j57369p4877Q3965R0447l3415m0043J44222L09824J76875q3930
14324b54742p1386J88233M30771M20990K17027m9690l18462l76775k11339n6220
14314h1593n3722j20478j08468J105L1581l2353j9928p1689k08290j35165J45613
14303f53387L85025M45336K78026M3525r0260j98199l08777k61379q1963j0639
$$ plain form
14377 -760746 -798218 -690074 -644823 -728816 -971962 -1320649 -1631954 -1798251 -1812828 -1758074
14367 -1758074 -1663805 -1525072 -1354391 -1135864 -800340 -329468 151986 491905 576371 421434
14357 421434 224135 183846 139193 -140821 -489267 -683597 -733032 -691867 -620365 -634997 -782110
14346 -782110 -950207 -1038000 -1146294 -1249991 -1141486 -907762 -807851 -843469 -843046 -736753 -626238
14335 -626238 -670441 -827810 -902687 -818722 -728275 -761690 -801733 -657511 -347687 -170812 -254742
14324 -254742 -326128 -137895 292876 713866 930893 881203 562741 185966 -25373 -81593
14314 -81593 -135315 -255793 -364261 -363156 -331575 -363928 -383856 -455545 -663835 -799000 -653387
14303 -653387 -268362 176974 455000 498525 408265 210066 -98711 -360090 -442053 -452692
14293d52692m8098j9901M0292L6903k4658n1361K5479R9759Q5742J8995j49905
14282d39445l13612k94055k02425j53346r4975P4437L15543L94265K96085J05806
14272c11722m3350r7566j54565k11720j17494O4003J06291N6599M0459M9497Q1997
14261e37571J44768K29241K35717J01195j1893q0752j63976j73224j44166j55000
14251e55661j26819m2258J1353J441q7815j82855r7621J39452L77102M29701K67394
14240A33414Q4722j996N2493J89214J87255Q1611N7647J56793K29336J57865P5910
14229A404264P0775O8777l4981j21904j35318j84859l03263m72875n03949l50063
14219e63396k27563q1579Q4499J44958J63257J49213N8862r5110j66663K7129
$$ plain form
14293 -452692 -500790 -520691 -480399 -443496 -468154 -519515 -494036 -394277 -308535 -289540 -439445
14282 -439445 -753057 -1047112 -1249537 -1402883 -1497858 -1423421 -1107878 -713613 -417528 -311722
14272 -311722 -355072 -452638 -607203 -818923 -936417 -872414 -766123 -709524 -669065 -619568 -537571
14261 -537571 -392803 -163562 72155 173350 161457 80705 -83271 -256495 -400661 -555661
14251 -555661 -682480 -724738 -713385 -711944 -799759 -982614 -1080235 -940783 -563681 -133980 133414
14240 133414 218136 216140 268633 457847 645102 726713 784360 941153 1170489 1328354 1404264
14229 1404264 1475039 1543816 1508835 1386931 1251613 1066754 763491 290616 -213333 -563396
14219 -563396 -790959 -872538 -788039 -643081 -479824 -330611 -271749 -366859 -533522 -506393
14209e06393K57944J93770j05677l24565k78925q7747J2624j03663l05495l75335
14199a623462k51853n6703R2255J94180J52145m2898j62815j32787j3071J12425
14189a732584J92927K42465K70048K58655K17883J99645J31632l477q5817j34964
14179d43587j74295k09039j43696k7956J8259R052k4229n4924o6442m347J07353
14168a013851J78071J89349J93522J32293n5030j52908m0590J31943K47075K51671
14158F1545J65893J60056K82805M00538M41887M37745L39997J73743j1398k18935
14148B233876m22502n12198m98642m15954l12806k22425j49457q1535L1930J34988
14138b14725K06958K41041J68436L6723k00K8258j5616r0931q3552p8934j17743
$$ plain form
14209 -506393 -248449 -54679 -160356 -484921 -763846 -851593 -838969 -942632 -1248127 -1623462
14199 -1623462 -1875315 -1932018 -1839763 -1645583 -1493438 -1536336 -1699151 -1831938 -1845009 -1732584
14189 -1732584 -1539657 -1297192 -1027144 -768489 -550606 -350961 -219329 -222806 -308623 -443587
14179 -443587 -617882 -826921 -970617 -998573 -980314 -971262 -995491 -1050415 -1116857 -1121204 -1013851
14168 -1013851 -835780 -646431 -452909 -320616 -375646 -528554 -569144 -437201 -190126 61545
14158 61545 227438 387494 670299 1070837 1512724 1950469 2290466 2464209 2452811 2233876
14148 2233876 1811374 1299176 800534 384580 71774 -150651 -300108 -381643 -349713 -214725
14138 -214725 -7767 233274 401710 438433 438233 466491 450875 359944 276392 197458 79715
14127G9715j65288k79712l09581k07494p5156L3515P2949J12002J28059P1395
14117e39596K2110J3699K2852J8055l9640P108J37891Q1224p2012p9809M4804
14106c83314J64110J68494R8338Q2957J30735J78921J41897N8382N1167O3133
14096G54820l4942j24342j48525j79424j97805j76939j53576j37640j28727j38364
14086f65464j90880k42541r9211K14437M02072M13526K60185M7936m9176j05698
14076a4814j34467j79361k58308k76383j72678K3946K16779L28733K64256P5639
14066a26658N0909J27653O1006j27193k34643k07241j22966p3961j08382r9905
14056h61381l1288o264j1904k2738o2758j31414p8799M6816Q6091R7539Q9463
$$ plain form
14127 79715 -85573 -365285 -674866 -882360 -957516 -924001 -851052 -739050 -610991 -539596
14117 -539596 -517486 -503787 -480935 -462880 -502520 -495412 -357521 -276297 -348309 -428118 -383314
14106 -383314 -219204 -50710 47628 130585 261320 440241 582138 640520 691687 754820
14096 754820 719878 595536 447011 267587 69782 -107157 -260733 -398373 -527100 -665464
14086 -665464 -856344 -1098885 -1198096 -983659 -581587 -168061 92124 140060 90884 -14814
14076 -14814 -149281 -328642 -586950 -863333 -1036011 -1012065 -795286 -466553 -202297 -126658
14066 -126658 -75749 51904 112910 -14283 -248926 -456167 -579133 -653094 -761476 -861381
14056 -861381 -892669 -898933 -910837 -933575 -996333 -1127747 -1206546 -1159730 -1073639 -976100 -886637
14045h86637M4829L1160J56185K60598K82030L22139K69753J69409J89539K89931
14035A128936L63384L01392J60075L9676j22978k45069j63181m5441n3841l0412
14025A332541J07258K03131J78424J40144P5952k0484o6783j11024k67991l93105
14015A178063l85404m02707m18594l02987j69578q5540K5108Q6146L7575J6116
14005d21802M6672J28931J84407J38706K9423r9146j93800k24685k31461j35246
13995g78001J09673K96696L72860L65633K03677q8677l44217l73146k22788m0163
13985d98453J03692K77040M64650N39135M53005K13254n5774k56787m06291n08009
13975C25462n35632m17524j04385K06247J32408k50933m67763l46941j8259L18637
$$ plain form
14045 -886637 -841808 -810648 -654463 -393865 -111835 210304 480057 649466 839005 1128936
14035 1128936 1492320 1793712 1953787 1993463 1870485 1625416 1462235 1416794 1362953 1332541
14025 1332541 1439799 1642930 1821354 1961498 2037450 2016966 1950183 1839159 1571168 1178063
14015 1178063 792659 389952 -28642 -331629 -501207 -586747 -561639 -475493 -437918 -421802
14005 -421802 -375130 -246199 -61792 76914 106337 7191 -186609 -411294 -642755 -778001
13995 -778001 -668328 -371632 1228 366861 570538 481861 137644 -235502 -458290 -498453
13985 -498453 -394761 -117721 346929 886064 1339069 1552323 1496549 1239762 833471 325462
13975 325462 -210170 -627694 -732079 -525832 -393424 -644357 -1112120 -1459061 -1477320 -1158683
13965a158683M35144L63035K56058J45832L7922m7992m6570P6177L65994O04611
13955A031528N48044L05371N4164j14210k74132m31211m38950k01032J21018K62679
13945H63269K29185J74488J46644Q1799n6409j59564j35520q0705j17350k59606
13935F86231m72918n04625k36845O5171J45122J06397J01707J42859J39126K7447
13925A99672k8951P717n4592k22052k49480q6690R7962J98920K21256J72529K4270
13914B80561k00804l33222k31492l7047j8369l8937J13646K50013J58833M220
13904e2598o7901q9766j0910J62172K52915J18565r6506k98167m24099m25454
13894i31749k96703r1183k1572q7351j01577j6578Q1855J00857J35343K73587
$$ plain form
13965 -1158683 -723539 -360504 -104446 41386 79308 31316 -15254 60923 426917 1031528
13955 1031528 1579572 1884943 1939107 1824897 1550765 1119554 680604 479572 600590 863269
13945 863269 1092454 1266942 1413586 1495385 1438976 1279412 1143892 1063187 945837 686231
13935 686231 213313 -291312 -528157 -462986 -317864 -211467 -109760 33099 172225 199672
13925 199672 170721 178438 123846 -98206 -347686 -434376 -336414 -137494 83762 256291 280561
13914 280561 79757 -253465 -484957 -522004 -540373 -579310 -465664 -215651 -56818 -52598
13904 -52598 -120499 -210265 -221175 -59003 193912 312477 215971 -82196 -506295 -931749
13894 -931749 -1228452 -1319635 -1341207 -1428558 -1530135 -1546713 -1464858 -1364001 -1228658 -955071
13884i55071L59939K92542Q3790j38442j57817j6178P9660Q8898J30142J89965
13874d2572J76460O1473j01314k11617k80378l40622l48558k46912j25800j52812
13864a612652k14747j37600j5194J25608K75382L74874M08355L97779L62316K82272
13854B46393J93047J69916P4830k17963l81279k63966j88788j85543r6306o6878
13844g16537j19231n4793J70190L97365M22131K47464m2172k99564l53174k31019
13834e79340q3534J4272M0750J42073K84085K64606R5545n2350K8851K43955K78686
13823F77599O8909j25693j31417o4041J3084R86p8174j00425q1247p2844n8407
13812D8330j9983O5494J14468m1509k63069k50935m4150J71399J96776K8087q9274
$$ plain form
13884 -955071 -595132 -302590 -218800 -357242 -515059 -531237 -451577 -362679 -232537 -42572
13874 -42572 133888 195361 94047 -117570 -397948 -738570 -1087128 -1334040 -1459840 -1612652
13864 -1612652 -1827399 -1964999 -1980193 -1854585 -1579203 -1204329 -795974 -398195 -35879 246393
13854 246393 439440 609356 684186 466223 84944 -179022 -367810 -553353 -649659 -716537
13844 -716537 -835768 -890561 -720371 -323006 99125 346589 304417 4853 -348321 -579340
13834 -579340 -662874 -648602 -607852 -465779 -181694 82912 178457 126107 154958 398913 677599
13823 677599 746508 620815 489398 425357 438441 439427 361253 260828 179581 106737 48330
13812 48330 28347 93841 208309 166800 -96269 -347204 -391354 -219955 -23179 4908 -84366
13801h4366Q787J54951P5033r3690j86518k78243k78869q7109L4348m933k7551
13790g68160j1110P6351J21311L5696p4334p4031M9519J04174N4508l0157m3931
13779e60164M9788J74464K59729J95777j4489k63410m94999n63939l94124j91033
13769a802400r0937R040J67039K84574J98470j7128n7057P3718K36652K86633
13759g11396K74934J87643l2025j80526k12878k33119k20965j28323Q7302L18425
13749h50928L22408J17760r8299k02019j73479l8290J58521K14247R089j81992
13739g22982j52636m5364o9945p8078P7115K12515K12780J23385J194j52768k08727
13728h03511j7343J65821K7179l15960n09472m05886k47689j81670l3758J91973
$$ plain form
13801 -84366 -75579 79372 154405 60715 -125803 -404046 -682915 -770024 -735676 -740609 -768160
13790 -768160 -779270 -702919 -581608 -545912 -620246 -694277 -644758 -540584 -486076 -516233 -560164
13779 -560164 -510376 -335912 -76183 119594 105105 -158305 -653304 -1217243 -1611367 -1802400
13769 -1802400 -1893337 -1884297 -1717258 -1432684 -1234214 -1251342 -1308399 -1234681 -998029 -711396
13759 -711396 -436462 -248819 -280844 -461370 -674248 -907367 -1128332 -1256655 -1169353 -850928
13749 -850928 -528520 -410760 -509059 -711078 -884557 -922847 -764326 -550079 -540990 -722982
13739 -722982 -875618 -920982 -990927 -1069005 -991890 -779375 -566595 -443210 -442016 -594784 -803511
13728 -803511 -820854 -655033 -627854 -943814 -1453286 -1859172 -2106861 -2288531 -2322289 -2130316
13718b130316L54146L71279K40850L7210j1096K32032M48593L48293J35358m9472
13708b3123j66928n5808J76104K68539K78478K66403K07889J70122O4734k15895
13698I70515l89931k93859j7651K07074J61853l8093j19710k0897R9154p467l32072
13687B18916o50447p19946m96398j86749N4044K24148L21349K22500J6307m8624
13677a044900l666n228q6275p2154K0043J7564k7036q6232j06479j7720J17202
13666a294881K55133L82124L91854K82561K09467J34786j4162r8629l9003P2225
13656B81475O2429j03329k56610l37176k20427j9654Q314o1942j29843j02157
13646h78920l4418L279O8668J98444K92238K58101J54448R7931M9901o7870j68259
$$ plain form
13718 -2130316 -1776170 -1404891 -1164041 -1126831 -1137927 -905895 -457302 -109009 26349 -23123
13708 -23123 -190051 -245859 -69755 198784 477262 743665 951554 1121676 1186410 970515
13698 970515 580584 286725 269074 476148 638001 599908 480198 459301 558455 550988 218916
13687 218916 -431531 -1151477 -1647875 -1834624 -1780580 -1556432 -1235083 -1012583 -996276 -1044900
13677 -1044900 -1048566 -1053794 -1140069 -1212223 -1192180 -1174616 -1201652 -1287884 -1394363 -1412083 -1294881
13666 -1294881 -1039748 -657624 -265770 16791 226258 361044 346882 248253 209250 281475
13656 281475 343904 240575 -16035 -353211 -573638 -593292 -584978 -646920 -776763 -878920
13646 -878920 -913338 -910059 -841391 -642947 -350709 -92608 61840 159771 209672 141802 -26457
13635b6457j19222N548K9014j19809l79116m61514k47020M185J36219J35559R6844
13624i45769J09455R2635L2559P7257J78522J83359R8323Q4686J83378K56528
13614C50933J83749K8172r7997j13633o6659N3153K32030K61902Q8759j29809
13604G90600k77042k63542j73808k18169l56432k93341Q8184M28716M93210M03478
13594F21854K36737P0677P8232J19709J31900J65934J43350l0689k20117k22964
13584A094623p0950J2519j23244k93490k89234j65560p0922o3653p1874j12846
13574a54631j44744n5484K9800L3120k9943j69997k92451k41548j23650r753O8163
13563a091118P6327R9854J23168J04504Q2871M9352l1959q1705j7708J29496J89314
$$ plain form
13635 -26457 -145679 -140131 -111117 -230926 -610042 -1071556 -1318576 -1314391 -1178172 -1042613 -945769
13624 -945769 -836314 -743679 -711120 -633863 -455341 -271982 -173659 -88973 94405 350933
13614 350933 534682 562854 464857 351224 284565 337718 569748 831650 920409 790600
13604 790600 513558 250016 76208 -141961 -498393 -791734 -703550 -274834 218376 621854
13594 621854 858591 929268 1007500 1127209 1259109 1425043 1568393 1537704 1317587 1094623
13584 1094623 1023673 1036192 912948 619458 330224 164664 93742 30089 -41785 -154631
13574 -154631 -299375 -354859 -325059 -291939 -321882 -491879 -784330 -1025878 -1149528 -1159281 -1091118
13563 -1091118 -1014791 -914937 -791769 -687265 -604394 -555042 -587001 -668706 -686414 -556918 -367604
13552c67604J00866k0850n6003o9652j23026j47310r9951m6804j06769j93439
13542a130542j44422m5159k3683k8426k6430P914K2950o28M1175Q1091P4080K4075
13530a148005m1163J8533J73404K32525J62765R2733J02204J30040J0030k13462
13520d80396k82811j71257J3417L40016O51855O66170L89985l5630l77755n01091
13510B12503m25014j86961J4826Q4161P5050N9538J29898K31689K95424K45773
13500G36887J48708J05068P4528O0312K875j90277l89778m12804k43472o1991
13490a69944J13339K47589P6847k52158n18945p26112q00425o05593k16197J37768
13480b713831L88203N70921O30855M63174J38840m9503o4826q1970j6226K27361
$$ plain form
13552 -367604 -266738 -287588 -343591 -413243 -536269 -683579 -783530 -830334 -937103 -1130542
13542 -1130542 -1274964 -1320123 -1343806 -1372232 -1398662 -1390748 -1367798 -1368426 -1327251 -1246160 -1172080 -1148005
13530 -1148005 -1189168 -1170635 -997231 -764706 -601941 -509208 -407004 -276964 -266934 -480396
13520 -480396 -763207 -934464 -921047 -581031 70824 736994 1126979 1091349 713594 212503
13510 212503 -212511 -399472 -384646 -300485 -225435 -165897 -35999 195690 491114 736887
13500 736887 885595 990663 1065191 1125503 1128378 938101 548323 135519 -107953 -169944
13490 -169944 -56605 190984 267831 15673 -503272 -1229384 -2029809 -2635402 -2851599 -2713831
13480 -2713831 -2325628 -1754707 -1123852 -660678 -521838 -571341 -636167 -718137 -734363 -507002
13470e07002N03192O51853N76361L05185J4379j30984j51865j59471k30260l34509
13460E36879l89388l49401l19773k73147p1101J86832L51672L15011J64775Q7907
13450B40266N0955L0372O527K9070K20312M54788N28395L38298N547j95996j85157
13439A523377j06724j35784k84159l75936k56909n7427o8777k65137m23737m29962
13429h81175l26535j57014k0669k3863p6702n6222J6037P6934J34938J97837K38955
13418h77479K46351J84345J3885j31459r5761M8236R0374L6100k4662j09524j60588
13407g80182l8452J91117K72546J85663J62424L23073M61757M52199K91348K1619
13397A543112k08709k80754k20737j59374j43595n4622J20666K21273J88645P0600
$$ plain form
13470 -507002 -3810 648043 1224404 1529589 1543968 1412984 1261119 1101648 871388 536879
13460 536879 147491 -201910 -521683 -794830 -865931 -679099 -327427 -12416 152359 240266
13450 240266 291221 321593 328120 357190 577502 1032290 1560685 1898983 1904530 1708534 1523377
13439 1523377 1416653 1280869 996710 620774 363865 306438 237661 -27476 -451213 -881175
13429 -881175 -1207710 -1364724 -1385393 -1409256 -1485958 -1542180 -1526143 -1449209 -1314271 -1116434 -877479
13418 -877479 -631128 -446783 -432898 -564357 -660118 -611882 -521508 -485408 -510070 -619594 -780182
13407 -780182 -818634 -627517 -354971 -169308 -6884 316189 777946 1230145 1521493 1543112
13397 1543112 1334403 1053649 832912 673538 529943 475321 595987 817260 1005905 1076505
13387A076505j16775k70820k30899j08811j44686k30670j37448M0495J56918K28789
13377B62598K50248J76657N4838j05563k82947m15526m75824m36075k50953o747
13367a229294J45640J69333J25561J21121K51786L39677K58446J53022M0832l9020
13357C37104M043J14531J98291K68169L33422K68762R0526k5474r3483j96000
13347A299891k09330j98261k72640k77957r9833J38155J45329p4337k49468l12323
13337a10774k76235j52450k8980R9458J63721J33568Q1077L4813j6068p2030q3674
13326b27574o6985m9642k3967N1912J90618K93194L14454K86303K02291P9342
13316A049946K4209J0481J3117M0758M9139N2601J11613K07834J89278N3980j6751
$$ plain form
13387 1076505 959730 688910 458011 349200 204514 -26156 -163604 -123109 33809 262598
13377 262598 512846 689503 744341 638778 355831 -59695 -535519 -971594 -1222547 -1229294
13367 -1229294 -1083654 -914321 -788760 -667639 -415853 -76176 182270 335292 376124 337104
13357 337104 341147 455678 653969 922138 1255560 1524322 1614848 1589374 1495891 1299891
13347 1299891 1090561 892300 619660 341703 241870 380025 525354 451017 201549 -110774
13337 -110774 -387009 -539459 -568439 -468981 -305260 -171692 -90615 -55802 -71870 -143900 -227574
13326 -227574 -294559 -344201 -368168 -316256 -125638 167556 482010 768313 970604 1049946
13316 1049946 1074155 1084636 1097753 1138511 1187650 1240251 1351864 1559698 1748976 1802956 1786205
13305A786205l243j6229n7397p4061o0738j1477O9553J20228N1745n9689o6536
13294A678361K6497N3020m8643j73110j80551j7283J47243R7472j7584p4021j49217
13283A342184k17785k80679l19584k66733k12740k22859k65454k22852J3220L37815
13273c15467M92836M17577K56950J16495K9725J3098R7761K43621K61351J25661
13263A739608n499j14882q3145J17256J95068J12835Q3366R2766P1159K9857P121
13252B245510Q032M0323O0232K2709p0259j88221k67801k83401k67168l02425
13242I97531l39585l06644k97043k38956j28210k0598R5279J36995R8199p457
13232a0489r3125j5608J30764K53318L90135M75697M58156M03403L68324L15579
$$ plain form
13305 1786205 1782962 1766733 1709336 1635275 1574537 1563060 1632613 1752841 1804586 1744897 1678361
13294 1678361 1704858 1757878 1709235 1536125 1355574 1338291 1485534 1583006 1565422 1491401 1342184
13283 1342184 1124399 843720 524136 257403 44663 -178196 -443650 -666502 -653282 -315467
13273 -315467 177369 594946 851896 968391 998116 1011214 1108975 1352596 1613947 1739608
13263 1739608 1734109 1619227 1536082 1653338 1848406 1961241 2044607 2137373 2208532 2238389 2245510
13252 2245510 2253542 2293865 2354097 2376806 2306547 2118326 1850525 1567124 1299956 997531
13242 997531 657946 351302 54259 -184697 -312907 -333505 -238226 -101231 -3032 -10489
13232 -10489 -103614 -119222 11542 264860 654995 1130692 1588848 1992251 2360575 2676154
13222B676154K39367K28908K02052k3556l77101n53378m87472l47918l12994l24161
13212I19901k12419q1517j43909l11295k47250j2193Q3958J65009L42847L75367
13202H78499J79647n9976k01040k65564k51313l9657K78686M63964M32438K34969
13192A650653P3633J64327L76332L93123J83027q1677l28323n40934o08211m53698
13182H28252j62878J60343M36024N80463M71976K78506K56153K70671J84975l491
13172C300994j74100j48926K7356P3225K4995L4076J2296j03187j86274j63055
13162B697400r1108k0902j5790r2387q9731J00014K46376J99408P9468l1421q7331
13151B893996q0740j12106j71767k17909k31438j64878q108K25572L97103M49687
$$ plain form
13222 2676154 2915521 3144429 3346481 3322925 2945824 2392446 1904974 1557056 1244062 919901
13212 919901 707482 625965 482056 170761 -76489 -88682 -4724 160285 503132 878499
13202 878499 1058146 998170 797130 531566 280253 240596 519282 983246 1415684 1650653
13192 1650653 1724286 1888613 2264945 2658068 2841095 2759418 2431095 1890161 1281950 828252
13182 828252 665374 825717 1261741 1842204 2314180 2592686 2848839 3119510 3304485 3300994
13172 3300994 3126894 2977968 3005324 3078549 3103544 3137620 3149916 3046729 2860455 2697400
13162 2697400 2606292 2585390 2569600 2477213 2387482 2487496 2733872 2933280 3012748 2981327 2893996
13151 2893996 2813256 2701150 2529383 2311474 2080036 1915158 1907050 2132622 2529725 2979412
13141B979412M57310M85341M85851L37089J41176O4986Q6595J07438M7705m9950
13131E142953p6204m3629K0114J696j86031m08636m73731m02287k00156P3331
13121C447420K06454J60713M7675M6986J94386L04989K07702J9588p6816n8597
13111D500500o3244j57534l06941m37729m30190k92574p1454K14146M38218M54145
13101C847343K91486J64027J31975J37357P6406q8104k32754k45600j04310R8531
13091D076357K39634L23358M66328M51195J35707k18115k71333p6198J19670J46192
13081E392795J00645K15015L27976L06065L02442L53034K81491J07309J1227J49050
13071G547049M27998M23366O1775k98192m86666o05193n35265j95080J62814L51489
$$ plain form
13141 2979412 3436722 3922063 4407914 4745003 4886179 4951165 5037760 5145198 5192903 5142953
13131 5142953 5066749 5023120 5043234 5044930 4858899 4450263 3976532 3574245 3374089 3447420
13121 3447420 3653874 3814587 3862262 3909248 4103634 4408623 4616325 4635913 4559097 4500500
13111 4500500 4437256 4279722 3972781 3535052 3104862 2812288 2740834 2954980 3393198 3847343
13101 3847343 4138829 4302856 4434831 4572188 4648594 4560490 4327736 4082136 3977826 4076357
13091 4076357 4315991 4639349 5105677 5556872 5692579 5474464 5203131 5126933 5246603 5392795
13081 5392795 5493440 5708455 6036431 6342496 6644938 6997972 7279463 7386772 7397999 7547049
13071 7547049 7975047 8398413 8460188 8161996 7675330 7070137 6534872 6339792 6502606 6854095
13061F854095L79351K15232K3036J261j0698m2623R851J07768K53488M62241N28263
13050H781265L54294J37593J0946j4995Q4449J76469Q5030j56036l62699l52381
13040H743935j5077M45918O35892N72639M51191K95250K13586L94886O59782P05104
13030A3103106N98850N48620O22017O72249N93081M67242L73443L40367L73974
13021A7692949M80226N21489M55059N20434P66447J010525J155260J252349J402495
13012B5257233J492847J447912J473615J566734J673965J871121K115253K213970
13004C9112650K099212K083260K355443K796907L263646L741684M356795N136370
12996F4945967N912234O551709P158583P801919Q554858R548874J0819265J2280205
$$ plain form
13061 6854095 7233446 7448678 7471714 7472975 7462277 7419654 7429505 7537273 7790761 8253002 8781265
13050 8781265 9135559 9273152 9284098 9269103 9353552 9530021 9615051 9459015 9096316 8743935
13040 8743935 8728858 9174776 9810668 10383307 10834498 11129748 11343334 11738220 12398002 13103106
13030 13103106 13701956 14250576 14872593 15544842 16137923 16605165 16978608 17318975 17692949
13021 17692949 18173175 18694664 19149723 19670157 20436604 21447129 22602389 23854738 25257233
13012 25257233 26750080 28197992 29671607 31238341 32912306 34783427 36898680 39112650
13004 39112650 41211862 43295122 45650565 48447472 51711118 55452802 59809597 64945967
12996 64945967 70858201 77409910 84568493 92370412 100925270 110474144 121293409 133573614
12988A33573614J3926087J5878003J8280654K1255640K4862488K9149436L4073833
12981B90999755L9252936M3395058M4081081L7489224K0185858n912083l2002934
12974D37488895m8865751n3901112n0583936m3622742l6191362k9579231k4005249
12967A50739512j9546841j6151312j3565897j1449501r688110q235948o910385
12960F5191518n651975m610224l890976l373063k916229k587216k368772k052267
12952C7740796j640875j300120j137826j137657j209243j220523j086729q08908
12944B8198915m76144k65875k29988k06563q544L01216M27405L41761L28179M83549
12934B8893911O24435N95597N10175N56108O90346Q11931J103419J621265K240775
$$ plain form
12988 133573614 147499701 163377704 181658358 202913998 227776486 256925922 290999755
12981 290999755 330252691 373647749 417728830 455218054 475403912 469491829 437488895
12974 437488895 388623144 334722032 284138096 240515354 204323992 174744761 150739512
12967 150739512 131192671 115041359 101475462 90025961 80337851 72101903 65191518
12960 65191518 59539543 54929319 51038343 47665280 44749051 42161835 39793063 37740796
12952 37740796 36099921 34799801 33661975 32524318 31315075 30094552 29007823 28198915
12944 28198915 27722771 27456896 27226908 27020345 27011801 27313017 27740422 28082183 28410362 28893911
12934 28893911 29518346 30113943 30624118 31180226 31870572 32682503 33785922 35407187 37647962
12925C7647962K732781K986049L171615L419183L747143M062835L967636L142428
12917F4877632J791230N30914r6531J9440O37679J401330K248660L205666M228335
12908G8844355N238598O264227P303465Q281710R299439J0700950J2533788J4495005
12900A52961537J6600503J9206237K2382323K6092615L0513708L5691071M1053725
12893C44501719M4878228M4119601L4744205J4135244j3892846l9073924n2914165
12886C76498062n4878168m9732821m2143474l4644069k8130542k2874688j8779657
12879A25314643j5457161j2586629j0255659q620500p477960o538688n640655
12872E8737391m769274m039568l447764l025701k762755k482430k141486j787143
$$ plain form
12925 37647962 40380743 43366792 46538407 49957590 53704733 57767568 61735204 64877632
12917 64877632 66668862 67199776 67103245 67122685 67760364 69161694 71410354 74616020 78844355
12908 78844355 84082953 90347180 97650645 105932355 115231794 125932744 138466532 152961537
12900 152961537 169562040 188768277 211150600 237243215 267756923 303447994 344501719
12893 344501719 389379947 433499548 468243753 482378997 468486151 429412227 376498062
12886 376498062 321619894 271887073 229743599 195099530 166968988 144094300 125314643
12879 125314643 109857482 97270853 87015194 78394694 70916734 64378046 58737391
12872 58737391 53968117 49928549 46480785 43455084 40692329 38209899 36068413 34281270
12864C4281270j492248j307046j149734r36574q46254q97134q95634p60755m81635
12855B5514256j18995Q7796M5722J1579N2495Q7507O8541p7222k63841k91497
12845B5116341o3764K53422M16589N23102P41476R95655J221316J426598J505841
12836C2136576J348226J079560R28498R97709J327786J801392K166072K356073
12828D4141892K535482K962101L603525M170636M605971N074278N723062O501010
12820G9317957P271309Q018747Q899859J0031513J1366414J2841313J4596309
12813A52343421J6772975J9419767K2734890K6847942L1712846L7048561M1994983
12806C48875385M4537619M1539708K9317406O654175k0762608m2763738n3139380
$$ plain form
12864 34281270 32789022 31481976 30332242 29395668 28549414 27652280 26756646 25995891 25514256
12855 25514256 25395261 25483057 25528779 25540358 25592853 25680360 25748901 25671679 25407838 25116341
12845 25116341 25052577 25305999 25722588 26245690 26987166 27982821 29204137 30630735 32136576
12836 32136576 33484802 34564362 35492860 36490569 37818355 39619747 41785819 44141892
12828 44141892 46677374 49639475 53243000 57413636 62019607 67093885 72816947 79317957
12820 79317957 86589266 94608013 103507872 113539385 124905799 137747112 152343421
12813 152343421 169116396 188536163 211271053 238118995 269831841 306880402 348875385
12806 348875385 393413004 434952712 464270118 470924293 450161685 407397947 354258567
12799C54258567n3062967m7303802l9864867l2781645k6726148k1804382j7869739
12792A14845017j4741651j2338478j0374457q684575p327819o315788n435457
12785D9626792m595938l994380l554050l032632k574172k349256k266040k195377
12777B5064947k047072j835840j653187j510900j346635j122238r02006p50388
12769A3896681p06183o76714m84038k37129k25514l73055m02285l53050l47796
12760A0090917l88399n15505p15948q46124p87822o21953m71735l51465k43947
12751E148019k14409j73666j9786J45996J38313n0570k21649j87573p0664r5838
12741D398173k90721n01985o23505n90558l52552r0006M2670R7169O7997l0525
$$ plain form
12799 354258567 301195600 253891798 214026931 181245286 154519138 132714756 114845017
12792 114845017 100103366 87764888 77390431 68705856 61378037 55062249 49626792
12785 49626792 45030854 41036474 37482424 34449792 31875620 29526364 27260324 25064947
12777 25064947 23017875 21182035 19528848 18017948 16671313 15549075 14647069 13896681
12769 13896681 13190498 12513784 12029746 11792617 11567103 11194048 10791763 10438713 10090917
12760 10090917 9702518 9187013 8471065 7624941 6837119 6215166 5743431 5391966 5148019
12751 5148019 4933610 4759944 4740158 4886154 5024467 4973897 4752248 4564675 4494011 4398173
12741 4398173 4107452 3605467 2981962 2391404 2038852 1948846 1991516 2088685 2156682 2126157
12731B126157l6433N7360J64559K46829K46337J17120j00636k99278m13193m68728
12721A640094l64942j3660L95160O02518N16805J97210o7454j05213j82984k87402
12711B330132k38087j32754q2673p1452n1102j7947j0426p4533j53129j95547
12701A302482k28926k36962j83822n6671m2539k35670m17147l58384j32355Q5079
12691e04915K77230L80371K85030Q6965j1444n5759j04210j44189j60270j80331
12681a31522j90846m8802K04264L34183L66915K89956J09420r8876k40010k66128
12671C28554j16015J23076K84878M05382M44851K90545P3797l8270j39657j90450
12661A466691q3514k870k3443m4154k540N9121O3251O7724J17738Q4795n5968
$$ plain form
12731 2126157 2089724 2147084 2311643 2558472 2804809 2921929 2821293 2522015 2108822 1640094
12721 1640094 1275152 1261492 1656652 2259170 2775975 2973185 2905731 2800518 2617534 2330132
12711 2330132 2092045 1959291 1876618 1805166 1754064 1736117 1725691 1651158 1498029 1302482
12701 1302482 1073556 836594 652772 596101 553562 317892 -99255 -457639 -589994 -504915
12691 -504915 -227685 152686 437716 524681 513237 457478 353268 209079 48809 -131522
12681 -131522 -322368 -371170 -166906 167277 534192 824148 933568 834692 594682 328554
12671 328554 212539 335615 620493 1025875 1470726 1761271 1835068 1796798 1657141 1466691
12661 1466691 1383177 1380307 1356864 1312710 1310170 1369291 1432542 1500266 1618004 1702799 1646831
12650A646831p8622P9458K10326K36099J57744J2155j13953j02686j3917M6000
12640B079435R9171Q8329N3352J2026j44498l33219l46505k28406j70345j22491
12630I86849m9328n248N9346Q9689M3222k9434r7619j92483k33435j51045p6304
12619C44210J6827J05469J06317P7009J28110J42487l3219k12394j69192K6421
12609E32045J43363O6245j25140l30719l64328j11259J30036J04066l3598j3420
12599b709J18976J26541M9513J6799n0591l8123R6628J33031P2525M1316L7281
12588F01187n2756j73861j37236j5468M6107O1818J532k89924n91791n45216j91377
12577a286985K60067N79323N20412K54075L4233k18255l89297k90605m7549J21924
$$ plain form
12650 1646831 1568209 1647667 1857993 2094092 2251836 2263991 2150038 2047352 2033435 2079435
12640 2079435 2178606 2266935 2320287 2332313 2187815 1854596 1508091 1279685 1109340 986849
12630 986849 937521 932273 991619 1081308 1124530 1095096 997477 804994 571559 420514 344210
12619 344210 361037 466506 572823 649832 777942 920429 887210 674816 505624 532045
12609 532045 675408 741653 616513 285794 -78534 -189793 -59757 44309 10711 -2709
12599 -2709 116267 242808 292321 309120 258529 220406 317034 450065 522590 563906 601187
12588 601187 548431 374570 237334 221866 267973 329791 331323 41399 -550392 -1095608 -1286985
12577 -1286985 -1026918 -447595 72817 326892 361125 142870 -246427 -537032 -584581 -462657
12567d62657K23935K68937K38434K12290J54743K0515k2636O2757J28198J61865
12557I86381J85301J68405L6683j91574l84310m49985l71169j70862N643k1702
12547b07189j59292k61727k43275j35531p8099J7762J53050J13645L6168R7576
12537f66912J26902P4356Q1863K29023L25491L03885J96997L8559p1414j66070
12527D72680k60786k38427r0855J66914L69134L54477J80242K6874l6353n2282
12517H91618j00595j70489j98982j96361j93207j93437k22088k20629r2200J14405
12507e81965K30396O7911k05887k65053q7057J14744K38213K39383J77216J75922
12497A03823J90931J92063K49263K40599J19535K7039k2108l7052q5193k24284
$$ plain form
12567 -462657 -238722 30215 268649 480939 635682 656197 633561 696318 824516 986381
12557 986381 1171682 1340087 1376770 1185196 800886 350901 -20268 -191130 -185487 -207189
12547 -207189 -366481 -628208 -871483 -1007014 -1085113 -1067351 -914301 -800656 -764488 -666912
12537 -666912 -540010 -465654 -383791 -154768 170723 474608 671605 710164 638750 472680
12527 472680 211894 -26533 -117388 49526 418660 773137 953379 980253 943900 891618
12517 891618 791023 620534 421552 225191 31984 -161453 -383541 -604170 -696370 -581965
12507 -581965 -351569 -283658 -489545 -754598 -841655 -726911 -488698 -249315 -72099 103823
12497 103823 294754 486817 736080 976679 1096214 1123253 1101145 1064093 978900 754616
12487G54616l09727k14907n5893P242p00p8407j48495j57942j07613O3225K91630
12476D3029M79682N15072L24831J12832l1366q3460r049O9429N8480j694j5251
12465A462535o0514j60509q4579J58466K68507J75443J1400p8196n6460P4135
12455A710228J75054J16675o0253k26659l28563m37883m71087k74802l7311l1033
12445A34366k05862l25208j63357K03573M66228M53059K67665O2007m2957J5923
12435H65437N0768n5483j65509k17595j83500p2573k2741l9783j0300O1979K31248
12424D41948M11400M08431K37832K848k07933k97416k78322k58234k08917r6690
12414A54947J449J8269k8884o9267j03238k65674m33211m43255l09747q3762J60786
$$ plain form
12487 754616 444889 229982 174089 181331 180631 102224 -46271 -204213 -311826 -248601 43029
12476 43029 522711 1037783 1362614 1475446 1444080 1360620 1351571 1421000 1479480 1477786 1462535
12465 1462535 1402021 1241512 1156933 1315399 1583906 1759349 1770749 1692553 1636093 1710228
12455 1710228 1885282 2001957 1941704 1715045 1386482 948599 477512 202710 165399 134366
12445 134366 -71496 -396704 -560061 -356488 109740 562799 830464 892471 849514 865437
12435 865437 916205 860722 695213 477618 294118 221545 198804 159021 148721 210700 441948
12424 441948 853348 1261779 1499611 1502459 1294526 997110 718788 460554 251637 154947
12414 154947 156396 174665 145781 76514 -26724 -292398 -725609 -1168864 -1478611 -1562373 -1401587
12403a401587K42602O6175l6586R874l4348j44306j80431j23538o1566n8294j5922
12392a737927Q7023J00019M4872K1881O7421Q6028J9462k7792J5411J53906L70527
12381g99169M29962K30004j640j50511k10669j18210O6836J49558J04992l383
12371c02230j20518j94663j68415r1510m3732N2061J33047J57475K97907M61260
12361A80682N20947N02369M50731L37581J54343M1608m8562j05103j41420k43741
12351A649435k99920k05973l549J92822K96730L19885K52547O8696o6078J081
12341B205676J59056K00388J35480J07853J43018P8823p3204M0524L20566M43438
12331C761618M77386M66253L36808P3263k13803m12753m34278l63797l03325k87080
$$ plain form
12403 -1401587 -1158985 -1092810 -1129396 -1119522 -1153870 -1298176 -1478607 -1602145 -1663711 -1722005 -1737927
12392 -1737927 -1650904 -1550885 -1506013 -1484132 -1416711 -1330683 -1311221 -1339013 -1323602 -1169696 -799169
12381 -799169 -369207 -139203 -140843 -291354 -502023 -620233 -553397 -403839 -298847 -302230
12371 -302230 -422748 -617411 -785826 -877336 -921068 -869007 -735960 -578485 -280578 180682
12361 180682 701629 1203998 1654729 1992310 2146653 2188261 2139699 2034596 1893176 1649435
12351 1649435 1349515 1143542 1139993 1332815 1629545 1949430 2201977 2270673 2204595 2205676
12341 2205676 2364732 2565120 2700600 2808453 2951471 3030294 2957090 2997614 3318180 3761618
12331 3761618 4239004 4705257 5042065 5115328 4901525 4488772 4054494 3690697 3387372 3100292
12321C100292l15226l63357l56051k30625j06228o6553K8771K60638M98854O54053
12311C104568P05293N57287K34589j2357L789K12814M05448N20357O69764Q36223
12301G237775R47595R17336O85464N65458P21707R02757J050751J327445J697720
12292A6054008K031591K298269K590126K951157L375297L880494M594809N600114
12284D3375865O913748Q623987J0733152J2991002J4934989J5100884J0814563
12277A23488190Q95876j0605052j7382132j8132735j5617609j2328277r496294
12270D0821967p333901n670575m402710l541831l048575k632632k091199j478866
12262A0621678r83295p05788o91248q24006r32711q66454o32359m05188l11485
$$ plain form
12321 3100292 2785066 2421709 2065658 1835033 1728805 1662252 1691023 1951661 2450515 3104568
12311 3104568 3809861 4367148 4601737 4589380 4593169 4805983 5211431 5731788 6401552 7237775
12301 7237775 8185370 9102706 9788170 10353628 11075335 11978092 13028843 14356288 16054008
12292 16054008 18085599 20383868 22973994 25925151 29300448 33180942 37775751 43375865
12284 43375865 50289613 58913600 69646752 82637754 97572743 112673627 123488190
12277 123488190 124384066 113779014 96396882 78264147 62646538 50318261 40821967
12270 40821967 33488066 27817491 23414781 19872950 16824375 14191743 12100544 10621678
12262 10621678 9638383 8932595 8241347 7417341 6484630 5618176 4985817 4580629 4269144
12253D269144k67713k52045l59614m99989n62436n53361n28615l66300m3872K03000
12243A038199L51033L85330K86397J90740J28156R9984R9406J41629J74271N3828
12233B948973j36328j80938j39570n9336J59178L04567J49776j08772k77139k98170
12223B362241j73857m7610O18K2524k7630p0868l1823q6172k38821l79605l95597
12212I33400k02660n9608j36286k39644j28116J33112L00624L51571M19506L80110
12202A752009J69047j25027l46936l88579l17477j91948j16237j97219k62713
12193b5080k10963j59810j10752M4811J66725R9611L8739J82936L78660L56125
12183G61002J72864K6818o8568p8512p4898j24415j97925k68079k00841l317J55009
$$ plain form
12253 4269144 4001431 3749386 3389772 2889783 2327347 1773986 1245371 879071 835199 1038199
12243 1038199 1389232 1774562 2060959 2251699 2379855 2479839 2579245 2720874 2895145 2948973
12233 2948973 2812645 2631707 2492137 2432801 2591979 2896546 3046322 2937550 2660411 2362241
12223 2362241 2188384 2140774 2141392 2163916 2136286 2065418 2033595 1947423 1708602 1328997 933400
12212 933400 730740 671132 534846 295202 167086 300198 600822 952393 1371899 1752009
12202 1752009 1921056 1796029 1449093 1060514 743037 551089 434852 237633 -25080
12193 -25080 -236043 -395853 -506605 -461794 -295069 -195458 -156719 26217 404877 761002
12183 761002 933866 960684 892116 813604 738706 614291 416366 148287 -52554 -55871 99138
12172I9138K72290L67207L21226Q1349k07788l01738j19659J95523L12579J91615
12162A211742Q4351Q3466J18235R9576m489o6087n5835r9587k05807k10146j48799
12151H06620q1207m5958j73097l18373k50710n0602k2323r5317j2707J06513P3301
12140f3860n2357q9868k2822O2272R1155N9005L5972m1131r1938J4172K08286
12129A08886L39288K61653L2765j39524j87084k55887l31616k32270L4659K68728
12119a00402L01639Q0460j31518p5697P1247J9145j00053m3152M7419j9035j88986
12108a38933j42799J95658M85961N05513L23990J69416R0080l7299k07274l01360
12098I42953l54939m11554l80830l19630k49036j69241j66252k32484k75886j65658
$$ plain form
12172 99138 371428 738635 1059861 1141210 933422 631684 512025 707548 1020127 1211742
12162 1211742 1296093 1379559 1497794 1597370 1592881 1526794 1470959 1371372 1165565 955419 806620
12151 806620 725413 679455 506358 187985 -62725 -113327 -135650 -230967 -243674 -137161 -63860
12140 -63860 -116217 -206085 -228907 -166635 -75480 -16475 19497 -21634 -113572 -99400 108886
12129 108886 448174 709827 742592 603068 415984 160097 -171519 -403789 -369130 -100402
12119 -100402 201237 281697 150179 74482 145729 164874 64821 21669 69088 50053 -138933
12108 -138933 -281732 -86074 399887 905400 1229390 1398806 1488886 1451587 1244313 942953
12098 942953 588014 176460 -204370 -524000 -773036 -942277 -1108529 -1341013 -1616899 -1782557
12088a782557J18146M78715O45986N64959M54900M37697M27736L44408K41266
12079A931256J59374Q3865l7071k13680l61021l56808l90762n40401m92221j67444
12069c84913J10055K15712J81467R8181J23228J83062K11286K00119M1611j65627
12059H14181j82218j12912j63690k78453k46507k3859J29394J81271K16158J82647
12049E16012O9452o7473j76246j72634m8042J01214J02812j05408l18513l67630
12039d66456k55229j24829P281K31163M31093L87069J74591o9000k94652m33474
12029d12443m38520l26900k53786k38233j14596J15573K11951J41656J43479K05296
12019i66523J73422J09017J59244L40186M62315M02393J90321j7261j27282k01041
$$ plain form
12088 -1782557 -1664411 -1185696 -539710 25249 480149 917846 1345582 1689990 1931256
12079 1931256 2090630 2174495 2137424 1923744 1562723 1205915 815153 274752 -217469 -384913
12069 -384913 -274858 -59146 122321 220502 343730 526792 738078 938197 979808 814181
12059 814181 631963 519051 355361 76908 -169599 -193458 -64064 117207 333365 516012
12049 516012 585464 517991 341745 169111 121069 222283 325095 219687 -98826 -466456
12039 -466456 -721685 -846514 -839233 -608070 -176977 210092 384683 315683 21031 -412443
12029 -412443 -850963 -1177863 -1431649 -1669882 -1784478 -1668905 -1456954 -1315298 -1171819 -966523
12019 -966523 -793101 -684084 -524840 -184654 277661 680054 870375 853114 725832 524791
12009E24791j46556J21467L90204M25529K27493l58q690L5444l6467n9067q3657
11998A390133k07802k47400j37813l7045Q765q7829k56612l48622k99257p4360
11988b97842J85833M02079N34446N28095L26325m9111m49902p31080p39972m43476
11978g34605l4631K53478L92717L61706K21643J08985J23555K26557J55151L6456
11968A111012J82126M95003P22855P39325N08139J00359k42210l34882l05563
11959B976164l70102n41033n41647l61687k88619l40378l02979j85429o7768N3031
11949B9553K18014M07597M35036K60122L6396j35366j38275k2011P3032P6003
11939A240101j8351r6394o3198k4678j06219j70962j28207n7279k0401q3932j95380
$$ plain form
12009 524791 378235 499702 889906 1315435 1542928 1542570 1533880 1569324 1532857 1473790 1390133
11998 1390133 1182331 934931 797118 760073 768838 681009 424397 75775 -223482 -297842
11988 -297842 -112009 290070 824516 1352611 1678936 1629825 1179923 448843 -291129 -734605
11978 -734605 -769236 -515758 -123041 238665 460308 569293 692848 919405 1074556 1111012
11968 1111012 1293138 1788141 2510996 3250321 3758460 3858819 3616609 3281727 2976164
11959 2976164 2606062 2065029 1523382 1161695 873076 532698 229719 44290 -23478 29553
11949 29553 247567 655164 1090200 1350322 1386718 1251352 1113077 1091066 1164098 1240101
11939 1240101 1221750 1125356 1062158 1037480 931261 760299 632092 574813 554412 470480 275100
11928B75100k53765k55366k51960k10868j03017j8876j2067j28936l64508m60610
11918a784873j77619L06886O92446Q40286O70729K44493j00914k18071j67646
11909C05717K0812J07011o2989k81718l24332j24644P8065p8919l14903k09972
11899h85872P089O1938J3326j1454P6199K2476k33610k65419j6298J93378K82338
11888g55909K63363Q9314k8728P6007J59759K8091j47167j65956l8816O522q0204
11877e93724j12335q3387j42940j19034J20972K75998K47846K18757K21744J39403
11867A73300l1701p8834o9034j78934j53038P3868K38683K02862N6982l5606o5129
11856A33419n1645J01308K42734R0923j35979j48914k9944K1633n9397k09327
$$ plain form
11928 275100 21335 -234031 -485991 -696859 -799876 -818752 -830819 -959755 -1324263 -1784873
11918 -1784873 -1962492 -1655606 -963160 -122874 547855 792348 691434 473363 305717
11909 305717 326529 433540 370551 88833 -235499 -360143 -282078 -360997 -675900 -885872
11899 -885872 -878783 -816845 -803519 -814973 -738774 -716298 -949908 -1215327 -1231625 -1038247 -755909
11888 -755909 -492546 -403232 -431960 -355953 -196194 -168103 -315270 -481226 -520042 -513520 -593724
11877 -593724 -706059 -789446 -932386 -1051420 -930448 -654450 -406604 -187847 33897 173300
11867 173300 141599 62765 -6269 -185203 -338241 -264373 -25690 177172 234154 198548 133419
11856 133419 81774 183082 425816 516739 380760 231846 201902 223535 164138 -45189
11846d5189k42838k01851j37789Q8776L62652M29753L49860K32545N9100p3557
11836H21462j04671q5008q7397r4612j4307O4274J03435J18286J00071O8126M4674
11825I34333P7469J78441K11361J01540j7473r8142k36901m01659l94445j88256
11815A66268p856n7081k44157l90920m47403m56448l02962O022K19369K42911
11805a272257J85325J40001J34152J17347J1861p1561o3668o8769p2826p651N4147
11794i13899R0805Q3999m3491j74247j47845l4763J07278K14388R7850j66102
11784h86027k71056k36203k05902j10770M063Q2227O6564k5116o5409J5922R3621
11773a538086R8638O4662k0217o7779p2063j16542j45255j30329j68061j38383
$$ plain form
11846 -45189 -288027 -489878 -627667 -538891 -176239 253514 603374 835919 895019 821462
11836 821462 716791 631783 544386 449774 435467 499741 603176 721462 821533 889659 934333
11825 934333 1011802 1190243 1401604 1503144 1485671 1387529 1150628 748969 354524 166268
11815 166268 158412 101331 -142826 -533746 -981149 -1437597 -1740559 -1734537 -1515168 -1272257
11805 -1272257 -1086932 -946931 -812779 -695432 -683571 -755132 -818800 -887569 -960395 -968046 -913899
11794 -913899 -823094 -739095 -782586 -956833 -1104678 -1139441 -1032163 -817775 -719925 -886027
11784 -886027 -1157083 -1393286 -1599188 -1709958 -1705895 -1623668 -1557104 -1582220 -1647629 -1631707 -1538086
11773 -1538086 -1439448 -1374786 -1395003 -1462782 -1534845 -1651387 -1796642 -1926971 -2095032 -2233415
11763b233415l1938L0942J35145K61022M41487O78338P97085N66303J15263j4262
11753G45970J29114K10919J40824k4357j90997k20677j11024m5087j7935P6358
11743F93108J53331O5960m5798n6797o3252p8074j72699k31676q4171O9679J8275
11732B67886j66394l81585n58108m79827j92687N0516J38515J70902L01986L21061
11722e27735J60687N7181J01345J63437J27111K0429r7475j35542q210M7015o7169
11711a58926j58113o3211K37002M91766M77757K66721N5488n2339j21998j67032
11701H07115j69193j33184l4021N2562J7730p8439j49846j62280j40235j68376
11691a58167j20485J29933M65780N57380K92774n3000k61374l53220l84233l68624
$$ plain form
11763 -2233415 -2265353 -2234411 -2099266 -1838244 -1396757 -718419 78666 644969 760232 745970
11753 745970 875084 1086003 1226827 1202470 1011473 790796 679772 634685 616750 693108
11743 693108 846439 912399 866601 809804 746552 668478 495779 264103 179932 249611 267886
11732 267886 101492 -280093 -838201 -1318028 -1510715 -1460199 -1321684 -1150782 -848796 -527735
11722 -527735 -367048 -309867 -208522 -45085 82026 102455 4980 -130562 -138772 -91757 -158926
11711 -158926 -317039 -380250 -143248 348518 826275 1092996 1148484 1096145 974147 807115
11701 807115 637922 504738 470717 523279 541009 462570 312724 150444 10209 -158167
11691 -158167 -278652 -148719 317061 874441 1167215 1114215 852841 499621 115388 -253236
11681b53236k08256k3514N4252J07842J78407K30615K10575O2373j31484j98644
11671B8930j81399j51692j02410l8742N6222J27845N8596o3725l8267J06297J20185
11660g8160J3072r4640j62609j24732p372Q0214M5577p9213r8809K8633J40499
11649c37540N6279k78661m96401l73980j23929M6296M9622j05455k21640j80081
11639a965490j19535j23023o1762Q5490J65320J95174K56835K57055K45390J99940
11629h64606k1756k90134k96090k4377K92136M43324L08749M9584k3868j8495
11619d45533r3484k00572k36740j33932K7786R0271K5049r6882k78811l96436
11609a739284l40343k20370j43707o4946Q7635L21644M09673K58684J34942J51085
$$ plain form
11681 -253236 -461492 -485006 -430754 -322912 -144505 86110 296685 359058 227574 28930
11671 28930 -152469 -304161 -406571 -445313 -389091 -261246 -202650 -266375 -304642 -198345 -78160
11660 -78160 -65088 -159728 -322337 -447069 -454441 -374227 -328650 -407863 -506672 -478039 -337540
11649 -337540 -281261 -559922 -1056323 -1430303 -1554232 -1507936 -1458314 -1563769 -1785409 -1965490
11639 -1965490 -2085025 -2208048 -2269810 -2184320 -2019000 -1823826 -1566991 -1309936 -1064546 -864606
11629 -864606 -886362 -1176496 -1472586 -1496963 -1204827 -761503 -452754 -403170 -427038 -445533
11619 -445533 -539017 -739589 -976329 -1110261 -1082475 -992204 -967155 -1064037 -1342848 -1739284
11609 -1739284 -2079627 -2299997 -2443704 -2508650 -2421015 -2099371 -1689698 -1431014 -1296072 -1144987
11599a144987K19229K20903J03846N312k2064k4206R8131K14203J47873j21242
11589c03002n18674o38259l50568L0381K57539L43432L20522J35282o6620j70435
11579i60402j10918P7906J08206O4306J27699J96818J36502j6271p7308J887K72781
11568a78794M43657K52328p9285k97377l02547j46474J12149L07398K60066J5229
11558C86350j34506r4125p5365j41328j96331j30149k6714k5989q1780j20108
11548f40045k31703k87298r5147J99169L36385K97669K79744L60300L87747K41802
11538H48623P6039l1338j59612k69540k38595k2702K07069J57687q9979k34468
11528B43184j96921n1865Q2154J41382K1645k49954m39174l95476k17184j70818
$$ plain form
11599 -1144987 -925758 -704855 -601009 -595697 -617761 -641967 -543836 -329633 -181760 -303002
11589 -303002 -821676 -1459935 -1810503 -1780122 -1522583 -1179151 -858629 -723347 -789967 -960402
11579 -960402 -1071320 -993414 -885208 -820902 -693203 -496385 -359883 -376154 -453462 -451575 -178794
11568 -178794 264863 517191 437906 140529 -162018 -308492 -196343 111055 371121 386350
11558 386350 251844 157719 82354 -58974 -255305 -385454 -412168 -438157 -519937 -640045
11548 -640045 -871748 -1159046 -1254193 -1055024 -718639 -420970 -141226 219074 606821 848623
11538 848623 924662 893324 733712 464172 225577 202875 409944 567631 477652 243184
11528 243184 46263 -5602 76552 217934 239579 -10375 -449549 -845025 -1062209 -1233027
11518a233027j79251l8763J50783J80015l0066k47529l13497k39336p2791k9856
11508b053318p1612n2526O1849K22373L08543K58897J84664J65781J10745j0924
11498h75528j31549j01849R0160J19866p6426k17838j76823j3342J21614J46729
11488a114986J27071J71123K94566M07082L09815O4213j00736n5821J72996K96034
11478E71357J59557r5211k39307k49342j63358k2449q2742m14419n93808k89226
11468a418948K24042O08694P18608M66324N7656k30225k08013n7870o9963q5739
11458D566m0516J9429M8523K5159K7571N5457P7679J4606j12698k06092j68421
11447b54737j6230J58709J69209k9302j83025j87747j92428k60853k85936k99871
$$ plain form
11518 -1233027 -1412278 -1451041 -1300258 -1120243 -1150309 -1397838 -1711335 -1950671 -2023462 -2053318
11508 -2053318 -2124930 -2177456 -2115607 -1893234 -1584691 -1325794 -1141130 -975349 -864604 -875528
11498 -875528 -1007077 -1108926 -1018766 -898900 -975326 -1193164 -1369987 -1383329 -1261715 -1114986
11488 -1114986 -987915 -816792 -522226 -115144 194671 258884 158148 102327 275323 571357
11478 571357 730914 635703 396396 147054 -16304 -38753 -121495 -535914 -1129722 -1418948
11468 -1418948 -1194906 -586212 132396 598720 656376 426151 218138 160268 90305 4566
11458 4566 -35950 -16521 32002 57161 84732 140189 217868 232474 119776 -86316 -254737
11447 -254737 -270967 -112258 56951 27649 -155376 -343123 -535551 -796404 -1082340 -1382211
11437a382211l83704m03147k11999P5930K33051J58134Q370l8781M2147K41318
11427a660892L50279K62336J29105J2687o2077p8083L6075K79588M14027L60667
11417D3712K25090J3391j50085o8204J35360K25997K08326J62230J14778J09273
11407A019868N2527j10091k02952p6763J36906K96518L53174K31342N4684p3743
11397A681470j59486j62531p2258J0914j2099j47510k57588k71725l18063l54712
11387f3588k86366r1633O0276L2668l3660l3956M7923J39759J03094n8512j11800
11376b95795k2872j4858o5107M1451J67433J71368J59539J63030J11455L9895
11366D55539k0243j35140k72147k83576j87201o5926j7247q8978j43826q2947
$$ plain form
11437 -1382211 -1765915 -2169062 -2381061 -2305131 -2072080 -1913946 -1905576 -1944357 -1902210 -1660892
11427 -1660892 -1310613 -1048277 -919172 -906485 -968562 -1046645 -1010570 -730982 -316955 43712
11417 43712 268802 282193 132108 63904 199264 425261 633587 795817 910595 1019868
11407 1019868 1072395 962304 759352 682589 819495 1116013 1469187 1700529 1755213 1681470
11397 1681470 1521984 1359453 1287195 1298109 1286010 1138500 880912 609187 291124 -63588
11387 -63588 -349954 -441587 -381311 -348643 -382303 -416259 -368336 -228577 -125483 -183995 -295795
11376 -295795 -318667 -333525 -398632 -357181 -189748 -18380 141159 304189 415644 455539
11366 455539 435296 300156 28009 -255567 -442768 -508694 -525941 -614919 -758745 -841692
11356h41692L0031N6918l1945l6903R6317K02884K45448J80175M181q5282l1992
11345b11860L6822J4895O4123J94334K68152K97030K09905N3605J6537N0082j5223
11334I78402j57186j89036m2288Q9616J45063J52200N0945j21578k20244k17602
11324D68292k15045k00285j78046k42298l43731l85442l14683k06999j15707N154
11314a728790J31661K24539K99775L16586L35476L58485L29992K49702O8597j54135
11304D31888l73762n42566m76141k89421j71913j59015k17014k43889j99673q4067
11294b325573N9296J85168K73694L46783K87862J23804J82446M23695M81172K92489
11284C30836K915k98639l90672j68021M5612Q3312J22189J38389L6761p0451j68924
$$ plain form
11356 -841692 -811661 -754743 -786688 -823591 -727274 -524390 -278942 -98767 -94586 -179868 -211860
11345 -211860 -175038 -160143 -96020 98314 366466 663496 873401 927006 943543 993625 978402
11334 978402 821216 632180 589892 679508 824571 976771 1027716 906138 685894 468292
11324 468292 253247 52962 -125084 -367382 -711113 -1096555 -1411238 -1618237 -1733944 -1728790
11314 -1728790 -1597129 -1372590 -1072815 -756229 -420753 -62268 267724 517426 586023 431888
11304 431888 58126 -484440 -960581 -1250002 -1421915 -1580930 -1797944 -2041833 -2241506 -2325573
11294 -2325573 -2266277 -2081109 -1807415 -1460632 -1172770 -1048966 -866520 -442825 38347 330836
11284 330836 333751 35112 -355560 -523581 -477969 -394657 -272468 -134079 -97318 -167769 -336693
11273c36693j86737O436K89477L98706K37146o3020k57517k09905j56439k16251
11263d94797k03132r8042j5104J56758L60525M24662K71142N4889M4851J04309
11253F06061O863r5111q7561j47720k16662o6751J52093K08076J9039j38932J7256
11242B56651L22463M19473K70782J13506M982j74899m36733n55971l69652J5440
11232a33958L34450L89273K25843K4619j73218k55223k28812j82293j14120q5610
11222a99049r3056j2939N9539M0651K8022O9474J18794P1821q0608j57441l2381
11211a87173Q2196Q077j59534k66878j74031O3278K26255L00754L24776K73049
11201D90769J48847k5770j40126j07772k5285K4780O0866J02672J21512j1764
$$ plain form
11273 -336693 -523430 -516994 -227517 171189 408335 345315 87798 -122107 -278546 -494797
11263 -494797 -697929 -795971 -811075 -654317 -293792 130870 402012 456901 501752 606061
11253 606061 612924 517813 430252 282532 65870 -881 151212 359288 378327 239395 256651
11242 256651 579114 998587 1269369 1382875 1387857 1212958 776225 220254 -149398 -133958
11232 -133958 200492 589765 815608 840227 667009 411786 182974 681 -113439 -199049
11222 -199049 -292105 -305044 -245505 -204854 -176832 -107358 11436 83257 2649 -154792 -187173
11211 -187173 -104977 -96900 -256434 -523312 -697343 -634065 -407810 -107056 217720 490769
11201 490769 639616 613846 473720 365948 340663 365443 426309 528981 650493 638729
11191F38729k58017l92392l91417k58280o5246N6011J88455K83505K62945J44884
11181B09177J2410m0358p6610j72002k09820j36979j03087k09550l11029k21004
11171a258852M2486K19776J57746j0093J7432K43381L96162M90861N57167N40023
11161A396089L51760Q4428p7547j38224k49552l67633l53880k05960m7220l7748
11151C54513j83341k96911k49057j16021l3675q3792j77255j20121P1988K68883
11141e64789L55499L33223K84453K15375J31087J02408R4462O5097J9794n4875
11131I81734m7906M6633O8195K2434L3619L7406m1841j21561j71457k35445k61573
11120C10238k26519j07816J9396m086j52599k17039o3925J52899J64436K3210
$$ plain form
11191 638729 380712 -11680 -403097 -661377 -726623 -670612 -482157 -198652 64293 209177
11181 209177 221587 181229 104619 -67383 -277203 -414182 -517269 -726819 -1037848 -1258852
11171 -1258852 -1216366 -996590 -838844 -848937 -831505 -588124 -191962 298899 856066 1396089
11161 1396089 1747849 1832277 1754730 1616506 1366954 999321 645441 439481 392261 354513
11151 354513 171172 -125739 -374796 -490817 -524492 -608284 -785539 -905660 -833672 -564789
11141 -564789 -209290 123933 408386 623761 754848 857256 951718 1016815 1036609 981734
11131 981734 933828 980461 1048656 1071090 1104709 1142115 1100274 978713 807256 571811 310238
11120 310238 83719 -24097 -4701 -8787 -161386 -378425 -442350 -289451 -125015 -101805
11110a01805n6697j5851O913j14455k57248j94655k4037P1683J20017J89463J98676
11099a77996n193k77111k69109m7153J69358K99153L12815L07218J88296j02881
11089C97397k89432j93257o0J06571J42563J71641M0261k09236k61080j08138
11079b02770L6486P8049J3220p8507r7914j11872j39312p7313J14675K09778O1561
11068a93919j68367l26260l22330k16275j33100N4407K17695J33799o6918k52770
11058a274038m18294n58478o36490o06739l95170o3740K34393M25085M67727L83646
11048b442098K78372K22546K03418K13130K48666L24309L81744L65372K88339
11039H3798P7879j59259j80183o8133k5591l3202m3955j04603j32765m4146p28
$$ plain form
11110 -101805 -158502 -174353 -167440 -281895 -539143 -733798 -757835 -686152 -566135 -376672 -177996
11099 -177996 -183189 -460300 -729409 -776562 -607204 -308051 4764 311982 500278 397397
11089 397397 107965 -85292 -85352 21219 163782 335423 375684 166448 -94632 -202770
11079 -202770 -166284 -88235 -75015 -153522 -251436 -363308 -502620 -579933 -465258 -255480 -193919
11068 -193919 -362286 -688546 -1010876 -1227151 -1360251 -1305844 -1088149 -954350 -1021268 -1274038
11058 -1274038 -1692332 -2250810 -2887300 -3494039 -3889209 -3952949 -3718556 -3293471 -2825744 -2442098
11048 -2442098 -2163726 -1941180 -1737762 -1524632 -1275966 -951657 -569913 -204541 83798
11039 83798 161677 2418 -177765 -245898 -271489 -304691 -348646 -453249 -586014 -630160 -630888
11028f30888j4582k7058j15133j69349r1374R08P6481K19700L56073K70129L9108
11017h5985j09511j35630o8634l4627j79989l08961k24267j06528r7335j86708
11007a538175l05931k62856m9924L9622k5848J0640J39308J76191K09905L19249
10997a287819L59421K82325K87103L43961K25264K0769m5872j0844N5237P6900
10987C06445L4895Q0522J80379J03506o5898j24758m2794L5449k987K4700K42861
10976G72320L36820R6961j96625k97491k30928j43656r5103j6314P2610Q4868
10966C83462j2377j56909k16237k12148j53940J3341J07528O0286Q7517J25681
10956B6204Q3824J21240K08303R8681j70145l83382l63110k32656j35966J3845
$$ plain form
11028 -630888 -645470 -672528 -787661 -957010 -1048384 -1047476 -970995 -751295 -395222 -125093 -85985
11017 -85985 -195496 -331126 -399760 -434387 -614376 -923337 -1147604 -1254132 -1351467 -1538175
11007 -1538175 -1844106 -2106962 -2156886 -2117264 -2143112 -2132472 -1993164 -1816973 -1607068 -1287819
10997 -1287819 -928398 -646073 -358970 -15009 210255 231024 185152 174308 229545 306445
10987 306445 341340 421862 602241 705747 639849 515091 472297 507746 504759 529459 772320
10976 772320 1109140 1206101 1009476 711985 481057 337401 242298 225984 298594 383462
10966 383462 371085 214176 -2061 -214209 -368149 -354808 -247280 -186994 -99477 26204
10956 26204 110028 231268 439571 538252 368107 -15275 -378385 -611041 -747007 -733162
10946g33162J07610Q1427O2850M4746P2983J75243K48967K88508L30126L16572
10936I95870J43856r5202j76502l5553P2740K8366n5895j45550k90410m09298
10926C2422l24980j09058k5346k4030L5185N6866L8281O6362J51359K10857J54921
10915B62839R967o3163j6842k1660j03739q8911J338R2717J15606M5845q2206
10904A51791j20489L4617K36982K55805K8637j78087k87429l70911l31149j67977
10894g48210R012J44539K04222J91194J75808J35058L9612n6551j34761j08113
10884a48190j030k1595j69861k54360j70904L2242J85882K67043L38443K00275
10874B57945j03736j74223n0283o6407j89242k19624j44258k6131L1609k8439
$$ plain form
10946 -733162 -625552 -544125 -481275 -436529 -363546 -188303 60664 349172 679298 995870
10936 995870 1139726 1044524 868022 832469 905209 933575 877680 732130 441720 32422
10926 32422 -292558 -401616 -426962 -450992 -415807 -358941 -320660 -254298 -102939 107918 262839
10915 262839 272806 209643 192801 171141 67402 -21509 -20171 72546 188152 233997 151791
10904 151791 31302 65919 302901 558706 587343 409256 121827 -249084 -580233 -748210
10894 -748210 -739198 -594659 -390437 -199243 -23435 111623 151235 94684 -40077 -148190
10884 -148190 -149220 -170815 -340676 -595036 -765940 -733698 -547816 -280773 57670 257945
10874 257945 154209 -20014 -70297 -136704 -325946 -545570 -689828 -715959 -684350 -712789
10864g12789o4490j4064o2280j64955n7017J73686K85463K73075L25697L53047
10854C35373K26299M4352j40323k62353j90928O4103K78098L33669K43602J2732
10844I44624k28661k88059j95164j44727j90345j22672J37632L70262L47797J21075
10834G51762l3269j22684j33841m1416K2346k2711j36221k64766l00533j15608
10824c96941J27860M3530k43534k66643p0326J9225j27352k83175k37230j20298
10814a554884j55085l12150k96892j5144K58855L22891K86803J95611J96111L19208
10804g54676L27171J48906p2176k31294l45273l55641j90456P6346K98496K97513
10794h01084O1340j73349k61978k18214j12785m3477m9566j5187J26673K91326
$$ plain form
10864 -712789 -777279 -791343 -853623 -1018578 -1075595 -901909 -616446 -343371 -17674 335373
10854 335373 561672 606024 465701 203348 12420 76523 354621 688290 931892 944624
10844 944624 715963 427904 232740 88013 -102332 -225004 -87372 282890 630687 751762
10834 751762 718493 595809 461968 420552 442898 420187 283966 19200 -281333 -396941
10824 -396941 -269081 -225551 -469085 -735728 -806054 -786829 -914181 -1197356 -1434586 -1554884
10814 -1554884 -1709969 -2022119 -2319011 -2334155 -2075300 -1752409 -1465606 -1269995 -1073884 -754676
10804 -754676 -427505 -278599 -350775 -582069 -927342 -1282983 -1473439 -1397093 -1098597 -801084
10794 -801084 -739744 -913093 -1175071 -1393285 -1506070 -1549547 -1599113 -1614300 -1487627 -1196301
10784a196301M48944M83696L24502J20558L7492R1796J83763K49995K61219J64004
10774A169668k7302j72272j87049j49345k49952m28276m27898l24875k72897j41571
10764a211769M1391J82297K77038L44743L28334K03914P9995O0677R0033J79739
10754E76392L45635N28250N37890K94979J2430j99133l51811m50155m55057m24744
10744D14676l81835l58604l30307k16009j51628j37734j02001j33730j92227j51442
10734a740841q893K17435M34135N03495M64128M62496M48591L80046K55453Q6639
10724A502684l1120p4222j06594k13791k66638k44918j63404j088J24661J91151
10714G16721J73247K8789j26881k53234k85548j20009O9176J22695J07607R0355
$$ plain form
10784 -1196301 -747357 -263661 60841 181399 218891 310687 494450 744445 1005664 1169668
10774 1169668 1142366 970094 783045 633700 383748 -44528 -472426 -797301 -1070198 -1211769
10764 -1211769 -1170378 -988081 -711043 -366300 -37966 165948 245943 306620 396653 576392
10754 576392 922027 1450277 1988167 2283146 2295576 2096443 1744632 1294477 839420 414676
10744 414676 32841 -325763 -656070 -872079 -1023707 -1161441 -1263442 -1397172 -1589399 -1740841
10734 -1740841 -1749734 -1532299 -1098164 -594669 -130541 331955 780546 1160592 1416045 1502684
10724 1502684 1471564 1397342 1290748 1076957 810319 565401 401997 400909 525570 716721
10714 716721 889968 918757 791876 538642 253094 133085 202261 324956 432563 522918
10704E22918J8650j02965j73083k22594k72195k44779k11683l35450m70326l14532
10694a806039O9993L47428L26003J43937L7113N5569J10783J55864J52170P0652
10684c36527r4936j97251j38663L7515K25821K84591K11339J12561N6164M2322
10674B02936L3182n4062j33902j13643j2178P9216K19207L59590K30199j18481
10664F92064l66655m17035k70646R045J48168J08366n440q0259J0027J70776K22779
10653B21190J93975J91495J75712O3681m9906p1841j23352j77789k33114k41541
10643e1490j46279o0444n2176j43863k51762j49130J38754K94595K30792J31179
10633e9824Q5378P6636J26729K48397K91823K64482K22692L8288j80187j67250
$$ plain form
10704 522918 541568 438603 265520 42926 -229269 -474048 -685731 -1021181 -1491507 -1806039
10694 -1806039 -1736046 -1388618 -1062615 -918678 -881565 -825996 -715213 -559349 -407179 -336527
10684 -336527 -431463 -628714 -767377 -729862 -504041 -219450 -8111 104450 160614 202936
10674 202936 236118 182056 48154 -65489 -77667 1549 220756 580346 810545 692064
10664 692064 325409 -91626 -362272 -353227 -205059 -96693 -102133 -182392 -172365 -1589 221190
10653 221190 415165 606660 782372 846053 796147 724306 600954 423165 190051 -51490
10643 -51490 -197769 -258213 -310389 -454252 -706014 -855144 -716390 -421795 -191003 -59824
10633 -59824 25554 102190 228919 477316 769139 1033621 1256313 1294601 1114414 947164
10623I47164O979R4033K9274j79883m06807n50211n61895m48723k73671j04632
10613a448372M3590M2872o7540j08256M047J82968K43568K10783J57488J13460
10603f25392R7428M2803J2499N8183Q695k5060J26466K26054J34702L3225K0268
10592A09871K7259O1527N1733P425N349K2094j8918j34484k00958j19594J1899
10581a76797J02653J01567J123j63183l35765l32436j43539L4789Q5424k5012
10571h51176k52250m29528l26738n7614J36773K42313L00686K90394K01796J13191
10561f32153J56504K77538K90625K13647J09233p5172k05669j39222k8778J8837
10551a4610M0282q939k8067M2909L9912m9858j20908m0673J42187J22006j10667
$$ plain form
10623 947164 954143 1048176 1077450 897567 490760 -59451 -621346 -1070069 -1343740 -1448372
10613 -1448372 -1404782 -1361910 -1429450 -1537706 -1533659 -1350691 -1107123 -896340 -738852 -625392
10603 -625392 -527964 -485161 -472662 -414479 -405784 -430844 -304378 -78324 56378 89603 109871
10592 109871 137130 198657 250390 257815 263164 285258 266340 131856 -69102 -188696 -176797
10581 -176797 -74144 27423 28546 -134637 -470402 -802838 -946377 -911588 -826164 -851176
10571 -851176 -1103426 -1532954 -1859692 -1917306 -1780533 -1538220 -1237534 -947140 -745344 -632153
10561 -632153 -475649 -198111 92514 306161 415394 340222 134553 -4669 -33447 -14610
10551 -14610 25672 16733 -11334 31575 71487 21629 -99279 -139952 2235 124241 13574
10540A3574l30473l93780k35972o13R5259K0887l6647K7119J68946K06229M6620
10529d18851n077J40454K25522J28300l7773j18304j48954j15504n909J07297
10519b48799J99496J63743P6992P570j22087k57779k97996j89807j232J39325
10509e30574J14196p7057j99433j03436j8495j46866k78713k41431j55370n7974
10499a695153N4783J34131J45935K23058L34271K93961K15065K22178K01852R8422
10489B28503o064j21654k46528k43420l2352J80755K96998L46224L32394L62543
10479A097399L18329J63662P2975J14331K47609K37840J668l13562m68613m16991
10469A054647m23112m68209l69343j95615m7630M8612j2983j16727j01493m1083
$$ plain form
10540 13574 -316899 -710679 -946651 -947264 -852005 -831118 -867765 -840646 -671700 -465471 -418851
10529 -418851 -423928 -283474 -57952 70348 32575 -85729 -234683 -350187 -356096 -248799
10519 -248799 -49303 114440 191432 199002 76915 -180864 -478860 -668667 -669899 -530574
10509 -530574 -416378 -493435 -692868 -796304 -814799 -961665 -1240378 -1481809 -1637179 -1695153
10499 -1695153 -1640370 -1506239 -1360304 -1137246 -802975 -509014 -293949 -71771 130081 228503
10489 228503 222439 100785 -145743 -389163 -421515 -240760 56238 402462 734856 1097399
10479 1097399 1415728 1579390 1652365 1766696 2014305 2252145 2253813 1940251 1471638 1054647
10469 1054647 631535 163326 -206017 -401632 -449262 -400650 -413633 -530360 -631853 -672936
10459f72936r3159k42548k93147k45906j99496j55180n2169O0033J28615K03679
10449a562214K36501J89529J32278J52893J26895J5819n0676m7751L0153K38830
10439e37743L48339J86045J0786N982J22246K98616L17664O5676j34012o2596
10429F21003J4207m2933j51183k37082k93405l04286k49939j43445l9395R291
10419h17167O7406J5092j52891k04810n6560J37234K34103L36129M98541N96925
10409F54002L87821j15151n38210o32560m16887j18370N8019K971j86016k41158
10399a145539r6768O0382N6152n86P0237J04077l8509j78188j45468j20715k41221
10388a676146l17278j13814K20391M11853M68996M28015L53090L22838K53899
$$ plain form
10459 -672936 -766095 -1008643 -1301790 -1547696 -1747192 -1902372 -1954541 -1894508 -1765893 -1562214
10449 -1562214 -1325713 -1136184 -1003906 -851013 -724118 -708299 -758975 -806726 -776573 -537743
10439 -537743 -189404 -3359 7427 13409 135655 434271 751935 817611 683599 621003
10429 621003 635210 592277 441094 204012 -89393 -393679 -643618 -787063 -826458 -817167
10419 -817167 -749761 -734669 -887560 -1092370 -1148930 -1011696 -777593 -441464 57077 654002
10409 654002 1041823 926672 388462 -244098 -660985 -779355 -721336 -718365 -904381 -1145539
10399 -1145539 -1242307 -1181925 -1125773 -1126359 -1056122 -952045 -990554 -1168742 -1314210 -1434925 -1676146
10388 -1676146 -1993424 -2107238 -1886847 -1474994 -1005998 -577983 -224893 97945 351844
10379C51844K24585L23485L72609K24131j08010m02419n18655m82650k96949m2779
10369c54808J27706J45281J15071J03518M4835J803N4966J27408J77769K83696
10359H27245M11996L65052N0717k98671m42764m47415l47242j58322K686N9147
10349B2429J00559J81080K24852K06475J29509j1946q5759m7379k3300l3747j78145
10338D84628l34067k92235j14969J3759J01706J97685J65743j52745m25938l62923
10328g19356k23783j09448j1812J0163k8952j59860k63246p8095L02847M66870
10318h14672L54789J67008J02022J71920R2041k20400m45856l06416L2962K66877
10308e99725L67154L40981J76033m5137k65764m35496l98173j36351J05310J76627
$$ plain form
10379 351844 576429 899914 1272523 1496654 1388644 986225 467570 -15080 -312029 -354808
10369 -354808 -227102 -81821 33250 136768 181603 183406 238372 365780 543549 827245
10359 827245 1239241 1604293 1655010 1356339 913575 466160 118918 -39404 -36718 22429
10349 22429 122988 304068 528920 735395 864904 852958 767199 719820 696520 662773 484628
10338 484628 150561 -141674 -256643 -242884 -141178 56507 222250 69505 -356433 -719356
10328 -719356 -943139 -1052587 -1064399 -1054236 -1083188 -1243048 -1506294 -1584389 -1281542 -814672
10318 -814672 -459883 -292875 -190853 -18933 73108 -147292 -593148 -899564 -866602 -599725
10308 -599725 -232571 108410 284443 239306 -26458 -461954 -860127 -996478 -891168 -714541
10298g14541K22380K56631J63453L8130L131N635L4241R6214J24356J30399J88138
10287E48167K63587K19167j4931l52287o03521p00466o15265m18386k25152M724
10277a894363K85209M88778N00469M00630L65535L49180K20327P3142K835r3404
10267F98338k71968m44840m81250l73177j95006o042J58057K17422Q6102q9523
10257g01887j79945j32020M3854K38930K48244K2274j73398j70872L5608K82285
10247d86927M84091O16765N23363J80342j31187k52052l76097m88752m63743k19407
10237f13604J9384R3439J49207J93175J74027J20319R1206J17993J59836J40477
10227F45459J10252O7767K3822J5491L4302K5911k5001j9195N5797J28339K11357
$$ plain form
10298 -714541 -492161 -235530 -72077 -33947 -30816 -25181 9060 105274 229630 360029 548167
10287 548167 811754 1030921 1015990 663703 60182 -640284 -1255549 -1673935 -1899087 -1894363
10277 -1894363 -1609154 -1120376 -619907 -219277 146258 495438 715765 788907 791742 698338
10267 698338 426370 -18470 -499720 -872897 -1067903 -1073945 -915888 -698466 -612364 -701887
10257 -701887 -881832 -1013852 -969998 -731068 -482824 -460550 -633948 -804820 -769212 -486927
10247 -486927 -2836 613929 1137292 1317634 1186447 934395 558298 69546 -394197 -613604
10237 -613604 -594220 -500781 -351574 -158399 15628 135947 227153 345146 504982 645459
10227 645459 755711 823478 847300 862791 897093 923004 898003 878808 934605 1062944 1274301
10216A274301K95788K18550o6918l97424n78287n37805l82349j89701K5360K04728
10206a33757K87896K25073R0255J20633K28182J44784p6123k61574k97148l02336
10196B5885l61498k52671K4676J74333J59570P1326j6944k4210N5341J24713J0791
10185h688j67302q3421J41927K02505R1272r8809k63683k90356q2302K15810L46090
10174C043K74025J14652O173n4754j73037j85910l407K50812M44652M90368L57630
10163A524247J72163O1366o9213k40151l41507l18657k16984j20583n7683j32231
10153B60767l00770k96063o3200J30479J62738J78545K70773L69692L86483K21602
10143A321046q1630l06448k87781r3930M5936O2774R1287J22819N5771j37926
$$ plain form
10216 1274301 1570089 1788639 1721721 1324297 746010 208205 -174144 -363845 -338485 -133757
10206 -133757 154139 379212 469467 590100 818282 963066 886943 625369 328221 25885
10196 25885 -335613 -588284 -563608 -389275 -229705 -158379 -175323 -199533 -144192 -19479 -8688
10185 -8688 -175990 -259411 -117484 85021 176293 77484 -186199 -476555 -558857 -343047 3043
10174 3043 277068 391720 397893 343139 170102 -15808 -19215 231597 676249 1166617 1524247
10163 1524247 1696410 1757776 1688563 1448412 1106905 788248 571264 450681 392998 260767
10153 260767 -40003 -336066 -399266 -268787 -106049 72496 343269 712961 1099444 1321046
10143 1321046 1239416 932968 645187 551257 597193 659967 751254 874073 929844 791918
10133G91918l56482l81543j68366M7929R5790N6082R5839K33306L89713M26536
10123A230722K93075O4770k54394n15083n71033m59975k36182j72578k95555k42224
10113a158457j1403M3835J127O7137K31467M21045M57806L17380J26701J59740
10103F56378L15619L02266J70399j5163j95736j89802k6420P9856J70912K07515
10093A475824M3306j59521j80650k00650l75522m91561m74455l90305j87483O9907
10083h71110J70048N4466l3514L1988M4699n8367j44742j74739j34049K2779K26843
$$ plain form
10133 791918 435436 53893 -114473 -66544 29246 85328 181167 414473 804186 1230722
10123 1230722 1523797 1588567 1334173 819090 248057 -211918 -448100 -620678 -916233 -1158457
10113 -1158457 -1169860 -1126025 -1124898 -1057761 -826294 -405249 52557 369937 496638 656378
10103 656378 971997 1274263 1444662 1429499 1233763 1043961 1017541 1097397 1268309 1475824
10093 1475824 1519130 1359609 1178959 978309 602787 111226 -363229 -753534 -941017 -871110
10083 -871110 -701062 -646596 -680110 -648122 -603423 -661790 -806532 -981271 -1115320 -1092541 -865698
$$ [...]
##END NTUPLES=NMR SPECTRUM
##END=
