##TITLE=C13_Ser 2062-NEA
 CDCl3+DMSO, 22100 sc

 8.2.2024
##JCAMPDX= 6.0         $$ Bruker NMR JCAMP-DX V2.0
##DATA TYPE= NMR SPECTRUM
##DATA CLASS= NTUPLES
##ORIGIN= UXNMR, Bruker Analytische Messtechnik GmbH
##OWNER= root
$$ XWIN-NMR		Version 3.5
$$ Fri Feb  9 13:41:16 2024 Russian Standard Time (UT+4h)  she@DPX200
##.OBSERVE FREQUENCY= 50.327896
##.OBSERVE NUCLEUS= ^13C
##.ACQUISITION MODE= SIMULTANEOUS
##.ACQUISITION SCHEME= undefined
##.AVERAGES= 22101
##.DIGITISER RES= 17
##SPECTROMETER/DATA SYSTEM= spect
##.PULSE SEQUENCE= zgpg30
##.SOLVENT NAME= CDCl3
##.SHIFT REFERENCE= (INTERNAL, CDCl3, 0, 222.756)
##AUDIT TRAIL= $$ (NUMBER, WHEN, WHO, WHERE, WHAT)
$$ ##TITLE= Audit trail, XWIN-NMR		Version 3.5
$$ ##JCAMPDX= 5.01
$$ ##ORIGIN= Bruker BioSpin GmbH
$$ ##OWNER= she
$$ F:/spectra/data/she/nmr/c13/1/pdata/1/auditp.txt
$$ ##AUDIT TRAIL=  $$ (NUMBER, WHEN, WHO, WHERE, WHAT)
(   1,<2024-02-09 13:39:06.18 +0400>,<she>,<DPX200>,
      <created by zg, POWCHK disabled, PULCHK disabled
       terminated by command 'halt'
       configuration hash MD5:
       00 E9 B6 7A A2 85 ED C7 34 08 36 98 17 FE 4E 26
       data hash MD5: 32K
       79 91 3C 4A 56 F1 B2 EF D9 53 70 5B F0 2A D4 D6>)
(   2,<2024-02-09 13:39:08.43 +0400>,<she>,<DPX200>,
      <Start of raw data processing
       efp BC_mod = 2 LB = 2 FT_mod = 6 PKNL = 1 PHC0 = -368.7331 PHC1 = 19.41885 SI = 32K 
       data hash MD5: 32K
       1D 51 FE E8 9F FD 1E B2 87 D0 41 7B C6 CF 90 3A>)
(   3,<2024-02-09 13:39:11.26 +0400>,<she>,<DPX200>,
      <abs ABSG = 5 
       data hash MD5: 32K
       F0 25 5C 7C 18 6C 56 D1 E9 7D F2 34 27 80 77 CA>)
(   4,<2024-02-09 13:39:44.59 +0400>,<she>,<DPX200>,
      <pk PHC0 = -8.073517 PHC1 = 5.400001 
       data hash MD5: 32K
       6B D8 A4 0E 2E B4 87 9A 36 38 70 A9 D9 D8 A7 E8>)
(   5,<2024-02-09 13:39:47.98 +0400>,<she>,<DPX200>,
      <abs ABSG = 5 
       data hash MD5: 32K
       CF 55 B2 D0 5F 20 AF A1 14 06 C6 C3 D0 5A 7B 76>)
(   6,<2024-02-09 13:40:35.87 +0400>,<she>,<DPX200>,
      <pk PHC0 = -5.721442 PHC1 = 10.20001 
       data hash MD5: 32K
       79 EA 7D 53 E2 85 3C 7C 12 9F BE 5A D0 86 B6 D1>)
(   7,<2024-02-09 13:40:39.09 +0400>,<she>,<DPX200>,
      <abs ABSG = 5 
       data hash MD5: 32K
       29 64 BF 84 EE CC 6E 1E DD 6E 5A 3C EA 7A 41 12>)
$$ ##END=
$$ 
$$ hash MD5
$$ 63 D2 63 87 FE 43 52 F9 1B 82 FC E6 60 F9 8E 44
##$RELAX= 
##$RELAX= 
##$RELAX= 
##$RELAX= 
##$RELAX= 
##$RELAX= 
##$RELAX= 
##$RELAX= 
$$ Bruker specific parameters
$$ --------------------------
##$DU= <F:/spectra>
##$EXPNO= 1
##$NAME= <c13>
##$PROCNO= 1
##$TYPE= <nmr>
##$USER= <she>
##$AMP= (0..31)
100 100 100 100 100 100 100 100 100 100 100 100 100 100 100 100 100 100 
100 100 100 100 100 100 100 100 100 100 100 100 100 100 
##$AQSEQ= 0
##$AQ_mod= 1
##$AUNM= <au_zg>
##$AUTOPOS= <>
##$BF1= 50.322709
##$BF2= 200.13
##$BF3= 50.322709
##$BF4= 500.13
##$BF5= 500.13
##$BF6= 500.13
##$BF7= 500.13
##$BF8= 500.13
##$BYTORDA= 1
##$CFDGTYP= 0
##$CFRGTYP= 5
$$ [...]
##$SUBNAM4= <"">
##$SUBNAM5= <"">
##$SUBNAM6= <"">
##$SUBNAM7= <"">
##$SUBNAM8= <"">
##$SUBNAM9= <"">
##$SW= 239.972175391363
##$SWIBOX= (0..15)
0 1 3 0 0 0 0 0 0 0 0 0 0 0 0 0 
##$SW_h= 12077.2946859903
##$TD= 32768
##$TD0= 1
##$TE= 0
##$TE2= 300
##$TE3= 300
##$TEG= 300
##$TL= (0..7)
120 120 120 120 120 120 120 120 
##$TP= (0..7)
150 150 150 150 150 150 150 150 
##$TP07= 0
##$TPNAME0= <>
##$TPNAME1= <>
##$TPNAME2= <>
##$TPNAME3= <>
##$TPNAME4= <>
##$TPNAME5= <>
##$TPNAME6= <>
##$TPNAME7= <>
##$TPOAL= (0..7)
0.5 0.5 0.5 0.5 0.5 0.5 0.5 0.5 
##$TPOFFS= (0..7)
0 0 0 0 0 0 0 0 
##$TUNHIN= 0
##$TUNHOUT= 0
##$TUNXOUT= 0
##$USERA1= <user>
##$USERA2= <user>
##$USERA3= <user>
##$USERA4= <user>
##$USERA5= <user>
##$V9= 5
##$VALIST= <valist>
##$VCLIST= <CCCCCCCCCCCCCCC>
##$VD= 0
##$VDLIST= <DDDDDDDDDDDDDDD>
##$VPLIST= <PPPPPPPPPPPPPPP>
##$VTLIST= <TTTTTTTTTTTTTTT>
##$WBST= 1024
##$WBSW= 4
##$XGAIN= (0..3)
0 0 0 0 
##$XL= 0
##$YL= 0
##$YMAX_a= 64823119
##$YMIN_a= -131413594
##$ZGOPTNS= <>
##$ZL1= 120
##$ZL2= 120
##$ZL3= 120
##$ZL4= 120
##$ABSF1= 222.7558
##$ABSF2= -17.24104
##$ABSG= 5
##$ABSL= 3
##$ALPHA= 0
##$AQORDER= 0
##$ASSFAC= 0
##$ASSFACI= 0
##$ASSFACX= 0
##$ASSWID= 0
##$AUNMP= <proc_1d>
##$AZFE= 0.1
##$AZFW= 0.5
##$BCFW= 0
##$BC_mod= 2
##$BYTORDP= 0
##$COROFFS= 0
##$CY= -3
##$DATMOD= 1
##$DC= 0
##$DFILT= <>
##$DTYPP= 0
##$F1P= 0
##$F2P= 0
##$FCOR= 0.5
##$FTSIZE= 32768
##$FT_mod= 6
##$GAMMA= 0
##$GB= 0
##$INTBC= 1
##$INTSCL= 4.134877e-10
##$ISEN= 128
##$LB= 2
##$LEV0= 0
##$LPBIN= 0
##$MAXI= 10000
##$MC2= 0
##$MEAN= 0
##$ME_mod= 0
##$MI= 0.1934396
##$NCOEF= 0
##$NC_proc= 1
##$NLEV= 6
##$NOISF1= 120.0001
##$NOISF2= 80.00006
##$NSP= 0
##$NTH_PI= 0
##$NZP= 0
##$OFFSET= 222.7558
##$PC= 1.4
##$PHC0= -382.528
##$PHC1= 35.01886
##$PH_mod= 1
##$PKNL= yes
##$PPARMOD= 0
##$PSCAL= 0
##$PSIGN= 0
##$REVERSE= no
##$SF= 50.3227249666721
##$SI= 32768
##$SIGF1= 140
##$SIGF2= 120
##$SINO= 11.81781
##$SIOLD= 32768
##$SREGLST= <13C.CDCl3>
##$SSB= 0
##$STSI= 32768
##$STSR= 0
##$SW_p= 12077.2946859903
##$SYMM= 0
##$S_DEV= 0
##$TDeff= 32768
##$TDoff= 0
##$TI= <>
##$TILT= no
##$TM1= 0
##$TM2= 0
##$TOPLEV= 0
##$USERP1= <user>
##$USERP2= <user>
##$USERP3= <user>
##$USERP4= <user>
##$USERP5= <user>
##$WDW= 1
##$XDIM= 32768
##$YMAX_p= 330766244
##$YMIN_p= -3255859
$$ End of Bruker specific parameters
$$ ---------------------------------
##NTUPLES= NMR SPECTRUM
##VAR_NAME=  FREQUENCY,     SPECTRUM/REAL,   SPECTRUM/IMAG
##SYMBOL=    X,             R,               I
##VAR_TYPE=  INDEPENDENT,   DEPENDENT,       DEPENDENT
##VAR_FORM=  AFFN,          ASDF,            ASDF
##VAR_DIM=   32768,         32768,           32768
##UNITS=     HZ,            ARBITRARY UNITS, ARBITRARY UNITS
##FACTOR=    0.368581032318806, 1,           1
##FIRST=     11209.6787745874, 0,            0
##LAST=      -867.615911402871, 0,           0
##MIN=       -867.615911402871, -3255859,    0
##MAX=       11209.6787745874, 330766244,    0
$$ Real data points
##PAGE= N=1
##DATA TABLE= (X++(R..R)), XYDATA
$$ [...]
15974b535689J67997L36642M15248M30197L77707K97878K49286J40777l4933j42777
15964b97667q7957K4546o215p9150q7678m4317j3885p9442j15707o6101k375L5432
15952h20516Q0080K13367L35608L01191J89150J82624K42185J12123j78457m23326
15942B34029n27649m86928l87184l09416k37447n8859J71841K86555K66042J80542
15932h68474J48259J73894J26143L5664j0723k5127O94M3482L1753O4512J89101
15921i0822K42058J51885J03777J00854R490m5017L4762Q3538Q2823J08787L2093
15910H14228q0191j10368j17354j86895k31755j48524q1187q9589K5947K62492
15900E6804M25328M60060L32657J19571K0881j20522m06095n41550m48872k47459
$$ y = [-2535689, -2367692, -2031050, -1615802, -1185605, -807898, -510020, -260734, -119957, -154890, -297667, -385624, -361078, -367293, -446443, -534121, -578438, -592323, -671765, -787472, -853573, -855948, -820516, -740436, -527069, -191461, 109730, 298880, 481504, 723689, 835812, 657355, 234029, -293620, -780548, -1167732, -1477148, -1714595, -1773454, -1601613, -1315058, -1049016, -868474, -720215, -546321, -420178, -384514, -395237, -420364, -419670, -376188, -344435, -279923, -90822, 151236, 303121, 406898, 507752, 517242, 472225, 506987, 590525, 673348, 782135, 814228, 734037, 623669, 506315, 319420, 87665, -60859, -142046, -231635, -205688, 56804, 482132, 942192, 1274849, 1394420, 1415301, 1294779, 888684, 347134, -101738, -349197]
15890c49197O752J56602J17676Q2873J73468L11654L95796K57447j1678j23804
15880A017589m0665r0026l97546o96429o43602k62194K9689L1193n8218p5783
15870a185992j29958j95519p2163J65700L55755N15688N43307L64405J04740m1657
15860D24306N56k756o8257m2039L9081O1510k8683q9471o6117k4574r423n2815
15848A41318j40373j48949p6307N4801K57212M00223M59488L99544J80729j25351
15838A402335m19348n28543m18137k18724j11152j63025k58570k64198j93350
15829a172712q3456k9020q8900j23475n3610J02294K81487L46215K77379J25519
15819d18279O641P1628J67741J45693M8179m1303q4263j12008j72808j77023q6212
$$ y = [-349197, -342445, -185843, -68167, 14706, 188174, 499828, 895624, 1153071, 1141393, 1017589, 976924, 886898, 489352, -207077, -850679, -1112873, -1083184, -1051991, -1110209, -1185992, -1315950, -1511469, -1583632, -1417932, -1062177, -546489, -3182, 361223, 465963, 424306, 424862, 422106, 353849, 311810, 350891, 412401, 383718, 294247, 228130, 203556, 194133, 141318, 945, -148004, -224311, -169510, 87702, 487925, 947413, 1346957, 1527686, 1402335, 982987, 454444, 36307, -182417, -293569, -456594, -715164, -979362, -1172712, -1256168, -1285188, -1374088, -1497563, -1551173, -1448879, -1167392, -821177, -543798, -418279, -411638, -340010, -172269, -26576, 21603, -19700, -103963, -215971, -388779, -565802, -652014]
15808f52014l5651n5701j07498k03510k75129k17750l4866J75422L36443M01621
15798f68633L53416K05365P7014J8975q4412k04344j74500L4360K44853L07668
15788A09762K48644K38985K70841K55995O7257j52261j97173j94765k04041k07310
15778B35934k29961j87508q8376l8862q5346j72675o6834J63937K60776J98349
15768a0566O9660n9779j00651L7646L08172N24677N51864L46519K9828r3924J4813
15757A618259J08941j2300k60135m88387n83513o04756o45725n33257k54668j9045
15747a674586J18285J04609O1032J89629M08969M96667M64118M05916K15408o6958
15737G23089k76309l22644k37940j01386M4890Q8590P1257N5789K9164J3764J2156
$$ y = [-652014, -687665, -743366, -850864, -1054374, -1329503, -1547253, -1582119, -1406697, -1070254, -668633, -315217, -109852, -32838, -13863, -98275, -302619, -477119, -442759, -197906, 109762, 358406, 597391, 868232, 1124227, 1191484, 1039223, 842050, 647285, 443244, 235934, 5973, -181535, -269911, -308773, -394119, -566794, -633628, -469691, -208915, -10566, 59094, -685, -101336, -63690, 244482, 769159, 1321023, 1667542, 1697370, 1603446, 1618259, 1727200, 1714900, 1454765, 966378, 382865, -221891, -867616, -1400873, -1655541, -1674586, -1556301, -1451692, -1390660, -1201031, -792062, -295395, 168723, 574639, 790047, 723089, 446780, 124136, -113804, -215190, -170300, -81710, -10453, 45336, 74500, 88264, 100420]
15726A00420Q3997J64289J50075O966k05941k84153j50277j3158l0172q5781p9142
15715c42877o2811m6424K0391j3911j88462j63846Q5718L10268K66156N0223n4740
15704a40315L3191J88475K46105J37564J6123m0435j01084j76197j79846j30834
15694a47253j33352j78514k00210j41856k8099M9300K3602j10410j65469j8766
15684a051027R9538R8503M7182o7417j26476n1806R4812K66181L21743K19645
15674a49122Q0666q6781j97879j68665r5162j4595M3824M7981P4321J62520K63208
15663c9684K67910J39013l97j66912k52599j00124J24007K48220K48274J38286
15653F05994Q0764Q3407l4207k52784l13644j95495j54430j39847N023J35742
$$ y = [100420, 184417, 348706, 498781, 505747, 299806, 15653, -134624, -147782, -177954, -263735, -342877, -405688, -452112, -431721, -445632, -634094, -797940, -712222, -401954, -135798, -85575, -140315, -107124, 81351, 327456, 465020, 481143, 440708, 339624, 163427, -16419, -147253, -280605, -459119, -659329, -801185, -829284, -779984, -756382, -866792, -1032261, -1051027, -951489, -852986, -805804, -873221, -999697, -1051503, -956691, -690510, -368767, -149122, -68456, -155237, -353116, -521781, -616943, -631538, -587714, -539733, -465412, -302892, -39684, 228226, 367239, 366842, 199930, -52669, -152793, -28786, 219434, 467708, 605994, 686758, 770165, 735958, 483174, 169530, -25965, -180395, -320242, -315219, -179477]
15643a79477J33891K12967L49366K94878J04220M3152J25511J21333k7187j26274
15633A052380j99946l59315l89451k24532j16217j63717k26254j49360L5565J27293
15623f13554J1322j61461j80874j33154j11145o439J09635J67575J51058N9168
15613g07869Q2941K43698L32548K82784K07158J53993L7685j11040j30229p6955
15603C14714j27715k53306l41049l22598j45871Q0871K62534L73839L66939K02038
15593D10396j0634k19145l85794m03873l09397j06856J53691K81597J54249n4855
15583d90621n6508R0269K46277K80570P8555k24207m54957m10593n8482L20370
15573f79327M17560K61294P1579p3767j43265j62590k01368k43265k58612j43672
$$ y = [-179477, -45586, 167381, 516747, 811625, 915845, 958997, 1084508, 1205841, 1178654, 1052380, 852434, 493119, 103668, -120864, -237081, -400798, -627052, -776412, -740847, -613554, -602232, -763693, -944567, -1077721, -1188866, -1195305, -1085670, -918095, -767037, -707869, -624928, -381230, -48682, 234102, 441260, 595253, 632938, 521898, 391669, 314714, 186999, -66307, -407356, -729954, -875825, -794954, -532420, -158581, 208358, 410396, 399762, 180617, -205177, -609050, -918447, -1025303, -871612, -590015, -435766, -490621, -547129, -456860, -210583, 69987, 148542, -75665, -530622, -941215, -999697, -679327, -261767, -473, 71106, -2661, -145926, -308516, -509884, -753149, -1011761, -1155433]
15563a155433O7042J83913K47846K37648J34862R1319J19292K27342M01830N15953
15553A071614L72164l5706l83557m32579k44128j13399j89237k68790k30436j62444
15543f16498r5308n1848j9546Q4427K15915K75695K99882K09094K7874o0561k6332
15532B42794R9767K42184K18181N2140o3457r386J23625R6038j02400k69187k27957
15521D02342L018J43486r123k86250m49774m24743j90440J21231L35072L55823
15511F42J26553j59101l24982l12446o4914J96089K91455K36707J09704J33898
15501B33605L39814M67570L80957J87927N5926k4289j43688k58684k09860K6441
15491A055719K21759K25159J14766K8712l1166j21527k45265l26339l26109l03915
$$ y = [-1155433, -1088391, -904478, -656632, -418984, -284122, -192803, -73511, 153831, 555661, 1071614, 1443778, 1408072, 1024515, 591936, 347808, 234409, 45172, -223618, -454054, -616498, -711806, -763654, -783200, -698773, -482858, -207163, 92719, 301813, 329687, 269126, 242794, 342561, 584745, 802926, 855066, 791609, 782223, 905848, 1001886, 899486, 630299, 402342, 405360, 548846, 539723, 253473, -196301, -621044, -811484, -690253, -355181, 642, 127195, -31906, -356888, -669334, -734248, -538159, -246704, -9997, 99707, 233605, 573419, 1040989, 1421946, 1609873, 1665799, 1641510, 1497822, 1239138, 1029278, 1055719, 1277478, 1502637, 1617403, 1646115, 1614949, 1493422, 1248157, 921818, 595709, 291794]
15481B91794k23014j9248J34189P9132n2702n8709N2011J46621J24857O6207L0647
15470E71785M8940J42643J44151l958j92705k47143j62922j10703l7221O82p8855
15459G4694j23273K6232K56019L01933J66290Q3974K22669M22783M36854K98494
15449B166669J12407j34047l91972m99208m03667k44406j17453l1631n652o132
15439D44908P883R361m3864j48902j89084j12062n5390j49823k46427j18727P9446
15428e22681L193k92594m49232l47746j19460M9002N8918j4996l1699M4960J21144
15417a501191K05540L20862L56554K80263R3088q1890j3487J10932R5384J18393
15407a5552J17070m5487j82146k21833k09335j79051q2211O0844J13828M2460
$$ y = [291794, 68780, 49532, 183721, 262853, 210151, 151442, 203453, 350074, 474931, 541138, 571785, 620725, 763368, 907519, 903561, 710856, 463713, 300791, 190088, 152867, 153549, 74694, -48579, -22347, 233672, 535605, 701895, 785869, 1008538, 1431321, 1868175, 2166669, 2279076, 2145029, 1753057, 1253849, 850182, 605776, 488323, 456692, 451040, 444908, 452791, 462152, 418288, 269386, 80302, -31760, -87150, -236973, -483400, -602127, -522681, -519488, -812082, -1261314, -1609060, -1728520, -1679518, -1620600, -1635596, -1667295, -1622335, -1501191, -1295651, -974789, -618235, -337972, -244884, -326774, -340261, -229329, -133945, -15552, 101518, 56031, -126115, -347948, -557283, -736334, -818545, -757701, -643873, -601413]
15397f01413j39101k94567l09879j59671P7344J89167J39498P8324N1326N628
15387i63344o0163j09351k3088J27067K51775L24373K60498J70020K06896K32246
15377D16929J51197K6968m9617o9730j48842k54321k90373j78642O969J04413
15367b85049P0190j66n283m9666j78686k31011j07390J06586J71637P8816J04329
15356c25693K84954M11955K52245j37409m45142n82896n85203l84666o5582J87784
15346a389653J85096J9802j1432J28711K30117K71715K86462J90619P4218o7661
15336h2006k28780k50219j43621m1324N8054J60344K02120J84611K27349K76794
15326C63322K73762J97839P9753M2702P1703l7202k83114l78867k37481l5399
$$ y = [-601413, -740514, -1035081, -1344960, -1504631, -1427287, -1238120, -1098622, -1020298, -968972, -963344, -1023507, -1132858, -1155946, -1028879, -777104, -452731, -192233, -22213, 184683, 416929, 568126, 595094, 545477, 475747, 326905, 72584, -217789, -396431, -389462, -285049, -214859, -215025, -220308, -269974, -448660, -679671, -787061, -680475, -508838, -430022, -325693, -40739, 371216, 623461, 486052, 40910, -541986, -1127189, -1511855, -1577437, -1389653, -1204557, -1184755, -1196187, -1067476, -837359, -565644, -279182, -88563, -14345, -82006, -310786, -561005, -704626, -745950, -687896, -527552, -325432, -140821, 86528, 363322, 637084, 834923, 914676, 957378, 1029081, 991879, 708765, 329898, 92417, 57018]
15316E7018J07777K31137K78636J81651q512j80421k02830q3966p804J840j3064
15305C61462j48708l28177l07841o1606J66355J93478j16k21781l21293l50688
15295a018915l26213j74382J27946M31711M95416L62558K45875J92556J38636
15286D75188J79596K90818L26634K74817J63599O0584k2144L629J38988J49122
15276B040831N5021m9878j28445j67825k40281l03193k77897k51424k15857p5782
15266C85270l905o5071q9314l0029j5698m4806o2135j30119k85225m19873m01590
15255a162495k43157j25834o5512N5018J56445K45833L64266L50257J47350K4270
15245b53559N7187M1238L4136J47309K40280K73391K72169J50694l4499j27167
$$ y = [57018, 164795, 395932, 674568, 856219, 847707, 667286, 464456, 380490, 372686, 374526, 361462, 212754, -115423, -423264, -484870, -318515, -125037, -125153, -346934, -668227, -1018915, -1345128, -1519510, -1391564, -959853, -464437, -101879, 143996, 336552, 475188, 654784, 945602, 1272236, 1547053, 1710652, 1771236, 1749092, 1752721, 1891709, 2040831, 2095852, 2045974, 1917529, 1749704, 1509423, 1206230, 928333, 676909, 461052, 385270, 381365, 316294, 226980, 196951, 181253, 136447, 74312, -55807, -341032, -760905, -1162495, -1405652, -1531486, -1596998, -1541980, -1385535, -1139702, -775436, -425179, -277829, -253559, -196372, -155134, -120998, 26311, 266591, 539982, 812151, 962845, 928346, 801179]
15235H01179j00655n1699l2288m8886j16836j86433k07127j78613j04566Q100
15225b17824L4804j3770q2478q1412l2076l8694r0169j42067j41556j86558k12943
15214a204743j33119q364R9251J43723J12422R6740J28072J37035J29446Q7344
15204d12193n1718j17866m5731j1581q1212k74702l97597k24161P5563K02721
15194a338477J45270R0009Q7457R8752M8697j47066l09235j78973P08n1854j35744
15183a690456L4685L83561N89264M82503K54204J43693J17970J13154O7365j3761
15173D82182n695J01613J04131r3276j85438J3900K14151K18150J50148J26429
15163A126295R9959N381n2816l9117l2054n2198o4884k7354k0107j75392l62915
$$ y = [801179, 700524, 648825, 616537, 567651, 450815, 264382, 57255, -121358, -225924, -217824, -183020, -196790, -279268, -360680, -392756, -431450, -521619, -663686, -805242, -991800, -1204743, -1337862, -1346226, -1246975, -1103252, -990830, -894090, -766018, -628983, -499537, -412193, -463911, -581777, -627508, -639089, -720301, -995003, -1392600, -1616761, -1541198, -1338477, -1193207, -1103198, -1015741, -916989, -868292, -1015358, -1324593, -1503566, -1502858, -1554712, -1690456, -1655771, -1272210, -682946, -200443, 53761, 197454, 315424, 428578, 495943, 482182, 476487, 578100, 682231, 588955, 403517, 417417, 631568, 849718, 999866, 1126295, 1226254, 1231635, 1178819, 1139702, 1107648, 1055450, 990566, 963212, 943105, 767713, 404798]
15152D04798l79488k50113n7329K00628M27851M23542K35477J07734J47385K65420
15142A525905L24661K60430P1588j43631l47024n25728m76402j38299K36303M71009
15132A258812N72603M45128J92784l7170j88625j70488q3267n0279j53616k87221
15122A498661k74037k23493j95294j31642k3822J27469K27052J49638p86q9420
15112A064326j49600j54906j27684j78820k94638l34383k28325l7096J21719J28433
15102a90974o7192k47785k55325j56200k5945J76261K98784J38381n8811j02248
15092d91054l0075O7056J56596J70622J41045R2978l3591j24612n2414P9266R7514
15081G3331L1752l5666l9204m8288j39169k30584j85693l9166M0765N7112J06526
$$ y = [404798, 25310, -224803, -282132, -81504, 346347, 769889, 1005366, 1113100, 1260485, 1525905, 1850566, 2110996, 2182584, 2038953, 1691929, 1166201, 689799, 551500, 787803, 1258812, 1831415, 2276543, 2469327, 2432157, 2243532, 2073044, 1989777, 1939498, 1785882, 1498661, 1224624, 1001131, 805837, 674195, 650373, 777842, 1004894, 1154532, 1153746, 1064326, 914726, 759820, 632136, 453316, 158678, -175705, -404030, -441126, -319407, -190974, -258166, -505951, -761276, -917476, -943421, -767160, -468376, -329995, -388806, -491054, -521129, -454073, -297477, -126855, 14190, 107168, 73577, -51035, -103449, -24183, 73331, 105083, 69417, 30213, -18075, -157244, -387828, -573521, -612687, -571922, -514810, -408284]
15070d08284J49792J02910K3008R052M3225L824j07500j97796k47739k27319k08185
15059a065012k64332k70423q9996J72666L34183L37704L11255K79591R3346m4911
15049b05929P1970K03040J32787n0331j56643p0497R3360J54161P2022J1459M0748
15038B96147J16619K23529K57603J10735j06593j51657n2367L1457P2472J28766
15028I26711J13822K8651L4686J43809K74115K72142O3051j84569k37021j13889
15018A321508k2236j2509r3420k63030l67143k78638j00463P1367K17280L17554
15008G90270K24130p5672l08866l71140l09027j20905O6342J45276J26444L7847
14998B04699k4115J3659N9451P161m8871M0423J73372K03996J55055N7477j47250
$$ y = [-408284, -258492, -155582, -132574, -123522, -80297, -76473, -183973, -381769, -629508, -856827, -1065012, -1329344, -1599767, -1689763, -1517097, -1182914, -845210, -533955, -254364, -161018, -205929, -133959, 69081, 201868, 151537, -5106, -75603, 17757, 171918, 243940, 255399, 296147, 412766, 636295, 893898, 1004633, 898040, 746383, 694016, 725473, 797945, 926711, 1040533, 1069184, 1103870, 1247679, 1521794, 1793936, 1856987, 1672418, 1435397, 1321508, 1299272, 1286763, 1193343, 930313, 563170, 284532, 184069, 255436, 472716, 790270, 1014400, 938728, 629862, 258722, -50305, -171210, -104868, 40408, 166852, 204699, 180584, 194243, 253694, 260855, 211984, 252407, 425779, 629775, 784830, 842307, 695057]
14987F95057l76597m18830l21055k52535j53065j5175R3606J41950J02120K3570
14977d80954J0227m6578j44513p8883J30734K86138K60614J52717P2837j95M0811
14966B02955J87505K66633J55605r8334k74878k83323p6454J41856J53444k0691
14956C54318j94617j76842j6811Q7982K17844L04596J21151k90027n57970n19249
14946f69625l77272k08698p0032k1446O907N9684J09860J53105K09477K12017
14936e96023J43186Q0757M0200j8310m1246o417L2153O0350J02497J44902Q6368
14925B8417j7380M9683J48303M2521j36427k22065k57032k81395l07729k74282
14915a227386q0333J90176N08627O98643M57615J592k86380l39027j67185K2967
$$ y = [695057, 318460, -100370, -421425, -673960, -827025, -842200, -748594, -606644, -504524, -480954, -470727, -517305, -661818, -740701, -609967, -323829, -63215, 89502, 162339, 162144, 202955, 390460, 657093, 812698, 714364, 439486, 156163, 79709, 221565, 375009, 354318, 159701, -17141, -33952, 54030, 271874, 576470, 697621, 407594, -150376, -669625, -1046897, -1255595, -1325627, -1347073, -1340166, -1280482, -1170622, -1017517, -808040, -596023, -452837, -372080, -331880, -350190, -391436, -397853, -365700, -305350, -202853, -57951, 28417, 11037, 60720, 209023, 251544, 115117, -106948, -363980, -645375, -953104, -1227386, -1307719, -1117543, -608916, 89727, 547342, 548934, 262554, -76473, -243658, -220691]
14905b20691n5241k69521l21745k77966l35822k92917N461L27692M25287K54811
14895g60652M5391L3436K40435M60539M76760L18486N2174k42635l77846l58139
14885a12051k74919j65496q6704m8361L2880R9721J39609J77140K38694L20003
14875C20516L91012K96616l8009l43600m50257m41113m23018m47846m55168k61574
14865a852441J38123M72439M85571K77164R4670j6749r8437j45655j68564j48681
14855i62560n6645P7226K00273L45703L86295L31146K63612J78387L8334j43513
14845F58258k09772j16792j7028k6396j24923k05398k04241j84458k01367j85716
14835h17833r68K38443L37272K54941M6956j94756k99285l32164l90852k68256
$$ y = [-220691, -275932, -545453, -867198, -1145164, -1480986, -1773903, -1768442, -1440750, -1015463, -760652, -715261, -681825, -441390, 19149, 495909, 814395, 866569, 623934, 246088, -112051, -386970, -552466, -639170, -687531, -654651, -554930, -415321, -238181, 513, 320516, 711528, 1008144, 970135, 626535, 176278, -264835, -687853, -1135699, -1590867, -1852441, -1714318, -1241879, -756308, -479144, -384474, -401223, -499660, -645315, -813879, -962560, -1019205, -941979, -741706, -396003, -9708, 321438, 585050, 763437, 801771, 658258, 448486, 331694, 314666, 288270, 163347, -42051, -246292, -430750, -632117, -817833, -818801, -580358, -243086, 11855, 58811, -135945, -435230, -767394, -1158246, -1426502]
14825a426502k6965P0784R3879J56586J52666M6243l8794r0904j12449r822J50189
14814a035089K30885K83403K43720J7377j93437j91082o0213P1152K23139L34967
14804g5178K79639P5361p6005n7710j6361J1227j4048j40700j69393p0806k5845
14793b79819j1666n3887j62483k09938j37847Q031J07930J23030Q6715K7679N7673
14782d44582J29297J41162J50402J48989J44568J09751N5531J0896o7722j22285
14772B56007j23122m8858N0223N9402K7085J7609J00117K68332L45947K34286
14762A187028P8666M3334k3963k13673l65022l71604k77326j54867m4708J3208
14752a28927J06507K48747L50140K93888Q1330j02469k64614l75947k99747j74536
$$ y = [-1426502, -1453467, -1382683, -1288804, -1132218, -979552, -933309, -972103, -1063007, -1175456, -1185278, -1035089, -804204, -520801, -277081, -259704, -453141, -644223, -704436, -633284, -410145, -75178, 204461, 279822, 203817, 146107, 129746, 140973, 126925, -13775, -183168, -253974, -279819, -291485, -345372, -507855, -717793, -855640, -847609, -739679, -616649, -529934, -502255, -444582, -315285, -174123, -23721, 125268, 269836, 379587, 435118, 446014, 378292, 256007, 132885, 84027, 134250, 193652, 220737, 238346, 338463, 606795, 952742, 1187028, 1265694, 1309028, 1285065, 1071392, 706370, 334766, 57440, -97427, -142135, -128927, -22420, 226327, 576467, 870355, 951685, 849216, 584602, 208655, -91092, -265628]
14742b65628j49688q9275j6483l1146p5512j30919k3797J90223K21047K07356
14732a63822L02200L65927L64181K90715K82637M13815M72029L91804K78465J87729
14722C185680J51312K26243L49566L70465M28817O31919P84180Q10157R43360
14713G881699J192673J347561J486964J743287K173908K881160L780186M548924
14705B7036362N260588N986569N883626L717249m30191m642196o948306o966323
14697B8897378n699076m239149l101932k392255j961265j585319j229042r52821
14689G736519p58051o67630o89660o86439n72593m16499l31961l59282m74408
14680B779996o21191n84644k82995j3577Q1598M6132q4194j42215j30196j03966
$$ y = [-265628, -415316, -504591, -521074, -552220, -627732, -758651, -782448, -592225, -371178, -163822, 138378, 504305, 868486, 1159201, 1441838, 1855653, 2327682, 2719486, 2997951, 3185680, 3336992, 3563235, 3912801, 4283266, 4712083, 5344002, 6128182, 6938339, 7881699, 9074372, 10421933, 11908897, 13652184, 15826092, 18707252, 22487438, 27036362, 32296950, 38283519, 44167145, 47884394, 47454203, 42812007, 35863701, 28897378, 23198302, 18959153, 15857221, 13464966, 11503701, 9918382, 8689340, 7736519, 6978468, 6310838, 5621178, 4934739, 4362146, 3945647, 3613686, 3254404, 2779996, 2158805, 1574161, 1291166, 1277589, 1359187, 1405319, 1321125, 1178910, 1048714, 944748]
14670I44748p0033J0797P8435p6456l05497k82134n2270R9235J17766N4103j11950
14659D06744k28418r4865J72455L17024K48230O2637p6394r6490Q7112L81588
14649A179623N03048M34690L52060J58521k26010m91244m79232k80543j7915P3421
14639A206419m2978p7865L8376J90684L44215L38328L2681l71207o51216o07302
14629D00135k25859K02832L09161k252l31836l75946j95785K9448Q0299J2931
14619i6872n434J0014M950J5206J1814o4945j17781o0866J2365o5192j83363j99958
14607g40062j51841j49752j48078k86K04232K66793J97798J20616Q3151R2072
14597b25357J00545O6813N2679N5534M2297K6446L4625Q4809K37371L60695L31896
$$ y = [944748, 874715, 885512, 963947, 887491, 581994, 299860, 247590, 346825, 464591, 518694, 406744, 178326, 83461, 255916, 572940, 821170, 883807, 807413, 710923, 798035, 1179623, 1682671, 2117361, 2469421, 2627942, 2401932, 1910688, 1431456, 1150913, 1132998, 1206419, 1163441, 1085576, 1123952, 1314636, 1658851, 1997179, 2029860, 1658653, 1007437, 400135, 174276, 377108, 686269, 684017, 352181, -23765, -219550, -190102, -109803, -96872, -102306, -92292, -87342, -72136, -60322, -125267, -243048, -303914, -291549, -356741, -540104, -740062, -891903, -1041655, -1189733, -1190019, -985787, -718994, -521196, -400580, -317429, -225357, -124812, -57999, -5320, 50214, 92511, 118957, 153582, 238391, 475762, 836457, 1168353]
14586A168353J96333K6506j10808j87534k28238k88025l45792l21155j45565P3391
14576a62534J93776K15163K58804L62577L55983J51925p9138k10381k84491l30766
14566D70918l30610k55787q0261L8601K5698N2852J98494K74993K49922K18383
14556H63203J59072J53750K11148J13851j32007k50557j11280N8219J3263j83911
14546H94751k85657j73009j9807k0253q9347j48896j10186O233P0456J35861K01759
14535D61905K80560L32555K00541n6433k34478l09730k59287j46738j62838k39903
14525a33846k71352k33126j02181j6170n6544j28568j15218k2127J06653K19195
14515g53284K75360K48006J18133q0519k55866k89884j80009j3009Q3434Q9608
$$ y = [1168353, 1364686, 1391192, 1280384, 1092850, 864612, 576587, 230795, -90360, -235925, -162534, 31242, 246405, 505209, 867786, 1223769, 1375694, 1296556, 1086175, 801684, 470918, 140308, -115479, -195740, -157139, -131441, -78589, 119905, 394898, 644820, 863203, 1022275, 1176025, 1387173, 1501024, 1369017, 1118460, 1007180, 1065399, 1078662, 894751, 609094, 436085, 416278, 396025, 306678, 157782, 47596, 53829, 124285, 260146, 461905, 742465, 1075020, 1275561, 1219128, 984650, 674920, 415633, 268895, 106057, -133846, -405198, -638324, -740505, -756675, -813219, -941787, -1057005, -1079132, -972479, -753284, -477924, -229918, -111785, -192304, -448170, -738054, -918063, -931072, -847638, -758030]
14505g58030P4224M2692j4081p0744m2155K5081L6768N8803J32170K50919L33983
14494F9630K73164P0773j45592j87898k05297l48430m77702m68238l09337j43889
14484a872816q8870J7148J78554K11444Q2023q3588j27461o6003O1131J88915
14474a499523J97547M5135k05212k93927j53217N4320K94502M40984L55908J65996
14464e97487M0914M978o2394j42240j48486r9470p0494n7620N4788J44410P8069
14453h55032j2869L0468J68048K24653K04065J21857k2891j70325k30146k06916
14443g49088j53930q3777n906Q2781J66049K30981J90249P8832l5643j14266j46227
14432e39945j72708j64754j32925n9618Q0398R1317q5161j91832j23542k6177
$$ y = [-758030, -683806, -641114, -655195, -725939, -768094, -743013, -706245, -647442, -515272, -264353, 69630, 342794, 413567, 267975, 80077, -125220, -473650, -951352, -1419590, -1728927, -1872816, -1961686, -1944538, -1765984, -1554540, -1472517, -1556105, -1683566, -1749569, -1688438, -1499523, -1301976, -1256841, -1462053, -1755980, -1909197, -1854877, -1560375, -1119391, -763483, -597487, -556573, -551595, -613989, -756229, -904715, -1004185, -1074679, -1132299, -1077511, -933101, -855032, -867901, -837433, -669385, -444732, -240667, -118810, -141701, -312026, -542172, -749088, -903018, -986795, -992701, -909920, -743871, -512890, -322641, -243809, -279452, -393718, -539945, -712653, -877407, -1010332, -1069950, -989552, -898235, -983396, -1175228, -1298770, -1324947]
14422a324947O3776K15552L83854M67798M62055L82241J93268m7562j93597j96781
14412D05657n4949J58888K50799J22787j43605k56724j30742k1093r1673j82207
14402E7138j10475J3096M9258N8010J83371L44417L50740K19208J31770N9208
14392A355741r5323k21703l43295n66522p16416o28173m05815j96565n4507J01218
14382a771360K50272L31487L16507K73229K82236L03598K81717J92977K8607j25126
14372C64144k08434l17776l91054k72609q409K09538K96418K75397K31385J77822
14362C56422O1536j30328k62979k45882o7069J70428K91433L23948K52309Q9643
14352H39461l0952p3754j47567k59885l03818k07422J5749O7787j63264k81683
$$ y = [-1324947, -1261171, -1045619, -661765, -193967, 268088, 650329, 843597, 796035, 602438, 405657, 350708, 509596, 760395, 883182, 739577, 482853, 352111, 331018, 239345, 57138, -53337, -40241, 9017, 67027, 250398, 594815, 945555, 1164763, 1296533, 1355741, 1260418, 1038715, 695420, 128898, -587518, -1215691, -1621506, -1818071, -1872578, -1771360, -1521088, -1189601, -873094, -599865, -317629, -14031, 267686, 460663, 489270, 364144, 155710, -162066, -553120, -825729, -834138, -624600, -328182, -52785, 178600, 356422, 417958, 287630, 24651, -221231, -288300, -117872, 173561, 497509, 749818, 839461, 808509, 734755, 587188, 327303, 23485, -183937, -168188, -100401, -263665, -545348]
14342e45348r1431J32656J25003K7259L5554J21173J97281K01791P8056j03730
14332A78264k63304k99068j69143M5056K08279K63637L44242M49589M47353L46322
14322A551227P6026k39946l52328l17469k87087k65382j44370q0097j75939k53222
14312d88587j67236L3950J98326J48464J7016m7247j51458k75282l07019k79714
14302a318787k10610n5816J44893J40645m8859q8505K1823Q7011J65411K84054
14292h78740K74256J23813K2410R805n8137k05915k37502j06364k5519j5062J21510
14281i75445K67962J97765M5634L8720J71495K64021K18182J8085k76687n07801
14271e38069n40356l68235j36566R2545K53259L10033K85973K22814R6937p8900
$$ y = [-545348, -636779, -504123, -379120, -351861, -316307, -195134, 2147, 203938, 281994, 178264, -85040, -384108, -553251, -508195, -299916, -36279, 307963, 757552, 1204905, 1551227, 1627253, 1387307, 1034979, 717510, 430423, 165041, 20671, -59426, -235365, -488587, -655823, -621873, -423547, -275083, -258067, -305314, -456772, -732054, -1039073, -1318787, -1529397, -1585213, -1440320, -1299675, -1348534, -1437039, -1415216, -1328205, -1162794, -878740, -604484, -480671, -458261, -448456, -506593, -712508, -950010, -1056374, -1081893, -1096955, -975445, -707483, -509718, -464084, -425364, -253869, 10152, 228334, 246419, -30268, -538069, -1078425, -1446660, -1583226, -1490681, -1237422, -927389, -641416, -418602, -321665, -400565]
14261d00565j78053k02261j91140j94074j57939q5696r7987k06437k30691m0461
14251a985304K10013L53815L32375K44933K10843J91365J35705L1595l1048p1532
14241c77240o0753L6452J36227K02920J64339j5653j46283j18640k9897J15336
14231i3192K78916K95493J43318n3577j90049k64894k70585k20415j85061k19557
14221g79603k97265k95708k23508j31842l7Q0014J00688J18847J19221J56720
14211a152473K43744L28658M36427M91930L67155K47007J77281O2305j22530l87848
14201F91656n28384m61001l07695j84662j76650p1173J81389L35252L02598P1776
14191a46894j98858k27468p5922K6075k2032j44618j26068M1957K08382K42891
$$ y = [-400565, -578618, -780879, -972019, -1166093, -1324032, -1409728, -1507715, -1714152, -1944843, -1985304, -1775291, -1421476, -1089101, -844168, -633325, -441960, -306255, -274660, -305708, -377240, -437993, -401541, -265314, -62394, 101945, 86292, -59991, -178631, -208528, -93192, 185724, 481217, 624535, 570958, 380909, 116015, -154570, -374985, -560046, -779603, -1076868, -1372576, -1596084, -1727926, -1727963, -1647949, -1547261, -1428414, -1309193, -1152473, -908729, -580071, -143644, 348286, 715441, 962448, 1139729, 1202034, 1079504, 691656, 163272, -297729, -605424, -790086, -966736, -1037909, -856520, -521268, -218670, -146894, -345752, -573220, -649142, -623067, -645099, -789717, -915785, -873828, -665446, -422555]
14181d22555O6339j80560k35713j66757k20398l08296k61348j38673L9472K30911
14171a597578K98736K16896J19568O4503L5266J02631K90056M71609M45559K31175
14161F78421k0103k46477l66766k96571j26990Q2539K88847L91730L99040L20407
14151A104077J78492q815j53814j69457j36719j87251j44467Q0452P8814j52344
14141D88968k58626j47586m688k0029n7473j0654O1703J30676J42596O6547j7153
14130C74281j20180l08855m33308m18791l74063k94540j03845J23760L30857L97380
14120h27304K60403J36820J15648J41445J59621J59061R8581l8331q2589L795
14110A27150J07399J76581J54231J15183J03812K3103j05301j17504L6650J16589
$$ y = [-422555, -356216, -536776, -772489, -939246, -1159644, -1467940, -1729288, -1867961, -1828489, -1597578, -1298842, -1081946, -962378, -897875, -862609, -759978, -469922, 1687, 447246, 678421, 658318, 411841, 45075, -251496, -378486, -295947, -7100, 384630, 783670, 1104077, 1282569, 1273754, 1119940, 950483, 813764, 626513, 482046, 562498, 641312, 488968, 230342, 82756, 78068, 58039, 566, -10088, 51615, 182291, 324887, 391434, 374281, 254101, -54754, -488062, -906853, -1280916, -1575456, -1679301, -1555541, -1224684, -827304, -566901, -430081, -314433, -172988, -13367, 145694, 244275, 205944, 123355, 127150, 234549, 411130, 565361, 680544, 784356, 807459, 702158, 584654, 621304, 737893]
14100G37893j2912j20521j27740j01086l7172r930o4544n8655k5370n0401j77807
14089d8245l07088k39922n1642Q0676J43415K55741M39360N84623N06626J87919
14079A551463l6028p8789p1757q815N4063M554j35952k70083k40999j3981J51136
14068I04812J58163J48928L8487j46865j66262m8611P0107P0468k7016j02024
14058I00187j82925k36731r1963J31697K08759Q1787p3795n8604Q7729J44530
14048I10671N4253n1544j20416j92479k12543j13213m5579j38505j65459r6633
14038a71447j39957k28150j20101J40392L05515K03932l7699j86328j69487k6457
14028d29787K22082L77315K59746L5872j8161N5839L0990j58254l13825l16439
$$ y = [737893, 724981, 604460, 476720, 375634, 338462, 328532, 263988, 205333, 179963, 129562, -48245, -355333, -595255, -646897, -566221, -422806, -167065, 272295, 856918, 1363544, 1551463, 1515435, 1436646, 1364889, 1356074, 1410137, 1414691, 1278739, 1008656, 767657, 753676, 904812, 1062975, 1211903, 1250390, 1103525, 937263, 888652, 958759, 1029227, 1002211, 900187, 717262, 480531, 388568, 520265, 729024, 810811, 737016, 678412, 766141, 910671, 964924, 913380, 792964, 600485, 387942, 274729, 229150, 90645, -74814, -171447, -311404, -539554, -659655, -519263, -213748, -9816, -47515, -233843, -403330, -429787, -207705, 169610, 429356, 465228, 447067, 502906, 533896, 375642, 61817, -254622]
14018b54622k87321k32132k6667J78063K09623J66731J01819P5174J78339K07471
14008C16478K2165j90272l44155k97875N2100L71216L64554J25189j31761l16432
13998b8793l86662k84185p4039J07978J96724J99237J42557K8114j39139k93784
13988e31992l92236l09014q1810M4791K4460J5327L1048k5771j65071k77975k72073
13977a940316j50683J02477L68174M31904K76162j2583k24158k10337p2989N3222
13967a379127J7114j24032o7728J44939K77561K82356J88526O7156l7346j48167
13957g78748j95690j69427j24813m3835N7757J44867J76835J26384O6326R8141
13947f42203J58157J38533R1160O4167M2839J03950K09970K18277J71792Q0273
$$ y = [-254622, -541943, -774075, -800742, -622679, -413056, -246325, -144506, -69332, 109007, 316478, 338643, 148371, -195784, -493659, -441559, -70343, 294211, 419400, 287639, -28793, -415455, -699640, -773679, -665701, -468977, -269740, -127183, -99069, -238208, -531992, -924228, -1233242, -1315052, -1270261, -1245801, -1230474, -1199426, -1225197, -1390268, -1668243, -1940316, -2090999, -1988522, -1620348, -1188444, -912282, -924865, -1149023, -1359360, -1432349, -1379127, -1362013, -1486045, -1553773, -1408834, -1131273, -848917, -660391, -593235, -630581, -778748, -974438, -1143865, -1268678, -1312513, -1254756, -1109889, -933054, -806670, -740344, -642203, -484046, -345513, -254353, -190186, -147347, -43397, 166573, 384850, 556642, 636915]
13937F36915j36953l13667k57585l4747J73361K60132K04283N7507l0846j3259
13927E45141M0436k6531j39936j29339p55J05229Q5482r1252k52354k17377m0749
13916a22005J23680K54349L54979M01405L67304J66315j12758k29033j62349k7209
13906A014678R3809J50246M6524k47245m64999l69623r0123P0395M9777k8754
13896B24685m5919m0202j10682j47195j27133j07935p9068o4071o5385j15552
13886f78457k50816l05997j80709J8222J81364K89745L23614L03125K76766K51693
13876B28550K33200K18594J66046R5787K1471r4049k45784k74471j18458J69172
13866D00058L90335L60310J49019p5103j73269k13528k80120l14961k92488k23089
$$ y = [636915, 499962, 186295, -71290, -106037, 67324, 327456, 531739, 589246, 558400, 545141, 585577, 559046, 419110, 289771, 289016, 394245, 479727, 388475, 136121, -81256, -122005, 1675, 256024, 611003, 1012408, 1379712, 1546027, 1433269, 1204236, 1041887, 1014678, 1108487, 1258733, 1305257, 1058012, 593013, 223390, 133267, 203662, 253439, 224685, 178766, 138564, 27882, -119313, -246446, -354381, -433449, -497520, -562905, -678457, -929273, -1235270, -1415979, -1397757, -1216393, -926648, -603034, -299909, -23143, 228550, 461750, 680344, 846390, 942177, 963648, 869599, 623815, 349344, 230886, 400058, 790393, 1150703, 1299722, 1224619, 1051350, 837822, 557702, 242741, -49747, -272836]
13856b72836j13048O2003J34828o5936l52549m38758k78809q0614L893J0773R2440
13845a298613K60247K78319J37765n736j09473j07069q1149j00681m6506O3851
13835a009045O2678M4857J10633J16405L9025p3258k14008k51095j96627p9912
13825a450347O7019J95989K93538K46058O6659p3962j07881j78431k82360m03247
13815a626965m63194k46191L7636J21489R2192J77171L71861M45643L39698K16427
13805e34233J69773J80977J23178J8075M337R1399K33801L18451K94188K17579
13795A117525Q2206p3208j47871j73272k26932k53139j61632J5646J80064K48275
13785F07662K12465K21994K57673K03095P9504l5820q8265q0462j10407j51967
$$ y = [-272836, -385884, -323881, -189053, -254989, -607538, -1046296, -1325105, -1405719, -1401826, -1391053, -1298613, -1038366, -760047, -622282, -628018, -737491, -844560, -925709, -1026390, -1072896, -1009045, -946367, -901510, -790877, -674472, -635447, -708705, -922713, -1173808, -1370435, -1450347, -1383328, -1187339, -893801, -647743, -581084, -655046, -762927, -941358, -1223718, -1626965, -2090159, -2336350, -2298714, -2177225, -2085033, -1907862, -1536001, -1090358, -750660, -534233, -364460, -183483, -60305, -42230, -37893, 53506, 287307, 605758, 899946, 1117525, 1199731, 1126523, 978652, 805380, 578448, 325309, 163677, 179323, 359387, 607662, 820127, 1042121, 1299794, 1502889, 1582393, 1546573, 1458308, 1377846, 1267439, 1115472]
13775A115472j56555j87201k04541j60444l4132p465j82711l84141m03002l11428
13765i16148j97741m6970K7069N0427J05617J43552J90896K64063K02142M238
13755a72855j40199k25898l36656l89349k97238j32329k6342M2513K1209n8178
13745a715322k991J58553K18390J02182n6402j41135j12370M4660K57499L00098
13735i46838L02177M94617N73538L92497K26568K36126K26052M7204j42433k14297
13725A195211j88564j32778j30490j20259N899J37298O8188j76875m16563m26708
13715a85641j71918M7056L0908m5359l4558j3579M4354J26888J94040L33216M53955
13704G79362L96719K12403L0453r9385j03082o3889j70666k78095k24021j23044
$$ y = [1115472, 958917, 771716, 567175, 406731, 372599, 365134, 182423, -201718, -604720, -916148, -1113889, -1160859, -1133790, -1083363, -977746, -834194, -643298, -379235, -177093, -172855, -313054, -538952, -875608, -1264957, -1562195, -1694524, -1720866, -1678353, -1657144, -1715322, -1718313, -1559760, -1341370, -1239188, -1295590, -1436725, -1549095, -1504435, -1246936, -946838, -644661, -150044, 423494, 815991, 1042559, 1278685, 1504737, 1551941, 1409508, 1195211, 1006647, 873869, 743379, 623120, 629019, 766317, 834505, 657630, 241067, -185641, -357559, -310503, -279595, -324954, -359512, -373091, -328737, -201849, -7809, 325407, 779362, 1176081, 1388484, 1418937, 1319552, 1216470, 1152581, 981915, 703820, 479799, 356755]
13694C56755j21508k18129k54706k14764k06213j66336q4652J9085K24433L42800
13684c23235K66558K06913J88669J10369O600j16225k06774j70611r6711j49151
13674b83598k51767k39941j59885j21189l8725Q0909K18830L72508K96919L4922
13664i1017k4948R2581Q9694n793K5600J17456R0227L3105m8874j65415j35361
13653b2745L8131J38541J27561J58297J95677J65388J62333K23694J88489O1037
13643A436403n3955j87178l01119l58937l41873k82192k10560n0520R4595J17379
13633a37957M2046r2364j59166l0277K50356L93950J93362j16440k36424j85929
13623g8843r5107J07569K88750L00963J48332j17324l53764m62909m17910k02822
$$ y = [356755, 235247, 17118, -237588, -452352, -658565, -824901, -909553, -890468, -666035, -323235, -56677, 150236, 338905, 449274, 455874, 339649, 132875, -37736, -134447, -283598, -535365, -775306, -935191, -1056380, -1095105, -1014196, -795366, -422858, -125939, -91017, -115965, -23384, 66310, 60517, 86117, 203573, 293800, 326905, 278031, 112616, -22745, 15386, 153927, 281488, 439785, 635462, 800850, 963183, 1186877, 1375366, 1436403, 1382448, 1195270, 894151, 535214, 193341, -88851, -299411, -349931, -255336, -137957, -95911, -188275, -347441, -377718, -127362, 266588, 459950, 343510, 107086, -78843, -173950, -66381, 222369, 523332, 671664, 554340, 200576, -262333, -680243, -883065]
13613h83065K7124J75797L20540M10203L43020J91129R6859J3058j51963k53354
13603B89348k20028j40776l2338P1067J49099J89214J71818Q1050l4979j8332
13593E05143O0348M0028K4634O0634P3413K5413j1942N498O5808M2423j37771
13582G53629k93012k35860q4224L7233P5312J8678k3950p1242r4468l9891k9046
13571A3159n4030j52404k84649k02009J08678K93436K49509K52512L06944K20593
13561G51739L2748q1385l7304m3528j62321k81460l37434k12426L8256J09868
13551b23247l5151j92062k12099j34304J2395J90775K50611J33295n0547j90062
13541d50396k97038l70943l05660p8579J21588J67582J83773J70244P2231J0801
$$ y = [-883065, -855941, -680144, -359604, 50599, 393619, 584748, 681607, 694665, 542702, 289348, 69320, -71456, -103794, -32727, 116372, 305586, 477404, 558454, 523475, 505143, 565491, 605519, 630153, 690787, 764200, 789613, 777671, 783169, 848977, 891400, 753629, 460617, 224757, 140533, 177766, 253078, 271756, 247806, 176564, 82096, 42205, 13159, -40871, -193275, -477924, -679933, -571255, -277819, -28310, 224202, 531146, 751739, 784487, 703102, 665798, 622270, 459949, 178489, -158945, -371371, -333115, -223247, -258398, -450460, -662559, -796863, -784468, -593693, -343082, -209787, -260334, -450396, -747434, -1118377, -1424037, -1502616, -1381028, -1213446, -1029673, -859429, -787198, -776397]
13531g76397L9279O8828L8116k4135J1606J26834J32727N8672L778k0755k0959
13520c62406M592L7605L7268Q3374J85486K96134L39604K41343O6093n7948j22533
13509G48612j51939r3376O0439J27932o4832l15672l05014n0888J83344K17971
13499C56577J55967R9343J10775J58390R4412k3281m4081j422l7400j33283j60231
13488E75766k00347k88013l62142l45451j44000R7124K46172L37257K64002J01172
13478B81540Q1142J53807J60070J04885Q7726J26691K28248L22468K56831Q8461
13468A891869j08258k97262l71849l79671l93531l42009j95064p3358l745N1777
13458b21101O6239M2048Q218J092m7046j71248k84823m03317m65041l44828p3191
$$ y = [-776397, -737118, -668290, -630174, -654309, -642703, -515869, -383142, -324470, -320692, -341447, -362406, -357814, -320209, -282941, -199567, -14081, 282053, 621657, 863000, 929093, 871145, 748612, 596673, 503297, 563736, 691668, 626836, 311164, 6150, -44738, 138606, 356577, 512544, 611887, 722662, 881052, 975464, 952183, 908102, 906680, 869280, 735997, 575766, 375419, 87406, -274736, -620187, -764187, -667063, -420891, -83634, 180368, 281540, 362682, 516489, 676559, 781444, 869170, 995861, 1224109, 1546577, 1803408, 1891869, 1783611, 1486349, 1114500, 734829, 341298, -711, -195775, -269133, -272878, -221101, -154862, -112814, -104596, -103504, -150550, -321798, -606621, -1009938, -1474979, -1819807, -1892998]
13447a892998J54293J41361k5412o2456J04138L09377L69090L64621L90367L60658
13437B13039K83259J46427m4575j01885l2179o1479j85987j96253j14023j33363
13427b27019k19984j92605p5497j0059m2819K7791K59940M54898M28406J96547
13417E99599l5730j51739j81753j21218P5678K85893K67563j8006k80910k95179
13407A44198k13092j42279o6939L728J47449K89683K55296J54309N2852j20076
13397E05129l23237l80285k18276M7943K98724M70649N44295N43644L94329R4408
13387A977323r1891j72186k82314l21905l25238l88435l80011j98685k3080J00918
13377a05504K63030M75430N51335M50455L15429J71083Q1410L1491j66302l60505
$$ y = [-1892998, -1738705, -1597344, -1622756, -1685212, -1581074, -1271697, -902607, -537986, -147619, 213039, 496298, 642725, 598150, 496265, 464086, 402607, 216620, 20367, -93656, -227019, -447003, -639608, -715105, -725164, -767983, -740192, -480252, -25354, 403052, 599599, 563869, 412130, 230377, 109159, 184837, 470730, 738293, 720287, 439377, 144198, -68894, -211173, -278112, -274384, -126935, 162748, 418044, 572353, 625205, 505129, 181892, -198393, -416669, -368726, -70002, 400647, 944942, 1488586, 1882915, 1977323, 1885432, 1713246, 1430932, 1109027, 783789, 395354, 15343, -183342, -206422, -105504, 157526, 632956, 1184291, 1634746, 1950175, 2121258, 2202668, 2234159, 2067857, 1707352]
13367A707352l15559j41622m613P2597J53642K96916L35273J36704j08854k69626
13357A862210l99073m70173l76315j63657J0828J02182J69105J92927Q6108j31907
13347H82235j89509J4321K52655M29101M98200L74428P2568j90809k59722j61397
13337A722071l6106m0668j12268j31392j72687k28597k35832k21770j52061k9722
13327C60968J08050K01501K60060K42068J87915J67273J35908J7414j80345k57125
13317A243687j13422K1917l2743j18390j55377j48271j22432j35731j58262l8036
13307B42940K00315L22295J83799r5083l10505l81345k66610o4002J78687M34654
13297D45145N61619N61775N28847L73549J50331j13574k72187j43365L2796l35
$$ y = [1707352, 1391793, 1250171, 1245558, 1318155, 1471797, 1768713, 2103986, 2240690, 2131836, 1862210, 1463137, 992964, 616649, 452992, 463820, 566002, 735107, 928034, 1014142, 882235, 692726, 707047, 959702, 1388803, 1887003, 2261431, 2333999, 2143190, 1883468, 1722071, 1685965, 1645297, 1533029, 1401637, 1228950, 1000353, 764521, 542751, 390690, 360968, 469018, 670519, 930579, 1172647, 1360562, 1527835, 1663743, 1681157, 1500812, 1243687, 1130265, 1152182, 1119439, 1001049, 845672, 697401, 574969, 439238, 280976, 242940, 443255, 765550, 949349, 854266, 543761, 162416, -104194, -168196, 10491, 445145, 1006764, 1568539, 2097386, 2470935, 2621266, 2507692, 2235505, 2092140, 2124936, 2124601]
13287B124601j96690m50887n74332n00051l20078j78874j43908j49840j32612
13278e22671o2844j670n0849q5202j0360P6528J50992K94484M02569M06707M17815
13267A015499L91468K59682j44k88360m91435n04642k80624l9062M1150L7182
13257A40714K6978n3707r4557N7533K72674K72217P5587o3601m2747J12794K73532
13246I77417L07714J87801K7278j17856k41836l07448k59425j30334L2866J87468
13236F63645L23193M15410M56603N12621M41159J83166J467k5538j03533k54350
13226B613843l55342l25615k30641j18444J3431N5931J265j03983k09587k17584
13216A123274k02292k06604j38516j7939R4200K27033L17316K60508K21602K84314
$$ y = [2124601, 1927911, 1477024, 902692, 402641, 82563, -96311, -240219, -390059, -522671, -585515, -587185, -638034, -723236, -733596, -657068, -506076, -211592, 190977, 597684, 1015499, 1406967, 1666649, 1666505, 1378145, 886710, 382068, 101444, 62382, 103532, 140714, 167692, 113985, 19428, 76961, 349635, 621852, 697439, 633838, 591091, 703885, 977417, 1285131, 1472932, 1500210, 1382354, 1140518, 833070, 573645, 443311, 476177, 663645, 986838, 1402248, 1858851, 2371472, 2812631, 2995797, 2997264, 2971726, 2868193, 2613843, 2258501, 1932886, 1702245, 1583801, 1597232, 1653163, 1654428, 1550445, 1340858, 1123274, 920982, 714378, 575862, 557923, 652123, 879156, 1196472, 1456980, 1678582, 1962896]
13206A962896K98058J90745P0648L5504J5036m8612q3250j9609J24583J82612
13196B728611O1754r0332j57735j40501j18738j71758k23771k07072j98290k64904
13186A217264k55333r3514P3669J89509K26260K26934K17383J81771K03196K43032
13176B430171J16666j34105k20959m5371J61467J53542L2352k4575m4495o7525
13166B357168j0681J31983L23233M54225L60143J16151o2055r2241q7645j04500
13156C385781j83924l34511m79328n24521l70284j60764j540K04424M37583N03518
13146B476434L13589J27598O5777n6076j90809k55965k55347j77661k1198Q7820
13136B114162J51792J66454L4427j81653k62207j22159Q6145K47980L68198M71118
$$ y = [1962896, 2260954, 2451699, 2522347, 2557851, 2572887, 2524275, 2441025, 2421416, 2545999, 2728611, 2790365, 2700033, 2542298, 2401797, 2283059, 2111301, 1887530, 1680458, 1482168, 1217264, 961931, 868417, 942086, 1131595, 1357855, 1584789, 1802172, 1983943, 2187139, 2430171, 2546837, 2412732, 2191773, 2146402, 2307869, 2461411, 2493763, 2469188, 2424693, 2357168, 2346487, 2478470, 2801703, 3255928, 3616071, 3732222, 3670167, 3577926, 3490281, 3385781, 3201857, 2867346, 2388018, 1863497, 1493213, 1332449, 1330909, 1535333, 1972916, 2476434, 2790023, 2917621, 2983398, 2927322, 2736513, 2480548, 2225201, 2047540, 2026342, 2114162, 2265954, 2432408, 2466835, 2285182, 2022975, 1900816, 1986961, 2234941, 2603139, 3074257]
13126C074257M59671L42885K50229K69513L16813L24295K37326J20961k3754k34362
13116E137834l81113l40148j43604j1935n5285l7691J32522K68482K95839K66439
13106E131340J36812l8824j00448o0610K4374J62583K87247K99653J78375p0402
13096E950100l35128l67173j37668Q4518J53530J79988L08424L60775K06270n5170
13086F348466j76938J1921L04150N10125O27220P18935Q71345J018647R90693
13077A1224564P96922N54446M34578M50918M44785M09925M07983M55251N72261
13068A5751633P92012J018725J090219J024093R05775Q54637R97492J271545J532066
13059B5238197J673047J735775J806726K094695K448039K570877K539007K511080
$$ y = [3074257, 3533928, 3876813, 4127042, 4396555, 4713368, 5037663, 5274989, 5395950, 5372196, 5137834, 4756721, 4416573, 4272969, 4261034, 4205749, 4168058, 4300580, 4569062, 4864901, 5131340, 5268152, 5229328, 5128880, 5068270, 5092644, 5255227, 5542474, 5842127, 6020502, 5950100, 5614972, 5247799, 5110131, 5194649, 5348179, 5528167, 5836591, 6197366, 6403636, 6348466, 6171528, 6183449, 6487599, 6997724, 7624944, 8343879, 9215224, 10233871, 11224564, 12021486, 12575932, 13010510, 13461428, 13906213, 14316138, 14724121, 15179372, 15751633, 16543645, 17562370, 18652589, 19676682, 20582457, 21437094, 22434586, 23706131, 25238197, 26911244, 28647019, 30453745, 32548440, 34996479, 37567356, 40106363, 42617443]
13051D2617443K681923L128700L657556M136428M700457N370890N995309O544393
13043G8833099P131917P777033Q554757R544149J0660733J1993748J3704745J5843371
13035A64043552J8351303K1008953K3621860K5617864K5695767K2571059J5843904
13028C16754262O256069m825962j5853514k5027958l0545880l1790999k9728029
13021A85237989k5919391k1740502j8005490j4842004j2287740j0379102q913955
13014G3149805p621843o318715n207528m409794l690133l081495k800333k758880
13006C7261084k621586k272245j932002j697955j478970j308954j115109p61099
12998B4073164m33543k64625k65660l15471k54842j58508j42053j07333n65R7992
$$ y = [42617443, 45299366, 48428066, 52085622, 56222050, 60922507, 66293397, 72288706, 78833099, 85965016, 93742049, 102296806, 111840955, 122501688, 134495436, 148200181, 164043552, 182394855, 203403808, 227025668, 252643532, 278339299, 300910358, 316754262, 323010331, 318184369, 302330855, 277302897, 246757017, 214966018, 185237989, 159318598, 137578096, 119572606, 104730602, 92442862, 82063760, 73149805, 65527962, 59209247, 54001719, 49591925, 45901792, 42820297, 40019964, 37261084, 34639498, 32367253, 30435251, 28737296, 27258326, 25949372, 24834263, 24073164, 23639621, 23374996, 23109336, 22793865, 22539023, 22380515, 22238462, 22131129, 22130564, 22228556]
12988B2228556J64424K37708L51950M90529O10331O42310M99286L08205L57844
12979B5891143O21691Q93087J119833J408363J769590K078312K296929K570687
12971C8649635K918878L113447K981847K593836K209696J920598J670410J525867
12963E7584214J556190J777176K179461K817878L689583M680197N673129O517202
12955H6475030P301857Q234435R179754J0033594J1015971J2366476J4206320
12948A58813437J6535170J9260302K2323634K5218735K6753994K5627382K1044028
12941C15576682J2955849K233713r687659k0928255k9379734l3373370l2782246
12934B04614980k9372760k5041602k0797202j7123901j4091140j1553905r552742
$$ y = [22228556, 22392980, 22630688, 22982638, 23473167, 24083498, 24725808, 25225094, 25533299, 25891143, 26512834, 27405921, 28525754, 29934117, 31703707, 33782019, 36078948, 38649635, 41568513, 44681960, 47663807, 50257643, 52467339, 54387937, 56058347, 57584214, 59140404, 60917580, 63097041, 65914919, 69604502, 74284699, 79957828, 86475030, 93776887, 102011322, 111191076, 121224670, 132240641, 144607117, 158813437, 175348607, 194608909, 216932543, 242151278, 268905272, 294532654, 315576682, 328532531, 330766244, 321078585, 300150330, 270770596, 237397226, 204614980, 175242220, 150200618, 129403416, 112279515, 98188375, 86634470, 77081728]
12927G7081728q028591o839011n910238n116166m308315l568044l050813k657381
12919C7603169k368397k188448k001155j774897j579081j448696j207568q64397
12911B4170530o46328o03790n86153n08417l53724j72661n4099o7331k48454m82249
12901B0447324n31185l64756k13967r8346L3936O3826M8341J36807L83102P18768
12891B0623850J024511J158114J103534R65582R40846J122991J375050J454344
12883B9768822J428837J496472J676404J908685K165279K414820K674663L027632
12875D6561614L427685L898203M448466M935331N310494N709538O231249O906477
12867H7429057P637398Q298965R044994J0175796J1652860J3364149J5381935
$$ y = [77081728, 69053137, 62214126, 56303888, 51187722, 46879407, 43311363, 40260550, 37603169, 35234772, 33046324, 31045169, 29270272, 27691191, 26242495, 25034927, 24170530, 23524202, 22920412, 22334259, 21825842, 21472118, 21299457, 21245358, 21178027, 20929573, 20447324, 19916139, 19551383, 19337416, 19239070, 19273006, 19336832, 19385173, 19521980, 19905082, 20623850, 21648361, 22806475, 23910009, 24875591, 25816437, 26939428, 28314478, 29768822, 31197659, 32694131, 34370535, 36279220, 38444499, 40859319, 43533982, 46561614, 49989299, 53887502, 58335968, 63271299, 68581793, 74291331, 80522580, 87429057, 95066455, 103365420, 112410414, 122586210, 134239070, 147603219, 162985154]
12860A62985154J7728365K0396427K3131785K5223882K5701183K3451487J7626541
12853C16244824Q360563l071757j4677537k4372226l0491999l2469084l0944408
12846A88578376k7240340k2878328j8901505j5652130j2958033j0653077q868656
12839G1426307p614828o630275n711388m874108m165965l596894l197848k879284
12831C2755717k476421k103760j951023j965779j899418j702822j532250j324163
12823A7800081j097803r93665r96198j006734r42194p73905o97200p53606p35134
12814I803642n19301j98966p4467j84882l04243l41477l60129l54853l26857k75191
12804F863276j61010m2158o6619k69198l85874k56003j53491k17611k69708k48110
$$ y = [162985154, 180713519, 201109946, 224241731, 249465613, 275166796, 298618283, 316244824, 324605387, 321533630, 306856093, 282483867, 251991868, 219522784, 188578376, 161338036, 138459708, 119558203, 103906073, 90948040, 80294963, 71426307, 63811479, 57181204, 51469816, 46595708, 42429743, 38832849, 35635001, 32755717, 30279296, 28175536, 26224513, 24258734, 22359316, 20656494, 19124244, 17800081, 16702278, 15708613, 14712415, 13705681, 12763487, 11989582, 11292382, 10538776, 9803642, 9284341, 9085375, 9010908, 8826026, 8521783, 8180306, 7820177, 7465324, 7138467, 6863276, 6702266, 6660108, 6593489, 6324291, 5938417, 5682414, 5528923, 5311312, 5041604, 4793494]
12794D793494k23016j97775j90994j25510k0909Q0387J71729P7652k15938m54870
12784C694250n58210n96259n65506l58877L085K23309J82156O5089J9158Q1480
12774B189675K06106K22318R4954o0144k32989k90374q4256J40114J21821L0719
12764B337944j8021q7648m3666J92719M82739N67059L04513j9439q8342j1011
12754C616847L9956m0649j93726k20112j64720k13733k93785k29152j66378k50080
12744A884468l77326l95664k56050q4999K6077P0201J17736K02212J88004P6921
12734A451580j3094r2582r6880K8291P5599k8822j71208l10412k61616k2005J83902
12723G42753K12422J56849Q5457l1332j32123n4907Q6539J58380J75174R9603
$$ y = [4793494, 4570478, 4372703, 4181709, 4056199, 4035290, 4115677, 4287406, 4365058, 4149120, 3694250, 3136040, 2539781, 1974275, 1615398, 1618483, 1841792, 2023948, 2089037, 2108195, 2189675, 2395781, 2618099, 2713053, 2652909, 2419920, 2129546, 2045290, 2185404, 2307225, 2337944, 2319923, 2232275, 2188609, 2381328, 2864067, 3431126, 3735639, 3716200, 3627858, 3616847, 3656803, 3616154, 3422428, 3202316, 3037596, 2823863, 2530078, 2300926, 2134548, 1884468, 1507142, 1111478, 855428, 770429, 796506, 866707, 984443, 1186655, 1374659, 1451580, 1438486, 1345904, 1249024, 1277315, 1352914, 1324092, 1152884, 842472, 580856, 558851, 742753, 955175, 1112024, 1197481, 1166149, 1034026, 979119, 1065658, 1224038, 1399212, 1498815]
12713A498815j2386o2705q1025j1535J51396J68296M6495k0277o0572j99449m36414
12702I80639n18976k51022J49269L20638J72605m4182j52239j44534k5301J52227
12692F39124K02378J21752J9537p2181j13643j48274j52501j26212j76237k11229
12682a7486n5203J12140J49605J60614J19314N9785Q7187J91429K04814Q8044
12672A100243N0122J24987O6999j47501l50097m08005l48942l03537k85856k21843
12662g23430p7725M6867Q1178J2623P4256K90292L90067K96137J28735K1916o2143
12651D78773j46842k05611k36054j77360m5054M6708M8750O893j9095M5924J95218
12640g750K41328J16973K6356L3775j3560r9430o6503M2842J21290J10383J24260
$$ y = [1498815, 1486429, 1423724, 1342699, 1331164, 1482560, 1650856, 1697351, 1677074, 1616502, 1417053, 980639, 461663, 210641, 359910, 680548, 853153, 808971, 656732, 512198, 486897, 639124, 841502, 963254, 982791, 910610, 796967, 648693, 496192, 369980, 193743, -17486, -72689, 39451, 189056, 349670, 468984, 528769, 615956, 807385, 1012199, 1100243, 1150365, 1275352, 1342351, 1194850, 844753, 436748, 87806, -215731, -501587, -723430, -801155, -754288, -673110, -660487, -586231, -295939, 94128, 390265, 519000, 540916, 478773, 331931, 126320, -109734, -287094, -332148, -285440, -236690, -229797, -248892, -202968, -7750, 233578, 350551, 376907, 410682, 397122, 297692, 231189, 274031, 395321, 505704, 629964]
12629F29964J74041P8065j42010l06572l84163l57441j46679R7674K36911K67312
12619A47102K32388R8124q5209j44389k6065P0056N7168Q7691J86307J53973K05
12608G77351k1435J37847K51045K09241Q5083K7795J929j53906l54659m22960
12598E37331l39983k00814j42632k19055l08294k51005m4790Q6657R7931Q1025
12588g03629J31776K62442L63288L12797J92085J77328K17848J73562J68979L84757
12578A681233O45546O68337M84117J51320l06025o45381o49491l15891Q7494L34495
12568B135754L76968K25496k1417k03054k70534k62015k65859l83547m32261l00354
12558E99177m7036K04251L08036J63241j39171l85385m62374m54023m40107l18695
$$ y = [629964, 804005, 882070, 740060, 433488, 49325, -308116, -454795, -357121, -120210, 147102, 379490, 477614, 392405, 248016, 221951, 292007, 349175, 436866, 623173, 777146, 777351, 755916, 893763, 1144808, 1354049, 1439132, 1466927, 1468856, 1314950, 960291, 537331, 197348, -3466, -146098, -365153, -673447, -924452, -969242, -882585, -784654, -703629, -571853, -309411, 53877, 366674, 558759, 736087, 953935, 1127497, 1296476, 1681233, 2326779, 2995116, 3479233, 3630553, 3324528, 2679147, 2029656, 1713765, 1801259, 2135754, 2512722, 2738218, 2716801, 2513747, 2243213, 1981198, 1715339, 1331792, 899531, 599177, 552141, 756392, 1064428, 1227669, 1088498, 703113, 240739, -213284, -653391, -972086]
12548i72086m8689K14540L17126K30059J75099J92872R5697j876L4177J36767
12538C73686O0105j42806k04285j03417M5902J29853K29234M05953N28722M85616
12528A808563K11360j38348k75097j42770J5682O9625N8147O7222J81482K84651
12518B140517J87735J7021r4676k38218l48728l16772j34125M7312L9723q1543
12508A218246j23109o0820P1644K01641J86529P7418L3666J22990K45160K06616
12498B179981J7931j15274j63756k25749l53772m34724l05732m8140Q0334K2836
12488F53935j44179k97872k56462p0309P9746L4085j52194k26332p6296K15539
12478b40339M58213N23540L92102J81873P2348K3026r9018j63245j36084j21497
$$ y = [-972086, -1020775, -806235, -489109, -259050, -83951, 108921, 204618, 202742, 236919, 373686, 433791, 290985, 86700, -16717, 29185, 159038, 388272, 794225, 1322947, 1808563, 2019923, 1881575, 1606478, 1463708, 1479390, 1549015, 1607162, 1674384, 1855866, 2140517, 2328252, 2345273, 2250597, 2012379, 1663651, 1346879, 1212754, 1260066, 1299789, 1218246, 1095137, 1034317, 1105961, 1307602, 1494131, 1571549, 1605215, 1728205, 1973365, 2179981, 2197912, 2082638, 1918882, 1693133, 1339361, 904637, 598905, 550765, 631099, 653935, 509756, 211884, -44578, -114887, -35141, -1056, -153250, -379582, -455878, -240339, 217874, 741414, 1133516, 1315389, 1387737, 1410763, 1311745, 1148500, 1012416, 890919]
12468H90919q3830J8941P1948J1342q7176j48851j45742q4638k0817j9443M3300
12457D45953J78329J53523r721m4025l2601o7635p8221l8685M0291J03618N4211
12446G05037q6478k29740l56696l65575l24622k07272M9671K23989K12924M0358
12436c38404k13237l75021k52648J57984N02480O14388M86605R3040k57459k33609
12426A84119M6882K75996L15534L14113L35254L17671K04038q334j87880j98232
12416A599161j3644J33646Q2300p3096k93249n95173q43346r29721p75959m12542
12406b121623M460L01334L84880L57114K16548N4282N0923J33030J44649J0524
12396d63879k04170m01929m67341l41236j81381j27911j9753K31426L56005L38392
$$ y = [890919, 807089, 826030, 897978, 909320, 822144, 673293, 527551, 442913, 422096, 402653, 445953, 624282, 777805, 768084, 724059, 691458, 623823, 545602, 506917, 547208, 650826, 705037, 618559, 388819, 32123, -333452, -658074, -865346, -815675, -591686, -378762, -338404, -551641, -926662, -1179310, -1021326, -518846, 95542, 582147, 675187, 417728, 184119, 231001, 506997, 822531, 1136644, 1471898, 1789569, 1993607, 1985273, 1797393, 1599161, 1585517, 1719163, 1801463, 1728367, 1435118, 839945, -3401, -933122, -1709081, -2121623, -2117163, -1815829, -1430949, -1073835, -857287, -803005, -752082, -619052, -474403, -463879, -668049, -1069978, -1537319, -1878555, -2059936, -2187847, -2207600, -1976174, -1620169, -1281777]
12386a281777L47574L58857K97596K41560K79395K70635J04476m5299r2858j07449
12376C72710o4122O1279J59332Q6376j27651l38192m04178k78487J0164K87215
12366b35554L01161P8894j2555Q8524J75392J96099K07655K59260K55708J77108
12356A491692P4995k9531j7238R5049J20771j3891k20947l33632l23801l80407
12346D63060m92611m68240k70899K1863K22095K81232L60701M18791K74807k4899
12336G85900k87586l35884j32966J14739K02875J71738R8616M8059M6386J04302
12326H16179K51771L95912M78960M03076J61221m1997j35285p0410J39461K93903
12316B692791K06833j747r8977q5174N1987L21062M96429N43956O24694O87202
$$ y = [-1281777, -934203, -575346, -277750, -36190, 243205, 513840, 618316, 573017, 480159, 372710, 308588, 369867, 529199, 615575, 487924, 149732, -254446, -532933, -522769, -235554, 65607, 144501, 131946, 220470, 395862, 591961, 799616, 1058876, 1314584, 1491692, 1566687, 1537156, 1519918, 1614967, 1735738, 1721847, 1500900, 1167268, 843467, 463060, -29551, -497791, -768690, -746827, -524732, -243500, 117201, 535992, 810799, 785900, 498314, 162430, 29464, 144203, 347078, 518816, 617432, 665491, 711877, 816179, 1067950, 1463862, 1942822, 2345898, 2507119, 2465122, 2329837, 2259427, 2398888, 2692791, 2899624, 2897877, 2798900, 2713726, 2765713, 3086775, 3583204, 4127160, 4751854, 5439056]
12306E439056O74197O98460P82561Q05129Q77654J196332J671833K088407K380179
12297A6613808K716383L351842M225138N173753O198820O894187O253806L298200
12289E4725937j487460n850747p918569p781395o534418n119627l949681k977676
12281A3106364k101849j424838j007891p81651n96912m67089n24559o64639o82255
12272D854681n76999n15016n03014m24044k70720j48860n6837L0317Q1867L1034
12262B502409p7775j80855j85689j57230j66643k72334l32936k40495j87268j50180
12252E51004k4223J38503J53083lj38117k15049k43280j35065L694k2609j40628
12241g2690j64456l1326J56271K37461J77277K9567q4430n7424N4143J08436J255
$$ y = [5439056, 6113253, 6811713, 7594274, 8399403, 9277057, 10473389, 12145222, 14233629, 16613808, 19330191, 22682033, 26907171, 32080924, 38279744, 45173931, 51427737, 54725937, 53238477, 47387730, 39469161, 31687766, 25153348, 20033721, 16084040, 13106364, 11004515, 9579677, 8571786, 7790135, 7193223, 6726134, 6201575, 5536936, 4854681, 4277682, 3762666, 3259652, 2835608, 2564888, 2416028, 2359191, 2389508, 2471375, 2502409, 2424634, 2243779, 2058090, 1900860, 1734217, 1461883, 1128947, 888452, 701184, 551004, 526781, 665284, 818367, 818364, 680247, 465198, 221918, 86853, 90547, 67938, -72690, -237146, -268472, -112201, 125260, 302537, 332104, 247674, 190250, 244393, 352829, 354084]
12230C54084j22724r7131r3318j75716k39092k45805j29515J0766P0968J43379
12220e24104K71032L85281M17434M32467L76024J61714k5472j36478j76481j59292
12210A022125j61010j53183j24524n9127j8933m4558m4693J8576J67578L02232
12200I04483K92831J66711l117r6616q3512q6529j38682j96595j83150n4627P2792
12189E93989Q7770M4996l0949j04992j21225j08063r5202o1833M7425J46409Q5541
12178D83866j74719m82524m94109j90289J25741L57323N17648N55084M57868L31442
12168A487331K26268J36525k0206j58017k12978l15377m81569m90313k52016o2428
12158a42780j13261k18695j33849L8909R0718Q9045K26681M08609M11534K62381
$$ y = [354084, 231360, 134229, 40911, -134805, -373897, -619702, -749217, -738451, -667483, -524104, -253072, 132209, 549643, 982110, 1358134, 1519848, 1494376, 1357898, 1181417, 1022125, 861115, 707932, 583408, 524281, 505348, 460790, 416097, 434673, 602251, 904483, 1197314, 1364025, 1360908, 1264292, 1180780, 1094251, 955569, 758974, 575824, 521197, 593989, 681759, 726755, 695806, 590814, 469589, 361526, 266324, 204491, 251916, 398325, 483866, 309147, -173377, -667486, -857775, -732034, -374711, 142937, 698021, 1155889, 1487331, 1713599, 1850124, 1829918, 1671901, 1458923, 1143546, 661977, 171664, -80352, -142780, -256041, -474736, -608585, -569676, -478958, -389913, -163232, 245377, 656911, 919292]
12148I19292O3726j68238l08342k91060k30095k60718l81589m42019k86474P8832
12138a306685M25109N33969M44421K76553J21646P2426Q3076J07136J42322J90104
12128A090077K14078J54304m3453l55182o48167p18067n14702j01757K67410L67092
12118b88367K66804K10665J23422q1054k13453j77505m6228O3758J27413R8052
12108H3507k1273o9633K9395k2194j97826q7264K58537M05382K60579j2305l05036
12097C21869m34265l11750r0617j0253j78588l61208k89352l6363J07543O2416
12087a220568o043j6427O760K04519M95589N96109M95707K93887M2546j44112
12077G47967j17334J35653K69718J07767j15261l14918m22796l47408k06208j02686
$$ y = [919292, 983018, 814780, 506438, 215378, -14717, -275435, -657024, -1099043, -1385517, -1306685, -881576, -347607, 96814, 373367, 495013, 567439, 650515, 757651, 899973, 1090077, 1304155, 1458459, 1415006, 1059824, 411657, -306410, -821112, -922869, -655459, -288367, -21563, 189102, 312524, 231470, 18017, -159488, -205716, -141958, -14545, 83507, 62234, -7399, 21996, -198, -198024, -285288, -26751, 378631, 639210, 626905, 321869, -112396, -424146, -514763, -525016, -703604, -1064812, -1354164, -1390527, -1282984, -1220568, -1226611, -1243038, -1236278, -1031759, -536170, 59939, 555646, 849533, 892079, 747967, 630633, 766286, 1036004, 1143771, 1028510, 713592, 290796, -56612, -262820, -365506]
12067c65506j14432q6305J01781K40698K16770J79856J97570K20823J70370K9186
12057G90811n8863l7848K9897N700q5627j41111k21980k21171r2391L8361R9459
12046A05237J22701J32474J65243J59255K1457j34461j32224n6118n6791l1822
12036B94951K1085R6154K08409K67319K39908J68858J06604J06487R0783n0127
12026A550431k45465k91373j36567L163M2584O7208N1671j6222p134p163r8719
12015I12414o6540P3426K6853j76739l02982l53287l79834m09100l35565j28258
12005a139612O6664K02956L14349L47536K36017J39929J74796J67603L5837o4544
11995D81531l4395J6450o3960k22385j93672K2278K46999L73703L68831L04990
$$ y = [-365506, -479938, -566243, -464462, -223764, -6994, 172862, 370432, 591255, 761625, 790811, 731948, 694100, 723997, 729697, 644070, 502959, 280979, 59808, -32583, 5778, 105237, 227938, 360412, 525655, 684910, 706367, 571906, 439682, 383564, 326773, 294951, 316036, 412190, 620599, 887918, 1127826, 1296684, 1403288, 1509775, 1600558, 1550431, 1304966, 1013593, 877026, 880189, 922773, 989981, 1041652, 1025430, 1018296, 1011133, 912414, 845874, 919300, 946153, 769414, 466432, 113145, -266689, -675789, -1011354, -1139612, -1072948, -869992, -555643, -208107, 27910, 167839, 342635, 510238, 546075, 481531, 447136, 463586, 399626, 177241, -16431, 5847, 252846, 626549, 995380, 1300370]
11985A300370L07752M23165M50300K88851O5822j90226m53077o06982o51505n30551
11975D03919l48717l03337l04961j68353R104J59691K62565K00748J40416K32339
11965B83414L19529L38971L39884L26508K82311J59535l0415j86973j62544o7938
11955A602282q4665k12481l69998m55736m45191l83914k42499o7924K1447L1K3315
11944f15333J07333J36075J48209K34315K89627J52447o7272j84124k15908k18422
11934b33053j89048j62563j64723j19978K5650Q2442m0616j70250o8097J27334
11924i12902J70342J46143J11229Q649j5182J07520K21486K14823J00221J4796
11914A67125k5363r4136j39974j11157n6959m4721l4915K1677Q5656J92800L19679
$$ y = [1300370, 1608122, 2031287, 2481587, 2770438, 2836260, 2646034, 2192957, 1585975, 934470, 403919, 55202, -248135, -553096, -721449, -712345, -552654, -290089, -89341, 51075, 283414, 602943, 941914, 1281798, 1608306, 1890617, 2050152, 2019737, 1832764, 1670220, 1602282, 1517617, 1305136, 935138, 479402, 34211, -349703, -592202, -660126, -638679, -638648, -615333, -508000, -371925, -223716, 10599, 300226, 452673, 385401, 201277, -14631, -233053, -422101, -584664, -749387, -869365, -843715, -761273, -801889, -972139, -1040236, -912902, -742560, -596417, -485188, -476539, -491721, -384201, -162715, 52108, 152329, 167125, 141762, 47626, -92348, -203505, -260464, -305185, -340100, -318423, -232767, -39967, 279712]
11903B79712K82813J08309m7460j89243k17640l6954J75631K82905K94345J87168
11893A119586o4580l12050l27980j88330l5197P444q7380j25451o5097k4915n536
11882a09486M0392J51979K25966J46983j2013j70579k42554j07850N0146L2416
11872E400j16007l00153l27214j21939J25624K72597L19133K86890K00899J73273
11862E18503R9858l4798j39919j86003k16528l08827m05221l02369j15586q4645
11852a175535j19191j10688q4227j7579N6968R8628J30258J82531K98763M56578
11842b83494N09772L13058N979j78836k25914k22623k65518k54233o8183J30211
11832e39781J68258J2718j44902k13375k42066j62150j09338k17562l42375l72346
$$ y = [279712, 562525, 670834, 623374, 434131, 216491, 179537, 355168, 638073, 932418, 1119586, 1055006, 742956, 414976, 226646, 191449, 198893, 111513, -13938, -79035, -103950, -109486, -69094, 82885, 308851, 455834, 443821, 273242, 30688, -77162, -27016, 5400, -110607, -410760, -737974, -859913, -734289, -461692, -142559, 144331, 345230, 518503, 618361, 583563, 443644, 257641, 41113, -267714, -672935, -975304, -1090890, -1175535, -1294726, -1405414, -1489641, -1507220, -1450252, -1351624, -1221366, -1038835, -740072, -283494, 226278, 539336, 545315, 366479, 140565, -82058, -347576, -601809, -669992, -539781, -371523, -358805, -503707, -717082, -959148, -1121298, -1230636, -1448198, -1790573, -2162919]
11822b162919k86153j63099q8241m4688j3672J38753L31402L34017L33201L84044
11812a237355L57546K85358J35561r0912k33700j75929j7811J71566L90611M23417
11802H352K57895O5890m1371k8615J7638n9929k18449j93277P2077K64210K16849
11791C61270R7606J57567L16458K87487J31215L8513p9162k74991l71908k38278
11781D25777j3504J07017P1367r2509k81557m34013m25015k29637q587J28916
11771g51745J82387K31378K99490L42638L74328M11774L28371L3899k39063k61070
11761I52387j48334p7653k1387O5234Q3040o4457k10428j36481J22195L36354
11751I00470L34940K64802J87088R2143j87581o14343p81749n08074j30360J29961
$$ y = [-2162919, -2449072, -2612171, -2700412, -2745100, -2758772, -2620019, -2288617, -1954600, -1621399, -1237355, -879809, -594451, -458890, -549802, -783502, -959431, -977242, -805676, -415065, 8352, 266247, 332137, 290766, 262151, 279789, 219860, 1411, -191866, -119789, 144421, 361270, 458876, 616443, 932901, 1220388, 1351603, 1390116, 1310954, 1035963, 664055, 425777, 412273, 519290, 590657, 498148, 216591, -217422, -642437, -872074, -880661, -751745, -569358, -337980, -38490, 304148, 678476, 1090250, 1418621, 1452520, 1213457, 952387, 804053, 726400, 705013, 770247, 853287, 788830, 578402, 441921, 564116, 900470, 1235410, 1500212, 1687300, 1779443, 1591862, 977519, 195770, -312304, -442664, -312703]
11741c12703L02729J31549j85786l03768j05963J94683K88673K38051J70562R2697
11731E10724k578q5612j99023k99027k10554k547J90482K79811J96026M1785j05230
11720C14257k53336l75448m05274l45823j57551N4652J21063l7639k60101k48972
11710a594172l0751J43985K00316L02423M35893M82479M09094K27239J40657K65150
11700I82313L00911N8059k83571m67223m61792l78746k21722J893J10815J374
11690c57689j36817q0353R8516J65698J61658J46285O5020J9536J27378K15748
11680D24980K47180K56383K36372J15896o6020j83303j81935j40484j93805k93185
11670B22079l54552l56175l85479l71265k09437J4418J86133K01363J55596K20003
$$ y = [-312703, -9974, 121575, -64211, -367979, -473942, -279259, 9414, 247465, 418027, 510724, 508146, 422534, 223511, -75516, -286070, -288617, -98135, 181676, 377702, 419487, 314257, 60921, -314527, -719801, -1065624, -1223175, -1168523, -1047460, -1085099, -1345200, -1594172, -1624923, -1480938, -1280622, -978199, -542306, -59827, 349267, 576506, 717163, 982313, 1283224, 1341283, 1057712, 590489, 128697, -250049, -471771, -469878, -359063, -357689, -494506, -574859, -476343, -310645, -148987, -2702, 62318, 81854, 209232, 424980, 672160, 928543, 1164915, 1280811, 1214791, 1031488, 849553, 709069, 515264, 222079, -132473, -488648, -874127, -1245392, -1454829, -1440411, -1254278, -1052915, -897319, -677316]
11660f77316L60129L81666K31927M4107q2210k08549l32055k65378o4805O341
11650f06143k4811l2011l9439K6448J38309K50230L07795J76120L6056J7911o2269
11639A88196j36222n1083K2885l1514j33181k81879l90391l36435k24838j13692
11629a488154k3369P3093K06732L09244K27591J0669J6932K06905L43257M07203
11619B90103L72181J96936q8098k42413j39432M0606J77503J63003n6073l52664
11609C61652n43583m88722k89124j61789j54596j02086Q5409J84647M8769j19632
11599a179055j15086m3056j01437j53173n8731J42731L42452L59516K03909R183
11589e92747j53625j75657q1462j0254J116K5033J54541L17610L39375K13307
$$ y = [-677316, -317187, 64479, 296406, 340513, 258303, 49754, -282301, -547679, -612484, -606143, -630954, -662965, -702404, -675956, -537647, -287417, 20378, 196498, 232554, 250465, 188196, 51974, 891, 23776, -7738, -140919, -422798, -813189, -1149624, -1374462, -1488154, -1511523, -1438430, -1231698, -922454, -694863, -684194, -667262, -460357, -117100, 290103, 662284, 859220, 771122, 528709, 389277, 429883, 607386, 770389, 714316, 361652, -181931, -670653, -959777, -1121566, -1276162, -1378248, -1292839, -1108192, -1059423, -1179055, -1294141, -1337197, -1438634, -1591807, -1650538, -1507807, -1165355, -805839, -601930, -592747, -746372, -922029, -1003491, -1013745, -1012629, -987596, -833055, -515445, -176070, 37237]
11579C7237J68218K80169L00874J64436O8188K0330n2142q9098j02912o4049O7083
11568G98334K43490L20351J92570o9692k15848j75421q5105N780P697m4966M2345
11557A019535K00189J13262k41337n07102m97195l44784k18031j95379j37845
11548h08687m2771l2967n4155J00677L72067M88855K87963j543j49993j54950
11538D496o1957R901m9054r2475o0193o1697j15130j91127j54556j0840J68868
11527f13764L13247L01743J91044Q6366M4385j0438j23085k24623k53528j47903
11517d36556l0416n8711j05483l7057N8105R7439N3778R929M5425L2077j12880
11506d84350k40579k31171j10716M4669K14450K64352P6113j52908k21376k24296
$$ y = [37237, 205455, 485624, 786498, 950934, 1019122, 1039452, 987310, 898212, 795300, 731251, 798334, 1041824, 1362175, 1554745, 1485053, 1269205, 1093784, 1008679, 1014459, 1022156, 977190, 1019535, 1219724, 1332986, 1091649, 584547, 87352, -257432, -475463, -670842, -808687, -851458, -884425, -938580, -837903, -465836, 23019, 310982, 309439, 159446, 4496, -57461, -47560, -96614, -189089, -249282, -310979, -426109, -617236, -771792, -782632, -613764, -300517, 1226, 192270, 278636, 323021, 312583, 189498, -35125, -288653, -436556, -466972, -525683, -631166, -668223, -610118, -512679, -458901, -448972, -403547, -371470, -484350, -724929, -956100, -1066816, -1022147, -807697, -543345, -467232, -620140, -841516, -1065812]
11496a065812j88495r7476j516L4564P6510J97555L32017L51002J41390j56152
11486c76413l89252n30384m72393j47553K33457L47979K46512J95004J81200J49603
11476e62240J55940P1994l3275K2K7293j2817n7539r7199j53111k26274k64172
11465a151378k82054k81246j73801k2971m3593r0117M5544K59882L74710L00852
11455a064172J04474r7088k70659k89768p2995L2704o8505j04540n4209N0030
11445a834728K46364K70072J78198K71181M74776M52117K06385n6635k94756m75498
11435e62524n04623l24186j40399r5733j53208k18173k05681j37523l3880J15162
11425b260768L45590N91415O92398N78211L13989L3111j60386k53286k26444j37629
$$ y = [-1065812, -1254307, -1351783, -1353299, -1318735, -1242225, -1044670, -712653, -361651, -220261, -376413, -765665, -1296049, -1768442, -1915995, -1682538, -1334559, -1088047, -893043, -711843, -562240, -406300, -334306, -367581, -367559, -340266, -353083, -410622, -507821, -660932, -887206, -1151378, -1433432, -1714678, -1888479, -1911450, -1955043, -2045160, -1999616, -1739734, -1365024, -1064172, -959698, -1056786, -1327445, -1617213, -1690208, -1657504, -1726009, -1830549, -1884758, -1834728, -1588364, -1318292, -1140094, -868913, -394137, 57980, 264365, 207730, -87026, -562524, -1067147, -1391333, -1531732, -1627465, -1780673, -1998846, -2204527, -2342050, -2375930, -2260768, -1915178, -1323763, -631365, -53154, 260835, 293946, 133560, -119726, -346170, -483799]
11415d83799m6215k190o977k8890M502J47618K46588J50652o2015j71825j76355
11404d28906k63616m45792m99271l16265l7191L1734j10602j04961J22545L33984
11394a718341L65869L29531L42072L10887J88997Q8900N6701n192j7957J26082
11384F7549J97133O0042o2743o9446Q3165M10575O23373M89300J29053j67475
11374A760526l00716l32702k92058j71620l0669j8306q8381j74704k92888l34606
11364b76124k81459k29378j57083j5174J46290K14528P9821j34171k07195j20908
11354i80853l0209L0436P6918P9337J30282K51513K65209J26303r029n7394q7127
11343b04614j00116o1030q8985o8137P1202J04876K6769r9264k15523j96569q4225
$$ y = [-483799, -530014, -532204, -539181, -568071, -563569, -415951, -169363, -18711, -80726, -252551, -428906, -692522, -1138314, -1637585, -1953850, -1991041, -1959307, -2069909, -2174870, -2052325, -1718341, -1352472, -1022941, -680869, -369982, -180985, -92085, -35384, -40576, -58533, 67549, 264682, 324724, 261981, 192535, 275700, 686275, 1309648, 1798948, 1928001, 1760526, 1459810, 1127108, 835050, 663430, 632761, 614455, 526074, 351370, 58482, -276124, -557583, -786961, -944044, -959218, -812928, -598400, -518579, -652750, -859945, -980853, -1011062, -980626, -903708, -824371, -694089, -442576, -177367, -51064, -60093, -117487, -204614, -304730, -365760, -454745, -522882, -451680, -346804, -320035, -419299, -634822, -831391, -915616]
11332i15616k6518l1354k2507M2510J16525K1951p5579J1817J11018J84372K40081
11321c43300K13519Q3172r2403r7339J27341K93919L00818J46335j1021J7714
11311F38755R4481L8143m9009p5189k7582M4733n485r7386j64128k06081j19563
11300G1689M745K2612K1792K2668J8140J42140K54848J91712j6497k46455k92183
11289A95211j36153Q0086J77818J66405J43356J21719J29898J74933J48179j9826
11279A181626k65291l65592l01333k02952j29943l6202J7948J1396n8263k30669
11269c79275m15166m86732m81922l96540j47267J52198L77403M93437M41164L02306
11259e40394K29158J50598K2148l5678l7559K4914R9939Q6582Q1993Q4880R3274
$$ y = [-915616, -942134, -973488, -995995, -953485, -836960, -815009, -890588, -878771, -767753, -583381, -343300, -129781, -46609, -139012, -236351, -109010, 184909, 485727, 632062, 621041, 638755, 733236, 771379, 722370, 647181, 619599, 664332, 658847, 561461, 397333, 191252, 71689, 76434, 99046, 120838, 143506, 161646, 303786, 558634, 750346, 733849, 487394, 195211, 59058, 139144, 316962, 483367, 626723, 748442, 878340, 1053273, 1201452, 1181626, 916335, 550743, 249410, 46458, -83485, -119687, -101739, -90343, -148606, -379275, -794441, -1281173, -1763095, -2159635, -2306902, -2154704, -1777301, -1283864, -842700, -540394, -311236, -160638, -138490, -174168, -211727, -186813, -86874, -292, 81701, 166581, 259855]
11248B59855J01239Q5907J20339K16203K94729K85113J27443j69623l87507l35849
11238E97849k34643k64237k65566j51857K028P3178N1298Q5708Q2619n363j03939
11227a32925j89593k34619l14793l94074k87902j330K31040L20180L78353M77331
11217a48332M75376L50794K40190J29583j9607j88363k19120j14700j5153R7460
11207E88128J79848K08442J63412N8836o3922j82289k67864l62061m35960l80281
11197d93711k07613J8697K77217M56561M14326J47644r0550j23027m2213J5539
11187C72870K1358K3012M5926J02725J42216J08770m6504k01450k03175n0635
11177C15113N2882j05420k80980k24504j58724r9531l0538k6362P7242J94695
$$ y = [259855, 361094, 447001, 567340, 783543, 1078272, 1363385, 1490828, 1321205, 933698, 597849, 363206, 98969, -166597, -318454, -316426, -243248, -191950, -106242, -23623, -28986, -132925, -322518, -557137, -871930, -1266004, -1553906, -1555236, -1324196, -1004016, -625663, -148332, 327044, 677838, 918028, 1047611, 1028004, 839641, 620521, 505821, 490668, 588128, 767976, 976418, 1139830, 1198666, 1134744, 952455, 684591, 322530, -113430, -493711, -701324, -682627, -405410, 51151, 465477, 613121, 522571, 399544, 357331, 372870, 394228, 417240, 463166, 565891, 708107, 816877, 770373, 568923, 365748, 315113, 367995, 262575, -18405, -242909, -401633, -501164, -531702, -558064, -480822, -286127]
11167b86127K15326K63762L63608M60607M10636J95170N910r4465j95914l33324
11157A005189l74009k17615o10J09404P2017j4746q9037p7489J00471K01191M8139
11146G62905j17580j49177m9721P3095Q6613O8018P7168L7739j8681j5854o7393
11135F87132j18506j86091k16382r4586J06515J79368J2035j55458j12362P6778
11125A78443J43619O2256o0148k09441k28935l1405K39455L36881K47061Q0778
11115G58564n7484j43925k37269l15068k23709J2937K41975J99245k00126n31728
11105d96588n35608l19030k7337J88669K60691K37315J75777J4545j48694j45404
11095g95664m9670L4324L1709l2813K9342J74548J77427J67277K12786J67428
$$ y = [-286127, -70801, 192961, 556569, 1017176, 1427812, 1622982, 1628892, 1534427, 1338513, 1005189, 631180, 413565, 412955, 522359, 594376, 579630, 490593, 413104, 513575, 714766, 762905, 645325, 496148, 446427, 519522, 606135, 674153, 751321, 789060, 770379, 754525, 687132, 568626, 382535, 166153, 71567, 178082, 357450, 369485, 214027, 101665, 178443, 322062, 384318, 324170, 114729, -114206, -145611, 93844, 430725, 677786, 758564, 701080, 557155, 319886, 4818, -218891, -205954, 36021, 235266, 35140, -496588, -1032196, -1351226, -1378563, -1189894, -929203, -691888, -516111, -501566, -650260, -795664, -845334, -811010, -779301, -812114, -782772, -608224, -430797, -263520, -50734, 116694]
11085A16694N3678r6467k70330l04873j60098J62808N45826P58193O56299L17710
11075A779440q1540l09992l67604m14363l64799k42584k28872k27796j13319J32777
11065d38652M31544N75570M57344J94631k1119j44109j59110j7676J68949K83368
11055A330740L42689K00459j04545k35301p6010R3564L4682j06513p0469L3059
11045A442355l7080k30891k89934j79845k5686J28718K54364L04393K55613K4079
11035A646086k65508l56515k93196j83713o6771K4028N4398R5372J96269J88194
11025A038644N4620j34157l45144l71013j63636O5656K24414L00234K30120r016
11015H90722k64832k34539L7758K12765K15548J81314J49049Q3180j0271q9215
$$ y = [116694, 170372, 73905, -196425, -501298, -661396, -498588, 47238, 805431, 1461730, 1779440, 1697900, 1387908, 1020304, 605941, 241142, -1442, -230314, -458110, -571429, -438652, -7108, 568462, 1025806, 1220437, 1199318, 1055209, 896099, 878423, 1047372, 1330740, 1673429, 1873888, 1769343, 1534042, 1458032, 1551596, 1586278, 1479765, 1409296, 1442355, 1405275, 1174384, 884450, 704605, 678919, 807637, 1062001, 1366394, 1622007, 1646086, 1380578, 1024063, 730867, 547154, 480383, 504411, 558809, 654181, 850450, 1038644, 1093264, 959107, 613963, 242950, 79314, 144970, 369384, 669618, 899738, 890722, 625890, 391351, 429109, 641874, 857422, 1038736, 1187785, 1270965, 1260694, 1171479]
11005A171479j81544k99262l37379l15277l25414k69473j18513N4535J72209J44386
10995c04253l2994j48585j60662j09999l2224j27091l16665l60110k62524j26659
10985a981766m2571r8994j38137L9988K72930L18630J73486O9083Q8276N5194
10975a243881n6464j72559j97307n5014J26848J42781j8586j09597o7578l7299
10965a688656j02252r6376o4042j90952l30415l03791j20060J45705M27723N33520
10955a789596L72089J12961m1196j531J99349K52356M0606j00030q8504j28631
10945a172127q6423J56410M49667N84439N02532K76848J0018k12640l36991l63678
10935a91945k96887o4564J97263L20643K80424J77770J02901R627r1923j72672
$$ y = [1171479, 989935, 690673, 353294, 38017, -287397, -556870, -675383, -620848, -448639, -304253, -337247, -485832, -646494, -756493, -788717, -915808, -1232473, -1592583, -1855107, -1981766, -2024337, -2123331, -2261468, -2221480, -1948550, -1629920, -1456434, -1387351, -1299075, -1243881, -1300345, -1472904, -1670211, -1725225, -1598377, -1455596, -1474182, -1583779, -1651357, -1688656, -1790908, -1887284, -1951326, -2142278, -2472693, -2776484, -2896544, -2750839, -2323116, -1789596, -1417507, -1304546, -1345742, -1347273, -1147924, -895568, -854962, -954992, -1043496, -1172127, -1258550, -1102140, -652473, -68034, 434498, 711346, 721364, 508724, 171733, -191945, -488832, -553396, -356133, -35490, 244934, 422704, 525605, 535232, 443309, 270637]
10925B70637k50766l01007k58524j53723p0542j12212k84221l45297j98056k3604
10915a727315K13233M79154N66792M67176K69045J12329L5154l6567o0130J3304
10905C32175J21333J65599J35954N5211n9353j70249l19201m22513l66682l21727
10895h49453k92324j41997k1237p286J02334L07719L48550J48101j2894o8762
10885d87249j63927l33880m87214m84907l48284j69011J9171J40720J74533K35181
10875a904867K76143J64183M033K4768J65817K76781K98351K68489K24784J62629
10865c8889J14959J4059j30422j90815j55384r7860P504Q5659J14951J88688K26009
10854A38459J32464o0780j05385N4100J80785J99718J78555J7887j55383j78827
$$ y = [270637, 19871, -281136, -539660, -693383, -763925, -876137, -1160358, -1505655, -1703711, -1727315, -1514082, -1034928, -468136, -960, 268085, 380414, 415568, 379001, 318871, 332175, 453508, 619107, 755061, 810272, 750919, 580670, 261469, -161044, -527726, -849453, -1141777, -1283774, -1305011, -1312297, -1209963, -902244, -553694, -405593, -418487, -487249, -651176, -985056, -1472270, -1957177, -2305461, -2474472, -2455301, -2314581, -2140048, -1904867, -1628724, -1464541, -1460508, -1435740, -1269923, -993142, -694791, -426302, -201518, -38889, 76070, 90129, -40293, -231108, -386492, -484352, -476848, -391189, -276238, -87550, 138459, 270923, 210143, 104758, 158858, 339643, 539361, 717916, 735803, 580420, 401593]
10844D01593j18593o723R6780N9994r7683k92344m19631l78369j98781J307L6495
10833i15955M504M7880J12366J66148K38142K69999J97063O3378m7439p9892q1643
10822b5449p5237K0342J99501L03031K70260K08401J49105J8894o6415J1925N1458
10811A065816j46248l50831k77448j17866o5970m7838m1137j7490M1885J09377
10801A52250J66800J60950J23757N7360j6995o0967j37351j80605r7949J8620
10791A85870P8651Q9597O9315M4820J07739J18119m0458j44566j53810j95886
10781A59391j84912j23182q9569M2289J53104M1733r2362j72029k21902l0483
10771e17922K68623L81274L20623J69061j14078l73908l83603k50253k10386j32099
$$ y = [401593, 283000, 276277, 373057, 433051, 335368, 43024, -376607, -754976, -953757, -952450, -915955, -911451, -863571, -751205, -585057, -346915, -76916, 120147, 183525, 136086, 56194, -25449, -100686, -80344, 119157, 422188, 692448, 900849, 1049954, 1068848, 1002433, 1014358, 1065816, 919568, 568737, 291289, 173423, 107453, 59615, 18478, 988, 42873, 152250, 319050, 480000, 603757, 661117, 644122, 583155, 445804, 265199, 167250, 185870, 264521, 354118, 423433, 468253, 575992, 694111, 653653, 509087, 355277, 159391, -25521, -148703, -238272, -195983, -42879, -1146, -93508, -265537, -487439, -517922, -249299, 131975, 452598, 621659, 507581, 133673, -249930, -500183, -710569, -842668]
10761h42668J43850L61195M14227K95443O7636r6682k09141k75810k45990j55943
10751e43883J1240J90412K78486K23950Q4601O5908J55227J72191J28899K7039
10741G94070j12762k21107k99196l35111j80062J55166L86418L40148K03011J69327
10731H99902J32293R054j51538k56400k25658j62642j03090J8764N3846r0505
10721A24026k10295k20058j99975j23807j6255M3680J08831K82670L98853K74396
10711D62066N3070j16531k26645l23583l96983l02491n2806K9046j10292k07589
10701a192738j32788J43667L41548L36470K67719J53099P4845R3322J57829L00442
10691E43415M18102K14152k28728n71529n60733k92916m343J64536J92759J19760
$$ y = [-842668, -698818, -337623, 76604, 372047, 439683, 343001, 133860, -141950, -387940, -543883, -532643, -342231, -63745, 160205, 244806, 310714, 465941, 638132, 767031, 794070, 681308, 460201, 161005, -174106, -354168, -199002, 187416, 527564, 730575, 899902, 1032195, 1041249, 889711, 633311, 407653, 245011, 141921, 160685, 214531, 124026, -86269, -306327, -506302, -630109, -646364, -602684, -493853, -211183, 187670, 462066, 515136, 398605, 171960, -151623, -548606, -851097, -903903, -874857, -985149, -1192738, -1325526, -1181859, -840311, -503841, -236122, -83023, -8178, 85144, 242973, 543415, 961517, 1175669, 946941, 375412, -185321, -478237, -482580, -318044, -125285, -5525]
10681e525n447p0344J0820J92041L19970L03843J23437j68527m02472m30688k47460
10670c80352m8827N0298P7315R1577J44597K39575K81892J83499O5991q7326l46838
10659B71401n03844l72282j44814J6170J45784J50056M4102Q567J51776L14409
10649H1325J70785j44383k57997j76059r3091m5793l8161l7363J3934J67612K93455
10638f5736L12297K75509K10490J66806J93739J71149R8804Q2928O2849J4070
10628A522905j5268J7373J69825L59697L24235Q0632j26162k25558l52977n44246
10618A210456n78466l33501k4388J73116K40571J54957R0142Q7389L0557q0336
10608I70497j91249k36513k00341j58513j48952j29076n8998Q8618K17762K49343
$$ y = [-5525, -10972, -81316, -70496, 121545, 441515, 745358, 868795, 700268, 297796, -132892, -380352, -429179, -378881, -301566, -209989, -65392, 174183, 456075, 639574, 705565, 618239, 271401, -232443, -604725, -749539, -733369, -587585, -437529, -393427, -384860, -233084, 81325, 252110, 107727, -150270, -326329, -419420, -465213, -503374, -540737, -526803, -359191, -65736, 246561, 522070, 732560, 899366, 1093105, 1264254, 1363058, 1445986, 1508835, 1522905, 1507637, 1525010, 1694835, 2054532, 2378767, 2459399, 2333237, 2107679, 1754702, 1210456, 631990, 298489, 274101, 447217, 687788, 842745, 932887, 1020276, 1050833, 970497, 779248, 542735, 342394, 183881, 34929, -94147, -153145, -64527, 153235, 402578]
10598D02578K51489J83001q0996m10670m79497k14796Q8841J21967k8090r9804
10588b65977j57631l39072m13731l08430j78478m0889J9805r0595j24641L2989
10578a866650J03526M3705Q9134J19570j5203r7971J450J90991K59472J50890
10568a021086M7750J9856r182N23K6575J23651K67263L91907M05195K25101M2557
10557E20110m9289p2298L2448J70750J73468P0693l0796p4886j20457j90314k14430
10546B14999k56530l11489k72906j41251n9024j03056j03859K3192J07131L9358
10536h63435o3763j10308m6599J71722L35994K49018m136k56269m12866n14341
10526a514983n52691l94367p7509K44421L77719K63863J26034J04051J49298K00732
$$ y = [402578, 654067, 837068, 756072, 345402, -134095, -348891, -260050, -138083, -166173, -265977, -423608, -762680, -1176411, -1484841, -1663319, -1704208, -1684403, -1774998, -1899639, -1866650, -1763124, -1719419, -1630285, -1510715, -1525918, -1623889, -1622439, -1431448, -1171976, -1021086, -973336, -953480, -962662, -962139, -935564, -811913, -544650, -152743, 252452, 477553, 520110, 470821, 398523, 430971, 601721, 775189, 845882, 815086, 740200, 619743, 429429, 214999, -41531, -353020, -625926, -767177, -826201, -929257, -1033116, -1009924, -902793, -863435, -927198, -1037506, -1084105, -912383, -576389, -327371, -331507, -587776, -1000642, -1514983, -2067674, -2462041, -2539550, -2295129, -1917410, -1653547, -1527513, -1423462, -1274164, -1073432]
10516a073432K49933K24984Q9984j10400k75325l34311l06759k89438k40312m0652
10506b105728K59998M70473N85177O13697M89920K50441J5056q6637k4386J16843
10496E84854J84944J64783M0965j55854k90756l00811k10128p9550n2783j22285
10486b36621o4752N6186J56474J96071O7733j17885j68698p0679J15672K60858
10476A94359L38166L53531J95812r2294l89568n54760n70869m92207l45021j89247
10466a552098r5692Q1772L29494L33021J22356J6241J23468L16589M13898K86293
10456C75342O8734o3479j74967l38715m01395k30522j8573J09804K13040K56861
10446b03870J33723q9667k21254k48177k51493k74399k45796j13925M5890L3991
$$ y = [-1073432, -823499, -598515, -508531, -618931, -894256, -1228567, -1535326, -1824764, -2065076, -2105728, -1845730, -1375257, -790080, -176383, 313537, 563978, 579034, 492397, 468011, 584854, 769798, 934581, 975546, 819692, 528936, 228125, 17997, -61553, -114336, -236621, -301373, -245187, -88713, 107358, 175091, 57206, -111492, -182171, -66499, 194359, 532525, 886056, 1081868, 989574, 600006, 45246, -525623, -1017830, -1362851, -1552098, -1647790, -1566018, -1236524, -903503, -781147, -764906, -641438, -324849, 89049, 375342, 444076, 380597, 205630, -133085, -534480, -765002, -783575, -673771, -460731, -203870, -70147, -159814, -381068, -629245, -880738, -1155137, -1400933, -1514858, -1468968, -1434977]
10436a434977o2867l5306K9007Q6593J56960J57728Q0081m7047j14588j7202R4969
10425a106649J81572J56897n416q2653q3358p8584p9498j26913r0469R2723J74197
10414a048151O4006R1045K75513L29127K06881L6036q1799r3133j0655N1613J2034
10403a67483rJ0990p895j5916o4346j64250j11121J07458K42207K41916J82167
10392B53718Q544k72848m04879k86722n139J94509J43855O0222J00100J30295
10382g8345J8733k14768l79220l45209k12725r3296L9867J14981J28248J86960
10372h34774K66694K04873M5047K977O0513J78919L79563M87842L13851M7282
10362A152787r5040j47621j62736j40858j19427j11303j84847k78856k45941r9809
$$ y = [-1434977, -1497844, -1533150, -1504143, -1417550, -1260590, -1102862, -1022781, -1069828, -1184416, -1201618, -1106649, -925077, -768180, -773596, -856249, -939607, -1018191, -1097689, -1224602, -1315071, -1222348, -1048151, -984145, -893100, -617587, -288460, -81579, -45543, -127342, -220475, -231130, -179517, -167483, -167492, -156502, -164397, -180313, -244659, -408909, -520030, -412572, -170365, 71551, 253718, 262262, -10586, -415465, -702187, -707326, -512817, -368962, -308740, -208640, -78345, -59612, -274380, -653600, -998809, -1211534, -1304830, -1264963, -1149982, -1021734, -834774, -568080, -363207, -318160, -315183, -254670, -75751, 303812, 791654, 1105505, 1152787, 1057747, 910126, 747390, 606532, 487105, 375802, 190955, -87901, -333842, -433651]
10352d33651N4904J55682J98910J83291K01830K34166K06384J89143K40832K07514
10342A439005k7855l01922l97569l18849j47366R9291K52377K17068R7638J7246
10332I29064J748q7031j89197j90483j26375p4637j4019J44200L32955K85096
10322A011321M5093P0010L10013L86840L18338J49988j62632m63923n75751m85065
10312F04232l42759j98407L9830K76832L17973J62476l5466p9684K3991J23588
10302H92606J26935L6009q5780j41776j31230p4103n8619l5099R021l8965j64889
10291C34110k74094l68767l28474j90639j29724m9301O9313J54243K24527K33188
10281c25618P7640k30981m50132l97656j46530J72681L35610K55319J66244J57978
$$ y = [-433651, -378747, -223065, -24155, 159136, 360966, 595132, 801516, 990659, 1231491, 1439005, 1411150, 1109228, 711659, 392810, 245444, 344735, 597112, 814180, 911818, 929064, 930812, 843781, 654584, 464101, 337726, 263089, 249070, 393270, 726225, 1011321, 1056414, 1126424, 1436437, 1823277, 2141615, 2291603, 2128971, 1665048, 1089297, 604232, 261473, 63066, 102896, 379728, 697701, 860177, 824711, 745027, 769018, 892606, 1019541, 1055550, 969770, 827994, 696764, 622661, 564042, 528943, 537964, 498999, 334110, 60016, -308751, -637225, -827864, -957588, -1006889, -937576, -783333, -558806, -325618, -247978, -478959, -929091, -1326747, -1473277, -1300596, -964986, -709667, -543423, -385445]
10271c85445O5733j10061j77382j05452l7706o689M4689J28088J31237l2768k37447
10260g23203l62528l18147o1335K95579N21739N31029K92478p923j69246k39478
10250b41035j17803J64505L23500K66277J49798O5693N8409J44210J73669P8345
10240A065568r3411l04888l99643k97823n2275K69381L16872j3495l72416o15756
10230d97886p54902n94591k30400P8268K90593L38588K56881J61939P8252l2137
10220i05395p3957M1911J65946J85447K08063K84462L00159J62476o7504k70549
10210C1059l03261j77365l3706L5826M9862L7530M9634P7294P599j99744l58150
10199g83422l13981j65541j8958l4437j42652k7181K44879L96250L74888L03548
$$ y = [-385445, -319712, -429773, -607155, -712607, -750313, -757002, -712313, -584225, -452988, -485756, -723203, -1085731, -1403878, -1465213, -1169634, -647895, -116866, 175612, 167689, -1557, -241035, -358838, -194333, 129167, 395444, 545242, 610935, 669344, 813554, 987223, 1065568, 972157, 667269, 267626, -30197, -82472, 186909, 503781, 490286, 117870, -497886, -1252788, -1847379, -2077779, -1999511, -1708918, -1370330, -1113449, -951510, -873258, -905395, -979352, -937441, -771495, -586048, -377985, -93523, 206636, 369112, 301608, 31059, -272202, -449567, -483273, -447447, -397585, -360055, -310421, -233127, -225528, -425272, -783422, -1097403, -1262944, -1281902, -1316339, -1458991, -1486172, -1241293, -845043, -470155, -166607]
10189a66607K60301J96156O2775q6640j94640k14085j74894j23011k1064J78491
10179b83218L60680M05582L72068K60277J14318J4040j10209k08085k34084j75728
10169E15641k2114J30818J13725p1137k40753k23821n4474P1069Q9137J6208p642
10158C16657J61495L42317L90354L03387N8727k30314l71993l47940k29810k3622
10148C69258J57944J53490K1160j25306j77643r0987O5319J14996M5270K4662
10138E58163L339n1396k9814J23043L23373K72125p8914k86314j83811l8446J2082
10127F23430j9231m2194l9711l5317O9582K81683L49752J99871M4014p6232k32543
10116A123104l47224l97418l28793j40337J8016P3813M8899O1135P0539k9568
$$ y = [-166607, 93694, 289850, 352625, 265985, 71345, -142740, -317634, -440645, -461709, -283218, 77462, 483044, 855112, 1115389, 1229707, 1243747, 1133538, 925453, 691369, 515641, 493527, 624345, 738070, 666933, 426180, 202359, 147885, 218954, 308091, 324299, 316657, 478152, 820469, 1210823, 1514210, 1572937, 1342623, 970630, 622690, 392880, 369258, 527202, 680692, 701852, 576546, 398903, 307916, 373235, 488231, 533501, 558163, 561502, 510106, 480292, 603335, 926708, 1198833, 1119919, 833605, 649794, 611348, 623430, 604199, 562005, 522294, 486977, 556559, 838242, 1187994, 1387865, 1431879, 1355647, 1123104, 775880, 378462, 49669, -90668, -72652, 1161, 50060, 111195, 181734, 152166]
$$ [...]
##END NTUPLES=NMR SPECTRUM
##END=
