##TITLE=C13_Pr NCS
 CDCl3, 1100sc

 9.12.2021
##JCAMPDX= 6.0         $$ Bruker NMR JCAMP-DX V2.0
##DATA TYPE= NMR SPECTRUM
##DATA CLASS= NTUPLES
##ORIGIN= UXNMR, Bruker Analytische Messtechnik GmbH
##OWNER= root
$$ XWIN-NMR		Version 3.5
$$ Thu Dec  9 13:29:40 2021 Russian Standard Time (UT+4h)  she@DPX200
##.OBSERVE FREQUENCY= 50.327896
##.OBSERVE NUCLEUS= ^13C
##.ACQUISITION MODE= SIMULTANEOUS
##.ACQUISITION SCHEME= undefined
##.AVERAGES= 1101
##.DIGITISER RES= 17
##SPECTROMETER/DATA SYSTEM= spect
##.PULSE SEQUENCE= zgpg30
##.SOLVENT NAME= CDCl3
##.SHIFT REFERENCE= (INTERNAL, CDCl3, 0, 225.239)
##AUDIT TRAIL= $$ (NUMBER, WHEN, WHO, WHERE, WHAT)
$$ ##TITLE= Audit trail, XWIN-NMR		Version 3.5
$$ ##JCAMPDX= 5.01
$$ ##ORIGIN= Bruker BioSpin GmbH
$$ ##OWNER= she
$$ F:/spectra/data/she/nmr/c13/1/pdata/1/auditp.txt
$$ ##AUDIT TRAIL=  $$ (NUMBER, WHEN, WHO, WHERE, WHAT)
(   1,<2021-12-09 13:28:51.57 +0400>,<she>,<DPX200>,
      <created by zg, POWCHK disabled, PULCHK disabled
       terminated by command 'halt'
       configuration hash MD5:
       00 E9 B6 7A A2 85 ED C7 34 08 36 98 17 FE 4E 26
       data hash MD5: 32K
       E7 F4 32 98 01 6B D8 09 FE C6 52 BC 8E 2B F1 BA>)
(   2,<2021-12-09 13:28:53.85 +0400>,<she>,<DPX200>,
      <Start of raw data processing
       efp BC_mod = 2 LB = 1 FT_mod = 6 PKNL = 1 PHC0 = -331.0595 PHC1 = 32.96237 SI = 32K 
       data hash MD5: 32K
       52 A8 DA 10 00 DE C8 49 2A B4 3B 42 70 BA 66 1A>)
(   3,<2021-12-09 13:28:57.70 +0400>,<she>,<DPX200>,
      <abs ABSG = 5 
       data hash MD5: 32K
       6E 44 6B CC 25 9F E3 C6 49 A1 E6 57 10 C1 9B C8>)
$$ ##END=
$$ 
$$ hash MD5
$$ B2 71 AC A0 8D 5C 7E EB 58 D6 F6 67 E3 94 3C 51
##$RELAX= 
##$RELAX= 
##$RELAX= 
##$RELAX= 
##$RELAX= 
##$RELAX= 
##$RELAX= 
##$RELAX= 
$$ Bruker specific parameters
$$ --------------------------
##$DU= <F:/spectra>
##$EXPNO= 1
##$NAME= <c13>
##$PROCNO= 1
##$TYPE= <nmr>
##$USER= <she>
##$AMP= (0..31)
100 100 100 100 100 100 100 100 100 100 100 100 100 100 100 100 100 100 
100 100 100 100 100 100 100 100 100 100 100 100 100 100 
##$AQSEQ= 0
##$AQ_mod= 1
##$AUNM= <au_zg>
##$AUTOPOS= <>
##$BF1= 50.322709
##$BF2= 200.13
##$BF3= 50.322709
##$BF4= 500.13
##$BF5= 500.13
##$BF6= 500.13
##$BF7= 500.13
##$BF8= 500.13
##$BYTORDA= 1
##$CFDGTYP= 0
##$CFRGTYP= 5
##$CHEMSTR= <none>
##$CNST= (0..31)
1 1 145 1 1 1 1 1 1 1 1 1 1 1 1 1 1 1 1 1 1 1 1 1 1 1 1 1 1 1 1 1 
##$CPDPRG= <waltz16>
##$CPDPRG1= <>
##$CPDPRG2= <waltz16>
##$CPDPRG3= <>
##$CPDPRG4= <mlev>
##$CPDPRG5= <mlev>
##$CPDPRG6= <mlev>
##$CPDPRG7= <mlev>
##$CPDPRG8= <mlev>
##$CPDPRGB= <>
##$CPDPRGT= <>
##$D= (0..31)
0 2 0.00345 0 0 0 0 0 0 0 0 0.03 2e-05 3e-06 0 0 0 0 0 0 0 0 0 0 0 0 0 
0 0 0 0 0 
##$DATE= 1639038438
##$DBL= (0..7)
120 120 120 120 120 120 120 120 
##$DBP= (0..7)
150 150 150 150 150 150 150 150 
##$DBP07= 0
##$DBPNAM0= <>
##$DBPNAM1= <>
##$DBPNAM2= <>
##$DBPNAM3= <>
##$DBPNAM4= <>
##$DBPNAM5= <>
##$DBPNAM6= <>
##$DBPNAM7= <>
##$DBPOAL= (0..7)
0.5 0.5 0.5 0.5 0.5 0.5 0.5 0.5 
$$ [...]
##$SUBNAM4= <"">
##$SUBNAM5= <"">
##$SUBNAM6= <"">
##$SUBNAM7= <"">
##$SUBNAM8= <"">
##$SUBNAM9= <"">
##$SW= 239.972175391363
##$SWIBOX= (0..15)
0 1 3 0 0 0 0 0 0 0 0 0 0 0 0 0 
##$SW_h= 12077.2946859903
##$TD= 32768
##$TD0= 1
##$TE= 0
##$TE2= 300
##$TE3= 300
##$TEG= 300
##$TL= (0..7)
120 120 120 120 120 120 120 120 
##$TP= (0..7)
150 150 150 150 150 150 150 150 
##$TP07= 0
##$TPNAME0= <>
##$TPNAME1= <>
##$TPNAME2= <>
##$TPNAME3= <>
##$TPNAME4= <>
##$TPNAME5= <>
##$TPNAME6= <>
##$TPNAME7= <>
##$TPOAL= (0..7)
0.5 0.5 0.5 0.5 0.5 0.5 0.5 0.5 
##$TPOFFS= (0..7)
0 0 0 0 0 0 0 0 
##$TUNHIN= 0
##$TUNHOUT= 0
##$TUNXOUT= 0
##$USERA1= <user>
##$USERA2= <user>
##$USERA3= <user>
##$USERA4= <user>
##$USERA5= <user>
##$V9= 5
##$VALIST= <valist>
##$VCLIST= <CCCCCCCCCCCCCCC>
##$VD= 0
##$VDLIST= <DDDDDDDDDDDDDDD>
##$VPLIST= <PPPPPPPPPPPPPPP>
##$VTLIST= <TTTTTTTTTTTTTTT>
##$WBST= 1024
##$WBSW= 4
##$XGAIN= (0..3)
0 0 0 0 
##$XL= 0
##$YL= 0
##$YMAX_a= 7451162
##$YMIN_a= -2807390
##$ZGOPTNS= <>
##$ZL1= 120
##$ZL2= 120
##$ZL3= 120
##$ZL4= 120
##$ABSF1= 225.2393
##$ABSF2= -14.75813
##$ABSG= 5
##$ABSL= 3
##$ALPHA= 0
##$AQORDER= 0
##$ASSFAC= 0
##$ASSFACI= 0
##$ASSFACX= 0
##$ASSWID= 0
##$AUNMP= <proc_1d>
##$AZFE= 0.1
##$AZFW= 0.5
##$BCFW= 0
##$BC_mod= 2
##$BYTORDP= 0
##$COROFFS= 0
##$CY= -3
##$DATMOD= 1
##$DC= 0
##$DFILT= <>
##$DTYPP= 0
##$F1P= 0
##$F2P= 0
##$FCOR= 0.5
##$FTSIZE= 32768
##$FT_mod= 6
##$GAMMA= 0
##$GB= 0
##$INTBC= 1
##$INTSCL= 4.134877e-10
##$ISEN= 128
##$LB= 1
##$LEV0= 0
##$LPBIN= 0
##$MAXI= 10000
##$MC2= 0
##$MEAN= 0
##$ME_mod= 0
##$MI= 0.1934396
##$NCOEF= 0
##$NC_proc= -1
##$NLEV= 6
##$NOISF1= 120.0001
##$NOISF2= 80.00006
##$NSP= 0
##$NTH_PI= 0
##$NZP= 0
##$OFFSET= 225.2393
##$PC= 1.4
##$PHC0= -331.0595
##$PHC1= 32.96237
##$PH_mod= 1
##$PKNL= yes
##$PPARMOD= 0
##$PSCAL= 0
##$PSIGN= 0
##$REVERSE= no
##$SF= 50.3226000198075
##$SI= 32768
##$SIGF1= 140
##$SIGF2= 120
##$SINO= 11.81781
##$SIOLD= 32768
##$SREGLST= <13C.CDCl3>
##$SSB= 0
##$STSI= 32768
##$STSR= 0
##$SW_p= 12077.2946859903
##$SYMM= 0
##$S_DEV= 0
##$TDeff= 32768
##$TDoff= 0
##$TI= <>
##$TILT= no
##$TM1= 0
##$TM2= 0
##$TOPLEV= 0
##$USERP1= <user>
##$USERP2= <user>
##$USERP3= <user>
##$USERP4= <user>
##$USERP5= <user>
##$WDW= 1
##$XDIM= 32768
##$YMAX_p= 382030742
##$YMIN_p= -6744800
$$ End of Bruker specific parameters
$$ ---------------------------------
##NTUPLES= NMR SPECTRUM
##VAR_NAME=  FREQUENCY,     SPECTRUM/REAL,   SPECTRUM/IMAG
##SYMBOL=    X,             R,               I
##VAR_TYPE=  INDEPENDENT,   DEPENDENT,       DEPENDENT
##VAR_FORM=  AFFN,          ASDF,            ASDF
##VAR_DIM=   32768,         32768,           32768
##UNITS=     HZ,            ARBITRARY UNITS, ARBITRARY UNITS
##FACTOR=    0.368581032318806, 1,           1
##FIRST=     11334.6273832426, 0,            0
##LAST=      -742.667302747745, 0,           0
##MIN=       -742.667302747745, -6744800,    0
##MAX=       11334.6273832426, 382030742,    0
$$ Real data points
##PAGE= N=1
##DATA TABLE= (X++(R..R)), XYDATA
$$ [...]
8161b658367J11487N13560O17961K04695N60015N46188M00586J46724m77971m17038
8151d52160o46409j64805l67142j45799N59651O28722r52107j94001R39815K20858
8141e73377M88734K35514j35920k88235n83590k64140L64864K8840j32056j84232
8131a043598K04990P86732L65002K60566j56068m10938o30169j92375K22216l14419
8121i08061j18902M60833L95771K37251R09654Q89690l55421j066000l0642N43733
8111I57906K73336l23361q91740n22505j66359J9433n04394o56972r10661p54724
8101c480041P12880J055185M18905Q75936O59315l18151l33660J40229k58702
8092e28104o6689P51527L98611m47272L0161J38796M50274l53699o96241r82479
$$ y = [-2658367, -2546880, -2033320, -1415359, -1210664, -650649, -104461, 296125, 442849, -35122, -452160, -1098569, -1263374, -1630516, -1776315, -1216664, -587942, -1540049, -1734050, -794235, -573377, -84643, 150871, 14951, -273284, -856874, -1121014, -756150, -727310, -859366, -1043598, -838608, -51876, 313126, 573692, 417624, 6686, -623483, -815858, -593642, -908061, -1026963, -566130, -170359, 66892, 976546, 1866236, 1510815, 444815, 414173, 957906, 1231242, 907881, 16141, -506364, -672723, -653290, -1157684, -1814656, -2725317, -3480041, -2767161, -1711976, -1293071, -417135, 242180, -75971, -409631, -269402, -528104, -594793, 156734, 555345, 108073, 138234, 277030, 727304, 373605, -322636, -1305115]
8082a305115k24293O47199O36130M04759K4271l57177O68459Q65307j84331n35444
8072F39765j13346m39007p63863j55759O86965P04105j06256o41665q83586o55767
8062a728414m75071P07800J660439R42050J37533K37986J6719k23420l4282M18676
8052A660016n2563q9621l36746o14109L91245L45603k4976O12290k55052o80837
8042I55250l78266o75453p02486n919K99178O23280N91426m7846n81916p61701
8032f84453m04280Q6468j97127o93576N08886R55499N45252Q22010M33877M61810
8022A834366j85228n63329J09606M08084J82658m32772j90728J75388J30147O8852
8012A537044o34872j85042P58657P75503q39431j236926R7059R54372P07192j96362
$$ y = [-1305115, -1529408, -882209, -246079, 158680, 182951, -174226, 494233, 1359540, 1175209, 639765, 526419, 87412, -676451, -832210, -145245, 558860, 452604, -189061, -1072647, -1728414, -2203485, -1495685, 164754, 1106804, 1244337, 1482323, 1499042, 1275622, 1241340, 1660016, 1607453, 1517832, 1181086, 566977, 958222, 1303825, 1278849, 1891139, 1636087, 955250, 576984, -98469, -800955, -806874, -507696, 115584, 707010, 659164, 77248, -684453, -1088733, -1002265, -1199392, -1892968, -1384082, -428583, 116669, 938679, 1372556, 1834366, 1649138, 1085809, 1195415, 1603499, 1786157, 1353385, 1162657, 1338045, 1468192, 1537044, 902172, 717130, 1475787, 2251290, 1411859, 174933, 271992, 1226364, 1933556, 1737194]
8002A737194l89689L07353k52281j338210n26906N18835J009700l29264j302900
7993e66168l15462O4562n4316O4354k3105l36743n66306K99139J161264O87437
7983D14656N10865Q54258J4850p1388m28515p13673o30399n51650J63708j26118
7973e63406j26053Q8893N87774N87466N91542M06487J94177K83642L17121P5868
7963B443511m40047j154314q83476l34970K53458L84810N98245P39667m40552
7954A166332r00193n12020r6266L85060k16680n93605k1676O53537J30772J53452
7944A48713j97871K10534L12656l40289n4465O35839N02457j24041r63089p56093
7934f25649p04056o03735j78130J057714L07120r89454j07664L31434J28325k01533
$$ y = [1737194, 1347505, 1654858, 1402577, 64367, -462539, 56296, 1065996, 736732, -566168, -881630, -817068, -871384, -807030, -830135, -1166878, -1733184, -1434045, -272781, 414656, 925521, 1779779, 1794629, 1723241, 1294726, 581053, -49346, -600996, -437288, -563406, -689459, -600566, -12792, 574674, 1166216, 1572703, 1766880, 2050522, 2367643, 2443511, 2003464, 849150, -34326, -369296, -115838, 268972, 867217, 1606884, 1166332, 266139, -245881, -342147, 42913, -173767, -767372, -789048, -135511, -4739, 148713, -49158, 161376, 474032, 133743, 79278, 715117, 1217574, 1093533, 130444, -625649, -1329705, -1933440, -2111570, -1053856, -746736, -1736190, -1843854, -1512420, -1384095, -1585628]
7924a585628J22732M40853O99190N5920l12047p42755j124032j147530k46025
7915c839322O22414N72116O49669M98141J11P46986Q27118N89408N3968l48916
7905C71693j43901m782M6580O93709M17194m58624m1104m07410n77897o0949k60551
7894d26042N76174N46381p68983j23533R98373K18318k00758o82665k33818Q44235
7884G47682J83076q28485j012859p2205M50564r2413o80372n56039J22479j703
7874a740275L77364O05305J4482M98824M57267m35724o42621k27111j26412j72090
7864a390991L24252P55708L37251J8568O0128m3509K51943L41182P70949J449324
7854B874805J904588J031017l33482j563700j119685j17582l75437k07285J2761
$$ y = [-1585628, -1462896, -1022043, -322853, -266933, -578980, -1321735, -2445767, -3593297, -3839322, -3216908, -2644792, -1995123, -1496982, -1496871, -749885, 77233, 666641, 720609, 371693, 227792, 223010, 269590, 963299, 1380493, 921869, 880765, 473355, -104542, -165491, -426042, 150132, 696513, -72470, -196003, 802370, 1020688, 819930, 137265, -96553, 747682, 930758, 102273, -910586, -982791, -532227, -624640, -1305012, -1861051, -1738572, -1740275, -1362911, -757606, -743124, -244300, 212967, -222757, -865378, -1092489, -1218901, -1390991, -1066739, -311031, 26220, 44788, 104916, 61407, 313350, 654532, 1425481, 2874805, 4779393, 5810410, 5476928, 3913228, 2793543, 2675961, 2300524, 2093239, 2106000]
7845B106000k51369k77226O5165j33380j5953M22619J13545k07321p17883n49613
7835E54584q8515j09027j32765k56145n70309q18715n60100N13926J159116R81629
7825F73679J20669j64124K46578m41137r17693k93822M14326L19680j1623L14526
7815B61059P30445Q41766K54981m5812j88155j8985J29338m04792o19572k02879
7805G37394n04643M9429Q76608Q13722m0100k26413l15875p94632o48854j26790
7795a80154P5817k45810n99140m39128K86472J163052J371040M17508p75709j521030
7785d47082m55490l7002k19324j51203l75512l43631M39537R63070M81793L84338
7775B39494K09839n45074p19055n52002k52344k22435L59770o879l11491M46546
$$ y = [2106000, 1854631, 1577405, 1642570, 1509190, 1493237, 1915856, 2029401, 1822080, 1104197, 554584, 466069, 357042, 224277, -31868, -602177, -1420892, -1980992, -1467066, -307950, 673679, 794348, 630224, 876802, 435665, -482028, -775850, -361524, -41844, -53467, 261059, 991504, 1833270, 2088251, 2042439, 1854284, 1835299, 1964637, 1559845, 940273, 737394, 232751, 282180, 1158788, 1972510, 1932410, 1705997, 1390122, 595490, -53364, -180154, -104337, -350147, -949287, -1388415, -1101943, 61109, 1432149, 1849657, 1073948, -447082, -902572, -939574, -1158898, -1310101, -1685613, -2029244, -1589707, -626637, -144844, 239494, 449333, -95741, -814796, -1366798, -1619142, -1841577, -1481807, -1488686, -1800177, -1353631]
7765a353631M76112K11583j5781M58415K00385K9930k23807J55266J88853j144485
7755a017160j312208j013875M58068P27733j38533M8600O76014P15459O98784
7746a57118L28505j53808j055376o75374N61369R99327p6417m96981k93174r95080
7736b014127o70400O08379R23109M79189j35183J20604J312567J045159K14609
7727A883906m48526n93978k44307l60932l47260k2276K68409O89589P88212L61516
7717A974353n26256m81981l86730q69468N7211J09445O02645j6104q52717O12510
7707B22908P88030l60872j32009n77943l47184N83159O82424O30112j58565l83577
7697I46483r06423j012595K87014Q25475k55580j399003R2058R08426l11778o05963
$$ y = [-1353631, -877519, -665936, -681717, -223302, -22917, 7013, -216794, -61528, 127325, -1017160, -2329368, -3343243, -2885175, -2157442, -2295975, -2247375, -1571361, -855902, -157118, 171387, 17579, -1037797, -1713171, -1151802, -152475, -228892, -725873, -1019047, -2014127, -2684527, -2076148, -1153039, -673850, -809033, -688429, 624138, 1669297, 1883906, 1435380, 841402, 597095, 236163, -111097, -133373, 135036, 824625, 1612837, 1974353, 1448097, 966116, 579386, -290082, -232871, -123426, 479219, 463115, -389602, 222908, 1010938, 650066, 518057, -59886, -407070, 176089, 858513, 1488625, 1330060, 946483, 40060, -972535, -685521, 139954, -115626, -1514629, -1422571, -514145, -825923, -1431886]
7687a431886J88499K33887o2813K20818J98456O09533o3243q63588r58707k99985
7677b229029N55719Q76994J084478j0189p25592M57897N86127j14368j86857l16981
7667b1801k59587l91874p050M82316Q17N6038m66681R4098K09868m45440M56330
7656b92966k269o88359K72525O64772P01060L91322k10969q12598l39911O36832
7646C19439R33992n19507n43132L12691R51966M61526J90812N7579m55988j58153
7636A551225n2898j8867m24954k77352J93565N28124J76131L67333O3305n02872
7626A602740o92679n58923j018712m90008m73180k25916L82491N12310R63035
7617A158P86394r2381l10996j2339j21770l52493l73321m40268j05714K70876
$$ y = [-1431886, -1243387, -1009500, -1072313, -851495, -653039, -43506, -106749, -970337, -1929044, -2229029, -1673310, -796316, 288162, 277973, -447619, 10278, 596405, 482037, 295180, -21801, -281388, -673262, -680312, -197996, -197179, -141141, -607822, -513724, -303856, -749296, -292966, -295235, -983594, -711069, -46297, 654763, 1046085, 835116, 22518, -317393, 319439, 1253431, 733924, 190792, 503483, 1455449, 1916975, 2107787, 2165366, 1709378, 1551225, 1498327, 1479460, 1054506, 777154, 970719, 1498843, 1674974, 2042307, 2105612, 1602740, 910061, 351138, -667574, -1157582, -1630762, -1856678, -1474187, -961877, 1158, 787552, 695171, 384175, 371836, 250066, -102427, -475748, -916016, -1021730, -750854]
7607g50854K10908j54479j86020L01635j00206O5333M24765L55103J47758L90594
7597G04537j02015k47654l14326J69052L94898N522j057383o31581Q21523J125657
7587H68230O37323q4434q31133n12727m55572p86802q199L85680j14633K12186
7577f90081J006090Q68439o38081j240933k68087k85678J33009R90400R05103
7568G80181m41893j200263o48324j42039K90651N85838M84429K03208r704r6034
7558a93950k17463j195597q63597L85609K86788J8727q09528p22768K23310R20635
7548b167834L89482M44579L83712j11279K81367K29045N94458J176400J204664
7539B424594K30736o99683l37709j77213k98791l7578L4937m6196r9775j06084
$$ y = [-750854, -539946, -694425, -880445, -578810, -679016, -613683, -188918, 166185, 313943, 704537, 602522, 354868, 40542, 209594, 604492, 610014, -447369, -1078950, -257427, 868230, 1505553, 1421119, 589986, 77259, -378313, -1165115, -1173314, -787634, -902267, -690081, 316009, 1184448, 546367, -694566, -962653, -1248331, -1115322, -124922, 780181, 338288, -861975, -1510299, -1652338, -1361687, -775849, -291420, -88212, -97916, -193950, -411413, -1607010, -2470607, -2084998, -1798210, -1779483, -2589011, -3311779, -3088469, -2167834, -1778352, -1333773, -950061, -1061340, -779973, -550928, 43530, 1219930, 2424594, 2655330, 1955647, 1617938, 1440725, 1141934, 1104356, 1139293, 1093097, 993322, 887238]
7529H87238J466p97548q4597K64333l52661m61210m47840n37152J2747L91575
7519a123649L03950L61877N87701j44236o86060n34340k70370J20103K40878n67943
7509a712089k90791K68820K64471M36388L54724P87679J74980k90400o04388o10513
7499a221119k28218L47478N18084N87077o3888l4999n77494m65948L17772k28895
7489a050150j03608K03102o4218O97073J594555P90174J98774M25172p1439o60935
7479A958500q58162o46054k14816K28629m8560k84788j28168r5053m08636Q5377
7469d11731M36374P18176M20295q7183r7086o04208n35771j86944j58525k69755
7459g76358M47649J30166q30239j50912N09398M80897R8478J49543N90055M35040
$$ y = [887238, 888704, 91156, 6559, 270892, -81769, -542979, -990819, -1527971, -1515224, -1123649, -819699, -457822, 129879, -14357, -700417, -1234757, -1505127, -1385024, -1144146, -1712089, -2002880, -1734060, -1469589, -1033201, -678477, 109202, 284182, -6218, -610606, -1221119, -1449337, -1101859, -583775, 3302, -60586, -95585, -673079, -1139027, -821255, -1050150, -1153758, -950656, -1014874, -317801, 1276754, 2066928, 2265702, 2690874, 2619435, 1958500, 1100338, 454284, 239468, 468097, 419537, 134749, 6581, -88472, -497108, -411731, 24643, 742819, 1163114, 1075931, 978845, 374637, -161134, -348078, -506603, -776358, -328709, -198543, -1028782, -1179694, -670296, -189399, -90921, 58622, 648677, 1083717]
7449A083717l31290j62803K61712M06856l96720q63218m71374K45860N61571k44962
7439H9349P18687J058115K37130k37174j52346J60295O59620k34005j219260j084388
7429c977j93407J85590l18736L0935R51653R18549l86899j025323j59829M93160
7419D91716L19122l26782o57287m7477L91957r4227O1860l89557k97481L12163
7409b35993J94999l51224M02697J076566Q03408N46616n4864k95604m46279r4090
7399A546232j93606m74477m30777J56306j13976j84902j79151p1081K85923M55398
7389G95889J11065o35568o76491j67874J75464M96716O85037M79215J53337K0957
7379A437747M8883k92644k62224L61768K30482o40182m22112q2996l49150n35339
$$ y = [1083717, 752427, 589624, 851336, 1258192, 861472, -1746, -473120, -227260, 334311, 89349, 808036, 1866151, 2103281, 1866107, 1713761, 1874056, 2533676, 2299671, 1080411, -3977, -197384, -11794, -330530, -299595, 652058, 1570607, 1183708, 158385, -1444, 491716, 810838, 484056, -173231, -220708, 171249, 77022, 138882, -250675, -548156, -235993, -40994, -392218, 10479, 1087045, 1890453, 2437069, 2382205, 2086601, 1640322, 1546232, 1352626, 878149, 447372, 603678, 489702, 304800, 125649, 54568, 340491, 795889, 906954, 271386, -405105, -572979, -397515, 99201, 784238, 1263453, 1416790, 1437747, 1486630, 1193986, 931762, 1293530, 1524012, 883830, 461718, 378722, 29572, -505767]
7369e05767k45509l09332o4098M24763Q43714M73412l52805j87791j1840o34712
7359e69965r91917J27905J571344J446310L75352m32997p14777q01331k49841
7350b39917O15112L84641p89919j388068o6859P33167M86675j71408j23516l52598
7340i12690K32083O46262K46330n24255m70433M42710O0765k23516K30806L46064
7330G4126J84793q7839q86343m05080P25540Q51309M23586J81206J31255p1960
7320A120593j59045n77168p41434j15818k38318l93776k23893J102886Q39780
7311F13807K30149K80219m42416j64131K59039k36751j55306q9074o39550m23466
7301g67480M6826K96273N67911N78894L50358l84526m59613l59436j81347n56715
$$ y = [-505767, -751276, -1060608, -1124706, -699943, 143771, 617183, 264378, 76587, 64747, -569965, -1561882, -1433977, 137367, 1583677, 1959029, 1526032, 811255, 9924, -239917, 375195, 759836, -30083, -1418151, -1485010, -751843, -265168, -436576, -560092, -912690, -680607, -34345, 211985, -312270, -782703, -339993, -279228, -502744, -271938, 74126, 258919, 171080, -715263, -1120343, -394803, 456506, 880092, 1061298, 1192553, 1120593, 961548, 384380, -357054, -472872, -711190, -1104966, -1328859, -225973, 613807, 843956, 1124175, 681759, 517628, 776667, 539916, 384610, 295536, -344014, -767480, -720654, -424381, 143530, 722424, 1072782, 688256, 228643, -130793, -312140, -868855]
7291h68855m74594O54391Q02862j64558L64916P51682N5709k16352o15321p48652
7281d58772J8464l66028n7284P09569N56739M41340L09881l5926m56126j44604
7271E17253K94110K95127r5638n16151n84081k71694J5346J111056J349819J10627
7261B225774j135544j128320m19296k52124L48257L11581r98022j158520j64544
7252b370758Q45239J006403M37827M38520K13830q2920J17481q0229L38038l90346
7242D73085q87180o23421O6435M66489M78483M63092j35077l73461j99779P7665
7232a93669k29024r64356o53171k6709M02888M86948L28762N25439J74329m20263
7222e68826p1645N50603m48778j69598L5382j20046N52990Q30463L40935l26818
$$ y = [-868855, -1343449, -689058, 113804, -50754, 314162, 1065844, 1121553, 905201, 289880, -458772, -440308, -806336, -863620, -154051, 402688, 844028, 1153909, 1117983, 661857, 517253, 811363, 1106490, 1010852, 494701, -89380, -361074, -345728, 765328, 2115147, 2225774, 1090230, -38090, -457386, -709510, -361253, -49672, -1047694, -2206214, -2370758, -1525519, -519116, -81289, 357231, 571061, 488141, 605622, 525393, 863431, 473085, -414095, -1037516, -971081, -504592, -26109, 436983, 301906, -71555, -271334, -193669, -422693, -1387049, -2040220, -2066929, -1664041, -1177093, -848331, -322892, -148563, -568826, -640471, -89868, -538646, -708244, -672862, -792908, -239918, 590545, 931480, 604662]
7212F04662o31372l12655L22731j95115o2331M71228K42739K47633K91731j64629
7202H14622j4554J7307n4846K21713j84782o63431q22368K45580P30846K30777
7192E20864R1795k59541l52191M63567M09680m77490k05637m08314k0297j3391
7182b50955j21043K59332o1701p22412j286566p35793l28059Q5234M42781j7333
7172b736515l30168O99863N72838k51182l10844L22903J118574J066218P70966
7163I22653l07053L48857P46610j12296m79417J96251O19012J40126j235269p36047
7153A03427M49357j66866m55424K88584m19236q3338P91157J081901j21268o16027
7143H52267K02553J38004m30622K15612L47133n13500j33680K00124p82926q50071
$$ y = [604662, -26710, -339365, -16634, -211749, -274080, 197148, 439887, 687520, 979251, 814622, 800068, 817375, 762529, 984242, 799460, 136029, -686339, -440759, 290087, 520864, 612659, 353118, 927, 464494, 874174, 396684, 191047, -217267, -237564, -250955, -371998, -112666, -174367, -896779, -2183345, -2919138, -3247197, -3161963, -2719182, -2736515, -3066683, -2366820, -1793982, -2045164, -2356008, -2033105, -914531, 151687, 922653, 615600, 964457, 1711067, 1598771, 1119354, 1315605, 1934617, 2074743, 839474, 103427, 552784, 385918, -69506, 219078, -200158, -283496, 507661, 1589562, 1468294, 852267, 1054820, 1192824, 762202, 977814, 1324947, 811447, 677767, 877891, 94965, -755106]
7133g55106m39683K2540N24308Q68445K21354j98433o13375p20199p1494q2769
7123a244412j27696j28016M08100J381038R42147o81525r00499o25244K98855
7114f77252M73813m4135k39028K79235M86757k08435J41082K67548m31621o35228
7104e87264L38853O20119N93773L28359j50148k03277q32238n16029L70788k3934
7094f0998o34690n23651L67806R28137R79918P40369J12013J82656k36340n89454
7084A265766o68709p83584o15365L4426n9594k6287P32601M87312J69528J39173
7074F75267l19821M82879N98311k9981L36628l53540m7909N08010K08063J1937
7064B069844p56143l50524k34035L1655L68733Q76456O43422N58840J51379j85706
$$ y = [-755106, -1194789, -1172249, -647941, 220504, 441858, 243425, -369950, -1090149, -1161643, -1244412, -1372108, -1500124, -1092024, 289014, 1231161, 549636, -350863, -976107, -677252, -203439, -247574, -486602, -207367, 279390, 70955, 212037, 479585, 47964, -587264, -248411, 371708, 965481, 1293840, 1143692, 940415, 108177, -407852, -37064, -60998, -695688, -1219339, -851533, 76604, 1056522, 1796891, 1908904, 2091560, 1855220, 1265766, 597057, -186527, -801892, -767466, -827060, -853347, -120746, 366566, 536094, 675267, 355446, 838325, 1436636, 1406655, 1743283, 1389743, 1341834, 1849844, 2057907, 2069844, 1313701, 963177, 729142, 760797, 1129530, 2005986, 2649408, 3208248, 3359627, 3173921]
7054C173921R9062Q8421p55914j196264q11778q97446q82004j60305j80221J89642
7044a332886K5661J63074L60569N94201O06971N77003Q29640N38781k28884r39681
7034A194449o24719l11312j94196P8331O31880J081317j60013p62449o8821k3051
7024H41416K98392l20831l40836K23265l59437n99877j33533K44355P9440K78459
7014B10813m00119r76366q54073k74740K63921J176359J172224k7076m26659K17729
7004H2013m3996l79851m52418J82833L75103O51046R78501M11060o37720q78819
6994B87752o1428J57289j24844l46288l40290L75378M76503l73230n05622K83854
6984a70926O03117Q7630n23318m77492n74259k38490K73092O51517K27543k63714
$$ y = [3173921, 3272983, 3361404, 2605490, 1409226, 597448, -299998, -1182002, -1342307, -1522528, -1332886, -1307225, -1144151, -783582, -189381, 417590, 994593, 1824233, 2363014, 2134130, 1194449, 569730, 258418, 64222, 142553, 774433, 1855750, 1695737, 933288, 864467, 841416, 1139808, 818977, 478141, 701406, 341969, -257908, -391441, -147086, -67646, 210813, -189306, -1165672, -2019745, -2294485, -2030564, -854205, 318019, 290943, -135716, 82013, 38017, -341834, -794252, -611419, -236316, 414730, 1393231, 1804291, 1166571, 287752, 226324, 383613, 258769, -87519, -427809, -52431, 424072, 50842, -454780, -170926, 432191, 519821, -3497, -480989, -1055248, -1293738, -1020646, -369129, -141586, -405300]
6974d05300L01592j8929q3291M84019L07895k99093J78457P32468M69533j44085
6964A523266r27297n83436M23337J002396P21625k00594m77460n93520j76439
6955G11878J11892L26253J98828J02323p7702j85932r159L44877n907P0800n75502
6944A012649p75770j71821K33968K40909p53733k73815O95179N02997N01158j81036
6934A030685q13656l38167j27077L75021P79773J92464j09500o13761n7717R09777
6924A227842O27047k60044m32815j45303J72608L84325r4496o24178p1859N91236
6914A374363Q98634J74037l72659M9471j44995j07008J00242k28053m5806J77138
6904A875364O41271O9981m67408J86938O64087m06573j071242J9769P54595P35543
$$ y = [-405300, -103708, -122637, -205928, 278091, 585986, 286893, 465350, 1197818, 1667351, 1523266, 595969, 12533, 435870, 1438266, 2159891, 1959297, 1481837, 888317, 711878, 823770, 1150023, 1348851, 1451174, 1373472, 1187540, 1178381, 1523258, 1517351, 1588151, 1012649, 236879, 65058, 299026, 539935, -213798, -487613, 207566, 710563, 1211721, 1030685, 217029, -121138, -248215, 126806, 906579, 1099043, 989543, 375782, 318065, 1227842, 1854889, 1594845, 1162030, 1016727, 1189335, 1573660, 1479164, 854986, 783127, 1374363, 2272997, 2447034, 2074375, 2123846, 1978851, 1871843, 1972085, 1744032, 1698226, 1875364, 2516635, 2586616, 2119208, 2306146, 2970233, 2563660, 1492418, 1512187, 2266782, 3002325]
6894C002325J067167j79462j064218p26597O3629M87622L99998j52498p08109
6885B189857j095286j151639j93457O08318J031436J220156J175970M67610L24304
6876D577269N2599k00035J02390n7249M52013P74986N31619Q37608J259386J320594
6866I651180J538772K320504J391564J800501K468629L831900M289351M080109
6858C1372510N411692P297444J0256241J3551470J7948756K3341319K8940848
6851A38120280L1721741K3734210L050581j9398636l1020258k9857272k3888578
6844I2462068j8211710j4173313j1787029q955508o363177n083747m210685l291477
6836B0385422l103178j743441q88770j705614j420135j589313j739786j576706
$$ y = [3002325, 4069492, 3890030, 2825812, 2099215, 2162844, 2650466, 3050464, 2897966, 2189857, 1094571, -57068, -250525, 357793, 1389229, 2609385, 3785355, 4252965, 4577269, 4629868, 4429833, 4532223, 4474974, 4926987, 5701973, 6233592, 7071200, 8330586, 9651180, 11189952, 13510456, 14902020, 16702521, 19171150, 23003050, 27292401, 31372510, 36784202, 44081646, 54337887, 67889357, 85838113, 109179432, 138120280, 169842021, 193576231, 196626812, 177228176, 146207918, 116350646, 92462068, 74250358, 60077045, 48290016, 39334508, 32971331, 27887584, 23676899, 20385422, 17282244, 15538803, 14650033, 12944419, 11524284, 9934971, 8195185, 6618479]
6828F618479p84454m43910n85879n98153l27237L67712k04840m79644q2676j36481
6818C342917p1145L9313j7393l47123j04009Q18949M46036j7920k61205j04959
6808C723461Q6310L3309k82062n78615J43902k45187j15664L68469N70881j74839
6798C529965j11145M90679L50825o78498q13244n51838q62482m22153q6446K74955
6788A120618O94952Q55930L56165q50397j37075j90628q67253K30305J74167o23302
6778G63482N3169M39017O08812K74772K91419m80761j042244j29980J21665k74645
6768F24706r3226K31921J78527k03183L71570P08625J36819J5632K26400k87797
6758A909994j18149l10870q05965j21796N8729L03639M66001N33582k1120o19597
$$ y = [6618479, 5834025, 5390115, 4804236, 4206083, 3878846, 4246558, 4041718, 3562074, 3479398, 3342917, 3271772, 3311085, 3293692, 2946569, 2842560, 3661509, 4107545, 4089625, 3828420, 3723461, 3809771, 3843080, 3561018, 2982403, 3126305, 2881118, 2765454, 3133923, 3704804, 3529965, 3418820, 3909499, 4260324, 3581826, 2768582, 2216744, 1354262, 932109, 845663, 1120618, 1815570, 2671500, 3027665, 2177268, 2040193, 1849565, 982312, 1212617, 1386784, 763482, 816651, 1255668, 1864480, 2139252, 2430671, 1949910, 907666, 777686, 899351, 624706, 531480, 763401, 941928, 738745, 1110315, 1818940, 1955759, 1971391, 2197791, 1909994, 1791845, 1480975, 675010, 553214, 611943, 915582, 1381583, 1915165, 1894045, 1274448]
6748A274448j29311K50540K88732K93868p05794n81977q5845O32161j7183m59129
6738G60510k64942J54492O8240n97119r60382m51522o3076l58231l68542r4967
6728b175539O67846P92196M07522M03637J99778n1538K4329m86703n51522l70615
6718a140609l10070P26728J002632N19595M58494K96581O4103m41846q3208m4675
6708A047725l48520p6820k34321o10824o67443n73885j13687J446202O59167k82429
6698B45165q0282P3696k48949k34610k65198Q6522M07749J01314K96651L8819
6688D20877k98750P41544R09970j27021q47791r94588L87726L12638j011389j47783
6678f54567O71855K52899p46940q29790L12366R57350M07712n03408q67151m68471
$$ y = [1274448, 1145137, 1395677, 1684409, 1978277, 1272483, 690506, 604661, 1236822, 1219639, 760510, 495568, 650060, 718300, 121181, -839201, -1290723, -1353799, -1712030, -2080572, -2175539, -1507693, -715497, -307975, 95662, 295440, 243902, 268231, -218472, -769994, -1140609, -1450679, -723951, 278681, 798276, 1256770, 1553351, 1617454, 1175608, 1092400, 1047725, 699205, 622385, 388064, -222760, -890203, -1464088, -1577775, -131573, 527594, 245165, 164883, 238579, -10370, -244980, -510178, -423656, -15907, 85407, 382058, 420877, 122127, 863671, 1773641, 1646620, 798829, -195759, 191967, 504605, -506784, -654567, 17288, 270187, -476753, -1306543, -994177, -36827, 370885, -132523, -999674, -1468145]
6668a468145N27130R20435L5082n73359J26174O99295Q99249K59624o26558j12615
6658F86312P86300N14046p32199q59134n09670k9260J34862o94374n61435J17706
6648a146846J295409J152335L64950O74005L57513n91236q11342l42146r4751
6639H57891L44687J145953O11680l99009p72201p27912o43244m51875L8948j7304
6629a2386j10731j64575L42264K47870j60262n48324l82594K17886P33514O20824
6619G83486M42045J61414k9232k87525O61630R07375Q45848k66411j067208l30638
6609A820784n48918j89826N54514M92813l16474j07624L02363L48374n25457r54745
6599H75804j09495L21299Q91104M60469j21371j030232j596961l97844O73065
$$ y = [-1468145, -941015, -20580, 14502, -558857, -432683, 266612, 1165861, 1425485, 798927, 686312, 1472612, 1986658, 1254459, 395325, -114345, -143605, -8743, -703117, -1264552, -1146846, 148563, 1300898, 1665848, 2339853, 2697366, 2106130, 1294788, 952642, 857891, 1202578, 2348531, 2960211, 2561202, 1789001, 1061089, 417845, -34030, 4918, -12386, -123117, -287692, 54572, 302442, 142180, -406144, -788738, -570852, 162662, 783486, 1225531, 1386945, 1357713, 1070188, 1731818, 2639193, 3485041, 3218630, 2151422, 1820784, 1271866, 1082040, 1636554, 2129367, 1812893, 1705269, 2007632, 2356006, 1830549, 875804, 766309, 1087608, 1978712, 2439181, 2317810, 1287578, -309383, -707227, -34162]
6590c4162J16265m83983M01527O52274N94150P43541L218r38446n10743R6463
6580F40104l26283q60207k06163Q83476P23714J68883m0989n00801n07013M45659
6570D20380O92936P91416J32191j066965j520471j01923N36770j48015j45333
6561d09014L05146O5998n29375j55052J58327J017534M92185m15547o65306l69827
6551e04931j93686N53580J254794P08772l13077j23118k51691k93951J07430L53934
6541A298056l51808n22978M76638R06138O47532N4085o7608o619k97447j39130
6531A996859L33306J07670l48558J48843O59785Q4229q33966n77765J37866K57922
6521A966191p6335q98241p50532k76805K08146M63972K99478L19139l43403n80670
$$ y = [-34162, 82103, -401880, -353, 651921, 1246071, 1989612, 1992830, 1054384, 543641, 640104, 313821, -546386, -752549, 130927, 854641, 1023524, 982535, 481734, -25279, 420380, 1113316, 1904732, 2036923, 969958, -550513, -652436, -115666, -263681, -409014, -103868, -37870, -567245, -722297, -563970, 453564, 945749, 530202, -135104, -504931, -698617, -145037, 1109757, 1818529, 1505452, 1382334, 1130643, 836692, 944122, 1298056, 946248, 423270, 899908, 1806046, 2453578, 2507663, 2440055, 2433436, 2135989, 1996859, 2330165, 2437835, 2089277, 2238120, 2897905, 2982134, 2148168, 1570403, 1708269, 1966191, 1889856, 991615, 241083, -35722, 172424, 636396, 935874, 1255013, 911610, 330940]
6511C30940j81932N24846N17159J11145L56049K44083o50997l18261J38084L06992
6501A378108N7960J95667M14935l4805O33250Q65233M42009K50401n18297j215272
6491B469189r38849o23176L52043Q95322M10340p6373L86806O68058L60897J83918
6481D088175N6918l11424q2763j55197k41201K08080K91245Q13381O96025L42543
6471E705782K74033L21868K89068Q91921P95232N87577O40016J139070J566251
6462A2210818J661135J417520J034564J929341K847300L165508M756889O437476
6454C5460551P595919Q909501J0022903J2859687J5695089J8498419K0674249
6447A29716318J8978719J1324059Q09514r079205j6488169j9378241j8240009
$$ y = [330940, 149008, 673854, 1191013, 1302158, 1658207, 1902290, 1251293, 933032, 1071116, 1378108, 1436068, 1631735, 2046670, 2011865, 2645115, 3510348, 3952357, 4202758, 3684461, 2469189, 1530340, 907164, 1259207, 2154529, 2564869, 2488496, 2875302, 3543360, 3904257, 4088175, 4145093, 3833669, 3750906, 3595709, 3354508, 3562588, 3853833, 4667214, 5363239, 5705782, 5979815, 6301683, 6590751, 7482672, 8277904, 8865481, 9505497, 10644567, 12210818, 13871953, 15289473, 16324037, 18253378, 21100678, 24266186, 29023075, 35460551, 43056470, 51965971, 61988874, 74848561, 90543650, 109042069, 129716318, 148695037, 160019096, 160828610, 151749405, 135261236, 115882995, 97642986]
6440I7642986j5910806j3690850j1097687r331379p626525o144055n375471l893716
6432B4572497l092871k785142j808271k065408k456679j303675o94844n14550
6424I851057j15069P5685m98411r55179m07807k57911o41638j04983j34439q35313
6414E975992l12618R010K84088l91973n49272j97972l66537j55083M96103N68768
6404E360506J151739J319957J052879N31330P2735p99146j061440q54827p38886
6395F034847n77846L643m98757j999372j396223j19437K27823K82614O00805P00845
6385C258942K72040m97387o14424q6229l4976M83382Q72172K51195K09795l20470
6375C794040j40202j22580k42289L46544N98284J77682l5429j065426j478684
$$ y = [97642986, 81732180, 68041330, 56943643, 47612264, 39985739, 33841684, 28466213, 24572497, 21479626, 18694484, 16886213, 14820805, 12364126, 11060451, 10365607, 9851057, 9735988, 9811673, 9313262, 8358083, 7950276, 7692365, 7050727, 6945744, 6811305, 5975992, 5663374, 5672384, 5956472, 5564499, 5015227, 4817255, 4450718, 4295635, 4791738, 5360506, 6512245, 7832202, 8885081, 9416411, 9489146, 8690000, 7628560, 6773733, 6034847, 5457001, 5460644, 4961887, 2962515, 1566292, 1446855, 1674678, 1957292, 2558097, 3258942, 3530982, 3033595, 2419171, 2332942, 2297966, 2781348, 3653520, 3904715, 4114510, 3794040, 3653838, 3531258, 3288969, 3635513, 4233797, 4411479, 4376050, 3310624, 1831940]
6366A831940p14572n15415m35795Q47428K39442k51028q1525R5309M14346P40445
6356B170575N88204K96436j11856p6023l27924m2630M47000K49009J03680J82838
6346C479309N10274J33647n87809k60312J97946l42468m24208n73875k68930n6679
6336A806895J75467K16009R28583K12164l209m9581L15203P90775R02524Q13209
6326F108039J11315n00950l91358K83044p14602q21051o23431o22456j01120K22973
6316B950403O00105M03041K78785m65609l77851O46231P38743N35091O11253j88943
6306E731249J84480N39790l30568M29513J293028R01796Q81220J183333J813984
6297A2627825K253824K236236K242189K885314L202275L718249N843660P682339
$$ y = [1831940, 1117368, 601953, 166158, 1013586, 1253028, 1002000, 920475, 1015784, 1430130, 2170575, 2758779, 3055215, 2943359, 2867336, 2539412, 2496782, 2943782, 3192791, 3296471, 3479309, 3989583, 4123230, 3535421, 3275109, 3473055, 3130587, 2706379, 2132504, 1863574, 1806895, 1982362, 2198371, 3126954, 3339118, 3335909, 3286328, 3601531, 4392306, 5294830, 6108039, 6219354, 5718404, 5327046, 5610090, 4895488, 4074437, 3451006, 2828550, 2727430, 2950403, 3550508, 3953549, 4232334, 3766725, 3388874, 4035105, 4773848, 5308939, 5920192, 5731249, 5915729, 6455519, 6124951, 6554464, 7847492, 8749288, 9630508, 10813841, 12627825, 14881649, 17117885, 19360074, 22245388, 25447663, 29165912, 35009572, 42691911]
6289D2691911J0468031J3982022J8672597K6173647L7510022M7113958M0190184
6282B36802372K614520l7627629m6665750l8062219k7155801j8473910j4294697
6275E7136886j1751192q924090o501974m787907l670952l166531k422761j971380
6267A3940099j574401q03975q08076j967604j692662j048753n34315q2260k3991
6258E404062j36306n7449L10657L48187l8363j021995j938934j383213M91092
6249A977738J273074O42489m04949m62645j51506p85198l51337j28184m24851
6240A184631M21573K28239j043634j186001q90332k6649J499547O73703N00934
6231A362011N13581p59074p63308n0711N00647J269165L26417n00237k52733L7248
$$ y = [42691911, 53159942, 67141964, 85814561, 111988208, 149498230, 196612188, 236802372, 239416892, 201789263, 155123513, 117061294, 89905493, 71431583, 57136886, 45385694, 36461604, 29959630, 25171723, 21500771, 18334240, 15911479, 13940099, 12365698, 11561723, 10753647, 8786043, 7093381, 6044628, 5510313, 5428053, 5404062, 5267756, 5210307, 5520964, 5869151, 5830788, 4808793, 2869859, 1486646, 1977738, 3250812, 3893301, 3488352, 3025707, 2874201, 2089003, 1737666, 1609482, 1184631, 1606204, 1834443, 790809, -395192, -1285524, -1312173, 187374, 861077, 1362011, 1875592, 1116518, 353210, 302499, 803146, 2072311, 2398728, 1898491, 1645758, 1683006]
6221A683006L0239J25947M87518K37754q8741l32963m284M96028k47923j46822
6211B239759M8280R0241K91545j13664n35892r35102r77128n69934r55620K1768
6201a395747Q46276M63195M75785J063387P74005o1968k09582q49876l86952K75770
6191I94293N52520J166672N54503p52608m22263J59084N899M608o8268j464407
6181G30033p79495m09530L97073N1874K75332P96975M9873m7659R6142N04734
6171A665352M5830n27008n16136j30258R1725K89247J38503J44993K25432q5429
6161A342251k2154k01182k23123J61912k46590l44674l33338m83260j94938L64561
6151a80535Q59931q4233J46702J140521J181893J72967m30786q99375q03133l17605
$$ y = [1683006, 1713245, 1839192, 2326710, 2564464, 2475723, 2142760, 2138476, 2634504, 2386581, 2239759, 2288039, 2378280, 2669825, 2556161, 2020269, 1085167, 108039, -461895, -1417515, -1395747, -549471, -86276, 389509, 1452896, 2226901, 2164933, 1955351, 1105475, 718523, 994293, 1546813, 2713485, 3267988, 2515380, 2093117, 2252201, 2258100, 2262708, 2194440, 730033, -49462, -458992, -61919, -10045, 265287, 1062262, 1112135, 1064476, 1160618, 1665352, 1711182, 1184174, 668038, 537780, 629505, 918752, 1057255, 1202248, 1427680, 1342251, 1320097, 1118915, 895792, 1057704, 811114, 466440, 133102, -350158, -545096, -180535, 679396, 595163, 741865, 1882386, 3064279, 3237246, 2806460, 1907085, 1103952, 786347]
6141G86347k02463l8038N88839J94428n1056m9326K27180M16020L00775n26435
6131A646271r37541l70201J10891R3976k66877n24865J58793M00779n63900q2408
6121c35082M44979O81760L58588n32184o06267l2843L13951P43250L04550K2538
6111A363240J28359m1148L71168K09101k87065l04830n48237O56221J02679l76415
6101A273073N06422L48988l09796j2587K87616L9168j4039l22344q45183o00953
6091C50365j11168L27147K40832J70923L55401R64401R35154j39132q05454n92301
6081A696168p63405q82151n32542o4455N43741O52374p8289n62519M55200J527911
6071A992033O90310j31064o59600j257233q38808k45312k86466P1858M07123r7248
$$ y = [786347, 583884, 545846, 1134685, 1329113, 1278057, 1228731, 1455911, 1871931, 2172706, 1646271, 708730, 338529, 449420, 543396, 276519, -248346, -89553, 311226, -252674, -335082, 109897, 791657, 1150245, 618061, 11794, -21049, 292902, 1036152, 1340702, 1363240, 1491599, 1450451, 1821619, 2030720, 1743655, 1438825, 890588, 1546809, 1649488, 1273073, 1779495, 2128483, 1818687, 1806100, 2093716, 2132884, 2118845, 1796501, 951318, 350365, 239197, 566344, 807176, 978099, 1333500, 2297901, 3233055, 3093923, 2288469, 1696168, 932763, 50612, -481930, -546385, -2644, 649730, 571441, 8922, 464122, 1992033, 2682343, 2551279, 1891679, 634446, -204362, -449674, -736140, -664282, -257159, -354407]
6061c54407k48804J02982P01851J073612P75500K30570j96848n27768r32737j263560
6051f39609o98399M25192O31968Q16652O54123J09405n86355l51522P9736j36584
6041C04607m14914m02896p56181n23862J184173J069760P0271o19322l07393M09322
6031A3565M9255M15978J288128J039926j60776p42581m59182l29416p60360j58911
6021A95626L16088K57589R82229M2515j013023o16744l4192M85666L97081K7995
6011A040830K3532l61158m17042m46040o49492k86635L81611Q8329o9315J6546
6001f78834J38827J17778M41269J69637l38205m92229q91943K9759P39869J014318
5991B50246M67172j02393O0715O2079m1210O21101P06953K90228n15747q63280
$$ y = [-354407, -603211, -500229, 201622, 1275234, 2050734, 2281304, 2084456, 1556688, 623951, -639609, -1338008, -912816, -280848, 535804, 1189927, 1299332, 712977, 361455, 441191, 304607, -110307, -513203, -1269384, -1793246, -609073, 460687, 530958, -88364, -395757, 13565, 62820, 478798, 1766926, 2806852, 2646076, 1903495, 1444313, 1114897, 354537, 195626, 511714, 769303, 1751532, 1794047, 781024, 164280, 130088, 615754, 1012835, 1040830, 1064362, 703204, 286162, -159878, -809370, -1096005, -714394, -626065, -695380, -678834, -540007, -422229, 19040, 188677, -149528, -641757, -1533700, -1503941, -764072, 250246, 717418, 615025, 675740, 737819, 696609, 1317710, 2024663, 2314891, 1799144, 935864]
5981I35864p20015p8389Q10386J040983N6266o63178j187275j053296j90599Q4625
5971i64628L45526O05166P95146M26079K44331L67778K5931l92213m55775l35705
5961F61636m19761o9663J14926l04064r0768J86855O47354M18058n21131l86124
5951B37318L72288M50687N37158O7625p29719n50082j64548J83638N66690q1963
5941H89092m75868m41442j25945K44412J097885O12529n2893J00461o54499j510429
5931c16697n23681N77041M71006p4388J39896L72391N04292R2911l41306m90638
5921D10827k93638J81052J51141J40317J6537m218j49512j7138O61540O31140
5911A728048j992o58225p89132m82926r2698j81277K35024L63758k34793k49828
$$ y = [935864, 215849, 137460, 947846, 1988829, 2045095, 1381917, 194642, -858654, -1049253, -964628, -619102, -13936, 781210, 1207289, 1451620, 1819398, 1845329, 1453116, 997341, 661636, 241875, 172212, 287138, -16926, -107694, 79161, 726515, 1144573, 623442, 237318, 609606, 1060293, 1597451, 1665076, 935357, 385275, 220727, 404365, 971055, 889092, 413224, -28218, -154163, 90249, 1188134, 1800663, 1747770, 1848231, 1193732, -316697, -840378, -263337, 207669, 133281, 273177, 645568, 1149860, 1242771, 901465, 410827, 117189, 298241, 449382, 589699, 606236, 602018, 452506, 435368, 1096908, 1728048, 1726056, 1067831, 278699, -204227, -296925, -478202, -243178, 120580, -114213, -364041]
5901c64041m3669P53362N77002M14570M10384k25342l14686m46548o42055m50048
5891c31071k27346n74841k25372k38239k07716n26907k2126Q61275R55343P86207
5881B49207m31429n88547M9243M59550J55661J33240O11864N30432K36084N89425
5871A994730J12846o14079l20668K81238M51783P9548m85900K46849O36302k71773
5861B110876o80403k45826K3318K77084k09130m26838n4869p2160r5927J04216
5851G30341j21927J19920q7193m42792M02495Q50544Q9551r293j21340K06651
5841A616957K99474q82976r05693j13969m36503m41130k53247j71870J99820L39305
5831g49832L3844p28234L01621J329421N93318j82870m01831n11184l0002J91185
$$ y = [-364041, -407710, 345652, 922654, 1337224, 1747608, 1522266, 1207580, 761032, 118977, -331071, -558417, -1133258, -1358630, -1596869, -1804585, -2331492, -2353618, -1492343, -537000, 249207, -182222, -770769, -721526, -261976, -106315, 26925, 638789, 1169221, 1405305, 1994730, 2107576, 1493497, 1172829, 1454067, 1905850, 1985398, 1499498, 1746347, 2382649, 2110876, 1430473, 1184647, 1207965, 1485049, 1275919, 849081, 794212, 722052, 626125, 730341, 608414, 728334, 641141, 198349, 600844, 1451388, 1540939, 1531646, 1410306, 1616957, 1916431, 1033455, 127762, 13793, -422710, -863840, -1117087, -1288957, -1089137, -749832, -715988, -1444222, -1142601, 186820, 780138, 597268, 195437, -315747, -345749, -154564]
5821a54564p03887l35452l63080M05480Q23160M8774l05218K5561L97507L49492
5811A87773K5161k03486J217623R37907n1374k97496O50562O01725N3108P17059
5801C838562L20552L771l55918l57998n68219o74276j63213r8974L46211M62155
5791B752653m20009p85659l59714K37100Q78946J48467n8135K80518q3388l79164
5781B211615k69330K69079J71252J96715P14546P86219k1309J25047J10798k50140
5771D044492j205991j032743m28111p75034j35545K96844Q30573J595035M15049
5762C604569l70972p9127n95792k00005J71397J5522J57610J053422J310501N70340
5752E637465j26012n23012r61866K3673O38465R54408Q34619P57328N24903O77653
$$ y = [-154564, -858451, -1193903, -1556983, -1151503, -328343, -279569, -584787, -559226, -161719, 187773, 212934, 9448, 1227071, 2164978, 2113604, 1816108, 2466670, 3068395, 3121503, 3838562, 4159114, 4162885, 3806967, 3448969, 2880750, 2206474, 2043261, 1944287, 2290498, 2752653, 2332644, 1546985, 1187271, 1424371, 2303317, 2451784, 2393649, 2674167, 2590779, 2211615, 1942285, 2211364, 2382616, 2579331, 3293877, 4080096, 4058787, 4183834, 4294632, 4044492, 2838501, 1805758, 1377647, 602613, 467068, 763912, 1594485, 3189520, 3604569, 3233597, 3154470, 2558678, 2358673, 2530070, 2545592, 2703202, 3756624, 5067125, 5637465, 5511453, 4988441, 4026575, 4050248, 4688713, 5643121, 6477740, 7235068, 7759971, 8437624]
5742H437624O55177P74689J031736J076664J233425K056449L627706M366510M959233
5733B8219213N475949P022132R522300J2401199J6607289K3144970L3180080M3073282
5725A78646414M3875031J7856944k4676122m4704551m0684803l1040060k2813016
5718G6459837j6593392j2377608r201753o025030m604712m734182m323762k127998
5710A6471400j144002j678895j951271j995240j544619q83242q67493o99692l31007
5701E375939K03881J47618o89843j222665m40113P64875L24511K55634n88264
5692D131573j055681p0552J122010N23813k16255k33959j221167j06579P72170
5683C645373J79549j265322j120770m29162j48913j31928j20293m07617k15091
$$ y = [8437624, 9092801, 9867490, 10899226, 11975890, 13209315, 15265764, 18893470, 23259980, 28219213, 33695162, 40717294, 50239594, 62640793, 79248082, 102393052, 135573132, 178646414, 222521445, 240378389, 215702267, 170997716, 130312913, 99272853, 76459837, 59866445, 47488837, 38287084, 32262054, 27657342, 22923160, 18599398, 16471400, 15327398, 13648503, 11697232, 9701992, 8157373, 7274131, 6406638, 5706946, 5375939, 5579820, 5727438, 5037595, 3814930, 3374817, 4139692, 4464203, 4719837, 4131573, 3075892, 3005340, 4127350, 4651163, 4434908, 4200949, 2979782, 2873203, 3645373, 3824922, 2559600, 1438830, 1009668, 860755, 728827, 608534, 200917, -14174]
5674a4174J6295M613L08255Q41232J315790L65884r39212q72893j59041Q37066
5664A703815J390895J195858J4281r91393m93657N3049K04838n01747p5956J87878
5654B687861j05897o2497l72018l01919k75362n35913n45332m75368N67714K04767
5644G86036m33356k15101j12746K38284j28875K66250O72941M56350j61492m65725
5634I02566m23778K62127n6876l15809R16067P9785j41596j44793k56984M56413
5624A277122K81998n21853p44245j11488J56896P7535J247720R20782M63039j15674
5614B931832p45509j89877J558q94642j138842j37407P19566K82192l14837L95656
5604I09690M45157K85998M15195p8612K21787k01367o50696m41211m43869j42063
$$ y = [-14174, 2121, 6734, 314989, 1156221, 2472011, 2837895, 1898683, 1025790, 866749, 1703815, 3094710, 4290568, 4304849, 3313456, 2819799, 2872848, 3077686, 2575939, 2499983, 2687861, 2581964, 2519467, 2147449, 1845530, 1570168, 1034255, 488923, 13555, 581269, 786036, 352680, 137579, 24833, 263117, 134242, 400492, 1073433, 1529783, 1368291, 902566, 478788, 740915, 684039, 368230, 1284297, 1364082, 1222486, 1077693, 820709, 1277122, 1559120, 1037267, 293022, 181534, 338430, 415965, 1663685, 2584467, 3047506, 2931832, 2186323, 1996446, 1998004, 1103362, -35480, -172887, 546679, 828871, 514034, 909690, 1354847, 1640845, 2056040, 1977428, 2199215, 1997848, 1347152, 905941, 462072, 320009]
5594C20009J77606N76824l9590l30127j76615l50102j62013q38467j80012P73890
5584b28597P42954N37704l6231j73143N64913N65379l04597j091787j265098j19988
5574h08491Q71589N86692j4266K02573N74613K40070q88928n14212L59725K87201
5564H96566Q80774Q86715r9216r07312n48083m83381j154936k7042J034114N71724
5554A049923J56477K40340p16969r01855l57902M60372Q16908J07111J04024O90315
5544A648744O0610l37264J3657l77459K06688j46288n68053L07823K31019l42656
5534F96821l44569j76852m35890n35241m2532Q66918P71222m84439q7987O17680
5524H45131N77146R89069M33692P3623k4716j82833l88396K60762N24432J039227
$$ y = [320009, 497615, 1074439, 1034849, 704722, 528107, 178005, 15992, -822475, -1002487, -228597, 514357, 1052061, 1015830, 842687, 1407600, 1972979, 1668382, 576595, -688503, -808491, 63098, 649790, 635524, 838097, 1412710, 1652780, 763852, 249640, 609365, 896566, 1777340, 2664055, 2564839, 1657527, 1109444, 626063, -528873, -555915, 478199, 1049923, 1206400, 1446740, 729771, -172084, -529986, -69614, 747294, 854405, 958429, 1648744, 1709354, 1372090, 1385747, 1008288, 1214976, 1068688, 500635, 808458, 1039477, 696821, 352252, 175400, -260490, -795731, -838263, 28655, 799877, 315438, 227451, 845131, 1422277, 2411346, 2845038, 2918661, 2893945, 2711112, 2322716, 2583478, 3107910, 4147137]
5514D147137P2770j526194j738548q13637M02100R41814K06508j00875k75377
5505A315698L79602Q91033O69046o49m58823J96675L2892j31637j82386k9186
5495B682265J89776L49884J76267K14815P86117M19890m58679p21572P5263J90960
5485C904986j35306m16294m93982j02508k06934M95752J022664O58264L76650
5476E103292O03300k79855Q7094M25170J20707M82323K81943j1816k3376j63532
5466F625250J20084L61834L80259K321738L015642K439423K687292L066185L746948
5457B4764655M668017O332927Q278051J1450795J5723508K2022559L2253106M4788301
5449A70281919N2786116L2753214j8878782n0074683m6686336l4556419k4236057
$$ y = [4147137, 4219907, 2693713, 955165, 141528, 543628, 1485442, 1691950, 1591075, 1315698, 1695300, 2586333, 3255379, 3254730, 2795907, 2992582, 3025474, 2893837, 2711451, 2682265, 2872041, 3221925, 3398192, 3613007, 4399124, 4819014, 4360335, 3638763, 3714026, 3904986, 3769680, 3353386, 2859404, 2756896, 2549962, 3045714, 4068378, 4726642, 5103292, 5706592, 5426737, 5513831, 5939001, 6059708, 6542031, 6823974, 6812158, 6788782, 6625250, 6745334, 7107168, 7487427, 9809165, 12824807, 15264230, 17951522, 21017707, 24764655, 29432672, 35765599, 44043650, 55494445, 71217953, 93240512, 125493618, 170281919, 223068035, 255821249, 236942467, 186867784, 140181448, 105625029, 81388972]
5442H1388972j6536246j1818150r060649p020966n500956l727382l369076k943962
5434B1411585k183449k276861j715957r01187j260408j447732j107139k74890
5426A0243962j5083m83341j641274j527738r56120q43081k9595J175934N44767
5417F468431p9268k55585o96989k09536P70616J003603r7515r03583j032109O6945
5407E035010J179430R03949R7265N55501P79601L3049m56779j082284j069501
5398E975241j006402n62035o77224q84624m79397n5404K79970p11543j116142
5389G62440p10326l74286K79147L67603Q25346O69895M98274P89750P51066L8127
5379C897036J99671P87829j06754o00379o34588k43330Q85534K98071o07467R7747
$$ y = [81388972, 64852726, 53034576, 43973927, 36952961, 31452005, 27724623, 24355547, 21411585, 19228136, 16951275, 15235318, 14334131, 13073723, 11625991, 10518852, 10243962, 10228879, 9745538, 8104264, 6576526, 5620406, 4777325, 4747730, 5923664, 6468431, 6389163, 6133578, 5436589, 5227053, 5997669, 7001272, 6903757, 6000174, 4968065, 5035010, 6214440, 7118389, 7215654, 7771155, 8550756, 8583805, 8127026, 7044742, 5975241, 4968839, 4406804, 3729580, 2844956, 2365559, 2310155, 2590125, 1878582, 762440, 52114, -322172, -43025, 324578, 1149924, 1819819, 2318093, 3107843, 3858909, 3897036, 4096707, 4884536, 4777782, 4177403, 3542815, 3299485, 4185019, 4483090, 3875623, 3973370]
5369C973370J03336n95945k88632k19930P224N22301K57913j94943K04639Q03198
5359D572531O25881K96158M96997P52564M6105m98750n48975m5529Q46465J198534
5349G741981O09493j79161l92132n88156m26507M23417L3068J24584N83331J94756
5339H124674J52149K09213P44868J241446J021875M36515J147431J603983R21910
5330A5604064L36513K166930L301950L700512L809794M502610O747111Q663462
5322D8832946J0358148J2909664J8083593K3246100L0783513M3073196N6206392
5315B43493552O1954089M8355581K1337867O889653j19822k8236474o1311164
5308B92363282o5927802n1956660l7393949k6594617k0229103j6580300j3004159
$$ y = [3973370, 4076706, 3480761, 3192129, 2972199, 2979423, 3501724, 3759637, 3564694, 3769333, 4572531, 5198412, 5494570, 5991567, 6744131, 6790236, 6291486, 5742511, 5696982, 6543447, 7741981, 8351474, 8172313, 7780181, 7192025, 6765518, 7188935, 7222003, 7346587, 7929918, 8124674, 8276823, 8486036, 9230904, 10472350, 11494225, 11930740, 13078171, 14682154, 15604064, 15940577, 18107507, 21409457, 25109969, 28919763, 33422373, 40169484, 48832946, 59191094, 72100758, 90184351, 113430451, 144213964, 187287160, 243493552, 305447641, 353803222, 375141089, 382030742, 381910920, 353674446, 292363282, 226435480, 174478820, 137084871, 110490254, 90261151, 73680851, 60676692]
5301F0676692j0254148p758480o043708m996828l358057k455411k169954k261294
5293B1378812k718202l229587k260570j108057j175705j739604j776374j132398
5285F238315k73348k18288n02072j44028K93158L65118M8001j7715j23929K9874
5275E695086j8491q7313k45724k99243k77787k25725m93519k26955M10263L58827
5265D589419O733n63592j23645j74681j223377j359883j81834N82810N02996m88406
5255A566540m51257K54119L17577J23332K20602M26776O12398k93218n09278k45224
5245B022367q27506m18455M36876P6678J82360M81145P61342R36668k842o64008
5235B984625n06260j07057q9235M23490R7602j324566o91018O76904J168514K25639
$$ y = [60676692, 50422544, 42664064, 36620356, 31623528, 28265471, 25810060, 23640106, 21378812, 18660610, 15431023, 13170453, 12062396, 10886691, 9147087, 7370713, 6238315, 5964967, 5746679, 5244607, 5100579, 5393737, 5758855, 5806856, 5789141, 5665212, 5695086, 5676595, 5589282, 5343558, 5044315, 4766528, 4540803, 4047284, 3820329, 4230592, 4589419, 4596152, 4032560, 3908915, 3734234, 2510857, 1150974, 969140, 1551950, 2054946, 1566540, 1115283, 1369402, 1686979, 1810311, 2030913, 2457689, 3070087, 2776869, 2267591, 2022367, 1194861, 776406, 1213282, 1289960, 1472320, 1953465, 2714807, 3651475, 3648633, 2984625, 2478365, 2371308, 2282073, 2705563, 2803165, 1478599, 787581, 1464485, 2632999, 2858638]
5225B858638j89667l85275q60639p87467m76524r268M94277L27332K8610O26262
5215A626279K80816k62972N4189L5853J55209J65181p2352j61870n84501p54690
5205D81142n00562M65414N11291k27785n68787J84200L09419n50352m60005O56514
5195C00489N56003Q0355q5837Q04374O39088Q30106P08490l79064j208106j028374
5185A217524k1539K08562o8212j76997p68518o65950k08986J08212J34164r005
5175b50745l53597r16102q41837m801J154306O49571K21380J57440n992j74030
5165c64407k09338N33665M43989K9172K43110J08374o86128o52488o10466k49055
5155a413572n4831k94486n01244O10006J377379J094314M37353o73350p90857
$$ y = [2858638, 2668971, 2283696, 1423057, 635590, 159066, 149798, 644075, 971407, 1000017, 1626279, 1907095, 1644123, 1698312, 1734165, 1889374, 2054555, 1982203, 1820333, 1235832, 481142, -19420, 445994, 957285, 729500, 160713, 344913, 654332, 103980, -356025, 300489, 856492, 936847, 851010, 1655384, 2294472, 3124578, 3833068, 3454004, 2245898, 1217524, 1195985, 1404547, 1336335, 1159338, 390820, -275130, -484116, -375904, -241740, -250745, -604342, -1520444, -2362281, -2367082, -1212776, -563205, -341825, -184385, -190377, -364407, -573745, -40080, 403909, 433081, 676191, 784565, 98437, -554051, -1164517, -1413572, -1468403, -1762889, -2264133, -1654127, -276748, 817566, 1254919, 581569, -209288]
5146b09288l83011m34360l97139m59518n58948M40319J081277J231667M1128j52482
5136A99645k17060l39566o7793N08048L81889K26556M57287j1354m15989n73512
5126A48151m37226n14710p72241o9395M67646k60197l27001M30022M11329L21934
5116f01688M06633O74557M44210n4628L54311J45449r08820o16619O02381j3195
5106D32591l51973M7386j22216l26383n21268J58902K656o72136m29543q8096
5096a870080K60162M40665L22720K31526M76016O7677J42116K32780O10733R31824
5086A846139N80192K02083R0346L20557m24408p03069n00066o37234m93389N40754
5076H21905L26585J76973K21751L54128J4091q73744p23473m14968k19624j85781
$$ y = [-209288, -592299, -1026659, -1423798, -1883316, -2442264, -2001945, -920668, 310999, 352127, 199645, -17415, -356981, -424774, 83274, 465163, 691719, 1149006, 1137652, 721663, 148151, -289075, -803785, -1576026, -1645421, -1177775, -1437972, -1764973, -1334951, -923622, -601688, -195055, 479502, 923712, 869084, 1223395, 1368844, 460024, -156595, 445786, 432591, 80618, 128004, 5788, -320595, -841863, -682961, -680305, -1352441, -1781984, -1870080, -1609918, -1169253, -846533, -615007, -138991, -71314, 70802, 303582, 914315, 1846139, 2426331, 2628414, 2718760, 3039317, 2614909, 1911840, 1411774, 774540, 281151, 821905, 1148490, 1325463, 1547214, 1901342, 1915433, 1041689, 318216, -96752, -316376, -502157]
5066e02157K7041L4419K72525K58712J65419K72009K82684K11442l69215n42162
5056A10717k12876O90529M84011j60956j005174j016828n52323p98979j75240
5047b637119M81498J125859J191063j6137m61681j63824j27395q2504p37527j08538
5037a536305Q27649M06432N37720P20612J93859p48598o32963m13212j8511l0151
5027f93468J99383k40403j99885O27600m13713q3341R59168O56767P5197j05613
5017G81692J34144j00907K63055K88646m31549p23249q4016q8970j13298j48878
5007b23330l4932K46475K36649m98825K54541J145301k87840r35031K7436J27546
4997E7990o02778o3458J56692L18316P18222P62859l75814j086537j98494K79134
$$ y = [-502157, -475116, -440697, -168172, 90540, 255959, 527968, 810652, 1022094, 652879, 110717, -102159, 588370, 1072381, 911425, -93749, -1110577, -1662900, -2461879, -2637119, -2155621, -1029762, 161301, 145164, -316517, -480341, -607736, -690240, -1427767, -1536305, -708656, -302224, 235496, 956108, 1149967, 401369, -231594, -644806, -663317, -693468, -494085, -734488, -934373, -306773, -720486, -803827, 155341, 812108, 887305, 781692, 915836, 814929, 1077984, 1366630, 935081, 211832, 127816, 38846, -74452, -223330, -258262, -11787, 224862, -273963, -19422, 1125879, 838039, -96992, -69556, 57990, -544788, -608246, -451554, -133238, 584984, 1347843, 972029, -114508, -313002, -33868]
4987c3868k19436o9009K22070l98551k69237L56436N49752P77p71702J26881K97459
4976b08428K68500K14989q000O98776O41948j84074m62655j75430n27803J98723
4966D56546N5184j077325m25942Q9322o1966L43392N57229K14258M6837j91241
4956F294p6166Q7316J67028P9222M35874l0386r0754L71935j43612L56132R53270
4945B116153L42429k53994K79823k3869q65920N2535P19041Q02991J746330K333701
4935G249220J600198r75476k433938j772567o64353p26115n94556o62454m82910
4926E37049j16582M64884K00192l12159q12855l55144P5728k04648p960K46680
4916b84815k6069j03208o14126l64748J029239J307814K07595o42990L25688M92471
$$ y = [-33868, -253304, -322313, -100243, -498794, -768031, -411595, 138157, 138934, -632768, -505887, -208428, 60072, 275061, 267061, 965837, 1607785, 1423711, 961056, 785626, 257823, 456546, 511730, -565595, -991537, -902215, -964181, -620789, -63560, 150698, 197535, 6294, -69872, 17444, 184472, 263694, 699568, 669182, 578428, 950363, 806751, 1162883, 2116153, 2458582, 2204588, 2484411, 2460542, 1594622, 1647157, 2366198, 3169189, 4915519, 7249220, 8849418, 7873942, 5440004, 3667437, 3003084, 2276969, 1682413, 1019959, 537049, 420467, 885351, 1085543, 773384, -39471, -394615, -318887, -523535, -531495, -284815, -310884, -414092, -1028218, -1392966, -363727, 944087, 1151682, 508692, 834380, 1326851]
4906A326851r6843k69066k35851l41868J29809k2988J96559n15800p21612p51743
4896a302552j28561J70704k24343j81264m83875L65400J231466M40159M16357
4887C03491L89529l10254p41194p02732K4679m7612o30359l66858j49000N08571
4877a721739L36665j12089K50458l41101n54564M28660O05392O41837J49863N21398
4867B04780K74750J26026J76742m94635m20131K08382K8338k85746k7557J87568
4857b1483j57842n82882L4716R13366n3542j581277r96573M03534L54904P81084
4847i05995R83308M73617K61315q4349j6806m08p08075p12021J21110N0843K11591
4836c25870M85910M16703l1817k39870j30225l19959m4818J31378P7357j02136
$$ y = [1326851, 1230008, 960942, 725091, 383223, 513032, 490044, 686603, 170803, -550809, -1302552, -1431113, -1260409, -1484752, -1666016, -2149891, -1784491, -553025, -112866, 303491, 693020, 382766, -358428, -1061160, -1036481, -1084093, -1714452, -2081310, -2230310, -1721739, -1385074, -1497163, -1246705, -1587806, -2142370, -1713710, -1108318, -466481, -316618, 204780, 479530, 605556, 782298, 287663, -132468, 75914, 104252, -181494, -209051, -21483, -179325, -762207, -727491, 185875, 132333, -1448944, -2445517, -2041983, -1687079, -905995, 77313, 550930, 812245, 727896, 711090, 710682, 2607, -709414, -588304, -537461, -325870, 160040, 576743, 544926, 305056, 174831, -145128, -189946, -58568, 18789, -83347]
4826h3347k79129l27709J51152Q42007J134140P02439L46589l96537n82015l29063
4816A178527o04627l03796j3688K66606N05192k85782n22884l88590J93104j065791
4806a041729n21673J030781M37269N60383O18287r9523K14228m92644j339483
4797f34104K10957J124568R9267N98440P67088J56441m32028j003010p43569q2572
4787F1478O36023L34789m6088m36914o27580o62623K340O96464K56183k2387P37366
4776I29051N7535o18601l47182O28366m56147k7326O85741L13290M02721p8572
4766A488876o87285r68086l41055L41353k05172k13661L0558K29358L01089j134694
4756a158719j336438j32187L95268O42258L54707n8062N372Q02586Q66690P37077
$$ y = [-83347, -362476, -690185, -539033, 302974, 1437114, 2139553, 2486142, 2089605, 1507590, 1178527, 573900, 270104, 256416, 523022, 1028214, 742432, 219548, -169042, 24062, -1041729, -1563402, -532621, -95352, 465031, 1083318, 983795, 1198023, 705379, -634104, -423147, 701421, 800688, 1399128, 2166216, 2322657, 1890629, 887619, 144050, 61478, 697501, 1032290, 986202, 549288, -78292, -740915, -738575, -42111, 214072, 191685, 929051, 986586, 367985, 20803, 649169, 193022, 165696, 851437, 1164727, 1567448, 1488876, 801591, -166495, -507550, -166197, -371369, -585030, -554472, -325114, -24025, -1158719, -2495157, -2627344, -2232076, -1589818, -1235111, -1293173, -1287801, -485215, 381475, 1118552]
4746A118552M99854r3398L51348o41804j381653j033360J73514P92435R9645n61562
4736f76429m95723L10837K79366L36237J9501J4307K20766J78223l64629m34803
4726f12347k84183q3942K25052k37390r18766N75029O74971l99817l48970k48698
4716a659061L66559K62279r28638l81778O11921M04971q15007r55254l12868N52637
4706b854239Q26879L29953M07163R64530O09227m31318p40494n68991K14509Q35499
4696d07282L93270M0094j55376n23489n9747l81444m63836J562115K047558O39588
4686B691451J1033J02753p47892j511476j007419J51902N11195m3304l87119L83598
4676A54722j81615n84570n92665p16805M1250R05126K03597r7328R02136P58067
$$ y = [1118552, 1618406, 1525008, 1876356, 1234552, -147101, -1180461, -1006947, -214512, -114867, -676429, -1172152, -861315, -581949, -245712, -226211, -211904, 8862, 187085, -177544, -612347, -896530, -980472, -755420, -992810, -1911576, -1336547, -661576, -1061393, -1410363, -1659061, -1292502, -1030223, -1958861, -2340639, -1728718, -1323747, -2138754, -3094008, -3406876, -2854239, -2027360, -1697407, -1290244, -325714, 283513, -147805, -888299, -1457290, -1242781, -407282, -14012, 26082, -129294, -652783, -712530, -1093974, -1557810, 4305, 2051863, 2691451, 2702484, 2805237, 2057345, 545869, -461550, -309648, 201547, 158243, -228876, 154722, -26893, -611463, -1204128, -1920933, -1879683, -974557, -770960, -868288, 33848, 791915]
4666G91915N45512Q32199N49820K19611j81577j30053l93785n59858p45389o16351
4656C12044N54989j42299o76908o31124m69918n6161J4538q21776o37862j7338
4646b571815M70028J83118K6338j34816M68804R61804N75996n93545L55117J470595
4636A211624K85421q85161q06216p86141m19671m56615r076J091512R39228R3240
4626B58145N89592J020632O2236r49021p03465M5633K52079J246029O15298n00723
4616A936435p42956j091146j182601l22865M21004J270821P41576k58204N1185
4607H23249K41815J52438k18609l7772o18619r29942m55786p09181p70377p38291
4597c261075K44057Q80864J275496J359887R97340M333J9557k07860n31870j55195
$$ y = [791915, 1337427, 2169626, 2719446, 2939057, 2757480, 2627427, 2233642, 1673784, 928395, 312044, 867033, 724734, 47826, -583298, -1053216, -1109377, -1094839, -1916615, -2554477, -2571815, -2101787, -1918669, -1892331, -2027147, -1558343, -596539, -20543, -614088, -258971, 1211624, 1497045, 611884, -194332, -980473, -1400144, -1856759, -1865835, -774323, 164905, 258145, 847737, 1868369, 1930605, 981584, 278119, 323752, 575831, 1821860, 2437158, 1936435, 1193479, 102333, -1080268, -1403133, -982129, 288692, 1030268, 772064, 823249, 1065064, 1217502, 998893, 961121, 342502, -587440, -1043226, -1752407, -2522784, -3261075, -3017018, -2136154, -860658, 499229, 1496569, 1500902, 1520459, 1312599, 780729, 625534]
4587F25534m29564m66527o12344q12118n26710L61963N00681P82751N22353O73553
4577F19572R18786L51548J60742l800N5711j27362j44629K23740l61853q29745
4567H62710L5082j2636j53152Q024k19943J6660O45679L2041o09260l16328j44928
4556A43949N19873P77515j9394l63163j62389l55273j78371j75725M76199K74810
4546I38031n22559j063243r46989m43880J55138o6903m61516N65373N77935l9821
4536a308434K39471K37679K2844r4678j2568K67250q4925K28377N46423O4309
4526A05748P34926P41495n787m61579l60348K99574J53991n39678m22449J86090
4516D31983n0289o22864m31090M07053K25125l09847n8958K98646N4397j8780
$$ y = [625534, 195970, -270557, -882901, -1695019, -2221729, -1859766, -1359085, -576334, -53981, 619572, 1538358, 1889906, 2050648, 2046848, 2102559, 1975197, 1830568, 2054308, 1692455, 862710, 897792, 885156, 732004, 740028, 520085, 536745, 1182424, 1214465, 605205, 288877, 143949, 663822, 1441337, 1421943, 1058780, 896391, 541118, 362747, 187022, 663221, 938031, 415472, -647771, -1594760, -2038640, -1883502, -1950405, -2411921, -1846548, -1268613, -1308434, -1068963, -831284, -808440, -903118, -915686, -648436, -733361, -504984, 41439, 105748, 840674, 1582169, 1576382, 1114803, 754455, 1054029, 1208020, 668342, 245893, 431983, 381694, -241170, -672260, -265207, -40082, -349929, -408887, -110241, -55844, -74624]
4506g4624k01967l87670K7145J12492p42079q15622L74797Q32464Q20508K92743
4496B38187p79995m8826K18528o3908k18193p9054L60262R44032J092694N85336
4486B249063j195364j507365l56828J278072J623538R27245J92861l01348q71010
4477B038864o09824j31706l44904l97743m06725N8802k62403m2266O170o22480
4467g14215r14434J28905M71471k9548l85609N01857P23013L334m06498O4192
4457e57532K34342l46766N26291O97873J16833k65554q2534M95241J01518Q5687
4447A005399J99265j63168j79385R3210m19601p49722r10056r92667k16292O72158
4437a660859Q45921J002793L57231k17714j074270o14678O10246M55262J058291
$$ y = [-74624, -276591, -664261, -637116, -524624, -1266703, -2082325, -1707528, -875064, -54556, 238187, -541808, -590634, -372106, -436014, -654207, -733261, -372999, 571033, 1663727, 2249063, 1053699, -453666, -810494, 467578, 2091116, 3018361, 3211222, 2909874, 2038864, 1429040, 1297334, 952430, 554687, 147962, 206764, -55639, -97905, -91735, -714215, -1628649, -1499744, -1028273, -1057821, -1443430, -941573, -218560, -215226, -621724, -557532, -323190, -669956, -143665, 554208, 671041, 405487, 322953, 818194, 919712, 1005399, 1204664, 1041496, 862111, 955321, 535720, -214002, -1124058, -2116725, -2333017, -1660859, -814938, 187855, 545086, 327372, -746898, -1361576, -751330, -296068, 762223]
4428G62223J196532J83527n75763o18178j247329j523476p59145J64336J374707
4419a042566J263180q77o74533K50566R3557j011448l38338L01132Q95736J206542
4409I42951P0724j84046k8057J67328J85936K36674r7380j134237j548788r99572
4399b388467k83913k7019K09465M78658P24298Q64191K53679k96933J86938k55554
4389e34657m79321n85074j63258P76537L38594K87239P82208J018239j03286r17471
4379D19750o62336r403L78800J27668L35763N67035k19830o69854m78848K72031
4369F0776P1659n76527m74554K92160O0650J72532N50456o67854n42856Q4493
4359i69065O12842j71183N4555P656q83800j082308r96511k04128L11252N02806
$$ y = [762223, 1958755, 2142282, 1566519, 948341, -298988, -1822464, -2581609, -2417273, -1042566, 220614, 219737, -454796, -204230, -110673, -1122121, -1460459, -1159327, -263591, 942951, 1013675, 829629, 801572, 968900, 1154836, 1391510, 1294130, 159893, -1388895, -2388467, -2672380, -2699399, -2489934, -2011276, -1286978, -422787, -169108, -466041, -279103, -534657, -1013978, -1599052, -1762310, -985773, -647179, -359940, 422268, 1440507, 1337221, 419750, -242586, -251989, 126811, 254479, 590242, 1157277, 937447, 267593, -211255, 60776, 132435, -444092, -918646, -626486, -565836, -393304, 157152, -510702, -1053558, -969065, -356223, -527406, -472851, -465195, -1348995, -2431303, -3427814, -3631942, -3320690, -2817884]
4349b817884J571800J565311N79434k69555P9351O42612K02585m24894j008848
4340A19912q09316k61106j26737J21245M9722l1393M4617O22169J113918J92852
4330A035883r03077o99980N73785K65752p09638m90035N96463R98399O33468j37256
4320A163764l40785J10871O26613L31275r95313j284596q47261n73502k40980
4311b049914K47294M05858M75853O94126J58731o14439K38282Q32538M57877r42217
4301i6011k96626m50672j308668l70150N98617J359227J542750Q31398p72638
4292A037227r91860L34372O05808N43023P82061O98287n9030o50788l85397k87008
4282A626695M3176m84291p00313J64443N93162J49231m27344n76722j31565Q1765
$$ y = [-2817884, -1246084, 319227, 898661, 629106, 708457, 1351069, 1553654, 1128760, 119912, -689404, -950510, -1077247, -956002, -906280, -937673, -893056, -270887, 843031, 1035883, 132806, -567174, 6611, 272363, -437275, -927310, -330847, 667552, 1301020, 1163764, 822979, 933850, 1560463, 1891738, 896425, -388171, -1235432, -1808934, -2049914, -1802620, -1396762, -920909, -226783, -68052, -682491, -444209, 388329, 846206, -96011, -392637, -843309, -2151977, -2522127, -1923510, -564283, 978467, 1809865, 1037227, 45367, 379739, 985547, 1528570, 2310631, 3008918, 2949888, 2299100, 1913703, 1626695, 1669871, 1185580, 485267, 649710, 1242872, 1392103, 964759, 388037, 256472, 338237]
4272C38237M57543M8671k37278P6984J77743O8138M87797Q97848O12356J82888
4262C110927o93432j142386m96380O9641j54287r60576k90858J55164M17380J44064
4252A59257p60693p77883R89741J487662j19202j150064m93061M15364K64218
4243A5339r61524j018707l38713J34221k16201l31193L86126K27708J46894N17194
4233a438856J81413p3491R5975N15583j3628p18196M0742N30726Q69059P61766
4223G51093J01198J65411K08173L70837k9753l69181l01584o49693m26120n42434
4213g22053j03882P77618J076256N01274j38078o64505l20615M8582k57431P4197
4203B71363p100o16580J087274J746009P27163K40627L93059O21777j71726n60325
$$ y = [338237, 795780, 844451, 607173, 684157, 861900, 930038, 1417835, 2315683, 2928039, 3110927, 2417495, 1275109, 778729, 848370, 694083, -266493, -557351, -402187, 15193, 159257, -601436, -1379319, -389578, 1098084, 978882, -171182, -664243, -248879, 15339, -946185, -1964892, -2303605, -2169384, -2385585, -2716778, -2330652, -2102944, -1956050, -1438856, -1257443, -1330934, -1234959, -719376, -733004, -1451200, -1410458, -879732, -10673, 751093, 852291, 1017702, 1225875, 1596712, 1566959, 1197778, 896194, 246501, -179619, -722053, -825935, -48317, 1027939, 1529213, 1391135, 726630, 406015, 454597, 197166, 271363, 264263, -352317, 734957, 2480966, 3208129, 3448756, 3841815, 4463592, 4291866, 3731541]
4193C731541j340477j625305p07301K38994O11540j87166q77892m79684K85555
4184c50195K22728J21530J131094Q64739M5348K4104l51027n46809m42040l60798
4174C58674R1512N00387N22986M20497r5159n80101r88643m89333N42490K94366
4164E77676l73198j36275L07570j83542m48776L35520K59003l11535n46540r21164
4154a441261p88940M22704N43535k06574k63171n0736j39505J68166o647K0949
4144a741480J47571O92607O66216M57104k74127K25231M53647J71843k8307o02027
4134A68278k57824p4548j48238q99785j261197k12061K90821M97970L50929l2325
4124a577980j0482J44258L85108J65757N51250L22567N0529l1174P45362J320055
$$ y = [3731541, 2391064, 765759, 58458, 297452, 908992, 721826, -156066, -635750, -350195, -127467, -5937, 1125157, 1989896, 2035244, 2059348, 1708321, 1161512, 719472, 358674, 450186, 950573, 1473559, 1894056, 1798897, 1218796, 230153, -259180, 283310, 577676, 204478, 68203, 375773, 192231, -256545, 78975, 337978, 26443, -520097, -1441261, -2230201, -1807497, -1263962, -1470536, -1733707, -1784443, -1923948, -1755782, -1762429, -1741480, -1593909, -901302, -235086, 222018, -52109, 173122, 626769, 798612, 770305, 168278, -89546, -164094, -312332, -1212117, -2473314, -2685375, -2394554, -1896584, -1545655, -1577980, -1588462, -1444204, -1059096, -893339, -342089, -19522, 31007, -167, 745195, 2065250]
4114B065250j09237j585920j031205M56244M94353m5215j08055m10284j018936
4105a293005P9417P69062N89834K88129n5296K15726P7118n77672n5476J97691
4095B35528j21091j96316K16237Q74146l67200o72959j17929K98909Q50576L31655
4085A331556m93298r9653k63814j3482p7000k41332K07666K52839j8542J66883
4075G51823l79047q16393p46692o66151m3792p2008L56038K08899M21402N68634
4065d17287J67348J45839l27216l51885J49608L57371m68643l14660N63729N31223
4055C5427P25420K99n98120l37705M25616N85980j59479l02867K95599k65907
4045D04263l29308J1954N07408P48966N47283J9678m16889p44908r1948k2566
$$ y = [2065250, 1956013, 370093, -661112, -204868, 289485, 244270, 136215, -274069, -1293005, -1213588, -444526, 145308, 433437, 378141, 593867, 670985, 93313, 37837, 235528, 114437, -81879, 134358, 1008504, 641304, -31655, -149584, 149325, 999901, 1331556, 838258, 738605, 474791, 461309, 384309, 142977, 350643, 603482, 584940, 751823, 372776, -443617, -1190309, -1856460, -1900252, -1972260, -1616222, -1407323, -985921, -417287, -249939, -104100, -431316, -783201, -633593, -276222, -744865, -1059525, -495796, 35427, 760847, 761146, 163026, -174679, 250937, 836917, 677438, 374571, 670170, 404263, 74955, 86909, 594317, 1343283, 1890566, 1910244, 1493355, 748447, 656499, 633933]
4035F33933p10105n74013k9275n2319j14086R5223N32278M87811k09830K92134
4025C51751N59257N48318j74983j31672N79205J01637p26507p55591q3951k24040
4015D3424n74184P2165J83986k06203K10818J46071j86657o1745K60367K46128
4005A34170k19861k94838J70715K79971O1809k01361o76676k08100K30072j52854
3995h76953J92812P57052N8689k55137K38873Q52096L57416q6236k86617k27004
3985G24991j84603K45826l4106O43099J106461K65335k01402l51039k4690n95721
3975A594151r45520k57131l19009k45564Q71641L45390o03698n27399P8211Q72408
3965H63480J94738l28846j99384l62110m9524k04305m60977l32890k76234m02911
$$ y = [633933, -76172, -650185, -679460, -731779, -845865, -750642, -218364, 269447, 59617, 351751, 911008, 1459326, 1284343, 1152671, 1731876, 1833513, 1107006, 351415, 267464, 43424, -530760, -458595, -274609, -480812, -269994, -123923, -310580, -372325, -111958, 134170, -85691, -380529, -209814, 70157, 131966, -69395, -746071, -954171, -724099, -876953, -684141, 72911, 131600, -123537, 115336, 967432, 1324848, 1238612, 951995, 724991, 540388, 786214, 752108, 1395207, 2501668, 2767003, 2565601, 2214562, 2189872, 1594151, 648631, 391500, 72491, -173073, 698568, 1043958, 440260, -87139, -8928, 863480, 1058218, 729372, 529988, 167878, 118354, -85951, -546928, -879818, -1156052, -1558963]
3955a558963k86503L01421L14953N08550M74157J22289n53921l63343J40601M38853
3945d61906N36889j44025P7630O89285J89939L5306k21317l83789K99048m7548
3935E69512J02830n15759j376834n09406R10925J264451N15206J1472n82966r82631
3925e93200J74841P77452l4911j109356m71555j12265k0168Q72731N40581r55823
3915i31673o23721j38213M2310P14365O90478J524j22289K18629q8275J86885
3905d9980M10290L118j160190q47362l14617N35527O73779J30646K11486k63749
3895f71052l01702K57991M12168O569p4728J021237Q23621L38462p72197j694257
3885f53888j034580K52846O11134L72137K64390Q0232j006327q69226j86044O26734
$$ y = [-1558963, -1845466, -1544045, -1229092, -720542, -246385, -124096, -678017, -1041360, -900759, -461906, 74983, -69042, 8588, 697873, 887812, 923118, 701801, 318012, 617060, 569512, 672342, 156583, -1220251, -1729657, -818732, 445719, 960925, 972397, 389431, -593200, -418359, 359093, 324182, -785174, -1256729, -1368994, -1389162, -516431, 24150, -931673, -1555394, -1693607, -1651297, -936932, -246454, -244930, -367219, -148590, -236865, -49980, 360310, 363428, -796762, -1644124, -1958741, -1423214, -749435, -618789, -407303, -671052, -972754, -714763, -302595, -296026, -370754, 650483, 1474104, 1812566, 1040369, -653888, -1688468, -1435622, -824488, -452351, -187961, -107729, -1114056, -1983282, -2169326, -1542592]
3875a542592J082559O18113l0072o78894m5730j07997r6243O62121J06822r30049
3865i61962M3405Q41123P59647L43704n99192j225624j413183q96036J66168M95304
3855b446646N06029M5847P9989K73041Q85771P07278R1184k97545m28145k94337
3845h77534O33148P94500K32249O43014M41146k51332q70956o52849n88155J38954
3835c57815J012933L89647o45759j638309j157799l3367N82012o8728j10368J44422
3825a883131L95128J98048L66908J32419n91525j80665M12020K58677m86742l25040
3815a703903Q14067J425874P52037m15054j107562p28219m59188L13793P65481
3806c42674J073097J018046j05922o34352o85783l56698l67565m61681J52171
$$ y = [-1542592, -460033, 158080, 128008, -550886, -596616, -704613, -800856, -138735, -31913, -961962, -918557, -77434, 682213, 1025917, 426725, -798899, -2212082, -3108118, -2941950, -2446646, -1940617, -1894770, -1814781, -1541740, -655969, 51309, 142493, -155052, -583197, -877534, -244386, 550114, 782363, 1425377, 1866523, 1615191, 744235, 91386, -496769, -357815, 655118, 1044765, 399006, -1239303, -2397102, -2430469, -1848457, -1917185, -2027553, -1883131, -1488003, -1289955, -923047, -790628, -1382153, -1562818, -1150798, -892121, -1378863, -1703903, -889836, 536038, 1288075, 873021, -234541, -962760, -1421948, -1108155, -342674, 730423, 1748469, 1642547, 1008195, 322412, -34286, -401851, -863532, -711361]
3797g11361j25316k71783N96998Q91813k15457q72461q62940J19150P90424J24046
3787e36887n67588j55250p2626N56218J375550j6722n12578J01521j9418K36014
3777C88234L85593N25965M00897M08203L3186K70915K77288j62036p23729q32340
3767I72176q55119l0124Q62303M41990m36223p63085q4304o2939p58514l67857
3757a081696R9610O69061P25727J94559l06635K37043J84351j132486l72368R66446
3747A83612J94506r53611o59311j96480m43034k93497L62454J046615J033768
3738B75022L88511r4002q10032o88838l85988J11820M120l5976J00470k87842
3728a422735m79132p6768O36668Q71094N85274N35517P0201l01182n70583l24857
$$ y = [-711361, -836677, -1108460, -511462, 380351, 164894, -707567, -1570507, -1451357, -660933, -536887, -1104475, -1259725, -1332351, -776133, 599417, 582695, 70117, 171638, 152220, 388234, 773827, 1299792, 1700689, 2108892, 2142078, 2412993, 2690281, 2528245, 1804516, 972176, 117057, 86933, 949236, 1391226, 955003, 191918, 107614, 44675, -713839, -1081696, -982086, -313025, 412702, 607261, 300626, 537669, 722020, -410466, -782834, 183612, 378118, -575493, -1234804, -1431284, -1874318, -2167815, -1805361, -758746, 275022, 663533, 569531, -240501, -929339, -1315327, -1203507, -1199387, -1235363, -1134893, -1422735, -1901867, -1978635, -1341967, -470873, 114401, 649918, 720119, 418937, -151646, -476503]
3718d76503J43296j54792n67079m35128j37874j66009J59573J220063J250548
3709H36095J33074j384989j334678M1197O12754Q07707Q52668K46292o25022n87231
3699d02133r0273n0542m08921K95332k9663k76934j21233L18632K12893k09773
3689g62615L9355N03194Q34308M70388K34696j71215J6677K56382k46507m70736
3679G03927J37917L14413p9624p61738q13155l14328J09159K76655M21224L33012
3669C27462r0953L52606J11903l70342O4799J74329j10794O21448O97862L86385
3659B164705N29052m83648j829662j398947l50760M15868P27562L09123m70596
3650c87303p20414j21895K71321P0752K76298Q64745O82979K31721j31856j118790
$$ y = [-476503, -333207, -487999, -1055078, -1490206, -1628080, -1794089, -1634516, -414453, 836095, 969169, -415820, -1750498, -1709301, -1096547, -288840, 563828, 810120, 185098, -402133, -492406, -542948, -951869, -656537, -686200, -963134, -1084367, -765735, -552842, -762615, -723260, -220066, 614242, 1084630, 1319326, 1148111, 1164788, 1421170, 1174663, 703927, 841844, 1156257, 1076633, 314895, -498260, -812588, -703429, -426774, -5550, 327462, 236509, 589115, 701018, 330676, 395475, 569804, 459010, 1080458, 1778320, 2164705, 2693757, 2210109, 380447, -1018500, -1369260, -953392, -225830, 83293, -387303, -1107717, -1229612, -958291, -887539, -611241, 253504, 936483, 1168204, 1036348, -82442]
3640h2442q05419M47516K40113K51066M72251Q64645k55742o65383l01316p20480
3630e55191l24395J18001j61208j77717R3458J094750K30255j76943K21541O48488
3620A011039l41278j455282n70630N65597O9408j44290P66162J315476J212173
3611B428375M30557k60889n31724p85229o11871o8218j08960l57315o9337j58608
3601i3219L8283K5308n39571K49017O15583N61188J043903J5931n60887n42295
3591H13241J59954j02500l79506j37986L16199Q61164n7955q52021l51244j10257
3581A59089K75464M7590l7130J6043l38380n56399o83921O59264Q61176m16903
3571a4107l03611r4600m34243j13379J51584j33256L70853P32004O45947l81844
$$ y = [-82442, -887861, -440345, -200232, 50834, 523085, 1387730, 1131988, 466605, 165289, -555191, -879586, -761585, -922793, -1100510, -1007052, 87698, 317953, 141010, 362551, 1011039, 669761, -785521, -1356151, -790554, -721146, -865436, -99274, 1216202, 2428375, 2858932, 2598043, 2066319, 1281090, 669219, 601001, 492041, 134726, 65389, -93219, -54936, -29628, -569199, -320182, 295401, 856589, 1900492, 1916423, 1355536, 813241, 973195, 870695, 491189, 353203, 669402, 1530566, 1472611, 620590, 269346, 159089, 434553, 482143, 445013, 461056, 122676, -433723, -1117644, -458380, 402796, -14107, -317718, -412318, -846561, -959940, -808356, -941612, -570759, 161245, 807192, 425348]
3561D25348p56793M8788K07081L73297M58689k32956l39386m14948m15380k57125
3551i03385J8976K52345L82787K75291J12834p64967j069384o25711J84740J63650
3541a972824n27539O28847J163249Q25391J55044k22731l30584p04059o72292
3532a657498J81216j84272n46005p38049m64507O20507J187192P95539O23014
3523a82863K56165l49951q84411m98000P67462J406799M01542n08053j29719L21775
3513F00746L499k70795l02452j78153j191457o36049R85088O99690m4498O6312
3503b68069n85158q01402K63817R98936j5702l49802P5923n2450m67563o56593
3493a858063M53863N21971m72111P1011J215036J026916L4635j012090j434414
$$ y = [425348, -331445, -282657, -75576, 297721, 756410, 523454, 184068, -230880, -646260, -903385, -884409, -632064, -249277, 26014, 138848, -626119, -1695503, -2321214, -2136474, -1972824, -2500363, -1871516, -708267, 117124, 272168, 49437, -281147, -985206, -1657498, -1476282, -1660554, -2206559, -2944608, -3409115, -2788608, -1601416, -805877, -182863, 73302, -276649, -1161060, -1659060, -891598, 515201, 916743, 408690, 278971, 600746, 604245, 333450, 30998, -147155, -1338612, -1974661, -989573, -289883, -334381, -268069, -853227, -1654629, -1390812, -391876, -407578, -757380, -681457, -733907, -1201470, -1858063, -1404200, -882229, -1354340, -1283329, -68293, 958623, 993258, -18832, -1453246]
3484a453246m43124K18732Q38056K60720j67601l2779j7488j10625L59333R7145
3474d50877j10894J00888L16343j1528K72762q3325l03600j7566q5325O34501
3464B61379L53039l12161J13635Q1157l29830n44105m88287L96604K9656j35729
3454e74642l393j84340K92228j24452p85737r45792N1020J49617K89890J005758
3444h29843L19463L93271m692m14036r36983j368158k83753K10863R92831J002996
3434i18041P70033O8432n54425k08084K31099O78909P71757K0525o41063l03806
3424h4664q6470R2461K41359m3452k18380K76963J70265q4272n50209m27955J37693
3413e76661O37677m814j60078q53974n94976L44478N42786N48995L93436j90799
$$ y = [-1453246, -1896370, -1677638, -839582, -578862, -746463, -779242, -796730, -907355, -548022, -450877, -561771, -460883, -144540, -156068, 116694, 33369, -270231, -287797, -373122, 261379, 614418, 302257, 415892, 497049, 167219, -376886, -865173, -468569, -438913, -574642, -578035, -762375, -470147, -594599, -1380336, -2326128, -2275108, -2125491, -1835601, -829843, -510380, -117109, -121801, -535837, -1472820, -2840978, -3124731, -2913868, -1921037, -918041, -148008, -79576, -634001, -842085, -610986, 67923, 839680, 860205, 219142, -84664, -171134, -78673, 162686, 119234, -99146, 177817, 348082, 263810, -286399, -714354, -576661, 61016, 56202, -103876, -957850, -1552826, -1208348, -665562, -116567, 276869, 86070]
3403H6070n21270l42008k67145K95719R04353j68617m61525j63874n89581j73910
3393a401788q7946k57079k2463m58747M61685J113816K72011l11560p3328J61114
3383f04285K33116N45131P26769L62421n37489p44854l8525m18827m13208L16710
3373e73041L40995k02092l3639l57660j038568j317457o57633J143186J504334
3364a191575K82162j07530K30354p374o90272j201836P34618R46429l48935J57931
3354a196028M63207J28245m1986j41100j77467l00284m29510j13428L06934k69365
3344a770782k01892J49493J93709J14696n5742k76166l17253l47855j47060q8013
3334b746865O51787M33393L01895J184394J007396K02679o77138j425677n03188
$$ y = [86070, -435200, -777208, -1044353, -748634, 155719, -12898, -474423, -638297, -1227878, -1401788, -1489734, -1746813, -1769276, -2228023, -1766338, -652522, -380511, -692071, -765399, -604285, -371169, 173962, 900731, 1263152, 725663, -19191, -57716, -476543, -889751, -573041, -232046, -434138, -467777, -825437, -1864005, -3181462, -3839095, -2695909, -1191575, -909413, -1016943, -786589, -793963, -1484235, -2686071, -1951453, -1005024, -1353959, -1196028, -732821, -604576, -646562, -787662, -965129, -1265413, -1694923, -1808351, -1501417, -1770782, -1972674, -1823181, -1629472, -1514776, -1570518, -1846684, -2163937, -2511792, -2658852, -2746865, -2095078, -1661685, -1359790, -175396, 832000, 1034679, 357541, -1068136, -1571324]
3325a571324M99749O38577O07757k4749n36485l66220l02911k18020L68945J95965
3315g08716M55295O22775O39545K60043p99902j049960l52339L81525K92253P63499
3305E04018P65814L57907l0491N7950q3821o97379r99616q22319L6846P27453
3295a83638O6199l19210J69885J35672K68896j18435l02971J68376P67528J063518
3285A715820K16616o32916l05080L7183l4852n68063n65675j16840J84258o2634
3275a32183n93559m51526J50101N51815O68114j34841m05872l41358J64009N88441
3265F3141k90428k88204k39178M19759k14432j062901m79074N66285M66201J4630
3255a044201L95314Q00929j4465p26398Q97261J592365M9086q25846o53298Q9601
$$ y = [-1571324, -1071575, -432998, 174759, 150010, -386475, -752695, -1055606, -1273626, -904681, -708716, -253421, 369354, 1008899, 1268942, 469040, -580920, -933259, -551734, -259481, 504018, 1269832, 1627739, 1597248, 1655198, 1571377, 873998, -125618, -947937, -911091, -183638, -117439, -436649, -266764, -131092, 137804, 19369, -283602, -115226, 652302, 1715820, 1932436, 1299520, 994440, 1031623, 996771, 428708, -136967, -253807, -69549, -132183, -725742, -1177268, -1027167, -475352, 192762, 57921, -347951, -689309, -525300, 63141, -227287, -515491, -754669, -334910, -549342, -1612243, -2091317, -1525032, -1058831, -1044201, -648887, 152042, 137577, -588821, 308440, 1900805, 1949891, 1124045, 470747, 560348]
3245E60348K13497P2765l09332o49760o21842m32943K5669J38497k13560L53650
3235h63011P60342J39247L06232J099138N75875n69117r89256n38376l80391l45195
3225h04512O81328O95828n34063n18933L73886J00504m01588k0531P06240J76474
3215D54633j15312k58210K08724M82062n74572q67790N65645p2219m06474M68549
3205a14964J88409n36381Q3552n4095k91997q53690n32109Q85657J057095Q90765
3195G22242J45370n79432j32507N94304L41789r415q06005m13739P3069o95285
3185g59609o19636P03063J300547K24009r97245j068961M43031M19304l56015
3176g11512j16210J52137L35847J97562j78624j27610N98j00396q62123q38301
$$ y = [560348, 773845, 846610, 537278, -112482, -734324, -1167267, -1141598, -1003101, -1216661, -863011, -102669, 36578, 342810, 1441948, 2017823, 1448706, 459450, -78926, -459317, -804512, -123184, 572644, 38581, -480352, -106466, -5962, -407550, -428081, 278159, 454633, 339321, 81111, 289835, 771897, 197325, -670465, -104820, -177039, -583513, -114964, 73445, -462936, -379384, -433479, -725476, -1579166, -2111275, -1225618, -168523, 722242, 867612, 288180, 155673, 749977, 1091766, 1082351, 276346, -137393, -64324, -759609, -1379245, -676182, 624365, 848374, -148871, -1217832, -774801, -355497, -711512, -827722, -675585, -339738, -142176, -320800, -448410, -447812, -548208, -1410331, -2248632]
3166b248632r8946K18651N39976J044225O77390o1821n7932j4490J87451L36930
3156E22802j38143o07337p64372M47300R42803P76823j60476p06479L14385J98399
3146H25705l04071k69286k01316m42675K993L97460L68516K87043p8493n66542
3136A9334j96698m1414N6165o43421m87950N60440J67649J18155j28134J91406
3126c84468L34051L38679Q15986L6681o5673O5313m5734l89160L1381L25157o18730
3115D43483n20064J240n76183o47140m99003l19415Q97725R67302O7910n462n5789
3104b45396l83107O99427O41754K10360J97080j94293n88957q81640L5697N77513
3094F8438m84334q08704m5730K24711R8677K20304O52595N00822J83367j91745
$$ y = [-2248632, -2347578, -2128927, -1588951, -544726, 132664, 70843, 12911, -1579, 185872, 522802, 384659, -222678, -987050, -539750, 403053, 1179876, 1019400, 312921, 627306, 825705, 521634, 252348, 51032, -391643, -388650, 8810, 377326, 664369, 585876, 19334, -177364, -218778, -162613, -806034, -1293984, -733544, -565895, -447740, -575874, -384468, -50417, 288262, 1104248, 1140929, 1075256, 1140569, 1094835, 705675, 737056, 1062213, 443483, -76581, -75341, -651524, -1298664, -1797667, -2117082, -1219357, -252055, -184145, -189607, -245396, -628503, 70924, 712678, 923038, 1120118, 925825, 336868, -544772, -509075, 68438, -415896, -1224600, -1270330, -1045619, -946942, -726638, -74043, 426779, 610146, 418401]
3084D18401p69531j91507k29774n89009j28710m0197L29298K17498m30079o77281
3074b090891l20366p15481j49653L62756P64357J424721J194847l332M10409M21148
3064A298515o29518j236809k44717M32184L38094O51845N42324k30911q72438
3055D8569j07056l15999k42372K64155J40789j61372p1420l7942j06682J30916
3045d58414M57814K96004k0524l59193m31377M28355M45805j20543l5598m89914
3035b87585p08653m54651N45006Q45192R87037M56223n75649j032424m75545j30976
3025h32025M52198j8908k74793k1850p31461m66095M44444O57970K51771O2755
3015d75994P24296J648581N27939r21661j426453m81526K96003p89550o75783
$$ y = [418401, -351130, -542637, -772411, -1361420, -1490130, -1530327, -1201029, -983531, -1413610, -2090891, -2411257, -3126738, -3276391, -2913635, -2149278, -724557, 470290, 466958, 877367, 1298515, 668997, -567812, -812529, -380345, -42251, 609594, 1151918, 921007, 48569, -58487, -374486, -616858, -352703, -211914, -373286, -444706, -482648, -589330, -458414, -600, 295404, 274880, -84313, -515690, -87335, 358470, 237927, 202329, -287585, -996238, -1450889, -905883, -60691, 926346, 1382569, 806920, -225504, -701049, -832025, -379827, -398735, -673528, -695378, -1426839, -1892934, -1448490, -790520, -538749, -475994, 248302, 1896883, 2424822, 1503161, 76708, -404818, -108815, -898365, -1574148]
3006a574148P7983P2576P78024N56900N6771P86263O31666M89153j41550r84422
2996G49216p91405J53924j20944n49034j46528P08189M66752J51123K49984R48004
2986A819281N28405j307364p20181R4080k11863K95135N16558O61040K07539o65545
2976A217085j045630p41862l69272o02595j71184Q32179N26414k30886n41841
2967a127592n73259N43317M66513K73944O42047K22306K64229M70143n48260m08055
2957B25333k96052j029690q43899L85945Q74066J94541N1985K45944L73931N09971
2947F92075N0393m78327k60404M33521K1886o72494j96028K38737J63375L87185
2937C79919p1856p20136j24755P33607P05571m90188o94026K61916O3412k35071
$$ y = [-1574148, -1496165, -1423589, -645565, -88665, -31894, 754369, 1386035, 1875188, 1733638, 749216, -42189, 111735, -9209, -558243, -704771, 3418, 470170, 621293, 871277, 1819281, 2347686, 1040322, 320141, 414221, 202358, 497493, 1014051, 1675091, 1882630, 1217085, 171455, -570407, -939679, -1542274, -1713458, -881279, -354865, -585751, -1127592, -1700851, -1157534, -691021, -417077, 224970, 447276, 711505, 1181648, 633388, 225333, -70719, -1100409, -1944308, -1558363, -684297, -489756, -437771, -191827, 182104, 692075, 742468, 264141, 3737, 437258, 459144, -213350, -409378, -170641, -7266, 379919, 308063, -412073, -536828, 196779, 902350, 412162, -281864, -19948, 43464, -191607]
2927a91607n89616l93953L2249P64862Q59728K2547Q9144P33015L83354K12256
2917A921979k41709k74252j44780k13898r01220l58095Q4165l30807N36565P53320
2907H31268k60475l91758p4124N25357N21213J89216k90116p03820n42410m689
2897b00338L26326K59119j27814k66052k06383K04994L99595k33935l21984j8608
2887a85080J80236M5342j44430j72311k09903k88738K09607P12691L10352k67993
2877A89773k44242k3206r427m16381m9894M43390R35770J84718q57172n33806
2867c80477J04087M37171L4263K5178n52396p42303n33330j81442M57163o6559
2857a398645l29013M7756Q701P76299J029399K96962N39302K31724J24143R38756
$$ y = [-191607, -781223, -1175176, -1142927, -378065, 481663, 504210, 593354, 1326369, 1709723, 1921979, 1680270, 1406018, 1261238, 1047340, 146120, -211975, -127810, -458617, 77948, 831268, 570793, 179035, 104911, 630268, 1151481, 1340697, 1050581, 346761, -195649, -200338, 125988, 385107, 257293, -8759, -215142, -10148, 389447, 155512, -166472, -185080, -4844, 40498, -103932, -276243, -486146, -774884, -565277, 147414, 457766, 189773, -54469, -77675, -87102, -503483, -553377, -109987, 825783, 1010501, 153329, -380477, -276390, 160781, 195044, 220222, -332174, -1074477, -1607807, -1789249, -1332086, -1398645, -1727658, -1679902, -1671201, -894902, 134497, 431459, 970761, 1202485, 1326628, 2265384]
2847B265384j08950j051703r87164j376875p86927J193254J275733M02723n71514
2838B53961p52876j9359M70330N32146K15400l22019m53983J61976j13600n06627
2828e34651j8323p3781l93535N07359R78277K0037p15375j003010q13292J37773
2818a908521O08431L27116P33588L16309o15105j51260L66398J57070o43205K04436
2808f04743Q21544O50575Q51566J68302n7912K35539j50908m50381p45176p88009
2798f9603j14926M3113k79351o7584L59067P29692j26104n26534m79295O98646
2788A67121O14587j12196M08505P02159J48927o79098l31660m26819j32834l45514
2778A3178l89174k47782o57633j2213L41928K32270Q16791N3716j93131K39591
$$ y = [2265384, 2156434, 1104731, 117567, -1259308, -2046235, -852981, 422752, 825475, 253961, -498915, -518274, -47944, 484202, 699602, 377583, -76400, 85576, -28024, -534651, -552974, -626755, -1020290, -512931, 465346, 485383, -229992, -1233002, -2046294, -1908521, -1300090, -972974, -239386, 76923, -538182, -689442, -323044, -165974, -809179, -604743, 216801, 867376, 1718942, 1887244, 1829332, 2064871, 1913963, 1463582, 718406, -69603, -184529, -141416, -420767, -488351, -129284, 600408, 474304, -52230, -531525, 167121, 781708, 669512, 1078017, 1780176, 1929103, 1250005, 918345, 491526, 358692, 13178, -375996, -623778, -1281411, -1293624, -951696, -719426, 97365, 151081, -42050, 197541]
2768A97541R10966P35233J19213Q2664l35908j207238n68340k90834r66549Q817
2758a314435Q83855R5757m72592J40859j94192n74833o84615l97264L89692O18919
2748a508849L28992r3411P24831J149281K30688R0635M50860L32377o98528m57533
2738E49343J04843j58753m36968k41856N33924N01678n54881n93851o64831n26025
2728a487377N77531J043202M58139N85306k17155L06554M25228j80875k35223
2719A275330q2302r37j54028N64365L3512K54015P48344n76121j787224o80100
2709d05146r021j5140j63975r2472M90305O81600K60089m94306k63233K33364
2699B22065j14892o89569m48051p06563J42303N82007p5490O45721P19214L31025
$$ y = [197541, 1108507, 1843740, 1962953, 2045617, 1709709, 502471, -65869, -356703, -1323252, -1314435, -430580, -334823, -807415, -666556, -860748, -1435581, -2120196, -2517460, -2127768, -1508849, -1179857, -1273268, -548437, 600844, 831532, 922167, 1373027, 1705404, 1006876, 549343, 654186, 495433, 58465, -183391, 350533, 852211, 297330, -296521, -961352, -1487377, -909846, 133356, 591495, 1176801, 959646, 1266200, 1691428, 1510553, 1275330, 1193028, 1192091, 1038063, 1602428, 1635940, 1889955, 2638299, 2062178, 274954, -405146, -414167, -429307, -593282, -685754, -195449, 486151, 746240, 251934, -11299, 222065, 107173, -582396, -1030447, -1737010, -1594707, -1012700, -1088190, -442469, 276745, 607770]
2689F07770K01027q18286p90759j56703k57594m88464j17327J38706L49848L59702
2679i72080L69213J95889K31312O87792l29374p60446L15485J56296k38067J52071
2669a91909Q28081N75573J91409j00469m01423o68123j21700J62855K6927K69072
2659E70293M73449L1186j75637o20492R8338O2529p19689q16768j29056m6155
2649a272002k83675M65299J874813O57464n38033J34328N68339N03929j95339
2640A915123l69415k79052l77666k30746O03459P08879o1171n03015q8462M00244
2630A718178q8948q98825r57912m63425N67219K37521K40136o11643q14374j35642
2620a207715M7179N58223M51450L92599N77163M2200m11297o08920m3412N4284
$$ y = [607770, 808797, -9489, -800248, -956951, -1214545, -1703009, -1820336, -1681630, -1331782, -972080, -602867, -406978, -175666, 512126, 182752, -577694, -262209, -105913, -343980, -191909, 636172, 1211745, 1403154, 1302685, 901262, 233139, 111439, 274294, 301221, 570293, 1043742, 1074928, 899291, 278799, 377137, 439666, -280023, -1096791, -1225847, -1272002, -1555677, -1090378, 784435, 1441899, 903866, 1038194, 1606533, 2110462, 1915123, 1545708, 1266656, 888990, 658244, 1261703, 1970582, 1909411, 1406396, 1317934, 1718178, 1629230, 730405, -227507, -690932, -123713, 113808, 353944, -257699, -1072073, -1207715, -1160536, -602313, -150863, 241736, 818899, 861099, 449802, -159118, -202530, -148246]
2610a48246K28064n9981R4997P67743m59692m43685J08252K44000O95371R1837
2600A118660l45983l16357j48351N39253L49139P10225P86060n85573j077287
2591A029786r83956o49674o2697K1174J39084L02711K97957L33979o71145r39747
2581a182528j56318N37159N98765M57743l13470o01450j52041k10622J1906N69134
2571d41722J173736R78077k36075m86183l89445o34609p09948n74863m70407K60458
2561a530981N68700Q38924Q77061n58965r68413L05382P12610L80626k81421j08737
2551B34786L49532K10596n1485k17363l91539p2452m74330n87454J04328J56351
2541g39030m2253N72325L66909l47604m55340K39170O01749o38969o31123J72041
$$ y = [-148246, 79818, 19837, 114834, 882577, 422885, -20800, 87452, 331452, 1026823, 1118660, 772677, 456320, 307969, 847222, 1196361, 1906586, 2692646, 2107073, 1029786, 45830, -603844, -666541, -645367, -506283, -203572, 94385, 428364, -242781, -1182528, -1338846, -801687, -202922, 254821, -58649, -660099, -812140, -1022762, -1010856, -441722, 732014, 1710091, 1474016, 987833, 598388, -36221, -746169, -1321032, -1791439, -1530981, -962281, -123357, 753704, 194739, -773674, -468292, 244318, 624944, 343523, 234786, 584318, 794914, 743429, 526066, 134527, 62075, -412255, -999709, -895381, -739030, -781283, -208958, 157951, -189653, -644993, -405823, 195926, -443043, -1074166, -902125]
2531i02125L58629K63788N03250M26277l18055l51101K83349L7157l24523K54535
2521B31181M65974k03517m5050p3340n30315P4483R56090K89074r66735m92448
2511b94603K46693M85615L32653J33402k76882p44483j52481J50498J45809N98142
2501F24363L55389o49311q80120j51339P38337J135380N59760m54085l76121m85111
2491D17142n81676m06079J52263m3051n31863j71728j33756l10136J61127M66307
2481i81450N1370j23947J58369M98949k97559m27040j32489O7484k17593r2064
2471a495970n82585Q2156J303682J336365M94136N2070k12069p05055M0960K76373
2461E90063l34887o20491j1929j46602k06095J44574L58470j2382N09259J071942
$$ y = [-902125, -543496, -279708, 223542, 649819, 331764, -19337, 264012, 301169, -23354, 231181, 697155, 493638, 448588, 375248, -155067, -80584, 875506, 1164580, 197845, -294603, -47910, 437705, 770358, 903760, 626878, -117605, -270086, -119588, 26221, 624363, 979752, 330441, -549679, -701018, 37319, 1172699, 1732459, 1278374, 902253, 417142, -164534, -570613, -418350, -461401, -993264, -1164992, -1298748, -1608884, -1447757, -981450, -930080, -1054027, -895658, -396709, -694268, -1121308, -1253797, -1186313, -1403906, -1495970, -2078555, -1996399, -692717, 643648, 1137784, 1189854, 977785, 272730, 313690, 590063, 255176, -365315, -377244, -523846, -729941, -585367, -226897, -239279, 269980, 1341922]
2451A341922j62582j377396j86321l326k33546N67202O53044K46952k75214J88954
2441G59689l71941j078280m42113K6821L41468J028843R30124j47326m86514o65680
2431a04909N198N68749J53678l20600n80331l64625k32462l85787k63396P6143
2421a448342M85851J040943J593395R02871o21939l43721k40919J4231L26222
2412A708592m54426o84941n92897o51562n3774N78559j94778p99788m50972m65671
2402b061658k91135J82865j94295K91633P11671N4839l7505J63544p0266j00416
2392a350723N20719L78529J9547l92097p2190N48633k23024j219587j244944n26127
$$ y = [1341922, 1179340, -198056, -384377, -387703, -621249, -54047, 598997, 845949, 570735, 759689, 387748, -690532, -1132645, -1105824, -764356, 264487, 1194611, 1047285, 560771, -104909, -99711, 469038, 622716, 302116, -278215, -642840, -875302, -1261089, -1524485, -1448342, -962491, 78452, 1671847, 2574718, 1952779, 1609058, 1368139, 1382370, 1708592, 1254166, 569225, -23672, -675234, -729008, -150449, -345227, -1145015, -1595987, -2061658, -2352793, -2169928, -2364223, -2072590, -1360919, -1306080, -1343585, -1180041, -1250307, -1350723, -830004, -451475, -431928, -824025, -896215, -347582, -570606, -1790193, -3035137, -3561264]
$$ [...]
##END NTUPLES=NMR SPECTRUM
##END=
