##TITLE=C13_Pr 5290
 CD3OD, 22100sc

 29.1.2025
##JCAMPDX= 6.0         $$ Bruker NMR JCAMP-DX V2.0
##DATA TYPE= NMR SPECTRUM
##DATA CLASS= NTUPLES
##ORIGIN= UXNMR, Bruker Analytische Messtechnik GmbH
##OWNER= root
$$ XWIN-NMR		Version 3.5
$$ Thu Jan 30 13:46:19 2025 Russian Standard Time (UT+4h)  she@DPX200
##.OBSERVE FREQUENCY= 50.327896
##.OBSERVE NUCLEUS= ^13C
##.ACQUISITION MODE= SIMULTANEOUS
##.ACQUISITION SCHEME= undefined
##.AVERAGES= 18473
##.DIGITISER RES= 17
##SPECTROMETER/DATA SYSTEM= spect
##.PULSE SEQUENCE= zgpg30
##.SOLVENT NAME= D2O
##.SHIFT REFERENCE= (INTERNAL, D2O, 0, 222.646)
##AUDIT TRAIL= $$ (NUMBER, WHEN, WHO, WHERE, WHAT)
$$ ##TITLE= Audit trail, XWIN-NMR		Version 3.5
$$ ##JCAMPDX= 5.01
$$ ##ORIGIN= Bruker BioSpin GmbH
$$ ##OWNER= she
$$ F:/spectra/data/she/nmr/c13/1/pdata/1/auditp.txt
$$ ##AUDIT TRAIL=  $$ (NUMBER, WHEN, WHO, WHERE, WHAT)
(   1,<2025-01-30 10:05:10.26 +0400>,<she>,<DPX200>,
      <created by zg, POWCHK disabled, PULCHK disabled
       terminated by command 'halt'
       configuration hash MD5:
       00 E9 B6 7A A2 85 ED C7 34 08 36 98 17 FE 4E 26
       data hash MD5: 32K
       CD 3D B3 6A 97 77 5B 6F 2C 57 11 56 A0 C7 97 71>)
(   2,<2025-01-30 10:05:21.29 +0400>,<she>,<DPX200>,
      <Start of raw data processing
       efp BC_mod = 2 LB = 2 FT_mod = 6 PKNL = 1 PHC0 = -400.7638 PHC1 = 27.28833 SI = 32K 
       data hash MD5: 32K
       1A 23 99 67 11 5D DF 7A AD 8D 6E 83 1A CD 04 C6>)
(   3,<2025-01-30 13:45:11.46 +0400>,<she>,<DPX200>,
      <abs ABSG = 5 
       data hash MD5: 32K
       FD E5 50 67 F6 93 F2 C9 F4 86 74 06 75 BB 64 0B>)
(   4,<2025-01-30 13:45:35.87 +0400>,<she>,<DPX200>,
      <pk PHC0 = -4.469777 PHC1 = -0.8000002 
       data hash MD5: 32K
       50 B1 8B 01 30 DE C9 32 C1 3F EE 3B FA EF 40 48>)
(   5,<2025-01-30 13:45:39.03 +0400>,<she>,<DPX200>,
      <abs ABSG = 5 
       data hash MD5: 32K
       A1 9F A0 0F C4 53 E2 D2 62 23 A3 3C 40 FF C2 9C>)
$$ ##END=
$$ 
$$ hash MD5
$$ E0 F6 80 22 5C 2B 88 11 6A B9 66 9F 96 8D DC 9A
##$RELAX= 
##$RELAX= 
##$RELAX= 
##$RELAX= 
##$RELAX= 
##$RELAX= 
##$RELAX= 
##$RELAX= 
$$ Bruker specific parameters
$$ --------------------------
##$DU= <F:/spectra>
##$EXPNO= 1
##$NAME= <c13>
##$PROCNO= 1
##$TYPE= <nmr>
##$USER= <she>
##$AMP= (0..31)
100 100 100 100 100 100 100 100 100 100 100 100 100 100 100 100 100 100 
100 100 100 100 100 100 100 100 100 100 100 100 100 100 
##$AQSEQ= 0
##$AQ_mod= 1
##$AUNM= <au_zg>
##$AUTOPOS= <>
##$BF1= 50.322709
##$BF2= 200.13
##$BF3= 50.322709
##$BF4= 500.13
##$BF5= 500.13
##$BF6= 500.13
##$BF7= 500.13
##$BF8= 500.13
##$BYTORDA= 1
##$CFDGTYP= 0
##$CFRGTYP= 5
##$CHEMSTR= <none>
##$CNST= (0..31)
1 1 145 1 1 1 1 1 1 1 1 1 1 1 1 1 1 1 1 1 1 1 1 1 1 1 1 1 1 1 1 1 
##$CPDPRG= <waltz16>
##$CPDPRG1= <>
##$CPDPRG2= <waltz16>
##$CPDPRG3= <>
##$CPDPRG4= <mlev>
##$CPDPRG5= <mlev>
##$CPDPRG6= <mlev>
##$CPDPRG7= <mlev>
##$CPDPRG8= <mlev>
##$CPDPRGB= <>
##$CPDPRGT= <>
##$D= (0..31)
$$ [...]
##$SUBNAM4= <"">
##$SUBNAM5= <"">
##$SUBNAM6= <"">
##$SUBNAM7= <"">
##$SUBNAM8= <"">
##$SUBNAM9= <"">
##$SW= 239.972175391363
##$SWIBOX= (0..15)
0 1 3 0 0 0 0 0 0 0 0 0 0 0 0 0 
##$SW_h= 12077.2946859903
##$TD= 32768
##$TD0= 1
##$TE= 0
##$TE2= 300
##$TE3= 300
##$TEG= 300
##$TL= (0..7)
120 120 120 120 120 120 120 120 
##$TP= (0..7)
150 150 150 150 150 150 150 150 
##$TP07= 0
##$TPNAME0= <>
##$TPNAME1= <>
##$TPNAME2= <>
##$TPNAME3= <>
##$TPNAME4= <>
##$TPNAME5= <>
##$TPNAME6= <>
##$TPNAME7= <>
##$TPOAL= (0..7)
0.5 0.5 0.5 0.5 0.5 0.5 0.5 0.5 
##$TPOFFS= (0..7)
0 0 0 0 0 0 0 0 
##$TUNHIN= 0
##$TUNHOUT= 0
##$TUNXOUT= 0
##$USERA1= <user>
##$USERA2= <user>
##$USERA3= <user>
##$USERA4= <user>
##$USERA5= <user>
##$V9= 5
##$VALIST= <valist>
##$VCLIST= <CCCCCCCCCCCCCCC>
##$VD= 0
##$VDLIST= <DDDDDDDDDDDDDDD>
##$VPLIST= <PPPPPPPPPPPPPPP>
##$VTLIST= <TTTTTTTTTTTTTTT>
##$WBST= 1024
##$WBSW= 4
##$XGAIN= (0..3)
0 0 0 0 
##$XL= 0
##$YL= 0
##$YMAX_a= 100476311
##$YMIN_a= -52316485
##$ZGOPTNS= <>
##$ZL1= 120
##$ZL2= 120
##$ZL3= 120
##$ZL4= 120
##$ABSF1= 222.646
##$ABSF2= -17.35081
##$ABSG= 5
##$ABSL= 3
##$ALPHA= 0
##$AQORDER= 0
##$ASSFAC= 0
##$ASSFACI= 0
##$ASSFACX= 0
##$ASSWID= 0
##$AUNMP= <proc_1d>
##$AZFE= 0.1
##$AZFW= 0.5
##$BCFW= 0
##$BC_mod= 2
##$BYTORDP= 0
##$COROFFS= 0
##$CY= -3
##$DATMOD= 1
##$DC= 0
##$DFILT= <>
##$DTYPP= 0
##$F1P= 0
##$F2P= 0
##$FCOR= 0.5
##$FTSIZE= 32768
##$FT_mod= 6
##$GAMMA= 0
##$GB= 0
##$INTBC= 1
##$INTSCL= 4.134877e-10
##$ISEN= 128
##$LB= 2
##$LEV0= 0
##$LPBIN= 0
##$MAXI= 10000
##$MC2= 0
##$MEAN= 0
##$ME_mod= 0
##$MI= 0.1934396
##$NCOEF= 0
##$NC_proc= 3
##$NLEV= 6
##$NOISF1= 120.0001
##$NOISF2= 80.00006
##$NSP= 0
##$NTH_PI= 0
##$NZP= 0
##$OFFSET= 222.646
##$PC= 1.4
##$PHC0= -405.2336
##$PHC1= 26.48833
##$PH_mod= 1
##$PKNL= yes
##$PPARMOD= 0
##$PSCAL= 0
##$PSIGN= 0
##$REVERSE= no
##$SF= 50.3227304950709
##$SI= 32768
##$SIGF1= 140
##$SIGF2= 120
##$SINO= 11.81781
##$SIOLD= 32768
##$SREGLST= <13C.CDCl3>
##$SSB= 0
##$STSI= 32768
##$STSR= 0
##$SW_p= 12077.2946859903
##$SYMM= 0
##$S_DEV= 0
##$TDeff= 32768
##$TDoff= 0
##$TI= <>
##$TILT= no
##$TM1= 0
##$TM2= 0
##$TOPLEV= 0
##$USERP1= <user>
##$USERP2= <user>
##$USERP3= <user>
##$USERP4= <user>
##$USERP5= <user>
##$WDW= 1
##$XDIM= 32768
##$YMAX_p= 290427641
##$YMIN_p= -1118902
$$ End of Bruker specific parameters
$$ ---------------------------------
##NTUPLES= NMR SPECTRUM
##VAR_NAME=  FREQUENCY,     SPECTRUM/REAL,   SPECTRUM/IMAG
##SYMBOL=    X,             R,               I
##VAR_TYPE=  INDEPENDENT,   DEPENDENT,       DEPENDENT
##VAR_FORM=  AFFN,          ASDF,            ASDF
##VAR_DIM=   32768,         32768,           32768
##UNITS=     HZ,            ARBITRARY UNITS, ARBITRARY UNITS
##FACTOR=    0.368581032318806, 1,           1
##FIRST=     11204.1544572324, 0,            0
##LAST=      -873.140228757911, 0,           0
##MIN=       -873.140228757911, -1118902,    0
##MAX=       11204.1544572324, 290427641,    0
$$ Real data points
##PAGE= N=1
##DATA TABLE= (X++(R..R)), XYDATA
$$ [...]
12136a14989p3606r5177q6799p5726o1709k4243L2394O1288M6948J6192p494k155
$$ -114989 -188595 -283772 -370571 -446297 -508006 -532249 -499855 -438567 -391619 -375427 -382921 -385076
12124c85076K9614N1198M8927L4827j7702q9227j23920j13245n8383J7996P1298
$$ -385076 -355462 -304264 -255337 -220510 -238212 -327439 -451359 -564604 -622987 -604991 -533693
12113e33693R1445J00348J06345Q4967M6156K5883J2716O691L085j8152l4301
$$ -533693 -442248 -341900 -235555 -150588 -104432 -78549 -65833 -59142 -56057 -74209 -108510
12102a08510l1007m257K3285J5516k476M55j079j6827p985M8568Q2260M2365j4014
$$ -108510 -139517 -143774 -120489 -104973 -107449 -106994 -108073 -124900 -132885 -84317 -2057 40308 26294
12089B6294j6940J4037L8257M4110M5599L8101l97m3327n5276k9160J8825K8885
$$ 26294 9354 23391 61648 105758 151357 189458 189061 145734 90458 61298 80123 109008
12077A09008j3292m3873j9833J0664K5163M5959L4492p361k8963k4885j1929J923
$$ 109008 95716 51843 32010 42674 67837 113796 148288 140927 111964 87079 75150 77073
12065G7073P735o713k2182k4795k0507j7437j2339q605j2981k2500j9375k4633
$$ 77073 84808 78095 55913 31118 10611 -6826 -19165 -27770 -40751 -63251 -82626 -107259
12053a07259l4036n944L2101M3383K4046l2856r8685r9857l1271N0154J00531
$$ -107259 -141295 -147239 -115138 -71755 -47709 -80565 -179250 -279107 -310378 -260224 -159693
12042a59693J04483Q5750N5721P616l3508n0021m8296l5150k328M5050O8493M7554
$$ -159693 -55210 30540 86261 93877 60369 10348 -37948 -73098 -75426 -30376 38117 85671
12030H5671J6289j6969p8313j31257j29323p8322l3440j2810K2384O8445R7675
$$ 85671 101960 84991 6678 -124579 -253902 -332224 -365664 -378474 -356090 -287645 -189970
12019a89970Q8534M1660k843j5771P196M7602O0488M1473J1248k2751o0512p2899
$$ -189970 -101436 -59776 -62619 -78390 -71194 -23592 36896 78369 89617 66866 6354 -66545
12007f6545o2721p9302r8877p1855m007N4514P5504O6858N0718P469n0513p1988
$$ -66545 -129266 -208568 -307445 -379300 -383307 -328793 -253289 -186431 -135713 -128244 -178757 -250745
11995b50745n2492j508M3945M3556K2260K2417N0451P2472N2166P413k9082l4754
$$ -250745 -303237 -304745 -260800 -217244 -194984 -172567 -122116 -49644 2522 9935 -19147 -53901
11983e3901k2631n453m741k8537l4985k0916j8425k5899j3228o86j138l551k0538
$$ -53901 -76532 -81985 -86726 -115263 -150248 -171164 -189589 -215488 -228716 -229402 -230540 -234091 -254629
11970b54629k3373K7654Q8152J01463O4034l622n5259o5283l6762o493r526m0335
$$ -254629 -278002 -250348 -162196 -60733 3301 -321 -55580 -120863 -157625 -164118 -173644 -213979
11958b13979o8220m8767Q438M6606M7983L9432L1267L4260Q2094J14086R0576
$$ -213979 -282199 -330966 -322528 -275922 -227939 -188507 -157240 -122980 -40886 73200 163776
11947A63776N5588K0514k6164n5864m2107j1004q98j6508m1444m6335k6970q05
$$ 163776 219364 239878 213714 157850 115743 104739 103841 87333 45889 -446 -27416 -28221
11935b8221L0312M3793K8597K3640K3309P198l9617q6111p7837j8101O7525J32108
$$ -28221 2091 45884 74481 98121 121430 128628 89011 2900 -74937 -93038 -25513 106595
11923A06595J32662J03238N9807Q339l5456n1780l5919k4241m5426p3971o8822
$$ 106595 239257 342495 402302 410641 375185 323405 287486 263245 217819 143848 75026
11912G5026n0065k9067j8447n2336q0792o0481k0865K6475N2730L2211J9412L0362
$$ 75026 24961 -4106 -22553 -74889 -155681 -216162 -237027 -210552 -157822 -125611 -106199 -75837
11900g5837J8367j2888m980L7130M3384N199k6296l6775m8202p0136p1454k1952
$$ -75837 -57470 -70358 -75338 -38208 5176 10375 -15921 -52696 -100898 -171034 -242488 -264440
11888b64440L7799M3995J1755q506j2743k1051k4776j1145J1490L1312M2999O2653
$$ -264440 -226641 -182646 -170891 -179397 -192140 -213191 -237967 -249112 -237622 -206310 -163311 -100658
11876a00658O7378M4629K6820K8277K1491P203J0222O872l0208o8493m8713L0702
$$ -100658 -33280 11349 38169 66446 87937 95140 105362 112234 82026 13533 -35180 -4478
11864d478R4011R1093M0586j1748m6896p6181j06522j12977q0977l3188n663J509
$$ -4478 89533 180626 221212 209464 162568 86387 -20135 -133112 -214089 -247277 -252940 -251431
11852b51431K9589Q0681J20569R2782p116j05489j35737r8911n0863J6361O8065
$$ -251431 -221842 -141161 -20592 72190 65074 -40415 -176152 -275063 -325926 -309565 -241500
11841b41500N257q6869m3872O3795J10496R0591L1619l5212j01051j32452j07632
$$ -241500 -236243 -323112 -366984 -303189 -192693 -102102 -70483 -105695 -206746 -339198 -446830
11830d46830n8052k1170J259K1730L6683L6874M3823O7102O3565M8827N4612N6996
$$ -446830 -504882 -526052 -524793 -503063 -466380 -429506 -385683 -318581 -255016 -206189 -151577 -94581
11818i4581M0006N92n6598p7746m8920k2643k4948o9845j03196q5421l6973J2387
$$ -94581 -54575 -53983 -110581 -188327 -237247 -259890 -284838 -354683 -457879 -543300 -580273 -567886
11806e67886L3510M0568L8404K8338N0626R4967R7878N0669j0288m4089m4218
$$ -567886 -534376 -493808 -455404 -427066 -376440 -281473 -183595 -132926 -143214 -187303 -231521
11795b31521l3270j7682R125K8034K0795K7818Q0577J16680P7060M546m6038q0854
$$ -231521 -264791 -282473 -273348 -245314 -224519 -196701 -116124 556 77616 82162 36124 -44730
11783d4730r6231r2507q5420o4806j5863L9396O7878P5818N8419K2739j6466l5349
$$ -44730 -140961 -233468 -318888 -383694 -399557 -360161 -292283 -216465 -158046 -135307 -151773 -187122
11771a87122q381K1090K3789L9186P5966Q6981M2656k8687n0825j2151M1824Q1191
$$ -187122 -195503 -174413 -150624 -111438 -35472 51509 94165 65478 14653 2502 44326 125517
11759A25517P3673J7013p3094j59177j88035j49243p1411m946K0829N9003R4002
$$ 125517 199190 216203 143109 -16068 -204103 -353346 -424757 -429703 -408874 -349871 -255869
11748b55869P3062K0210k3439l5492k5148m226L4101M6888P972m2648p3239p9821
$$ -255869 -182807 -162597 -186036 -221528 -246676 -250902 -216801 -169913 -161941 -204589 -277828 -357649
11736c57649o2624l5892k138L7115O9189P4472M0932j0501l0829j8027k2907o9418
$$ -357649 -420273 -456165 -458303 -421188 -351999 -277527 -236595 -247096 -277925 -295952 -318859 -388277
11724c88277r9872n8319J2732M1604K8916L6842O5504P8546P4428P7636P8797
$$ -388277 -488149 -546468 -533736 -492132 -463216 -426374 -360870 -282324 -207896 -130260 -51463
11713e1463O3609L6672M455j2095j2315l1495o4593o6174m5949k5166j1727k7534
$$ -51463 12146 48818 53273 41178 28863 -2632 -67225 -133399 -179348 -204514 -216241 -243775
11701b43775n0608l5380J5897N9648Q1519O9153R282m5999m3155L344P3421J12997
$$ -243775 -294383 -329763 -313866 -254218 -172699 -103546 -94264 -140263 -183418 -180074 -106653 6344
11689F344P7876o939p1511p3636l3616J4450N8875Q2412N4133O842k1979j8387
$$ 6344 84220 77281 5770 -67866 -101482 -87032 -28157 54255 108388 115230 93251 74864
11677G4864K6235O8378P7819O7887N4013J4140l7610o0747k8676J8929P443l9999
$$ 74864 101099 169477 247296 315183 369196 383336 345726 284979 256303 275232 282675 242676
11665B42676n0368l4178q419K7710N0870M6215K5896j2342p4279j19519r9802
$$ 242676 192308 158130 149711 177421 228291 274506 300402 288060 213781 94262 -5540
11654e540j7705N4962P4462N2517K0210l275k1739l0152l6503n8938q8476q1060
$$ -5540 -23245 31717 106179 158696 178906 175631 153892 123740 87237 28299 -60177 -141237
11642a41237k2425M9480P5595P7742J01949J08846O0037m942m2158m8554k6206
$$ -141237 -163662 -114182 -38587 39155 141104 249950 309987 305045 262887 214333 188127
11631A88127q280n416l4403o8821m1567L7121P7365N6920J8973j6598o2556r4455
$$ 188127 179847 174431 140028 71207 29640 66761 144126 201046 220019 203421 140865 46410
11619D6410p3453j5007L3161M5466M0491K3535r716n2482o9596n5646m0390o1563
$$ 46410 -27043 -42050 -8889 36577 77068 100603 90887 38405 -31191 -86837 -127227 -188790
11607a88790p3012j155J05658J43620J13622O2738K2746J6119K2157J3179j1049
$$ -188790 -261802 -262957 -157299 -13679 99943 162681 185427 201546 223703 236882 225833
11596B25833l9947n3353l0451K3816R3523J60568K33789L53132M87721N89767
$$ 225833 185886 132533 102082 125898 219421 379989 613778 966910 1454631 2044398
11586B044398O38483N62970K81011j33221m73694o06366n50438m35142l33579
$$ 2044398 2682881 3245851 3526862 3393641 2919947 2313581 1763143 1328001 994422
11577I94422k21186j19986q4697j22909j67274j53516q6285j3923K7310M3327
$$ 994422 773236 653250 568553 445644 278370 124854 38569 24646 51956 95283
11567I5283M2089L0252K9787L1516K0141J2299J2238N3518R1417M3341m8814j11084
$$ 95283 137372 167624 197411 228927 249068 261367 273605 327123 418540 461881 413067 301983
11555C01983j26363j16770q5596l6473P473J4814j6938l6398j3750L5961R1208
$$ 301983 175620 58850 -26746 -63219 -55746 -40932 -57870 -94268 -108018 -72057 19151
11544A9151J17538R4478N0723J0412k0597n4623q7927p7024j5046L6758L6574
$$ 19151 136689 231167 281890 292302 271705 217082 129155 52131 37085 73843 110417
11533A10417r188n1686m2881k9584m2754m6897L565O6825Q0716N5885K411n8622
$$ 110417 101229 49543 6662 -22922 -65676 -112573 -109008 -42183 38533 94418 96829 38207
11521C8207r0952j04489j07562p8833m1560J71O4975J07642J05072Q2046N7109
$$ 38207 -52745 -157234 -264796 -343629 -385189 -385018 -320043 -212401 -107329 -25283 31826
11510C1826L7829K5431J8166J0036m003l7893q9761j02454o9903m1348k6509j1091
$$ 31826 69655 95086 113252 123288 119285 81392 -8369 -110823 -180726 -222074 -248583 -259674
11498b59674m089P554M6454P1872O7697L3477j8207l6142k9792k3297k758L3805
$$ -259674 -263763 -256209 -209755 -137883 -70186 -36709 -54916 -91058 -120850 -144147 -146905 -113100
11486a13100O7447Q6445N9903o79k5136R633L6355L6228M3181N3688O3586O9901
$$ -113100 -45653 40792 100695 100016 74880 84513 120868 157096 200277 253965 317551 387452
11474C87452O0395M5937L8923J4291m7757j26279j40542p9971l3058o5118j20212
$$ 387452 447847 493784 532707 546998 499241 372962 232420 152449 119391 54273 -65939
11463f5939j19745r7513r6395p0735j2757L2718N3140N4492N5774M4384N146k3685
$$ -65939 -185684 -283197 -379592 -450327 -463084 -430366 -377226 -322734 -266960 -222576 -217430 -241115
11451b41115k7944j1624J3416K0556P582J4593O0539P8880K6513j6237k620K3869
$$ -241115 -269059 -280683 -267267 -246711 -239129 -224536 -163997 -85117 -58604 -74841 -77461 -53592
11439e3592J0287k7607l9276m888M0312O6806O8052K3517n2047q8198n0894L0225
$$ -53592 -43305 -70912 -110188 -115076 -74764 -7958 60094 83611 31564 -56634 -107528 -77303
11427g7303Q8644Q3988L2620m1097j13817j66210j61028j26532j02763o5999j3448
$$ -77303 11341 95329 127949 86852 -26965 -193175 -354203 -480735 -583498 -649497 -662945
11416f62945L2862O4194O6060L1065k3951n7007m0314r244L5498Q2922J20760
$$ -662945 -630083 -565889 -499829 -468764 -492715 -549722 -590036 -599280 -563782 -480860 -360100
11405c60100J39093J35214J16104R4659O7058K0691l3512p2427q0753n6802k8817
$$ -360100 -221007 -85793 30311 124970 192028 212719 179207 106780 26027 -30775 -59592
11394e9592o881J1437J2716L562j3458m8729q5380q4110l3952L2289N9189K0917
$$ -59592 -66473 -55036 -42320 -38758 -52216 -100945 -186325 -270435 -304387 -272098 -212909 -191992
11382a91992l4384m6227n315N9294Q7978N0066n119k0307k9481n6523n0980k5770
$$ -191992 -226376 -272603 -277918 -218624 -130646 -80580 -85699 -106006 -135487 -192010 -242990 -268760
11370b68760j1356J0018L1904M3542M7380M7401N7727N4840N0929N2879L3494
$$ -268760 -280116 -270098 -238194 -194652 -147272 -99871 -42144 12696 63625 116504 149998
11359A49998Q746M364J3223J0048l421K2510P7622Q6153M5599M259k6836m3049
$$ 149998 158744 163108 176331 186379 182958 205468 283090 369243 414842 419101 392265 349216
11347C49216l5116k6998k1692j1109R673L0709M0099L628o7079j07625j04226
$$ 349216 314100 287102 265410 254301 263974 294683 334782 338410 271331 163706 59480
11336E9480q0950o6546n7010n1893n3190l8886j3998L6769R4406J00429O6072
$$ 59480 -21470 -88016 -145026 -196919 -250109 -288995 -302993 -266224 -171818 -71389 -5317
11325e317J6431n3614q6709n9821k2629R533J0852j1205j3158J3392L7412K5499
$$ -5317 11114 -42500 -129209 -189030 -211659 -202126 -191274 -202479 -215637 -202245 -164833 -139334
11313a39334l684k3006k5374k2375l9908o0334o2271l1385K982K1455M9536P2338
$$ -139334 -143018 -166024 -191398 -213773 -253681 -314015 -376286 -407671 -404689 -383234 -333698 -261360
11301b61360O1944K1381j9398l2384l1364l0157k2329J7867Q5534J24994J13827
$$ -261360 -199416 -178035 -197433 -229817 -261181 -291338 -313667 -295800 -210266 -85272 28555
11290B8555Q4515N8471N3436O1645J6498p4376j22029q0245O068M9021J7227p996
$$ 28555 113070 171541 224977 286622 303120 228744 106715 26470 32538 81559 98786 90790
11278I0790l086j503m588k6980q0547j22601j33076j10775p2811l3821j6256k3356
$$ 90790 87704 86201 81613 54633 -25914 -148515 -281591 -392366 -465177 -498998 -515254 -538610
11266e38610r818O859K8833P8705J13982R5151M4359p925m0427j1421N2659P4013
$$ -538610 -548428 -541569 -512736 -434031 -320049 -224898 -180539 -188464 -228891 -240312 -187653 -113640
11254a13640N6240K7356O657K7749N8580K5312l7366n4552l0614j6708l2302m8475
$$ -113640 -57400 -30044 -23387 4362 62942 88254 50888 -3664 -34278 -50986 -83288 -131763
11242a31763l2954J8743M3488K3115J3127L8629O0331N4570O3020O4517K9061
$$ -131763 -164717 -145974 -102486 -79371 -66244 -27615 32716 87286 150306 214823 243884
11231B43884m358l703J6153K6058J241o8119j43708j72014j26889m6193J3447
$$ 243884 239526 235823 251976 278034 279275 211156 67448 -104566 -231455 -277648 -264201
11220b64201K5774R44j1748J7731N1660L7687J2962K1034M8526O2516M1420j7485
$$ -264201 -238427 -237483 -249231 -231500 -179840 -142153 -129191 -108157 -59631 2885 44305 26820
11208B6820p7816q9094n5610k0987j591Q020j0666n0894q3926r7434r4873n0411
$$ 26820 -50996 -140090 -195700 -216687 -218278 -210258 -220924 -271818 -355744 -453178 -548051 -598462
11196e98462L1190P4051N2991J2260q561j3119j4061r00L0921L4348J9257K5349
$$ -598462 -567272 -493221 -440230 -427970 -436531 -449650 -463711 -464611 -433690 -399342 -380085 -354736
11184c54736L6140L1597K2335K3933L9649N4185M6075J5928j0696j6272j0084
$$ -354736 -318596 -286999 -264664 -240731 -201082 -146897 -100822 -84894 -95590 -111862 -121946
11173a21946p181j6730k7887j0087M4985R5790Q1021o008j08749j60030j31790
$$ -121946 -129127 -145857 -173744 -183831 -138846 -43056 37965 31957 -76792 -236822 -368612
11162c68612o4302r757L3060O7662N1793k0995p4956n1092Q860O3436P3150P2445
$$ -368612 -432914 -442671 -409611 -341949 -290156 -311151 -386107 -437199 -428339 -364903 -291753 -219308
11150b19308R1718Q5054M3369P919J4891L3677M383n8120q3336m4339J6115N2012
$$ -219308 -127590 -42536 833 8752 23643 57320 61703 3583 -79753 -124092 -107977 -55965
11138e5965N1514K2813k1392m0161r015L2429N2215N0129O576n5102j00579j14727
$$ -55965 -4451 18362 -3030 -43191 -52206 -19777 32438 82567 89143 34041 -66538 -181265
11126a81265q6456m0901j1641l613O171L5286N7166N6642N9805P7662Q8848R0035
$$ -181265 -267721 -308622 -320263 -323876 -317705 -282419 -225253 -168611 -108806 -31144 57704 147739
11114A47739R5866R7388N8603q093n1086n2736l5913l0461l1967n7116j06784
$$ 147739 243605 340993 399596 391503 340417 287681 251768 221307 189340 132224 25440
11103B5440j10979m4292M6189P6422J7985n9110q5251n0158K0487P3310R5706
$$ 25440 -85539 -129831 -83642 -7220 10765 -48345 -133596 -183754 -163267 -89957 5749
11092E749Q4815L2222k0870l9067k9000m30K8502N0416M4589Q552j7359k8721
$$ 5749 90564 122786 101916 62849 33849 33419 61921 112337 156926 165478 148119 119398
11080A19398l636M1709M6840J9516l525l4768p5399q2201n2674j6286n193k6186
$$ 119398 115762 157471 204311 223827 220302 185534 110135 27934 -24740 -41026 -46219 -72405
11068g2405l6740k8879j1759K6991O0078N7065K5116o381K06L7763O6379O1403
$$ -72405 -109145 -138024 -149783 -122792 -62714 -5649 19467 13086 13292 51055 117434 178837
11056A78837K3708j8160n3587m8628j4531n744j4087j5497k6097m8619m9739k6078
$$ 178837 202545 184385 130798 82170 67639 61895 47808 32311 6214 -42405 -92144 -118222
11044a18222o000p504n001L880j5147m2153l5382k0846j2117K7413O6502M9955
$$ -118222 -124222 -131726 -136727 -132847 -147994 -190147 -225529 -246375 -258492 -231079 -164577 -114622
11032a14622j0283n1045m4295r431K8406N6117O6735M9910K5576J5825Q202p345
$$ -114622 -124905 -175950 -220245 -229676 -201270 -145153 -78418 -28508 -2932 12893 21095 13750
11020A3750n4922j09851j07261m4813J8890N0604P2100N9148R107l5163q2341
$$ 13750 -41172 -151023 -258284 -303097 -284207 -233603 -161503 -102355 -93248 -128411 -210752
11009b10752j11207r7358q2718p5847m2112J2300O5774J26056J77645J57105Q9069
$$ -210752 -321959 -419317 -502035 -577882 -619994 -607694 -541920 -415864 -238219 -81114 7955
10998G955O0511O4857L9389j4395l8843l9288o4360q0168o2342n0228l5538J0793
$$ 7955 68466 133323 172712 158317 119474 80186 15826 -64342 -126684 -176912 -212450 -201657
10986b01657M2028L4696L0474J5998k7930o1753o5496m8385j1794K4989M5180
$$ -201657 -159629 -124933 -94459 -78461 -106391 -168144 -233640 -282025 -293819 -268830 -223650
10975b23650M6737L9235K6970L0595P1401R3157N1354J711l5900o1430o3092m1746
$$ -223650 -176913 -137678 -110708 -80113 -8712 84445 135799 137510 101610 40180 -22912 -64658
10963f4658l8121o8450p7328m0239p707J3236L2066M8461P0613R4839R0445N7817
$$ -64658 -102779 -171229 -248557 -288796 -296503 -283267 -251201 -202740 -132127 -37288 53157 110974
10951A10974J7916l0081p1001j02931j24161j09434n1819l51K1794O7020J14013
$$ 110974 128890 98809 27808 -75123 -199284 -308718 -360537 -360888 -339094 -272074 -158061
10940a58061R6438O1286Q5905J32561R6994K2237o706k6122o3797r4767r3447
$$ -158061 -61623 -337 85568 218129 315123 337360 330654 304532 240735 145968 52521
10929E2521q4669p3937m4040O920L8380L6356K0765p346k9149l6525n4031m9012
$$ 52521 -32148 -106085 -150125 -143205 -104825 -68469 -47704 -55050 -84199 -120724 -174755 -223767
10917b23767Q783Q3399J01953M8948j4532l8795j7993J1068L6559P1397Q4775
$$ -223767 -214984 -131585 -29632 19316 4784 -34011 -52004 -40936 -4377 67020 151795
10906A51795O2611Q195n8842q8315p5645l2618K2918M7383M9153N7631O7246N8220
$$ 151795 214406 222601 163759 75444 -201 -32819 -9901 37482 86635 144266 211512 269732
10894B69732L1409O699N693R987n233k4682j9555N321r065p0805q7773j9231N4270
$$ 269732 301141 307840 313533 323520 318287 293605 274050 279371 270306 199501 111728 92497 146767
10881A46767O6494M8071M1762L4646L76m4834p3798p1255m6673m2319o4222p0983
$$ 146767 213261 261332 303094 337740 338116 293282 219484 148229 101556 59237 -4985 -75968
10869g5968m1393J7513Q9248J21645O8489l0722q1362m6840j737k6626o9386o1404
$$ -75968 -117361 -99848 -10600 111045 179534 148812 67450 20610 18873 -7753 -77139 -138543
10857a38543n7328p4643m1150M6911J14974J30290J06210O4754P687k5717p069
$$ -138543 -195871 -270514 -311664 -264753 -149779 -19489 86721 151475 159162 133445 126376
10846A26376J1281M07j8117l5322l9206j4966L369K880J4628L9627M1453k8005
$$ 126376 137657 138064 119947 84625 45419 30453 33822 36702 51330 90957 132410 104405
10834A04405j29391j37628n0633M3169N8840J632m6285m0481p605Q591o367k2905
$$ 104405 -24986 -162614 -213247 -170078 -111238 -109606 -155891 -196372 -203977 -195386 -201753 -224658
10822b24658j5067l095N519Q561K7360Q5311J39991J30291P7291K5006k4092n6277
$$ -224658 -239725 -242820 -237301 -228740 -201380 -116069 23922 154213 231504 256510 232418 176141
10810A76141m7505k6663j7065j4341k924K0125L2252J7424m532l2881n6545n2190
$$ 176141 128636 101973 84908 70567 67643 87768 120020 137444 132912 100031 43486 -8704
10798h704j6456P220l362n191O065m362k0047m744L1509L8484O911n825p417j5680
$$ -8704 -25160 -17940 -21302 -26493 -20428 -24790 -44837 -49581 -18072 20412 27323 21498 14081 -1599
10784a599P457N5769O6709J8375k7273k4295k1632n7560j00320q9247l6509J3800
$$ -1599 5858 61627 128336 146711 119438 95143 73511 15951 -84369 -173616 -210125 -196325
10772a96325M5588N9951O0414K3096k3297J783M5878N0739N6116O5714O9421N2677
$$ -196325 -150737 -90786 -30372 -7276 -30573 -28790 17088 67827 123943 189657 259078 311755
10760C11755M362n3949j00069j02386o8903m0645k8357o949N0902J00035Q4099
$$ 311755 316117 262168 162099 59713 -9190 -49835 -78192 -85141 -34239 65796 149895
10749A49895L3679N877K981J0023Q736j491o73j4162m7521p0910r1551r1145l3868
$$ 149895 183574 189451 192432 202455 211191 209700 209027 194865 147344 76434 -15117 -106262 -140130
10736a40130J3422Q355O290K1979J3963k0377m5630k5867r99J2391J9569K2155
$$ -140130 -126708 -118353 -112063 -90084 -76121 -96498 -142128 -167995 -168994 -156603 -137034 -114879
10724a14879J8588J724j7802k7626p902L0639M2777K7801K103l2086l9655q426
$$ -114879 -96291 -94567 -112369 -139995 -147897 -117258 -74481 -46680 -44577 -76663 -116318 -124744
10712a24744K1938J3185n399J8237N4697O1419M1000R283j8760m6104p5449j05085
$$ -124744 -102806 -89621 -95020 -76783 -22086 39333 80333 89616 70856 24752 -50697 -155782
10700a55782r7906m6526n59J4637P07k0973l1595k8793k9230k4796j5677j4642
$$ -155782 -253688 -300214 -300773 -286136 -285429 -306402 -337997 -366790 -396020 -420816 -436493 -451135
10688d51135j3434m160R55j3719l3329k0915J3328K5270L1557P1305J18310J05842
$$ -451135 -464569 -468729 -467774 -481493 -514822 -535737 -522409 -497139 -465582 -394277 -275967 -170125
10676a70125L2168l8728n2635r532L8856N7210K7852m3103q4644n8843l2156l7367
$$ -170125 -137957 -176685 -229320 -238852 -199996 -142786 -114934 -158037 -242681 -301524 -333680 -371047
10664c71047m8518l3844J9853P3520Q6783O7553M1529j1338r8011j49080j15181
$$ -371047 -419565 -453409 -433556 -360036 -273253 -205700 -164171 -175509 -273520 -422600 -537781
10653e37781l9440L4210Q4755R5277Q1479N7296K3308j4850l0107m401J3023M302
$$ -537781 -577221 -543011 -458256 -362979 -281500 -224204 -200896 -215746 -245853 -250254 -237231 -232929
10641b32929k96J1936L1381M1563M0692L6861J9673j1909l9269m8091k1519J8648
$$ -232929 -233225 -221289 -189908 -148345 -107653 -70792 -51119 -63028 -102297 -150388 -171907 -153259
10629a53259K4369r81j3561n77p91m8763p5794k6756J8947Q399j5336j8738r638
$$ -153259 -128890 -129871 -143432 -144009 -144800 -193563 -269357 -296113 -277166 -268767 -284103 -302841 -312479
10616c12479n161j205J8382N2470P2184N5966J7997l5160p9791q4499o3015l3427
$$ -312479 -317640 -318845 -300463 -247993 -175809 -119843 -101846 -137006 -216797 -301296 -364311 -397738
10604c97738J5499O3962Q6297P2890M8638K2843r088j6133J0532L0785J4029r873
$$ -397738 -382239 -318277 -231980 -159090 -110452 -87609 -96697 -112830 -102298 -71513 -57484 -67357
10592f7357j2746k410p963l4099m2850o208M3116O8708N8870J4162l3558m2245
$$ -67357 -80103 -82513 -90476 -124575 -167425 -173633 -130517 -61809 -2939 11223 -22335 -64580
10580f4580k3974Q448M6388O0795N5037M8177L0292J7903N298k5830o4850p8040
$$ -64580 -88554 -80106 -33718 27077 82114 130291 160583 178486 183784 157954 93104 15064
10568A5064p2190o0169l4619j1399k27J2508L8607M5845J1359l5172n8591o7104
$$ 15064 -57126 -117295 -151914 -163313 -163540 -151032 -112425 -66580 -55221 -90393 -148984 -216088
10556b16088q6690q4780k3678M7627O1092J7998k5299n952N8244J10310J26808
$$ -216088 -302778 -387558 -411236 -363609 -302517 -284519 -309818 -315770 -257526 -147216 -20408
10545b0408R2280N1949M0121J9136m424O092K6830K7879J5427P682O946Q379L470
$$ -20408 71872 123821 163942 183078 178654 184746 211576 239455 254882 262564 269510 277889 281359
10532B81359j6630m0282m7527m6562j1620O5978J42477J70675J13525j7634j22291
$$ 281359 264729 224447 176920 130358 118738 184716 327193 497868 611393 593759 471468
10521D71468j27393p7051l1322j8979l0650n2831o9066o7267l8786J1026L9746
$$ 471468 344075 267024 235702 216723 186073 133242 64176 -3091 -41877 -30851 8895
10510H895K7236n080L62K7841M997n0834q4782q1046o7382n6164l3346q045K7344
$$ 8895 36131 31051 31413 59254 64251 13417 -71365 -152411 -219793 -275957 -309303 -317348 -290004
10497b90004P8430J20547J04240M4354J4170J3845J2613L8429O5395O0805N2780
$$ -290004 -211574 -91027 13213 57567 71737 85582 98195 136624 202019 262824 315604
10486C15604L8331Q088j8893l3023o3447r7667j02119p3845l2237p293k339J99
$$ 315604 353935 362023 343130 310107 246660 148993 46874 -26971 -59208 -66501 -68840 -68641
10474f8641N543L5811Q8252R3755K3862o6363j01674p2533m3077m5884m8283l0897
$$ -68641 -63098 -27287 60965 154720 178582 112219 10545 -61988 -105065 -150949 -199232 -230129
10462b30129n436K7985L9551K1999j462o137l432l1292n2490m9457m8255l4513
$$ -230129 -235565 -207580 -168029 -146030 -147492 -153629 -157061 -188353 -240843 -290300 -338555 -373068
10450c73068q560j537N471K3790N4948J02601J27092R7490M5752J8442Q547K993
$$ -373068 -381628 -383165 -377694 -353904 -298956 -196355 -69263 28227 73979 92421 100968 103961
10438A03961m084l4015p7897q9610p4327n2057k7472r28M6345P6043M8329j5149
$$ 103961 99877 65862 -12035 -101645 -175972 -228029 -255501 -256429 -210084 -134041 -85712 -100861
10426a00861p2323p4219l4982j2117k3648j8484L0448Q8180J17698J13049R2357
$$ -100861 -173184 -247403 -282385 -294502 -318150 -336634 -306186 -218006 -100308 12741 105098
10415A05098P0685O3394N8976N2646L5049N300l4392p2535r8878j15002j02988
$$ 105098 175783 239177 298153 350799 385848 391148 356756 284221 185343 70341 -32647
10404c2647n8267j8784m543O664J2742l733l1541k7464J7457L9252M357k1114
$$ -32647 -90914 -109698 -114241 -107577 -94835 -98568 -130109 -157573 -140116 -100864 -96507 -117621
10392a17621p520k123k1914m3840n3870m3203k5729j2879r95q927l9873n2788
$$ -117621 -125141 -127264 -149178 -193018 -246888 -290091 -315820 -328699 -329694 -338621 -378494 -431282
10380d31282k7738R512L1967K7660J2754J2114Q383q302l971J4344K4875N0102
$$ -431282 -459020 -449508 -417541 -389881 -377127 -365013 -356630 -364932 -368903 -354559 -329684 -279582
10368b79582Q2162R7861R3281P1181N2051M5141M9721N4229M4864O432o1250j22684
$$ -279582 -197420 -99559 -6278 64903 116954 162095 211816 266045 310909 317341 256091 133407
10356A33407j15806o0660k2398j2019k875L6517N4821J9417m138o082j9436m0593
$$ 133407 17601 -43059 -65457 -77476 -80351 -43834 10987 30404 26266 20184 748 -39845
10344c9845o0334r1626j10985p4189k7123r950M072J8740M0763P4992R4869O3479
$$ -39845 -100179 -191805 -302790 -376979 -404102 -414052 -409980 -391240 -350477 -275485 -180616 -117137
10332a17137M438m7042q1691p3832j9709L4101O3234N3120M293m4679p6484q5127
$$ -117137 -112699 -159741 -241432 -315264 -334973 -300872 -237638 -184518 -180225 -224904 -301388 -386515
10320c86515m1661R047J781j8658J9324O3808N6253K0758j4560k6244k5653k8371
$$ -386515 -428176 -419129 -417348 -436006 -416682 -352874 -296621 -275863 -290423 -316667 -342320 -370691
10308c70691k7989m609L3385N0769M4987N6854Q1067N2541K866r337k6802o9203
$$ -370691 -398680 -403289 -369904 -319135 -274148 -217294 -136227 -83686 -80820 -90157 -116959 -186162
10296a86162p1689l5894M202O4775J19609J28022O9609n504l5174r806K9901K7811
$$ -186162 -257851 -293745 -289543 -224768 -105159 22863 92472 86968 51794 41988 71889 99700
10284I9700j5698m0360k3177K906J7403J0447l6709j09187j56258j44249o8942
$$ 99700 84002 43642 20465 23371 40774 51221 14512 -94675 -250933 -395182 -464124
10273d64124J9474Q0682R5506N6968m763n0457l2938J2704L0230O2884Q1390K2598
$$ -464124 -444650 -363968 -268462 -211494 -216257 -266714 -299652 -286948 -256718 -193834 -112444 -89846
10261h9846k8632k2481j8550k8705k6859l500L6715O3595P9372R7495Q0005J6424
$$ -89846 -118478 -140959 -159509 -188214 -215073 -218573 -181858 -118263 -38891 58604 138609 155033
10249A55033k7349l4331n6767p4300k8292N1189Q4313M9622L559k4951n1166n3674
$$ 155033 127684 93353 36586 -37714 -66006 -14817 69496 119118 122677 97726 46560 -7114
10237g114j3914K5518K6105n031m9330q0833p6722m1630q38K5938L2398L8153
$$ -7114 -21028 4490 30595 25564 -23766 -104599 -181321 -222951 -223789 -197851 -165453 -127300
10225a27300K9169j0344o7715j21453j19505o4335j2312K7253O7826J05754J05171
$$ -127300 -98131 -108475 -176190 -297643 -417148 -481483 -493795 -466542 -398716 -292962 -187791
10214a87791P1836K6281l4274q6195j00282j00541r8748o0014N261N5773O8270
$$ -187791 -115955 -89674 -123948 -210143 -310425 -410966 -509714 -569728 -564467 -508694 -440424
10203d40424O7557P9973P0267L7835J3704n094l4574p4158q3315l9058K2863O9888
$$ -440424 -372867 -292894 -222627 -184792 -171088 -176182 -210756 -284914 -368229 -407287 -384424 -314536
10191c14536R0709Q3171O3470N9792L6096m3518j20388j19583o5945k8042j3021
$$ -314536 -223827 -140656 -77186 -17394 18702 -24816 -145204 -264787 -330732 -358774 -371795
10180c71795j1215j1637j1082j7806k1695k1390j867M5416Q6870R0802P2858P3987
$$ -371795 -383010 -394647 -405729 -423535 -445230 -466620 -468487 -423071 -336201 -245399 -172541 -98554
10168i8554J02927J12167N9915K428k6417n1511o8568k9780N8558J31734J83611
$$ -98554 4373 116540 176455 178883 152466 100955 32387 2607 61165 192899 376510
10157C76510K30336K77384L28856L50377K83614Q0423j77826l29101l47973l04688
$$ 376510 606846 884230 1213086 1563463 1847077 1927500 1749674 1420573 1072600 767912
10147G67912k37501j56284r1104m0657j5600l2377m9505m6250l5398l7724o3615
$$ 767912 530411 374127 283023 242366 226766 194389 144884 98634 63236 25512 -38103
10136c8103r8305j18908j12573q8007o9112n2003j5086K3107K4190M396P92l829
$$ -38103 -136408 -255316 -367889 -455896 -525008 -577011 -592097 -568990 -544800 -540404 -539612 -543441
10124e43441j3150j1048r184j1045J078K4664M1603N4866P2819P6140P8635R8644
$$ -543441 -556591 -567639 -576823 -587868 -586790 -562126 -520523 -465657 -392838 -316698 -238063 -139419
10112a39419J01525P6345K7492l370J4394M4242O7420P1454L3471l17j576L710
$$ -139419 -37894 38451 65943 62573 76967 121209 188629 260083 293554 293237 291661 295371
10100B95371J611j256N528J2611J3099J3993R366p644m2443p9742j04892j20427
$$ 295371 296982 295726 301254 313865 326964 340957 350323 342679 300236 220494 115602 -4825
10088d825j11511p7128k2694K6560L1498J327j0046L5615P7108L9846l5392o3770
$$ -4825 -116336 -193464 -216158 -189598 -158100 -156773 -166819 -131204 -54096 -14250 -49642 -113412
10076a13412n9913o3768n1296j1388J4548K8870M7825O0531O9875O6469K0954
$$ -113412 -173325 -237093 -288389 -299777 -285229 -256359 -208534 -148003 -78128 -11659 9295
10065I295l2452l1202j289K0540K8470L2644M3973N1894L0595j7665n6223p7428
$$ 9295 -23157 -54359 -55648 -35108 -6638 26006 69979 121873 152468 134803 78580 1152
10053A152n7546m50M4660N0259L2136J1105J499o86o084j6687j4168R616J1604
$$ 1152 -56394 -56844 -12184 38075 70211 81316 82815 82129 76045 59358 45190 54806 66410
10040F6410k0920m3324m0598l2356l7631n2119m3145j6186o458j7950k3581j4572
$$ 66410 45490 2166 -38432 -70788 -108419 -160538 -203683 -219869 -226327 -244277 -267858 -282430
10028b82430k0160m0493o5359p1477n7060j1829O8261J17460R3004N0263K5917
$$ -282430 -302590 -343083 -408442 -479919 -536979 -548808 -480547 -363087 -270083 -219820 -193903
10017a93903q227n7218j02929q8663p159O1803Q2559Q3445O6650L3462M963N440
$$ -193903 -202130 -259348 -362277 -450940 -458099 -396296 -313737 -230292 -163642 -130180 -125217 -119777
10005a19777L3968M7404L6214J4449L566j506j9120l5357l1928k5403j6097j0253
$$ -119777 -85809 -38405 -2191 12258 15824 14318 -4802 -40159 -72087 -97490 -113587 -123840
9993a23840k0967l1222m5088m6380k8818k8708l4850o872M1312O3526L5100j6133
$$ -123840 -144807 -176029 -221117 -267497 -296315 -325023 -359873 -366745 -325433 -261907 -226807 -242940
9981b42940n0362m8796j2802K9983M4691K1904q553k2374j6032r542k3304m3753
$$ -242940 -293302 -342098 -354900 -324917 -280226 -258322 -266875 -289249 -305281 -314823 -338127 -381880
9969c81880n2590j9858M4396Q3314Q1520M9718J037j8492M420K2548k586l8645
$$ -381880 -434470 -454328 -409932 -326618 -245098 -195380 -194343 -212835 -208415 -185867 -188453 -227098
9957b27098n0687l5162k665M6852J18282J23090M4429k2036m1122m6345m8051
$$ -227098 -277785 -312947 -315612 -268760 -150478 -27388 17041 -4995 -46117 -92462 -140513
9946a40513k3270J1736J6492m448m3547q2094p7464l9031j1691o971j7835l2674
$$ -140513 -163783 -152047 -135555 -140003 -183550 -265644 -343108 -382139 -393830 -400801 -418636 -451310
9934d51310m5792m2555M272P8269J14309J11339R5791N8038p041o4654o2534j3853
$$ -451310 -497102 -539657 -535385 -457116 -342807 -231468 -135677 -77639 -84680 -149334 -211868 -225721
9922b25721J3277O240L688O23j9935k8453j0979j2248m2277n4064k7260R036J3996
$$ -225721 -212444 -206204 -202516 -201893 -221828 -250281 -261260 -273508 -315785 -369849 -397109 -388073 -374077
9909c74077l069k4866k4100K420J6553p483n6448q6834p5962k1057M4489P0428
$$ -374077 -377146 -402012 -426112 -423692 -407139 -414622 -471070 -557904 -633866 -654923 -610434 -540006
9897e40006O2457P0768J00480J15356R3259M9120L028n8014j17862j17895n0056
$$ -540006 -477549 -406781 -306301 -190945 -97686 -48566 -45538 -103552 -221414 -339309 -389365
9886c89365J4902L6790K4062j9176m1493k1480P733K1888K8724J9600j6340n4315
$$ -389365 -374463 -337673 -313611 -332787 -374280 -395760 -388027 -366139 -337415 -317815 -334155 -388470
9874c88470p9659j13834j48929j58283j26475p6232k7020K2471M2465M0595O6990
$$ -388470 -468129 -581963 -730892 -889175 -1015650 -1091882 -1118902 -1096431 -1053966 -1013371 -946381
9863i46381J12197J35984J13279O5181L9761O6821J21004J31469R2137M0402m769
$$ -946381 -834184 -698200 -584921 -519740 -479979 -413158 -292154 -160685 -68548 -28146 -32915
9852c2915l5980o6085q5498p0505l4956J0978P9618J34036J15894K3861n6652
$$ -32915 -68895 -134980 -220478 -290983 -325939 -314961 -235343 -101307 14587 38448 -18204
9841a8204n6508k6056k6355k4241n56J6775K6627M6943N7679M4833L1879L4030
$$ -18204 -74712 -100768 -127123 -151364 -151920 -135145 -108518 -61575 -3896 40937 72816 106846
9829A06846J4811k3405l6204m6423n7529m6103l0428j0384M991R978P52l818J5633
$$ 106846 121657 98252 62048 15625 -41904 -88007 -118435 -128819 -123828 -113850 -113098 -116916 -101283
9816a01283L3107J8104j778J69N468k80k4260n8662p3069p9467p7281m1094o016
$$ -101283 -68176 -50072 -51850 -51681 -46213 -46493 -70753 -129415 -202484 -281951 -359232 -400326 -406342
9803d06342P000K0926L2268J2546j7155j3488R734K0503J2797L083N571K1403
$$ -406342 -399342 -378416 -346148 -333602 -350757 -364245 -354511 -334008 -321211 -318128 -312557 -291154
9791b91154N0263M6148p954n4251k8805J1794j0761n3115p0560p7608q5212n5185
$$ -291154 -240891 -194743 -202697 -256948 -285753 -273959 -284720 -337835 -408395 -486003 -571215 -626400
9779f26400P214M2320L5670K0154K8229L4397K3703K2514J9440m528j7446J4330
$$ -626400 -619186 -576866 -541196 -521042 -492813 -458416 -434713 -412199 -392759 -397287 -414733 -400403
9767d00403O1031Q8057R2603Q6148Q0947N4193j1697o4880n1756j2165Q971L7468
$$ -400403 -339372 -251315 -158712 -72564 8383 62576 50879 -14001 -65757 -77922 -68951 -31483
9755c1483R5412J50314J44978R6412N5771L2908J0741k3488n8804o5035k3031
$$ -31483 63929 214243 359221 455633 511404 544312 555053 531565 472761 407726 384695
9744C84695J7064O848J1146O2574R5791Q5965Q5811J18415J34086J11360J05383
$$ 384695 401759 408607 419753 482327 578118 664083 749894 868309 1002395 1113755 1219138
9733A219138J38923J93230K48673L13318L94562N03751O29438Q03431J083262
$$ 1219138 1358061 1551291 1799964 2113282 2507844 3011595 3641033 4444464 5527726
9724E527726J497594K058848K800106L723862M690193N337414M899848K536552
$$ 5527726 7025320 9084168 11884274 15608136 20298329 25635743 30535591 33072143
9716C3072143j205364m184492n134270m618466l661934k822729k211992j742023
$$ 33072143 31866779 27682287 22548017 17929551 14267617 11444888 9232896 7490873
9708G490873j314783r43766o90851n45669m63341m30423m01389l50989k91899
$$ 7490873 6176090 5232324 4541473 3995804 3532463 3102040 2700651 2349662 2057763
9699B057763k55826k37789k09968j79661j69173j64088j33601q6494l7010J6687
$$ 2057763 1801937 1564148 1354180 1174519 1005346 841258 707657 621163 584153 600840
9689F00840M3202N1477M7853K6756P424j7863n0419r9471j50966j53172j02885
$$ 600840 644042 695519 743372 770128 777552 759689 709270 609799 458833 305661 202776
9678B02776m6281k3283j8258K0210O8173O0992K2301r918j8321j3646j8333j1800
$$ 202776 156495 133212 114954 135164 203337 264329 286630 276712 258391 244745 226412 214612
9666B14612o473J5194P0087R7944Q5285N7207L1991J653k7817j2934K2803J6733
$$ 214612 208139 223333 293420 391364 476649 533856 565847 567500 539683 526749 549552 566285
9654E66285k0831k1120l359l4372r6193j30955j14094m2914K1318M1928O7145
$$ 566285 545454 524334 520975 486603 390410 259455 145361 102447 123765 165693 232838
9643B32838R8863R1167M2258J59m715m825k9267m9239n2717o8665r1990p7868
$$ 232838 331701 422868 465126 465285 460570 455745 426478 377239 324522 255857 163867 85999
9631H5999k6875r78j9036k2696J1581K5255p746l5879j8253L0512R5097J22182
$$ 85999 59124 58146 39110 16414 27995 53250 45504 9625 -8628 21884 116981 239163
9619B39163O8484J7765J1288O132j4592l8263m5034l8243j2498M739j3126k7994
$$ 239163 307647 325412 336700 342832 328240 289977 244943 206700 194202 198941 185815 157821
9607A57821j7206M655J6175j0739n2706n4425j6538J3627K7354j3850p2731n7321
$$ 157821 140615 145270 161445 150706 98000 43575 27037 40664 68018 54168 -18563 -75884
9595g5884K3237R0400R8600O4219J1970l6878m8260l4344l2865k5103M926J7483
$$ -75884 -52647 37753 136353 200572 212542 175664 127404 93060 60195 35092 40018 57501
9583E7501j1484n1577n7588k9261k2048l7996l1459q781p225k2354j9331K3944
$$ 57501 46017 -5560 -63148 -92409 -114457 -152453 -183912 -192693 -199918 -222272 -241603 -217659
9571b17659O8071P5687N0780K5671M5266P4077O5087K3837k2232n0161m6623j1262
$$ -217659 -149588 -73901 -23121 2550 47816 121893 186980 210817 188585 138424 91801 80539
9559H0539L9163N7981L0911j6090n6144p9231p3299l9360J0273M8841N5106N5698
$$ 80539 119702 177683 208594 192504 136360 57129 -16170 -55530 -45257 3584 58690 114388
9547A14388N2239K7120r310k3318J5368N2534K0164l5277n9058m7728k6558k9358
$$ 114388 166627 193747 184437 161119 176487 229021 249185 213908 154850 107122 80564 51206
9535E1206k5371l4480p0920p7924m4072O686N7351P5004M6841J5987L749j5880
$$ 51206 25835 -8645 -79565 -157489 -201561 -194875 -137524 -62520 -15679 308 4057 -11823
9523a1823l0317j2603K8255N2838K4261j5443j3016K0740N8047P9270Q8831P1073
$$ -11823 -42140 -54743 -26488 26350 50611 35168 22152 42892 100939 180209 269040 340113
9511C40113L015n7524n0528l176O0259Q7656K1280q5755j46992j41808r6931m9248
$$ 340113 343128 285604 235076 231900 292159 379815 401095 315340 168348 26540 -70391 -119639
9499a19639k5458j489L2335M6545M0276J6328L290L9054R2700R9044O2729K1291
$$ -119639 -145097 -146586 -114251 -67706 -27430 -11102 -7812 31242 123942 222986 285715 307006
9487C07006k1076n7565n0487q581K7443L9778J6135j4388l4088l3625j5424n591
$$ 307006 285930 228365 177878 169297 196740 236518 252653 238265 204177 170552 155128 149537
9475A49537j3656j7675k2269k8553j2761L784k9731p3435o0378j5771M1165R1420
$$ 149537 135881 118206 95937 67384 54623 58407 28676 -44759 -105137 -120908 -79743 11677
9463A1677J16228J20776J00656N6291p694q2022j37785j44445j02175m0259J8185
$$ 11677 127905 248681 349337 405628 397934 315912 178127 33682 -68493 -108752 -90567
9452i0567L0112j3046o2965p6802m0781N225K5702K1918K512k351J6557K7178
$$ -90567 -60455 -73501 -136466 -213268 -254049 -248824 -223122 -201204 -198692 -201043 -184486 -157308
9440a57308L1606M7019Q0554J23051J30154R5178N7234L1518j3444n5229n6137
$$ -157308 -125702 -78683 1871 124922 255076 350254 407488 439006 425562 370333 314196
9429C14196m0634k4493m944J2500R333k7463n1158l7516j5225o506O147K2212
$$ 314196 273562 249069 244125 256625 265958 238495 187337 149821 134596 128090 134237 156449
9417A56449j789l9800l8197k9030l2933l6918k0956K1664O2446N9157M1671N4301
$$ 156449 154660 114860 76663 47633 14700 -22218 -43174 -21510 40936 100093 141764 196065
9405A96065O0286L1921q82k3945m8378p7765q3130k4534M7253P3977P9981Q4269
$$ 196065 256351 288272 287390 263445 215067 137302 54172 29638 76891 150868 230849 315118
9393C15118P8020M7312P35m4166p5463q4741m5194J7635L6192L2511L4394J8547
$$ 315118 393138 440450 441185 397019 321556 236815 191621 209256 245448 277959 312353 330900
9381C30900j3737m6903n3584j3375L1707K6630l9195j19616j54027j20752m0993
$$ 330900 317163 270260 216676 203301 235008 261638 222443 102827 -51200 -171952 -212945
9370b12945K6597M1555L0775N931k3593j6958M797K3651N4097O8749O4075M4148
$$ -212945 -186348 -144793 -114018 -108087 -131680 -148638 -143841 -120190 -66093 2656 66731 110879
9358A10879J3802J1434J2225j1472k1781j029K2136O1202J22913J35904O6495
$$ 110879 124681 136115 148340 136868 115087 114058 136194 197396 320309 456213 522708
9347E22708k8002m7796M897M2002K9221n229j0849j6765m2772m4338k9766l4137
$$ 522708 494706 446910 451807 493809 523030 517801 506952 490187 447415 403077 373311 339174
9335C39174n0639n7328m3290k3877k2869k9011j7146q177j5668k1679j9668k220
$$ 339174 288535 231207 187917 164040 141171 112160 95014 86837 71169 49490 29822 27602
9323B7602J6144M7048P4725O3634J8303n7559j25178j20120l6861N4283R6434
$$ 27602 43746 90794 165519 229153 247456 189897 64719 -55401 -92262 -37979 58455
9312E8455J00155J04995J16529R6708M0567p409k9700m2840l3821j0812Q645K2556
$$ 58455 158610 263605 380134 476842 517409 510000 480300 437460 403639 392827 401472 424028
9300D24028L3272M1468M3093J7476l2513o8093n5608l5409m6630p0664o6213l4748
$$ 424028 457300 498768 541861 559337 526824 458731 403123 367714 321084 250420 184207 149459
9288A49459O970O4834J18160J24497O8831k924m2212k1848L3412M9566L9210K6671
$$ 149459 156429 221263 339423 463920 532751 529827 487615 465767 499179 548745 587955 614626
9276F14626n532m2802m9817l1937j0103J7554N3146Q1314R1541P6503L7599j2664
$$ 614626 609094 566292 516475 484538 474435 491989 545135 626449 717990 794493 832092 819428
9264H19428n0505p4009o8342j7833K3573J5817l9635j13703j46468j51732j49343
$$ 819428 768923 694914 626572 608739 632312 648129 608494 494791 348323 196591 47248
9253D7248j04470O966R6091J11433P8497J3735n2867q5035n3188J4945K8301K769
$$ 47248 -57222 -50256 45835 157268 235765 249500 196633 111598 58410 73355 101656 104425
9241A04425k702J7001M0130O1151R8058J22312Q5948J0517n1965n1567Q552R0984
$$ 104425 101723 118724 158854 220005 318063 440375 526323 536840 484875 433308 441860 532844
9229E32844J36780J10822N1062q169o6799j16336j25181j02084q3163r3392j12638
$$ 532844 669624 780446 831508 823339 756540 640204 515023 412939 329776 236384 123746
9218A23746r8724n1386J3250O3247P9266P6735O6468M5864K4904n096k5711n155
$$ 123746 25022 -26364 -13114 50133 129399 206134 272602 318466 343370 338274 312563 307408
9206C07408K9373L4998J9454k2520p9169j16440j34535j20541n6876n914P427
$$ 307408 336781 371779 391233 368713 289544 173104 38569 -81972 -138848 -144762 -137335
9195a37335L3739P0407P6607N4137J8806J1046L1069N2366O0875N2684L3601j5902
$$ -137335 -103596 -33189 43418 97555 116361 127407 158476 210842 271717 324401 358002 342100
9183C42100o5856m5580M9676J34985J24746M9807p748j3059J3772M9666M7601
$$ 342100 276244 230664 280340 415325 540071 589878 582130 569071 582843 632509 680110
9172F80110L9552P6919J10391P4447K718m5264o5936p2121m9331j729N7684J14647
$$ 680110 719662 796581 906972 981419 984137 938873 872937 800816 751485 749756 807440 922087
9160I22087J15985L8868m5578o7792n2799n3510p5919j02490j04106n4769J4534
$$ 922087 1038072 1076940 1031362 963570 910771 857261 781342 678852 574746 519977 534511
9149E34511L3763J6297Q189K0250N4831P8148Q1186Q9143Q9705N9491K0321k017
$$ 534511 568274 584571 592760 613010 667841 745989 827175 916318 1006023 1065514 1085835 1083818
9137A083818j3974j6617M435M8051O8672M9512J5249j2315m2453q4743r7295n2759
$$ 1083818 1069844 1053227 1057662 1105713 1174385 1223897 1239146 1226831 1184378 1099635 1002340 949581
9125I49581p861K1362N4298O6425N1890M3754N8838P2829N1224K9864N1956P8471
$$ 949581 941720 963082 1017380 1083805 1135695 1179449 1238287 1311116 1362340 1392204 1444160 1522631
9113A522631P1857K7240m0608p9315m7760K8046O2135L1244k3755p9431q4572
$$ 1522631 1594488 1621728 1581120 1501805 1454045 1482091 1544226 1575470 1551715 1472284 1387712
9102A387712l2302J3707J1030o252J2907N5916P7209L4215l5783n8165l2906R318
$$ 1387712 1355410 1369117 1380147 1373895 1386802 1442718 1519927 1554142 1518359 1460194 1427288 1436606
9090A436606N7595J05636J26465J42274J81308K32013K84847L76942M88500N83111
$$ 1436606 1494201 1599837 1726302 1868576 2049884 2281897 2566744 2943686 3432186 4015297
9080D015297O92179Q46473J073081J392851J836641K453801L283399M342532N519134
$$ 4015297 4707476 5553949 6627030 8019881 9856522 12310323 15593722 19936254 25455388
9071B5455388O470229O304215L773899q86909m886084o260074n740698m638165
$$ 25455388 31925617 38229832 42003731 41116822 36230738 29970664 24229966 19591801
9063A9591801l587155k708451k025200j546870j195068r23213p44572o14307m98189
$$ 19591801 16004646 13296195 11270995 9724125 8529057 7605844 6861272 6246965 5748776
9054E748776l82664k79830k25341j83930j29047r3176p7491o3956m9316l1655
$$ 5748776 5366112 5086282 4860941 4677011 4547964 4454788 4377297 4313341 4264025 4232370
9044D232370k9484k4467K4538Q6339J01039P9444P1099R4939J23331J38268J16607
$$ 4232370 4202886 4178419 4202957 4289296 4390335 4469779 4540878 4635817 4759148 4897416 5014023
9033E014023J12077J50145K21281L27838M32399N12511O23145P67190R18470J077399
$$ 5014023 5126100 5276245 5497526 5825364 6257763 6770274 7393419 8160609 9079079 10156478
9023A0156478J321312J687385K176443K836715L760673N057352O881520R325475
$$ 10156478 11477790 13165175 15341618 18178333 21939006 26996358 33877878 43203353
9015D3203353J2433422J6022803J9217858J9560473J3137806n37032j3628219
$$ 43203353 55636775 71659578 90877436 110437909 123575715 123038683 109410464
9008A09410464j8938849j7832849j4448220j1077443q389963o378050m877020
$$ 109410464 90471615 72638766 58190546 47113103 38723140 32345090 27468070
9001B7468070l764029k950000k340119j863023j505468j219403r39847o81643
$$ 27468070 23704041 20754041 18413922 16550899 15045431 13826028 12886181 12204538
8993A2204538n04873m47408m89409n38211n32008m84361m02629l04722k27057
$$ 12204538 11699665 11252257 10762848 10224637 9692629 9208268 8805639 8500917 8273860
8984H273860j83326j25798l6511L9302R3900J45992J71182J86687K24732L02990
$$ 8273860 8090534 7964736 7928225 7967527 8061427 8207419 8378601 8565288 8790020 9093010
8974I093010L96667M92376O07526P77367R82006J205089J470353J819928K234458
$$ 9093010 9489677 9982053 10589579 11366946 12348952 13554041 15024394 16844322 19078780
8965A9078780K745132L385001M251399N494673P271162R733241J3100840J7648234
$$ 19078780 21823912 25208913 29460312 34954985 42226147 51959388 65060228 82708462
8957H2708462K3609007L0703453L7438370L9481735K9125954L373288k4142835
$$ 82708462 106317469 137020922 174459292 213941027 243066981 246440269 222297434
8950B22297434l7222406l6403607l0001378k3202372j7642757j3453391j0338003
$$ 222297434 185075028 148671421 118670043 95467671 77824914 64371523 54033520
8943E4033520q015624o276473m958713l947129l181378k582134k096583j706928
$$ 54033520 46017896 39741423 34782710 30835581 27654203 25072069 22975486 21268558
8935B1268558j389846j159778j073919j091250j082133r65525p79976o11551m96640
$$ 21268558 19878712 18718934 17645015 16553765 15471632 14506107 13726131 13114580 12617940
8926A2617940m38956l72261k52488j30379n5837j6870L5870J36699K33053K88876
$$ 12617940 12178984 11806723 11554235 11423856 11368019 11351149 11387019 11523718 11756771 12045647
8916A2045647L55236M88581O62775Q55229J043836J254388J514365J864621K346145
$$ 12045647 12400883 12889464 13552239 14407468 15451304 16705692 18220057 20084678 22430823
8907B2430823K989560L793702M817396O198958Q147250J0860180J4623622J9760511
$$ 22430823 25420383 29214085 34031481 40230439 48377689 59237869 73861491 93622002
8899I3622002K6529394L4708152M2873225M6583985L7120566Q990317k4542743
$$ 93622002 120151396 154859548 197732773 244316758 281437324 290427641 265884898
8892B65884898m2813018m3599600l6528806k8407052k1581253j6381702j2522495
$$ 265884898 223071880 179472280 142943474 114536422 92955169 76573467 64050972
8885F4050972r671607p579392o041378m877766l975447l260945k658140k143901
$$ 64050972 54379365 46799973 40758595 35880829 31905382 28644437 25986297 23842396
8877B3842396j748244j486199j343737j260352j154007j020785q99275p91430
$$ 23842396 22094152 20607953 19264216 18003864 16849857 15829072 14929797 14138367
8869A4138367o92034n93459m75864l40980k15138j35497r6442p1075n8878m1150
$$ 14138367 13446333 12852874 12377010 12036030 11820892 11685395 11588953 11517878 11459000 11417850
8859A1417850N6332K38845M37385N82514P04566Q57110J053384J262258J515909
$$ 11417850 11474182 11713027 12150412 12732926 13437492 14294602 15347986 16610244 18126153
8850A8126153J890444K415605L076721L925748N095347O766415R034503J2097124
$$ 18126153 20016597 22432202 25508923 29434671 34530018 41296433 50330936 62428060
8842F2428060J6278411K1840643K8675430L5731932L9704839L3649896J1635783
$$ 62428060 78706471 100547114 129222544 164954476 204659315 238309211 249944994
8835B49944994j7580226l5599046l7911089l2315133k5272048j9220937j4572179
$$ 249944994 232364768 196765722 158854633 126539500 101267452 82046515 67474336
8828F7474336j1147401q652987o825204n440594m346445l508422k894735k400241
$$ 67474336 56326935 47673948 40848744 35408150 31061705 27553283 24658548 22258307
8820B2258307j995206j689161j451811j272165j164664j064624r37619p98223
$$ 22258307 20263101 18573940 17122129 15849964 14685300 13620676 12683057 11884834
8812A1884834o63743n35129m50678l94304l41368l08652k93416k64001j96703
$$ 11884834 11221091 10685962 10235284 9840980 9499612 9190960 8897544 8633543 8436840
8803H436840j34104j07482p3718j2983O7149J42150K19015L27666M63385N86408
$$ 8436840 8302736 8195254 8121536 8108553 8175702 8317852 8536867 8864533 9327918 9914326
8793I914326P28097R32795J215827J560463J966809K517867L297613M334199N752027
$$ 9914326 10642423 11575218 12791045 14351508 16318317 18836184 22133797 26467996 32220023
8784C2220023P698349J0334665J3687890J7312926J9743561J7745214P874504
$$ 32220023 39918372 50253037 63940927 81253853 100997414 118742628 126617132
8777A26617132o838648j7096344j9235702j6767145j3245203j0129590p694618
$$ 126617132 119778484 102682140 83446438 66679293 53434090 43304500 35609882
8770C5609882n880536m541248l563565k857411k328610j881076j518244j236123
$$ 35609882 29729346 25188098 21624533 18767122 16438512 14557436 13039192 11803069
8762A1803069j025575q72814p54806o36381n31460m60606m16647l78886l66621
$$ 11803069 10777494 9904680 9149874 8513493 7982033 7521427 7104780 6725894 6359273
8753F359273l50691l17911k85156k33276j81822j59468j57413j74954j77567j29288
$$ 6359273 6008582 5690671 5405515 5172239 4990417 4830949 4673536 4498582 4321015 4191727
8743D191727m8364J4142L7323K4811L7639P8351J30833J87327K18187K48998L32314
$$ 4191727 4143363 4157505 4194828 4219639 4257278 4335629 4466462 4653789 4871976 5120974 5453288
8732E453288M53440O02462P59751R57919J289866J790895K435705L288344M373146
$$ 5453288 5906728 6509190 7268941 8226860 9516726 11307621 13743326 17031670 21404816
8723B1404816N571896O486574O137705L282401j517258n299662o405957n757557
$$ 21404816 26976712 33463286 39600991 42883392 41366134 36066472 29660515 23902958
8715B3902958m584481l492287k657815k062107j628371j271089r56782p20749
$$ 23902958 19318477 15826190 13168375 11106268 9477897 8206808 7250026 6529277
8707F529277n69828n00084m53237l94819l49331l21289l01002k83816k50919j89058
$$ 6529277 5959449 5459365 5006128 4611309 4261978 3940689 3639687 3355871 3104952 2915894
8697B915894j05999p5726r2688q2803m7354k5676l4076n6634p6318r0969r6577
$$ 2915894 2809895 2734169 2641481 2558678 2511324 2485648 2451572 2394938 2318620 2227651 2131074
8686B131074q3836n4762n4958q7116j11568j37039j58962j18245m8273m200J0849
$$ 2131074 2047238 1992476 1937518 1850402 1738834 1601795 1442833 1324588 1276315 1272115 1282964
8675A282964L4252M5868J9480j3023j1196J034l0638o9451n7445j3665K0072J7875
$$ 1282964 1317216 1363084 1382564 1369541 1358345 1359379 1328741 1259290 1201845 1188180 1208252 1226127
8663A226127l174k9244n2147o2719m4650j4132R338J7141J5166p638j8517k2220
$$ 1226127 1222953 1193709 1141562 1078843 1034193 1020061 1029399 1046540 1061706 1054068 1035551 1013331
8651A013331m4460n8094l3472J2722K5214k119L713L2659K7677J1972J875j1531
$$ 1013331 968871 910777 877305 890027 915241 913122 916835 949494 977171 989143 991018 979487
8639I79487k6836l0216k0648j2570k0891m8806l2340r074l9259p6543o9722n3898
$$ 979487 952651 922435 901787 889217 868326 819520 787180 778106 738847 662304 592582 538684
8627E38684o2689p0212n2441n06M8167N4378K7013l925j5929j1347j167J3522
$$ 538684 475995 405783 353342 352836 401003 455381 482394 478469 462540 451193 450026 463548
8615D63548K0728K2687M188n7306j01435p0005M102M6899P515n8594n7256J1022
$$ 463548 484276 506963 511151 453845 352410 282405 286507 333406 340921 282327 225071 236093
8603B36093Q3819R9629P3350L9959j560l8978l2976R345K4050J2207P676J1060
$$ 236093 319912 419541 492891 532850 531290 492312 459336 468681 492731 504938 512614 523674
8591E23674J8617J6726k409j5347j5635k8617m3831j9020L4201Q1310J19862J38057
$$ 523674 542291 559017 556608 541261 525626 497009 453178 434158 468359 549669 669531 807588
8579H07588J01891J8886n7322j02419j28094j45668j38772j08517q7218o7288
$$ 807588 909479 928365 871043 768624 640530 494862 356090 247573 160355 93067
8569I3067m1302k9979o529J7204J6259Q888o73k8311n1644l8298K2374P9180J09281
$$ 93067 51765 21786 15257 32461 48720 57608 56935 28624 -23020 -61318 -38944 40236 149517
8556A49517J09588P7910L3476K2234N1229O6892M7113L0013M5889O2011M6798
$$ 149517 259105 337015 370491 392725 443954 510846 557959 587972 633861 695872 742670
8545G42670K640m3148m8069j9234P974J8300k970o3934j28130j50790j38540j16943
$$ 742670 745310 702162 654093 634859 642833 661133 658163 594229 466099 315309 176769 59826
8533E9826r5325m9737J9187N5994L3086l122p950J1651J6423R225J7885L8802
$$ 59826 -35499 -85236 -66049 -10055 23031 19909 11959 23610 40033 49258 67143 105945
8521A05945L9972K9141L6629L4467J0857l540J5116M5542N8240O7528N6449J6115
$$ 105945 145917 175058 211687 246154 257011 253471 268587 314129 372369 439897 496346 512461
8509E12461J673n638m3844p1548m5793N97J3233O634k6268n8989m4841p18J5200
$$ 512461 514134 508496 464652 393104 347311 347908 361141 367775 341507 282518 237677 236959 252159
8496B52159j3451n3579o6986n4129k8634k300k780n02M6597R1477Q3771M9341
$$ 252159 238708 185129 118143 64014 35380 33080 30300 29798 76395 167872 251643 300984
8484C00984L3999J9153j3027m5346o1448m1153k3738n8367p9997n0332q711L8535
$$ 300984 334983 354136 341109 295763 234315 193162 169424 111057 31060 -19272 -27983 10552
8472A0552P0738N9876K6176j6112m2201m4828m9241l6240J8332O9631Q4020N6709
$$ 10552 81290 141166 167342 151230 109029 64201 14960 -21280 -2948 66683 150703 207412
8460B07412n448n7462m3038J9301P1447N8051j749k4609L1445J04634J17878Q0564
$$ 207412 201964 144502 101464 120765 192212 250263 248514 223905 255350 359984 477862 558426
8448E58426L3174k7343o3767m6020k1676p614J0760L7560O5335Q2930Q1465K8965
$$ 558426 591600 564257 500490 454470 432794 425180 435940 473500 538835 621765 703230 732195
8436G32195k6851l7888l8123l7024L888O3084P0284M8073K2638o869n5871r1246
$$ 732195 705344 667456 629333 592309 596197 659281 729565 777638 800276 793407 737536 646290
8424F46290n1212J7678K9479l5276j03053j25849j17862q0076k5023K4084L3030
$$ 646290 595078 612756 642235 606959 503906 378057 260195 180119 155096 179180 212210
8413B12210J3495j4836o1084q2457p2745m8503q352N3836R9475P6395K6270M411
$$ 212210 225705 210869 149785 67328 -5417 -53920 -62272 -8436 91039 167434 193704 198115
8401A98115J1868L4351L5816J978m9372p6339n7096k70M8827O5387O0261M7837
$$ 198115 209983 244334 280150 282128 232756 156417 99321 99051 147878 213265 273526 321363
8389C21363L3732r867n5438o4083l2882K0479N9116P6515P2844N5303N9865R0262
$$ 321363 355095 345228 289790 225707 192825 213304 272420 348935 421779 477082 536947 627209
8377F27209Q5103L4707k3564o3761p2326o4546p1134o2743l7709k4102j6322j1250
$$ 627209 712312 747019 723455 659694 587368 522822 451688 388945 351236 327134 310812 299562
8365B99562k3283n6198o5575k7645K4398P1205Q1679N1421M206l7450l1889K0445
$$ 299562 276279 220081 154506 126861 151259 222464 304143 355564 359770 322320 290431 310876
8353C10876N7741N4110J6494l9873p2136n0459J2856N8836O0607N1749L6626R495
$$ 310876 368617 422727 439221 399348 327212 276753 289609 348445 409052 460801 497427 506922
8341E06922k9223o7222q6170p9898n6557m6944n5103n7807p8556j07886q6186
$$ 506922 477699 410477 324307 244409 187852 140908 85805 27998 -50558 -158444 -244630
8330b44630l002O6051Q8296Q1973N4365J8700j0786j2548K0731M2161L2803L5517
$$ -244630 -247632 -181581 -93285 -11312 43053 61753 50967 38419 59150 101311 134114 169631
8318A69631O2661O8102K9606j7911l6492k5052k798J3500P559j1414j3697j8177
$$ 169631 232292 300394 330000 312089 275597 250545 247747 261247 268806 257392 243695 225518
8306B25518k9971j9505p186o612J122J0306J5662q05l8654o0309l7791r789r592
$$ 225518 195547 176042 168856 162244 163366 173672 189334 188529 149875 89566 51775 41986 32394
8293C2394o73K776j1800j5789J227J3307N126L42M648P033j0521k6159K912N5116
$$ 32394 31721 34497 22697 6908 8135 21442 26568 26910 31558 38591 28070 1911 4823 59939
8279E9939R5148J15411J16604J14286J06218P3445P771q0979j29916j20692q7100
$$ 59939 155087 270498 387102 501388 607606 681051 688822 607843 477927 357235 270135
8268B70135l7565K6063Q6634Q7870L0766k1545k9886j4712M275K4069J9181J3997
$$ 270135 232570 258633 345267 433137 463903 442358 412472 397760 402035 426104 445285 459282
8256D59282L3679M1275r367p7798r6162o8497j2862M4804P3497P9927O9952J1839
$$ 459282 492961 534236 524869 447071 350909 282412 269550 314354 387851 467778 537730 549569
8244E49569p1273j07939r2296r4522j25598j21945p0617j1902J8764J2703J0592
$$ 549569 478296 370357 278061 183539 57941 -64004 -134621 -146523 -127759 -115056 -104464
8233a04464J2105j7382l8012m4574m3803j1846N5344Q4904N9478N5164Q7126R8879
$$ -104464 -92359 -109741 -147753 -192327 -236130 -247976 -192632 -107728 -48250 6914 94040 192919
8221A92919Q9087P5365K7953n0397r4291o5773j2899J5802K8821L4363l532p4601
$$ 192919 282006 357371 385324 334927 240636 174863 161964 177766 206587 240950 237418 162817
8209A62817q5550l6862k850K2590L2323P765r308q26j0611l8290l0354J3367O8542
$$ 162817 77267 40405 37555 60145 92468 100233 90925 90099 79488 41198 10844 24211 92753
8196I2753J18570J21666O3850k6580j05205j30486j08362p3947k1439N7080J17781
$$ 92753 211323 332989 396839 370259 265054 134568 26206 -47741 -69180 -12100 105681
8185A05681J12366O0148J9035K271o632k3492k4813K929L9440O0571O2963N0290
$$ 105681 218047 278195 297230 299501 292869 269377 244564 247493 286933 347504 410467 460757
8173D60757J7476k0834l9079m1407j4765J0731N922M675o5l2196n7407l3095K5396
$$ 460757 478233 457399 418320 376913 362148 372879 378801 383476 383411 351215 293808 260713 286109
8160B86109N4605M0440J5022N595J9117M2603M2602J2959j6749k2140L049L1973
$$ 286109 340714 381154 396176 401771 420888 463491 506093 519052 502303 480163 483212 515185
8148E15185K3337j4711k9637m536L4946M6192K2610r872m4474n3552j9932J5526
$$ 515185 538522 523811 494174 489638 524584 570776 593386 583514 539040 485488 465556 481082
8136D81082N979m1881p7879n4810R578N5694O7224O3572O3785R0181J21876J09554
$$ 481082 487061 445180 367301 312491 322069 377763 444987 508559 572344 662525 784401 893955
8124H93955N3597L538j7609j8867J3383O9129R9969R0371O6880O9608R9486J52196
$$ 893955 947552 951090 933481 914614 927997 997126 1097095 1187466 1254346 1323954 1423440 1575636
8112A575636J89045J75699J44880J05724N1773J6070L2007J17415K31563L26028
$$ 1575636 1764681 1940380 2085260 2190984 2242757 2258827 2290834 2408249 2639812 2965840
8102B965840L94251M45043M79909N14101N62388O38145P49248R09177J095026
$$ 2965840 3360091 3805134 4285043 4799144 5361532 5999677 6748925 7658102 8753128
8093H753128J243723J376610J552218J710434J754732J664333J447863J100547
$$ 8753128 9996851 11373461 12925679 14636113 16390845 18055178 19503041 20603588
8085B0603588O83549L57205K52304L77662O64520J070893J608462K238572K881569
$$ 20603588 21287137 21644342 21896646 22274308 22938828 24009721 25618183 27856755 30738324
8076C0738324L498608M099464M667261N065272N063511M440583L118731J217426
$$ 30738324 34236932 38336396 43003657 48068929 53132440 57573023 60691754 61909180
8068F1909180r85613l062671m603648n428644n638847n407929m871926m234760
$$ 61909180 60923567 57860896 53257248 47828604 42189757 36781828 31909902 27675142
8060B7675142l658902l145406k676683k257736j884255j564436j314870j118539
$$ 27675142 24016240 20870834 18194151 15936415 14052160 12487724 11172854 10054315
8052A0054315r54751q28193p35580o62007n91774n16798m63655m31813m01305
$$ 10054315 9099564 8271371 7535791 6873784 6282010 5765212 5301557 4869744 4468439
8043D468439l64215l19704k85507k48681j56190m2693j050l5220q2383j09632
$$ 4468439 4104224 3784520 3499013 3250332 3094142 3051449 3050399 3015179 2932796 2823164
8033B823164j37174j59837j63385j64452j49990j24826j11188j14162j15210r8605
$$ 2823164 2685990 2526153 2362768 2198316 2048326 1923500 1812312 1698150 1582940 1484335
8023A484335p5115p4574r7643q7528n3505l7815m9291p1496n8403j2860N310k2077
$$ 1484335 1409220 1334646 1237003 1149475 1095970 1058155 1008864 937368 878965 866105 871415 849338
8011H49338o2287q6779q9257q0303o1048m2963r881M0412M6692o01l8485l3514
$$ 849338 787051 700272 611015 530712 469664 426701 416820 457232 503924 503323 464838 431324
7999D31324k0593k3613n1217n4497J3060R8192J39005J02385P121q1120j02644
$$ 431324 410731 387118 335901 281404 294464 392656 531661 634046 641167 560047 457403
7988D57403n7557J5581P1941P9215M6791l2817r3569p7257j6202L6480N9574N4759
$$ 457403 399846 415427 487368 566583 613374 580557 486988 409731 393529 430009 489583 544342
7976E44342L1779J2654J7665K6448O824l6466p6731j07968j20866q4755k2072
$$ 544342 576121 588775 606440 632888 639712 603246 526515 418547 297681 212926 190854
7965A90854j564l0029o6101n3201p176J0390o484j2143j817l234p198J9440P2396
$$ 190854 189290 159261 93160 39959 32783 43173 36689 24546 22729 19495 12297 31737 104133
7952A04133J08674J03482R3672Q1795M0531p579k6290l2194m5674n6000o5217
$$ 104133 212807 316289 409961 491756 532287 524708 498418 466224 420550 364550 299333
7941B99333o6434m5171k0917l4787m3700j1632Q340o718k3663k5726k3864k7278
$$ 299333 232899 187728 166811 132024 88324 76692 85032 78314 54651 28925 5061 -22217
7929b2217l1488k3524l0667p4967j15393q4712J7360R5453J08305R4789P7582
$$ -22217 -53705 -77229 -107896 -182863 -298256 -382968 -365608 -270155 -161850 -67061 10521
7918A0521O0012M8922M0915K5074q84k3020l4759m0596k6834k4453n4032n5743
$$ 10521 70533 119455 160370 185444 184560 161540 126781 86185 59351 34898 -19134 -74877
7906g4877j6019Q930K5306M2052L4247O357l4035o0724l2482J5045J4228n355
$$ -74877 -90896 -81966 -56660 -14608 19639 25996 -8039 -68763 -101245 -86200 -71972 -77327
7894g7327r987j9744l3091l6189j3235L4815P7893J01293J00884Q3351P3574N3513
$$ -77327 -87314 -107058 -140149 -176338 -189573 -154758 -76865 24428 125312 208663 282237 335750
7882C35750L0724L2661L4578j968p0014j00545p2950l2923j9598n7351j04488
$$ 335750 366474 399135 433713 431745 361731 261186 188236 155313 135715 78364 -26124
7871b6124j25382j02671j4577Q3873J40326J53950J22079P3806N2149M4854K2689
$$ -26124 -151506 -254177 -268754 -184881 -44555 109395 231474 305280 357429 402283 424972
7860D24972l1207j07413j48724j09891k5730K9606J3221l9826n3751l11P5595
$$ 424972 393765 286352 137628 27737 2007 31613 44834 5008 -48743 -49054 26541
7849B6541J01443P2518L9454R112o488j9685n1666q3327j08242j19749j03245
$$ 26541 127984 200502 239956 249068 242580 222895 171229 87902 -20340 -140089 -243334
7838b43334l5429M5333N6525R954j2953J7097O8748R4713Q1672O9242P7797P0572
$$ -243334 -278763 -233430 -176905 -166951 -179904 -162807 -94059 654 82326 151568 229365 299937
7826B99937L9818O408k2847n2149q9193j15528j00564n5255q041L0914O1125P5094
$$ 299937 339755 346163 323316 271167 181974 66446 -34118 -89373 -97414 -66500 -5375 69719
7814F9719O2072O154p2312j07812q5880n2994l4213j8432R419N3582Q6264P0806
$$ 69719 131791 137945 65633 -42179 -128059 -181053 -215266 -233698 -224279 -170697 -84433 -13627
7802a3627L6735K1265L8024O5694P4756O7254N2582K1745j9851m7252n9978o3858
$$ -13627 23108 44373 82397 148091 222847 290101 342683 364428 344577 297325 237347 173489
7790A73489n0358n0425n8883l3819r885j3604k5048r660L7848P9429P7253J9336
$$ 173489 123131 72706 13823 -19996 -29881 -43485 -68533 -78193 -40345 39084 116337 135673
7778A35673m6062n6277j6132J4614J2365j0550j0560K3453N0137O9549Q4702P3730
$$ 135673 89611 33334 17202 31816 44181 33631 23071 46524 96661 166210 250912 324642
7766C24642M8803Q879k4793k8498l4790o0243n0398J9737O7015L8868p890l0378
$$ 324642 373445 382324 357531 329033 294243 234000 183602 203339 270354 309222 301332 270954
7754B70954l0972j9682j6348k2065k2211p805M1661P7466O0837K2204k3662o7434
$$ 270954 239982 220300 203952 181887 159676 151871 193532 270998 331835 354039 330377 262943
7742B62943p1116m2953k8357j3982K9358N9334M7360M9301O8239M4217K275j9535
$$ 262943 191827 148874 120517 106535 135893 195227 242587 291888 360127 404344 406619 387084
7730C87084k8401k5668k5894k4081J0562N0809O8225Q8959R4269Q1835M5802k9040
$$ 387084 358683 333015 307121 283040 293602 344411 412636 501595 595864 677699 723501 694461
7718F94461q3359m9482J2772k194p1579j09633q8620k8267M671K3591O3561P6730
$$ 694461 611102 561620 574392 572198 500619 390986 302366 274099 278770 302361 365922 442652
7706D42652O0826M8187K5308L315k1784n2806o1532n0161J969P0059Q6632M1981
$$ 442652 503478 551665 576973 580288 558504 505698 444166 394005 395974 466033 552665 594646
7694E94646j1161k7718j3859O268K9301L7408K8080J5693R015K8999P7233J59323
$$ 594646 583485 555767 541908 548176 577477 614885 642965 658658 667673 696672 773905 933228
7682I33228K17679J66283M3783j3753L5136J03230J08784P3267O8453R1657R7436
$$ 933228 1150907 1317190 1360973 1347220 1382356 1485586 1594370 1667637 1736090 1827747 1925183
7671A925183Q9910J03249J30572J62466J74525J58647J69978K29479K98097L64564
$$ 1925183 2015093 2118342 2248914 2411380 2585905 2744552 2914530 3144009 3442106 3806670
7661C806670M40399M92586N13065N60931O53937P73697Q68742R07379R42315J050741
$$ 3806670 4247069 4739655 5252720 5813651 6467588 7241285 8110027 9017406 9959721 11010462
7651A1010462J224892J396116J552803J705951J884998K091906K298172K498279
$$ 11010462 12235354 13631470 15184273 16890224 18775222 20867128 23165300 25663579
7643B5663579K681806K827826K996855L208918L387784L495950L522677L414023
$$ 25663579 28345385 31173211 34170066 37378984 40766768 44262718 47785395 51199418
7635E1199418L116727K597001J827393P90693m67273j808228l053101m050215
$$ 51199418 54316145 56913146 58740539 59531232 59063959 57255731 54202630 50152415
7627E0152415m701544m938933m786153m404757l942541l471314l032204k636323
$$ 50152415 45450871 40511938 35725785 31321028 27378487 23907173 20874969 18238646
7619A8238646k277659j952962j656255j400031j197256j008244q31066o94556
$$ 18238646 15960987 14008025 12351770 10951739 9754483 8746239 7915173 7220617
7611G220617n94620n27505m79515m16658l37742k94515l05915l29636l31085k84198
$$ 7220617 6625997 6098492 5618977 5202319 4864577 4570062 4264147 3934511 3603426 3319228
7601C319228k04892j55253j57771j87938j91440j53310r6637o1122n6006p4291
$$ 3319228 3114336 2959083 2801312 2613374 2421934 2268624 2171987 2110865 2054859 1980568
7591A980568j04213j07092o9717k7194q325j7972l1845m4656n6140o4161o8118
$$ 1980568 1876355 1769263 1699546 1672352 1664027 1646055 1614210 1569554 1513414 1449253 1381135
7580A381135p3995n6918n591L4499m264p3762q9855o0665l8663l0609k9783m1346
$$ 1381135 1307140 1250222 1244631 1279130 1274866 1201104 1111249 1050584 1011921 981312 951529 910183
7568I10183o5167n1852j185K1303j3085n4510o4069p2536r8109j29350j14064
$$ 910183 845016 793164 791979 813282 800197 745687 681618 609082 510973 381623 267559
7557B67559k9988O2582R9507O9058j3801j00057j08356o2551j0805M5900Q0182
$$ 267559 237571 300153 399660 468718 454917 354860 246504 183953 173148 219048 299230
7546B99230Q9064O6958m21m9406l4873j0583j5650k6188j8553L043K0447K2176
$$ 299230 388294 455252 454831 405425 370552 359969 344319 318131 299578 302621 323068 345244
7534C45244J1327R497P045j2686k1865j8640n728R225J2035J1929J8050P531j4882
$$ 345244 356571 366068 373113 360427 338562 319922 314194 323419 335454 347383 365433 372964 358082
7521C58082n0696q6231q0796n0299l9572m4028k7560J5726M3983N3666N6357M3756
$$ 358082 307386 221155 140359 90060 50488 6460 -21100 -5374 38609 92275 148632 192388
7509A92388L906k8279q814J6860K3225J8759R793K679K198M944J9361M4649J9144
$$ 192388 196294 168015 159201 176061 199286 218045 227838 230517 232715 237659 257020 301669 320813
7496C20813l2746l3419J4323N4120M8882R460j1930k664p176k9743m1180m3286
$$ 320813 288067 254648 268971 323091 371973 381433 369503 366839 359663 329920 288740 245454
7484B45454k7709J1606O4057J06343R0095P513p5525r8063q0604o8455n8882l2690
$$ 245454 217745 229351 293408 399751 489846 497359 421834 323771 243167 174712 115830 83140
7472H3140j4202k5817k8144m297L5024O1973O2228O5807O4515L2505j1253k1034
$$ 83140 68938 43121 14977 10680 45704 107677 169905 235712 300227 332732 321479 300445
7460C00445P064K4826M034m2101p9398q4110n8410k5580j4039k1787j8688j2441
$$ 300445 307509 332335 336369 294268 214870 130760 72350 46770 32731 10944 -7744 -20185
7448b0185k4466l7657m5764n6680m0315J1141N8987P6961R2430R1707L7862p542
$$ -20185 -44651 -82308 -128072 -184752 -225067 -213926 -154939 -77978 14452 106159 144021 136479
7436A36479L356R931l2193p4989p2920k2531O699j2252r153K8663K4594k2101
$$ 136479 139835 149766 117573 42584 -30336 -52867 -46168 -58420 -67573 -38910 -14316 -36417
7424c6417l8161k2151j1602j7643j8029l010L116j9492l2422J90K9748L6546M7177
$$ -36417 -74578 -96729 -108331 -125974 -144003 -147013 -143897 -163389 -195811 -195621 -165873 -129327 -82150
7411h2150O5616Q1583P9831L8600l1236n6533l5472l3079m5504l4917r174n513
$$ -82150 -16534 65049 144880 183480 152244 95711 60239 27160 -18344 -53261 -62435 -67948
7399f7948j7426j6604k3982j7806R387K9763M9069P0299Q2555Q8698R5377Q8241
$$ -67948 -85374 -101978 -125960 -143766 -134379 -104616 -55547 14752 97307 186005 281382 369623
7387C69623M5974j7802n4617m6400J247N7137J01594J40164J70752J72265J32621
$$ 369623 415597 397795 343178 296778 298025 355162 456756 596920 767672 939937 1072558
7376A072558Q9742L3708n2578j15310j51235j67531j52493j36352j11587p9274
$$ 1072558 1162300 1196008 1143430 1028120 876885 709354 556861 420509 308922 229648
7366B29648q1931q3380k6320M6124P6657Q4896P3778L4089j2855m9935p8321q7085
$$ 229648 147717 64337 38017 84141 160798 245694 319472 353561 340706 290771 212450 125365
7354A25365m7416Q554K6835K9961O3971R7432R4909P8593L4197l0934n1719l8066
$$ 125365 77949 86503 113338 143299 207270 304702 399611 478204 512401 481467 429748 391682
7342C91682m0220l9092j4323L054R982J1969P739l810j9377k6265j7373L087l777
$$ 391682 351462 312370 298047 301101 311083 323052 330791 326981 307604 281339 263966 267053 263276
7329B63276m0854p1712p3562n7584l9985k2214k0950k2990p296j4279m0412m6758
$$ 263276 222422 150710 77148 19564 -20421 -42635 -63585 -86575 -93871 -108150 -148562 -195320
7317a95320m5050l5236J259M6086O5432N2680J3556j1919P608N0055O2064L4875
$$ -195320 -240370 -275606 -274347 -228261 -162829 -110149 -96593 -108512 -100904 -50849 11215 46090
7305D6090K204j7114m2880n5345k8710J612K3042M3093L0631j4677n2273n1236
$$ 46090 48294 31180 -11700 -67045 -95755 -94143 -71101 -28008 2623 -12054 -64327 -115563
7293a15563k8830p144J1544K0206J0455n49J5805M8555N1221J1569l8766n2605
$$ -115563 -144393 -151537 -139993 -119787 -109332 -109881 -94076 -45521 5700 17269 -21497 -74102
7281g4102l1160j7155j866J7787K0578J88l0760n4350o3336n1679k9743p976P667
$$ -74102 -105262 -122417 -124283 -106496 -85918 -85730 -116490 -170840 -234176 -285855 -315598 -323574 -315907
7268c15907k646m0480p4062o5427j9466K7777M9659K6654K831M644N741j1346
$$ -315907 -318553 -359033 -433095 -498522 -517988 -490211 -440552 -413898 -411067 -406423 -400682 -412028
7256d12028j4605K855J6075P579J1302L6955N1726O0135P5272Q8668Q1251N7969
$$ -412028 -426633 -423778 -407703 -400124 -388822 -351867 -300141 -240006 -164734 -76066 5185 63154
7244F3154M4224K9812J6486k45j0215J5787K2835k6478o7830m9787q037L8663
$$ 63154 107378 137190 153676 153431 143216 159003 181838 155360 87530 37743 29706 68369
7232F8369P1485L6151k9746p0091p2500l7912O202L6385L6047L3685N0867M5769
$$ 68369 139854 176005 146259 76168 3668 -34244 -28042 8343 44390 78075 128942 174711
7220A74711N745l5728n9368p2195o4204l7268k3381m1472o6237n1449j756M3354
$$ 174711 180456 144728 85360 13165 -51039 -88307 -111688 -153160 -219397 -270846 -272602 -229248
7208b29248N5742K6205j0742l0297l4701m9467q6170q3707k1870J9304P28j9086
$$ -229248 -173506 -147301 -158043 -188340 -223041 -272508 -358678 -442385 -464255 -444951 -444223 -463309
7196d63309N604M0533O3348R2690J00938P1471M4340K0998j8487l8563j3678K3884
$$ -463309 -457705 -417172 -353824 -261134 -160196 -88725 -44385 -23387 -41874 -80437 -94115 -70231
7184g0231L6269J5468j9282n0722o7853l6444J8991M5241J3560l9754n8576l0976
$$ -70231 -33962 -18494 -37776 -88498 -156351 -192795 -173804 -128563 -115003 -154757 -213333 -244309
7172b44309K534N779L684K3967K2791l7462j07772j05811n3986l736K9290K9357
$$ -244309 -241775 -235996 -232312 -208345 -185554 -223016 -330788 -436599 -490585 -494321 -465031 -435674
7160d35674K5024J7042n726r133J4877M4709O6321Q0876O7868K7486J4007J5040
$$ -435674 -410650 -393608 -399334 -408467 -393590 -348881 -282560 -201684 -133816 -106330 -92323 -77283
7148g7283k428l8652r0298j01596o2315k0163n707j7786l8165l2521j0535j931
$$ -77283 -79711 -118363 -208661 -310257 -372572 -392735 -398442 -416228 -454393 -486914 -497449 -499380
7136d99380L826N0081J16263J20301N3240j9641q1271j19375j07385p2749m2754
$$ -499380 -495554 -445473 -329210 -208909 -155669 -175310 -256581 -375956 -483341 -556090 -598844
7125e98844j0503J7071L9238N2575N7215O7141Q3582Q1083O8165P3772R2044Q1278
$$ -598844 -609347 -592276 -553038 -500463 -443248 -376107 -292525 -211442 -143277 -69505 22539 103817
7113A03817L0424m0814j08389j23900o0905K4551O4882N9083K6234j628J143K6880
$$ 103817 134241 93427 -14962 -138862 -199767 -175216 -110334 -51251 -25017 -26645 -25502 1378
7101A378O2917Q8952O7950P721l7059m3703m5560n8293l9886J615Q379k6506n8834
$$ 1378 64295 153247 221197 228918 191859 148156 102596 44303 4417 6032 14411 -12095 -70929
7088g0929n9235m4865k4801J4450O1420Q1245P8670R0144J03330O8596j4922r1733
$$ -70929 -130164 -175029 -199830 -185380 -123960 -42715 35955 126099 229429 298025 283103 191370
7076A91370j19384j03686n9386l0367k2019q894J4707M6625N7423L5278L3644
$$ 191370 71986 -31700 -91086 -121453 -143472 -152366 -137659 -91034 -33611 1667 35311
7065C5311P8169P3272r830q2959q1961k8082K2345K1382j1247l9015o3449o9670
$$ 35311 113480 186752 176922 93963 12002 -16080 6265 27647 16400 -22615 -86064 -155734
7053a55734n5356k3861J0745J9314J2814J2938L1386M6126K1555r952J0086M8635
$$ -155734 -211090 -234951 -224206 -204892 -192078 -179140 -147754 -101628 -80073 -90025 -79939 -31304
7041c1304M8346J2618l0662n6446o7577p4999o1985k1391J2477J7618L824k1986
$$ -31304 17042 29660 -1002 -57448 -125025 -200024 -262009 -283400 -270923 -253305 -249481 -271467
7029b71467m2853m2628k9561r534K4121O1733P7814M4219m003J1589R0439J33969
$$ -271467 -314320 -356948 -386509 -396043 -371922 -310189 -232375 -188156 -192159 -180570 -90131 43838
7017D3838P2055k9615q6497j01925j06741q3460j3262K7220L0580M4204K2589
$$ 43838 115893 86278 -219 -102144 -208885 -292345 -305607 -278387 -247807 -203603 -181014
7006a81014m7593j09865j37676j07776j0562R6765J24480R0556O9644O8009O2307
$$ -181014 -228607 -338472 -476148 -583924 -594486 -497721 -373241 -282685 -213041 -145032 -82725
6995h2725K5976k2247m8390n0530l9699j6495J4489L1847J0558k3480j3558K2834
$$ -82725 -56749 -78996 -127386 -177916 -217615 -234110 -219621 -187774 -177216 -200696 -214254 -191420
6983a91420K5860j341l9354o4887m9835N044N4842Q3882P0277M3678M2086N7244
$$ -191420 -165560 -166901 -206255 -271142 -320977 -315933 -261091 -177209 -106932 -63254 -21168 36076
6971C6076P2781O4374L1933jk6958o4014r7835j16444j27378r6725k1899L2050
$$ 36076 108857 173231 205164 205163 178205 114191 16356 -100088 -227466 -324191 -346090 -314040
6959c14040L5137L5496O9235R1034P4159K2707j9410L693N4099O6974M2993J0810
$$ -314040 -278903 -243407 -174172 -83138 -8979 13728 -5682 -1989 52110 119084 162077 172887
6947A72887j3254l4871m7214m9889n2383m9228m0309l5401k5304K1085P8140J00988
$$ 172887 159633 124762 77548 27659 -24724 -73952 -114261 -149662 -174966 -153881 -75741 25247
6935B5247R0106O2119L3000J6729J0262L336P137q930o3680r7626o6824q602N789
$$ 25247 115353 177472 210472 227201 237463 240799 247936 239006 175326 77700 10876 2274 8063
6922H063q332k1546k5608J354J7596r753o1152r7987n7840L3374R0432Q0315R180
$$ 8063 -269 -21815 -47423 -46069 -28473 -38226 -99378 -197365 -255205 -221831 -131399 -51084 -41904
6909d1904q3582j09344m3460J3457K5923J3735k6205o2151n9490k0467M0184J04490
$$ -41904 -125486 -234830 -278290 -264833 -238910 -225175 -251380 -313531 -373021 -393488 -353304 -248814
6897b48814J31089J05740O6374M9149L9136J2283n0962j15049j24130j14757j09838
$$ -248814 -117725 -11985 54389 103538 142674 154957 103995 -11054 -135184 -249941 -359779
6886c59779r5425p1463j8817N2460J11716J34565J07730N3658K3285J6990O639
$$ -359779 -455204 -526667 -545484 -493024 -381308 -246743 -139013 -85355 -62070 -45080 -38441
6875c8441q94j5375j2600J9396L1591m67k3635P10K3514j9522r3102j03504l7209
$$ -38441 -39335 -54710 -67310 -47914 -16323 -16790 -40425 -39715 -16201 -35723 -128825 -232329 -269538
6862b69538K3182K0274j3823k1030n278J9956O3467J02962J01805M3839k9833
$$ -269538 -246356 -226082 -239905 -260935 -266213 -246257 -182790 -79828 21977 65816 35983
6851C5983n9566l8666M860N4800P5195M8221j5422p5433q7368m7268J0796K9281
$$ 35983 -23583 -62249 -57389 -2589 72606 120827 105405 29972 -57396 -104664 -93868 -64587
6839f4587N859k4068m6456m1849j684L2791L8574K6875J0703m32j0647o630j1123
$$ -64587 -58728 -82796 -129252 -171101 -172785 -139994 -101420 -74545 -63842 -64274 -74921 -81551 -92674
6826i2674n0848r6904r4213n9189l3446L336N4000Q4352P7226N4701K3858j7260
$$ -92674 -143522 -240426 -334639 -393828 -427274 -423938 -369938 -285586 -208360 -153659 -129801 -147061
6814a47061m0837l2511j58L8180O0838N1244J2142j6352j017K8838K1166j162
$$ -147061 -187898 -220409 -220567 -182387 -121549 -70305 -58163 -74515 -75532 -46694 -25528 -26690
6802b6690P557K0390k72k7515j1758K7464L9501J8992j3537m5755n1332n0667
$$ -26690 -19133 1257 985 -26530 -38288 -10824 28677 47669 34132 -11623 -62955 -113622
6790a13622o3476o2354m7651k8573k3455l5501m8282l5547p650R99j4251o306
$$ -113622 -177098 -239452 -287103 -315676 -339131 -374632 -422914 -458461 -466111 -465112 -479363 -485669
6778d85669N1473R5611J07960J11629Q6658M1339J7411k1531q7421j10992p7534
$$ -485669 -434196 -338585 -230625 -118996 -32338 9001 26412 4881 -82540 -193532 -271066
6767b71066k6372R438K1204K8644K9533K900o3368j12672j02672n2827K0597Q1961
$$ -271066 -297438 -288000 -266796 -238152 -208619 -205719 -269087 -381759 -484431 -537258 -516661 -434700
6755d34700J05536R8464Q8481J00028Q8192L0051l5230o7281m7544N309N0443
$$ -434700 -329164 -230700 -142219 -42191 46001 76052 40822 -26459 -74003 -68694 -18251
6744a8251P5901P7778N5402L9795N2968N8405J7855m7715q7509p5454m2947j0222
$$ -18251 57650 135428 190830 230625 283593 341998 359853 312138 224629 149175 106228 96006
6732I6006L0777P1051P2743K6236l5119p6159q0843q2410j07374j14439p9074
$$ 96006 126783 197834 270577 296813 261694 185535 104692 22282 -85092 -199531 -278605
6721b78605k1360L4293P3966Q4617O2929L2982J1946J0121L4350N7198N1346J864
$$ -278605 -299965 -265672 -191706 -107089 -44160 -11178 768 10889 45239 102437 153783 155647
6709A55647o1085q7808o3914k1359l914r126j6776r338L479l944j4792L549L2266
$$ 155647 94562 6754 -57160 -78519 -82433 -91559 -108335 -117673 -114194 -118138 -132930 -129381 -97115
6696i7115M3280M1693M2293N9379P9813O6036K3477J0562J8628J8103N870j2785
$$ -97115 -53835 -12142 30151 89530 169343 235379 258856 269418 288046 306149 312019 299234
6684B99234k013M9370P9511M4503o347l588M7516M4481k0646p3799q6569l6261
$$ 299234 297221 346591 426102 470605 464258 460670 508186 552667 532021 458222 371653 335392
6672C35392K9687L7213o46k2302m858L0174N5348O5658O4189P4784J08271J29457
$$ 335392 365079 402292 401646 379344 374486 404660 460008 525666 589855 664639 772910 902367
6660I02367R3015J2633o0440q2383m0517J8479M3528M8340L7280J7211J8233M2287
$$ 902367 995382 1008015 947575 865192 824675 843154 886682 935022 972302 989513 1007746 1050033
6648A050033O5173O2846O8043Q7924R5662R4354Q3885P1623Q5369J33510J97800
$$ 1050033 1115206 1178052 1246095 1334019 1429681 1524035 1607920 1679543 1764912 1898422 2096222
6637B096222K51815K67299K48091K05408J57132J20258R8525J13941J69414J98397
$$ 2096222 2348037 2615336 2863427 3068835 3225967 3346225 3444750 3558691 3728105 3926502
6627C926502J78166J71150J94390K47148L48220M55834N33586O19366P20021Q38993
$$ 3926502 4104668 4275818 4470208 4717356 5065576 5521410 6054996 6674362 7394383 8233376
6617H233376J032577J286210J571346J928237K374430K906253L530877M282821
$$ 8233376 9265953 10552163 12123509 14051746 16426176 19332429 22863306 27146127
6609B7146127N202985O304462P524589Q715828R645281R817274Q420397M845118
$$ 27146127 32349112 38653574 46178163 54893991 64539272 74356546 82776943 87622061
6601H7622061m19636n582444q887199r941585r428258q179052o798880n591885
$$ 87622061 87202425 81619981 72732782 62791197 53362939 45183887 38385007 32793122
6593C2793122m592524l765996l119693k636679k248231j902924j596257j333538
$$ 32793122 28200598 24434602 21314909 18678230 16429999 14527075 12930818 11597280
6585A1597280j090241q78596p48671o91103o34602n36643m20551l34365l03522
$$ 11597280 10507039 9628443 8879772 8188669 7554067 7017424 6596873 6262508 5958986
6576E958986k88473k57489k21982j77629j42917j33156j16815q2160m3383r227
$$ 5958986 5670513 5413024 5191042 5013413 4870496 4737340 4620525 4538365 4494982 4485755
6566D485755K2841N4329Q9635R4693P0895L7709j7464n7899n9617m4910l5427
$$ 4485755 4508596 4562925 4652560 4747253 4818148 4855857 4838393 4780494 4720877 4675967 4640540
6555D640540n6506q6036j20456j52110j08538J5917J43457J90784J69889J81962
$$ 4640540 4584034 4497998 4377542 4225432 4116894 4132811 4276268 4467052 4636941 4818903
6545D818903K49276L15700L53884L70106L91739M13727M23944M64866N71123P17483
$$ 4818903 5068179 5383879 5737763 6107869 6499608 6913335 7337279 7802145 8373268 9090751
6535I090751Q69468J045461J255325J463972J707582K061855K559202L166252
$$ 9090751 9960219 11005680 12261005 13724977 15432559 17494414 20053616 23219868
6527B3219868L830491M596906N501047O479811P381616P881041P545170O036845
$$ 23219868 27050359 31647265 37148312 43628123 51009739 58890780 66435950 72472795
6519G2472795L339329q2688l372002n776972p035022p321661o974645o251489
$$ 72472795 75812124 75729436 72357434 66580462 59545440 52223779 45249134 38997645
6511C8997645n372974m532093l795499l166835k664624k279313j972538j718182
$$ 38997645 33624671 29092578 25297079 22130244 19465620 17186307 15213769 13495587
6503A3495587j487844j275135j082571r28427q18308p28569o38820n43497m47766
$$ 13495587 12007743 10732608 9650037 8721610 7903302 7174733 6535913 5992416 5544650
6494E544650l80732l31046k69950k24107k15113k17321k05597j69707j32882j20946
$$ 5544650 5163918 4832872 4562922 4338815 4123702 3906381 3700784 3531077 3398195 3277249
6484C277249j16635j03150j00469r7022p3467n9809m4356K42K0969k7219j02491
$$ 3277249 3160614 3057464 2956995 2859973 2786506 2726697 2682341 2682583 2703552 2676333 2573842
6473B573842j31782j07251p8732o7823q2290q0336l1012q649k8354m466L6613
$$ 2573842 2442060 2334809 2256077 2188254 2105964 2025628 1994616 1985967 1957613 1953147 1989760
6462A989760K5362j9129l5777l2697m0172k1641J6482K4487r014j2041M6458J00421
$$ 1989760 2015122 1995993 1960216 1927519 1887347 1865706 1882188 1906675 1897661 1885620 1932078 2032499
6450B032499J15722R1792L8767J9602R3594K34340L57393L79831K77960O8241
$$ 2032499 2148221 2240013 2278780 2298382 2391976 2626316 2983709 3363540 3641500 3709741
6440C709741k05031m10959m43544l63935k73406k20547k12956k02133j53735q5911
$$ 3709741 3504710 3093751 2650207 2286272 2012866 1792319 1579363 1377230 1223495 1137584
6430A137584j4533L8321M3790J2839p928j2426n2701r7072p4579k5094r852j9896
$$ 1137584 1123051 1161372 1205162 1218001 1210073 1197647 1144946 1047874 973295 948201 938349 918453
6418I18453k8742k9484l2054k5978j2344j3294k5088j9178j0990k4803j5042K2655
$$ 918453 889711 860227 828173 802195 789851 776557 751469 732291 721301 696498 681456 704111
6406G04111M0142M7876N6883O9748R1291Q2565L4013j4470l9080p5320j20464
$$ 704111 744253 792129 849012 918760 1010051 1092616 1126629 1112159 1073079 997759 877295
6395H77295j46542j54898j44396q6594K4159J17649J42177J30998J29564J23413
$$ 877295 730753 575855 431459 344865 369024 486673 628850 759848 889412 1012825
6385A012825P7199J4789m0367n5968k474O2409P1610L3795J4923K4739K2392l0218
$$ 1012825 1090024 1104813 1064446 1008478 1006004 1068413 1140023 1173818 1188741 1213480 1235872 1205654
6373A205654j15386j60387j34553p1061j3757m735l6689n4165m6061k3062K7944
$$ 1205654 1090268 929881 795328 724267 710510 705775 669086 614921 568860 545798 573742
6362E73742Q0439J31625J36164O3048k4468r8458j46953j54562j12410o3250m5573
$$ 573742 654181 785806 921970 985018 960550 862092 715139 560577 448167 384917 339344
6351C39344n5352p6879p6938l7746k625j7914m5149m0287j1751K2051N0122N7565
$$ 339344 283992 207113 130175 92429 89804 71890 26741 -13546 -25297 -3246 46876 104441
6339A04441K5597j2210k4349j2852O073J1517l915j4390k1804m3948p4870q9840
$$ 104441 130038 117828 93479 80627 86700 98217 94302 79912 58108 14160 -60710 -150550
6327a50550n7280R111L9047K8445J1302K962J2265L5616N1241N8261O0021M5029
$$ -150550 -207830 -198719 -159672 -131227 -119925 -116963 -104698 -69082 -17841 40420 100441 145470
6315A45470J0935o611o035j4811N07L6511L8863M340l4902l7827n080j384m590
$$ 145470 156405 149794 143759 128948 129455 165966 204829 209169 174267 136440 131360 129976 125386
6302A25386k848k3055n4871o0937k2328N2438J13320J17058Q9376O0741K1983
$$ 125386 122538 99483 44612 -16325 -38653 13785 127105 244163 333539 394280 416263
6291D16263k1222l2600l3836m4274l0463m19K4540L9112L3792q169o7341q7702
$$ 416263 395041 362441 328605 284331 253868 253449 277989 317101 350893 342724 275383 187681
6279A87681n7861j6292N701N310J6670K5526J2758l742N721K9008N2084R6482
$$ 187681 129820 113528 119229 124539 141209 166735 179493 175751 181472 210480 262564 359046
6267C59046J20945Q5292J2005m6610n4869l9260k6983L839K9309J968o0334p4301
$$ 359046 479991 565283 577288 530678 475809 436549 409566 413405 442714 444682 384348 310047
6255C10047l8043p122K0081J6771j3145j9125o006L07M961J3642Jj6160j416J5620
$$ 310047 272004 264882 284963 301734 288589 269464 263458 263765 268726 282368 282369 266209 264793 280413
6241B80413J9874K4064J8266m284l2708n4594n8416l7468o837K4539M4340M9258
$$ 280413 300287 324351 342617 338333 305625 251031 192615 155147 148310 172849 217189 266447
6229B66447N2589M5556j643o0992p9698n8874l1361N54M8031R7452J18345Q0862
$$ 266447 319036 364592 362949 301957 222259 163385 132024 132578 180609 278061 396406 477268
6217D77268J6980k3031m7816p2154p6414n5517l5644k8633l7122o1343o3024k8525
$$ 477268 494248 471217 423401 351247 274833 219316 183672 155039 117917 56574 -6450 -34975
6205c4975q837N035N7452J04035J01880R0438Q5371O9705M2772J4301k3159n9362
$$ -34975 -43812 -38777 18675 122710 224590 315028 400399 470104 512876 527177 504018 444656
6193D44656p2569o1233n4481o3487q3208q7786o9713k5817J9083K7457O214m0536
$$ 444656 372087 310854 256373 192886 109678 21892 -47821 -73638 -54555 -27098 -20884 -61420
6181f1420q0113o7178k857Q1823J46538J58629J25152Q4342N9721M3433J6953
$$ -61420 -141533 -208711 -211568 -129745 16793 175422 300574 384916 444637 488070 505023
6170E05023j1180l5425m2076k2484k0841n3255q5330j00353r8990o9065j6066
$$ 505023 493843 458418 416342 393858 373017 319762 234432 134079 35089 -33976 -50042
6159e0042M3496J00088J09480P7439M4289K0368K4833N1535P7678J11500J53232
$$ -50042 -6546 93542 203022 280461 324750 345118 369951 421486 499164 610664 763896
6148G63896J87772K02391J79823J13034J8389n1246p5633p5123p7575p6716o5520
$$ 763896 951668 1154059 1333882 1446916 1465305 1414059 1338426 1263303 1185728 1109012 1043492
6137A043492l4932K3393P5740R5807Q4168L7232m517O621M1083M4877L3216L1485
$$ 1043492 1008560 1031953 1107693 1203500 1287668 1324900 1320383 1327004 1368087 1412964 1446180 1477665
6125A477665J5344J362K2567P0124J34358J88843K13816K04987J63760J33368
$$ 1477665 1493009 1494371 1516938 1587062 1721420 1910263 2124079 2329066 2492826 2626194
6115B626194J61839K53392L50766L74394L34125K75451K40978K59157K91593L24340
$$ 2626194 2788033 3041425 3392191 3766585 4100710 4376161 4617139 4876296 5167889 5492229
6105E492229L96944N23417O76565Q31766J002004J209025J461931J774900K177357
$$ 5492229 5889173 6412590 7089155 7920921 8922925 10131950 11593881 13368781 15546138
6096A5546138K698026L353531M186788N225121O489062P960022R494337J0768117
$$ 15546138 18244164 21597695 25784483 31009604 37498666 45458688 54953025 65721142
6088F5721142J1187398R876136O101159L17458n491417r329414j0696537j0327910
$$ 65721142 76908540 86784676 92885835 93203293 87711876 78382462 67685925 57358015
6080E7358015r114936p644176o263776n090492m135875l376969k766609k277111
$$ 57358015 48243079 40598903 34335127 29244635 25108760 21731791 18965182 16688071
6072A6688071j888558j595846j386326j223753j073794r24506p93845o92238o03926
$$ 16688071 14799513 13203667 11817341 10593588 9519794 8595288 7801443 7109205 6505279
6063F505279n24276m60363l99459l52141l22951k85119k49767k43343k55555k53161
$$ 6505279 5981003 5520640 5121181 4769040 4446089 4160970 3911203 3667860 3412305 3159144
6053C159144k14785j41628n6988M4494J11753P5560l83n6548j07106j59092j78855
$$ 3159144 2944359 2802731 2745743 2790237 2901990 2977550 2977167 2920619 2813513 2654421 2475566
6042B475566j67625j56340j51248j52866j57571j53767j33493q9686n3020m6118
$$ 2475566 2307941 2151601 2000353 1847487 1689916 1536149 1402656 1312970 1259950 1213832
6032A213832k0187M6691R1826R1910P2557K2526l7037n8115p7744r8550r6343
$$ 1213832 1193645 1240336 1332162 1424072 1496629 1519155 1482118 1424003 1346259 1247709 1151366
6021A151366p7198m8895j0115K0192K8907L4934K4265k4325r9928j58806j29437
$$ 1151366 1074168 1025273 1015158 1035350 1064257 1099191 1123456 1099131 999203 840397 710960
6010G10960k9180M3353M7566P731l6853p0578q1466m3562J7300M9642K5495j2598
$$ 710960 681780 725133 772699 780430 743577 672999 591533 547971 565271 614913 640408 627810
5998F27810P35L0191O947j6723P95J2768m935m1574n6111l8237l5125n0130o3087
$$ 627810 628545 658736 665683 648960 649755 662523 657588 616014 559903 521666 486541 436411 373324
5985C73324q1981o7249l744N2523O4699N2860K3652j3434n250M5002P7255P6410
$$ 373324 291343 224094 220350 272873 337572 390432 414084 400650 395400 440402 517657 594067
5973E94067O7894O0569M6082L2268K714n9045j02318q8752m9696l1660l3157l4551
$$ 594067 661961 722530 768612 800880 803594 744549 642231 553479 503783 472123 438966 404415
5961D04415k2232p276L329J0572o460k8616l7222l8098l9568m3893o6315p2485
$$ 404415 382183 374907 378236 388808 382348 353732 316510 278412 238844 194951 128636 56151
5949E6151l7541J5642N1532L7006Q136K7828O1077M4969n259l6840k6293k3405
$$ 56151 18610 34252 85784 122790 130926 158754 219831 264800 259541 222701 196408 173003
5937A73003m6773m0963k3503l3968l5731o916p830o6712q9034n2759k082L6624
$$ 173003 126230 85267 61764 27796 -7935 -14851 -22681 -89393 -178427 -231186 -233268 -196644
5925a96644M3028M236l1014k4207j9911J0499O8730R1335P7624L7383m879o136
$$ -196644 -153616 -149380 -180394 -204601 -224512 -214013 -145283 -53948 23676 61059 56180 50044
5913E0044K8157M1340K1772q869j9896p682l076q166j4493j1922K3143N2485L0475
$$ 50044 78201 119541 141313 132444 112548 104866 101790 93624 79131 67209 90352 142837 173312
5900A73312k1192m6144k2870J7837L3531L0300K6989J4636j0854l0898m0763o1664
$$ 173312 152120 105976 83106 100943 134474 164774 191763 206399 195545 164647 123884 62220
5888F2220q8938p8939k9311j0282j2033K1512R6438J48428J23721O3724p950o8931
$$ 62220 -26718 -105657 -134968 -145250 -157283 -135771 -39333 109095 232816 296540 288590 219659
5876B19659o6391m5269m8978l0181K7818M4522n197m6417l0767J2315M3933N4676
$$ 219659 153268 107999 59021 28840 56658 101180 95983 49566 18799 31114 75047 129723
5864A29723L2886r901j3609K6191M3662J5580k5694o2408n2310L659J8903j2585
$$ 129723 162609 152708 139099 165290 208952 224532 198838 136430 84120 87779 106682 94097
5852I4097k5532j5952k6670n3281o4904l3341L3201P6416O4842J6402j6094k2448
$$ 94097 68565 52613 25943 -27338 -92242 -125583 -92382 -15966 48876 65278 49184 26736
5840B6736k8473n2329n0668q503K7459M7627N4872L9167K3720J1458j9513l7697
$$ 26736 -1737 -54066 -104734 -113237 -85778 -38151 16721 55888 79608 91066 71553 33856
5828C3856k1070K154J259k4887n1233l4691M454J9814K7765N6725O0780K6718
$$ 33856 12786 14940 16199 -8688 -59921 -94612 -90158 -70344 -42579 14146 74926 101644
5816A01644M81p053l41J6260L5628O1126Q9292Q0105L8847P243K047J0976Q808
$$ 101644 102125 95072 94731 110991 146619 207745 297037 377142 415989 423232 425279 436255 445063
5803D45063n607k8519o8981j06953j10796p0566j5534L5676P5752P3563L1974
$$ 445063 439456 410937 341956 235003 124207 53641 38107 73783 149535 223098 255072
5792B55072l4051r0020j13308j15441p1736l6240m1376l8354j2924J7160L9669
$$ 255072 221021 131001 17693 -97748 -169484 -205724 -247100 -285454 -298378 -281218 -241549
5781b41549O7117P0870L1784j3769j9678Q122L6550M6010L3481K1275L3941O6676
$$ -241549 -174432 -103562 -71778 -85547 -105225 -97103 -60553 -14543 18938 40213 74154 140830
5769A40830P1604L0586k2391l5892r409o671k8729k2211J0807K2463J624k1124
$$ 140830 212434 243020 220629 184737 175328 168657 139928 117717 128524 150987 152611 131487
5757A31487k8246k9473k2148o632j1050k6529l3083l2010j7215Q645N3537R6289
$$ 131487 103241 73768 51620 44988 33938 7409 -25674 -57684 -74899 -66254 -12717 83572
5745H3572P9071J3223l3062k2646N5J4757L1131L7399M2567N1741N0479K2038
$$ 83572 162643 175866 142804 120158 120213 134970 166101 203500 246067 297808 348287 370325
5733C70325o868k3668k0909N948K5007K2471R122q708r306L2290P3834N0608k8695
$$ 370325 363457 339789 318880 324828 349835 372306 381428 372720 363414 395704 469538 520146 491451
$$ [...]
##END NTUPLES=NMR SPECTRUM
##END=
