##TITLE=C13_Pr 5252
 CDCl3, 22300sc

 15.1.2025
##JCAMPDX= 6.0         $$ Bruker NMR JCAMP-DX V2.0
##DATA TYPE= NMR SPECTRUM
##DATA CLASS= NTUPLES
##ORIGIN= UXNMR, Bruker Analytische Messtechnik GmbH
##OWNER= root
$$ XWIN-NMR		Version 3.5
$$ Thu Jan 16 13:39:20 2025 Russian Standard Time (UT+4h)  she@DPX200
##.OBSERVE FREQUENCY= 50.327896
##.OBSERVE NUCLEUS= ^13C
##.ACQUISITION MODE= SIMULTANEOUS
##.ACQUISITION SCHEME= undefined
##.AVERAGES= 19240
##.DIGITISER RES= 17
##SPECTROMETER/DATA SYSTEM= spect
##.PULSE SEQUENCE= zgpg30
##.SOLVENT NAME= CDCl3
##.SHIFT REFERENCE= (INTERNAL, CDCl3, 0, 222.646)
##AUDIT TRAIL= $$ (NUMBER, WHEN, WHO, WHERE, WHAT)
$$ ##TITLE= Audit trail, XWIN-NMR		Version 3.5
$$ ##JCAMPDX= 5.01
$$ ##ORIGIN= Bruker BioSpin GmbH
$$ ##OWNER= she
$$ F:/spectra/data/she/nmr/c13/1/pdata/1/auditp.txt
$$ ##AUDIT TRAIL=  $$ (NUMBER, WHEN, WHO, WHERE, WHAT)
(   1,<2025-01-16 10:54:44.87 +0400>,<she>,<DPX200>,
      <created by zg, POWCHK disabled, PULCHK disabled
       terminated by command 'halt'
       configuration hash MD5:
       00 E9 B6 7A A2 85 ED C7 34 08 36 98 17 FE 4E 26
       data hash MD5: 32K
       12 98 73 C6 87 B7 ED 43 AC A8 7D 23 B2 54 53 68>)
(   2,<2025-01-16 13:37:49.96 +0400>,<she>,<DPX200>,
      <Start of raw data processing
       efp BC_mod = 2 LB = 2 FT_mod = 6 PKNL = 1 PHC0 = -404.5853 PHC1 = 23.08833 SI = 32K 
       data hash MD5: 32K
       DE 23 FA 58 2D 38 CB 5D A0 99 D2 C8 2C C1 8C B3>)
(   3,<2025-01-16 13:37:52.48 +0400>,<she>,<DPX200>,
      <abs ABSG = 5 
       data hash MD5: 32K
       0F D8 32 4A 71 6E B8 4B C6 C6 A1 2F 88 2E C8 C6>)
(   4,<2025-01-16 13:38:24.62 +0400>,<she>,<DPX200>,
      <pk PHC0 = 3.447805 PHC1 = 2 
       data hash MD5: 32K
       54 9B 83 C4 4F CF 9E 37 83 E3 66 A3 4F 9A 1E 20>)
(   5,<2025-01-16 13:38:28.21 +0400>,<she>,<DPX200>,
      <abs ABSG = 5 
       data hash MD5: 32K
       A3 92 EC A9 86 A6 40 6E D1 17 B7 0B 46 9B B5 3B>)
$$ ##END=
$$ 
$$ hash MD5
$$ E3 23 19 25 C9 7E ED 13 62 4A E9 0B 2A AE 44 37
##$RELAX= 
##$RELAX= 
##$RELAX= 
##$RELAX= 
##$RELAX= 
##$RELAX= 
##$RELAX= 
##$RELAX= 
$$ Bruker specific parameters
$$ --------------------------
##$DU= <F:/spectra>
##$EXPNO= 1
##$NAME= <c13>
##$PROCNO= 1
##$TYPE= <nmr>
##$USER= <she>
##$AMP= (0..31)
100 100 100 100 100 100 100 100 100 100 100 100 100 100 100 100 100 100 
100 100 100 100 100 100 100 100 100 100 100 100 100 100 
##$AQSEQ= 0
##$AQ_mod= 1
##$AUNM= <au_zg>
##$AUTOPOS= <>
##$BF1= 50.322709
##$BF2= 200.13
##$BF3= 50.322709
##$BF4= 500.13
##$BF5= 500.13
##$BF6= 500.13
##$BF7= 500.13
##$BF8= 500.13
##$BYTORDA= 1
##$CFDGTYP= 0
##$CFRGTYP= 5
##$CHEMSTR= <none>
##$CNST= (0..31)
1 1 145 1 1 1 1 1 1 1 1 1 1 1 1 1 1 1 1 1 1 1 1 1 1 1 1 1 1 1 1 1 
##$CPDPRG= <waltz16>
##$CPDPRG1= <>
##$CPDPRG2= <waltz16>
##$CPDPRG3= <>
##$CPDPRG4= <mlev>
##$CPDPRG5= <mlev>
##$CPDPRG6= <mlev>
##$CPDPRG7= <mlev>
##$CPDPRG8= <mlev>
##$CPDPRGB= <>
##$CPDPRGT= <>
##$D= (0..31)
$$ [...]
##$SUBNAM4= <"">
##$SUBNAM5= <"">
##$SUBNAM6= <"">
##$SUBNAM7= <"">
##$SUBNAM8= <"">
##$SUBNAM9= <"">
##$SW= 239.972175391363
##$SWIBOX= (0..15)
0 1 3 0 0 0 0 0 0 0 0 0 0 0 0 0 
##$SW_h= 12077.2946859903
##$TD= 32768
##$TD0= 1
##$TE= 0
##$TE2= 300
##$TE3= 300
##$TEG= 300
##$TL= (0..7)
120 120 120 120 120 120 120 120 
##$TP= (0..7)
150 150 150 150 150 150 150 150 
##$TP07= 0
##$TPNAME0= <>
##$TPNAME1= <>
##$TPNAME2= <>
##$TPNAME3= <>
##$TPNAME4= <>
##$TPNAME5= <>
##$TPNAME6= <>
##$TPNAME7= <>
##$TPOAL= (0..7)
0.5 0.5 0.5 0.5 0.5 0.5 0.5 0.5 
##$TPOFFS= (0..7)
0 0 0 0 0 0 0 0 
##$TUNHIN= 0
##$TUNHOUT= 0
##$TUNXOUT= 0
##$USERA1= <user>
##$USERA2= <user>
##$USERA3= <user>
##$USERA4= <user>
##$USERA5= <user>
##$V9= 5
##$VALIST= <valist>
##$VCLIST= <CCCCCCCCCCCCCCC>
##$VD= 0
##$VDLIST= <DDDDDDDDDDDDDDD>
##$VPLIST= <PPPPPPPPPPPPPPP>
##$VTLIST= <TTTTTTTTTTTTTTT>
##$WBST= 1024
##$WBSW= 4
##$XGAIN= (0..3)
0 0 0 0 
##$XL= 0
##$YL= 0
##$YMAX_a= 121894584
##$YMIN_a= -32789819
##$ZGOPTNS= <>
##$ZL1= 120
##$ZL2= 120
##$ZL3= 120
##$ZL4= 120
##$ABSF1= 222.5654
##$ABSF2= -17.4314
##$ABSG= 5
##$ABSL= 3
##$ALPHA= 0
##$AQORDER= 0
##$ASSFAC= 0
##$ASSFACI= 0
##$ASSFACX= 0
##$ASSWID= 0
##$AUNMP= <proc_1d>
##$AZFE= 0.1
##$AZFW= 0.5
##$BCFW= 0
##$BC_mod= 2
##$BYTORDP= 0
##$COROFFS= 0
##$CY= -3
##$DATMOD= 1
##$DC= 0
##$DFILT= <>
##$DTYPP= 0
##$F1P= 0
##$F2P= 0
##$FCOR= 0.5
##$FTSIZE= 32768
##$FT_mod= 6
##$GAMMA= 0
##$GB= 0
##$INTBC= 1
##$INTSCL= 4.134877e-10
##$ISEN= 128
##$LB= 2
##$LEV0= 0
##$LPBIN= 0
##$MAXI= 10000
##$MC2= 0
##$MEAN= 0
##$ME_mod= 0
##$MI= 0.1934396
##$NCOEF= 0
##$NC_proc= 2
##$NLEV= 6
##$NOISF1= 120.0001
##$NOISF2= 80.00006
##$NSP= 0
##$NTH_PI= 0
##$NZP= 0
##$OFFSET= 222.646
##$PC= 1.4
##$PHC0= -401.1375
##$PHC1= 25.08833
##$PH_mod= 1
##$PKNL= yes
##$PPARMOD= 0
##$PSCAL= 0
##$PSIGN= 0
##$REVERSE= no
##$SF= 50.3227304950709
##$SI= 32768
##$SIGF1= 140
##$SIGF2= 120
##$SINO= 11.81781
##$SIOLD= 32768
##$SREGLST= <13C.CDCl3>
##$SSB= 0
##$STSI= 32768
##$STSR= 0
##$SW_p= 12077.2946859903
##$SYMM= 0
##$S_DEV= 0
##$TDeff= 32768
##$TDoff= 0
##$TI= <>
##$TILT= no
##$TM1= 0
##$TM2= 0
##$TOPLEV= 0
##$USERP1= <user>
##$USERP2= <user>
##$USERP3= <user>
##$USERP4= <user>
##$USERP5= <user>
##$WDW= 1
##$XDIM= 32768
##$YMAX_p= 432023733
##$YMIN_p= -1668747
$$ End of Bruker specific parameters
$$ ---------------------------------
##NTUPLES= NMR SPECTRUM
##VAR_NAME=  FREQUENCY,     SPECTRUM/REAL,   SPECTRUM/IMAG
##SYMBOL=    X,             R,               I
##VAR_TYPE=  INDEPENDENT,   DEPENDENT,       DEPENDENT
##VAR_FORM=  AFFN,          ASDF,            ASDF
##VAR_DIM=   32768,         32768,           32768
##UNITS=     HZ,            ARBITRARY UNITS, ARBITRARY UNITS
##FACTOR=    0.368581032318806, 1,           1
##FIRST=     11204.1544572324, 0,            0
##LAST=      -873.140228757911, 0,           0
##MIN=       -873.140228757911, -1668747,    0
##MAX=       11204.1544572324, 432023733,    0
$$ Real data points
##PAGE= N=1
##DATA TABLE= (X++(R..R)), XYDATA
$$ [...]
$$ plain form
9745 -422707 -462805 -482855 -494383 -577823 -722537 -819826 -790488 -697263 -628301 -532354 -377610
9734 -377610 -237500 -165998 -145754 -181299 -280692 -365615 -370502 -301485 -213867 -187843 -219796 -241910
9722 -241910 -234522 -165577 -41320 72543 117640 53514 -50829 -112164 -167912 -267547 -378272
9711 -378272 -453055 -464719 -425774 -419919 -511292 -637783 -704353 -692782 -646036 -590434 -519524 -439859
9699 -439859 -373592 -278284 -110629 30252 33669 -100507 -275092 -408577 -483791 -498465 -462221
9688 -462221 -389451 -297836 -177403 -10605 158628 258151 254141 131382 -93813 -350167 -560795
9677 -560795 -666073 -676305 -667131 -651597 -587126 -478532 -390277 -373022 -432482 -520912 -524873 -387821
9665 -387821 -177126 -42661 -66539 -170209 -278659 -380003 -461496 -540166 -635860 -675948 -625554
$$ packed form
9745d22707m0098k0050j1528q3440j44714r7289K9338R3225O8962R5947J54744
9734c77610J40110P1502K0244l5545r9393q4923m887O9017Q7618K6024l1953k2114
9722b41910P388O8945J24257J13863M5097o4126j04343o1335n5748r9635j10725
9711c78272p4783j1664L8945N855r1373j26491o6570J1571M6746N5602P0910P9665
9699d39859O6267R5308J67655J40881L417j34176j74585j33485p5214j4674L6244
9688d62221P2770R1615J20433J66798J69233R9523m010j22759k25195k56354k10628
9677e60795j05278j0232R174J5534O4471J08594Q8255J7255n9460q8430l961J37052
9665c87821K10695J34465k3878j03670j08450j01344q1493p8670r5694m0088N0394
$$ plain form
9654 -625554 -556955 -515822 -494801 -468601 -416733 -317074 -169107 -2538 136579 203168 193483
9643 193483 97372 -54497 -207890 -330462 -394849 -417732 -451572 -529246 -634002 -731023 -789150
9632 -789150 -779527 -692770 -565991 -479044 -412484 -296875 -145840 930 75543 48188 -16943
9621 -16943 -77221 -139317 -245294 -401633 -524275 -571361 -547282 -457389 -371524 -327824 -286642
9610 -286642 -235001 -184124 -123882 -92471 -134298 -214432 -288361 -327864 -337064 -321178 -304197 -316791
9598 -316791 -332959 -386951 -487141 -533537 -470533 -392833 -382207 -404381 -451797 -523406 -519432 -357399
9586 -357399 -138768 -21717 -1584 2715 9125 13118 -43395 -206262 -365839 -400742 -328213
9575 -328213 -239359 -225335 -326035 -501549 -650803 -727848 -715895 -590033 -377097 -131968
$$ packed form
9654f25554O8599M1133K1021K6200N1868R9659J47967J66569J39117O6589r685
9643A93483r6111j51869j53393j22572o4387k2883l3840p7674j04756r7021n8127
9632g89150R623Q6757J26779Q6947O6560J15609J51035J46770P4613k7355o5131
9621a6943o0278o2096j05977j56339j22642m7086K4079Q9893Q5865M3700M1182
9610b86642N1641N0877O0242L1411m1827q0134p3929l9503r200J5886J6981j2594
9598c16791j6168n3992j00190m6396O3004P7700J0626k2174m7416p1609L974J62033
9586c57399K18631J17051K0133M299O410L993n6513j62867j59577l4903P2529
9575c28213Q8854J4024j00700j75514j49254p7045J1953J25862K12936K45129
$$ plain form
9565 -131968 82931 190150 136684 -52245 -263714 -364294 -302153 -146191 -23730 26059
9555 26059 69119 148415 255317 330228 286305 146746 37438 -14520 -87532 -199518 -294120
9544 -294120 -332620 -282699 -186698 -124880 -101920 -114824 -194578 -321629 -424913 -439270 -332109
9533 -332109 -181042 -103329 -67819 16424 153097 262883 334230 405978 411708 296514 149882
9522 149882 75336 69230 81750 86999 91497 102817 129058 160135 164807 110623 9284 -51726
9510 -51726 -68951 -120242 -170188 -134103 -24459 106240 232790 326602 352939 257984 64137
9499 64137 -152851 -384133 -626131 -809849 -839536 -708281 -502369 -310669 -211453 -231102
9489 -231102 -268381 -261876 -254672 -230456 -123006 14284 77699 104966 173983 311109 481032
$$ packed form
9565a31968K14899J07219n3466j88929k11469j00580O2141J55962J22461M9789
9555B6059M3060P9296J06902P4911m3923j39559j09308n1958p3012j11986r4602
9544b94120l8500M9921R6001O1818K2960j2904p9754j27051j03284j4357J07161
9533c32109J51067P7713L5510Q4243J36673J09786P1347P1748N730j15194j46632
9522A49882p4546o106J2520N249M498J1320K6241L1077M672n4184j01339o1010
9510e1726j7225n1291m9946L6085J09644J30699J26550R3812K6337r4955j93847
9499F4137k16988k31282k41998j83718k9687J31255K05912J91700R9216j9649
9489b31102l7279O505P204K4216J07450J37290O3415K7267O9017J37126J69923
$$ plain form
9478 481032 585465 562942 458441 345634 240313 148593 71783 12651 49 49314 111489
9467 111489 134017 144804 191865 281526 376192 488426 643957 771235 783618 715071 659045
9456 659045 604658 516494 402155 281439 124889 -62633 -135460 -4012 248436 457968
9446 457968 533196 490447 335797 126078 -15367 -38633 -13220 4438 40 -24379 -63435
9435 -63435 -148618 -285323 -405937 -436066 -439240 -498120 -585023 -651394 -665969 -655887 -686972 -754809
9423 -754809 -794527 -769970 -657505 -456488 -189415 74010 170620 47071 -145911 -252715
9413 -252715 -246256 -201229 -171582 -141789 -93212 -29879 25138 69368 104368 146407 205629 213006
9401 213006 133884 19426 -97443 -219562 -351305 -445593 -435462 -354734 -277686 -227429 -192088
$$ packed form
9478D81032J04433k2523j04501j12807j05321r1720p6810n9132j2602M9265O2175
9467A11489K2528J0787M7061Q9661R4666J12234J55531J27278J2383o8547n6026
9456F59045n4387q8164j14339j20716j56550j87522p2827J31448K52448K09532
9446D57968P5228m2749j54650k09719j41445k3266K5413J7658m398k4419l9056
9435f3435q5183j36705j20614l0129l174n8880q6903o6371j4575J0082l1085o7837
9423g54809l9718K4557J12465K01017K67073K63425R6610j23549j92982j06804
9413b52715O459M5027K9647K9793M8577O3333N5017M4230L5000M2039N9222P377
9401B13006p9122j14458j16869j22119j31743r4288J0131Q0728P7048N0257L5341
$$ plain form
9390 -192088 -178901 -209820 -268372 -298577 -249239 -201405 -226306 -206868 -81236 29207 -23702
9379 -23702 -227337 -458068 -630270 -722228 -733953 -716645 -744691 -829094 -927812 -984968 -949376
9368 -949376 -824250 -695858 -616073 -523748 -384270 -240757 -92124 66871 219608 365007
9358 365007 497171 590845 646538 660647 599478 437146 249147 152982 126791 106963 74584
9347 74584 13287 -92791 -217957 -328837 -419692 -461827 -453276 -434307 -443306 -468227 -482953 -443737
9335 -443737 -339675 -224182 -149611 -85639 -28356 -27582 -92422 -164619 -178727 -65355 148831
9324 148831 358421 505710 542984 476795 393850 405890 516434 612975 623145 498772 240632
9313 240632 -23084 -218532 -365023 -435884 -376920 -231584 -109914 -57100 -59164 -95641 -98223
$$ packed form
9390a92088J3187l0919n8552l0205M9338M7834k4901J9438J25632J10443n2909
9379b3702k03635k30731j72202r1958j1725J7308k8046q4403r8718n7156L5592
9368i49376J25126J28392P9785R2325J39478J43513J48633J58995J52737J45399
9358C65007J32164R3674N5693J4109o1169j62332j87999r6165k6191j9828l2379
9347G4584o1297j06078j25166j10880r0855m2135Q551J8969q999k4921j4726L9216
9335d43737J04062J15493P4571O3972N7283P74o4840p2197j4108J13372K14186
9324A48831K09590J47289L7274o6189q2945J2040J10544R6541J0170j24373k58140
9313B40632k63716j95448j46491p0861N8964J45336J21670N2814k064l6477k582
$$ plain form
9302 -98223 -49803 -6515 43139 129825 214560 256728 332672 489717 629852 660005 610140
9291 610140 542204 472064 432401 443387 533780 694713 806071 764264 605613 387323 144112
9280 144112 -57117 -193447 -258648 -288710 -329846 -385880 -443481 -491736 -540371 -568288 -537092
9269 -537092 -496633 -528354 -593707 -588185 -529398 -505954 -511797 -495496 -439289 -337525 -185155 -59081
9257 -59081 -24291 -27039 -55744 -149377 -257925 -305822 -282604 -207053 -96432 16598 109113
9246 109113 188772 249291 224004 119725 59807 80367 142036 214514 249711 199789 106094
9235 106094 85086 179325 309155 432349 561193 653183 650997 593560 504613 396814 333752
9224 333752 351579 414678 417805 335574 246516 195727 191085 170425 70664 -110899 -349765 -608299
$$ packed form
9302i8223M8420M3288M9654Q6686Q4735M2168P5944J57045J40135L0153m9865
9291F10140o7936p0140l9663J0986R0393J60933J11358m1807j58651k18290k43211
9280A44112k01229j36330o5201l0062m1136n6034n7601m8255m8635k7917L1196
9269e37092M0459l1721o5353N522N8787K3444n843J6301N6207J01764J52370J26074
9257e9081L4790k748k8705r3633j08548m7897K3218P5551J10621J13030R2515
9246A09113P9659O0519k5287j04279n9918K0560O1669P2478L5197m9922r3695
9235A06094k1008R4239J29830J23194J28844R1990k186n7437q8947j07799o3062
9224C33752J7827O3099L127q2231q9058n0789m642k0660r9761j81563k38866k58534
$$ plain form
9212 -608299 -787040 -797771 -684170 -511182 -350491 -241038 -168163 -104925 -56574 -3746 89897
9201 89897 183345 277875 410930 560475 696288 792061 821563 766954 659200 531615 366646
9190 366646 220526 208451 340352 525336 689175 833356 985553 1109483 1134175 1094974
9180 1094974 1066320 1081553 1083860 1034189 1020392 1082019 1150977 1178460 1163935 1112512 1054031 1045800
9168 1045800 1116434 1212396 1242043 1196374 1135409 1092146 1071459 1122003 1255991 1370685 1385449
9157 1385449 1315001 1271200 1357681 1519177 1626195 1628072 1576380 1556428 1637666 1770606 1837967
9146 1837967 1835321 1877156 1999290 2105187 2153656 2174700 2139486 2051321 1997076 1981979 1951653
9135 1951653 1882342 1758777 1540784 1266772 1061077 1006582 1119808 1312827 1467360 1533904
$$ packed form
9212f08299j78741j0731J13601J72988J60691J09453P2875O3238M8351N2828R3643
9201H9897R3448R4530J33055J49545J35813R5773K9502n4609j07754j27585j64969
9190C66646j46120j2075J31901J84984J63839J44181J52197J23930K4692l9201
9180A094974k8654J5233K307m9671j3797O1627O8958K7483j4525n1423n8481q231
9168A045800P0634R5962K9647m5669o0965m3263k0687N0544J33988J14694J4764
9157A385449p0448m3801Q6481J61496J07018J877n1692j9952Q1238J32940O7361
9146A837967k646M1835J22134J05897M8469K1044l5214q8165n4245j5097l0326
9135A951653o9311j23565k17993k74012k05695n4495J13226J93019J54533O6544
$$ plain form
9125 1533904 1540556 1566992 1662796 1802792 1918593 1978300 2053245 2210211 2423009 2651123 2907173
9114 2907173 3187593 3426389 3568233 3625330 3614128 3551664 3566266 3757980 4048889 4346852
9104 4346852 4619467 4903716 5261609 5682029 6159364 6775931 7562481 8426664 9357989 10461859
9094 10461859 11812942 13431965 15340422 17598065 20266112 23414985 27189491 31810499
9086 31810499 37487151 44277545 52200011 61418078 72051927 83717919 95153709 104050534
9078 104050534 107684085 104627173 95957621 84345889 72272780 61193361 51621464 43554349
9070 43554349 36833172 31289066 26802299 23210489 20296191 17865368 15763289 13921391
9062 13921391 12288959 10837179 9583213 8549711 7760508 7193758 6725654 6256177 5821474
$$ packed form
9125A533904O652K6436R5804J39996J15801N9707P4945J56966K12798K28114K56050
9114B907173K80420K38796J41844N7097j1202o2464J4602J91714K90909K97963
9104D346852K72615K84249L57893M20420M77335O16567P86550Q64183R31325J103870
9094A0461859J351083J619023J908457K257643K668047L148873L774506M621008
9086C1810499N676652O790394P922466R218067J0633849J1665992J1435790Q896825
9078A04050534L633551l056912q669552j1611732j2073109j1079419r571897q067115
9070D3554349o721177n544106m486767l591810k914298k430823k102079j841898
9062A3921391j632432j451780j253966j033502p89203n66750m68104m69477m34703
$$ plain form
9053 5821474 5449010 5087873 4704509 4301637 3935532 3638408 3358896 3081680 2880125 2742912
9043 2742912 2588112 2411706 2225672 2000167 1777130 1613334 1511582 1514804 1608567 1718917
9033 1718917 1818011 1852639 1796826 1696834 1595248 1532467 1495637 1427071 1346424 1286342 1266941
9022 1266941 1319415 1410935 1503473 1587349 1617618 1575390 1489760 1369312 1247665 1133434 991743
9011 991743 894939 947277 1057295 1123534 1225202 1358545 1377568 1295796 1194962 1078070 999014
9000 999014 1006686 1028563 922049 657818 287731 -55179 -218721 -205899 -102596 43455
8990 43455 191289 293147 355600 395333 427879 505987 686635 925963 1135054 1320963 1461708
8979 1461708 1451185 1308707 1154254 1028996 912394 777433 647812 585249 618643 700082
$$ packed form
9053E821474l72464l61137l83364m02872l66105k97124k79512k77216k01555j37213
9043B742912j54800j76406j86034k25505k23037j63796j01752L222R3763J10350
9033A718917R9094L4628n5813r9992j01586o2781l6830o8566q0647o0082j9401
9022A266941N2474R1520R2538Q3876L0269m2228q5630j20448j21647j14231j41691
9011I91743r6804N2338J10018O6239J01668J33343J9023q1772j00834j16892p9056
9000I99014P672K1877j06514k64231l70087l42910j63542J2822J03303J46051
8990D3455J47834J01858O2453L9733L2546P8108J80648K39328K09091J85909J40745
8979A461708j0523j42478j54453j25258j16602j34961j29621o2563L3394Q1439
$$ plain form
8969 700082 759138 765475 722515 683574 680431 701465 749313 810055 839231 819388 726225 510266
8957 510266 190794 -97029 -258398 -311265 -294065 -233086 -148971 -129825 -199588 -243064 -257905
8946 -257905 -333537 -415180 -420420 -334061 -221541 -137569 -55238 33728 129701 248918 420733
8935 420733 637867 776171 675558 395825 180250 187390 360977 584535 741735 803711
8925 803711 845113 881941 850767 748599 619032 453918 255915 104594 81178 166324 313895
8914 313895 489203 665595 827371 937306 955350 907074 834021 760565 699918 656151 646308
8903 646308 650364 670293 725217 737485 676624 619993 624196 724979 878156 1025689 1182827
8892 1182827 1339479 1440961 1467960 1448672 1401210 1311420 1187589 1096621 1058794 1062106 1103943
$$ packed form
8969G00082N9056O337m2960l8941l143K1034M7848O0742K9176j9843r3163k15959
8957E10266l19472k87823j61369n2867J7200O0979Q4115J9146o9763m3476j4841
8946b57905p5632q1643n240Q6359J12520Q3972Q2331Q8966R5973J19217J71815
8935D20733K17134J38304j00613k79733k15575P140J73587K23558J57200O1976
8925H03711M1402L6828l1174j02168j29567j65114j98003j51321k3416Q5146J47571
8914C13895J75308J76392J61776J09935J8044m8276p3053p3456o0647m3767r843
8903F46308M056J9929N4924J2268o0861n6631M203J00783J53177J47533J57138
8892A182827J56652J01482K6999j9288m7462q9790j23831r0968l7827L312M1837
$$ plain form
8881 1103943 1222134 1398136 1542021 1619799 1646059 1657877 1652397 1572457 1378224 1119471 928974
8870 928974 876198 899123 939041 973426 966176 908698 842676 829595 913491 1106424 1432067
8859 1432067 1837144 2207631 2501068 2711342 2812606 2805903 2771527 2801692 2858327 2866252 2832241
8848 2832241 2808424 2835626 2870472 2903346 3046357 3308212 3613462 3956022 4382020 4901319
8838 4901319 5478587 6091883 6693649 7278045 7909482 8656366 9559567 10670293 12103696
8829 12103696 13982409 16371407 19233044 22519829 26293453 30776859 36203075 42692775
8821 42692775 50366962 59433085 69945877 81344578 92206645 100283718 103114805 99569017
8813 99569017 90883133 79640357 68125616 57660444 48693812 41173187 34893946 29672758
$$ packed form
8881A103943J18191J76002J43885P7778K6260J1818n480p9940j94233k58753j90497
8870I28974n2776K2925L9918L4385p250n7478o6022j3081Q3896J92933L25643
8859A432067M05077L70487K93437K10274J01264o703l4376L0165N6635P925l4011
8848B832241k3817K7202L4846L2874J43011K61855L05250L42560M25998N19299
8838D901319N77268O13296O01766N84396O31437P46884R03201J110726J433403
8829A2103696J878713K388998K861637L286785L773624M483406N426216O489700
8821D2692775P674187R066123J0512792J1398701J0862067Q077073K831087l545788
8813I9569017q685884j1242776j1514741j0465172q966632p520625o279241n221188
$$ plain form
8805 29672758 25401040 21921255 19043683 16611435 14545606 12872539 11544933 10390530
8797 10390530 9285775 8257255 7410596 6781036 6277296 5769181 5235211 4776678 4463353
8788 4463353 4279036 4182870 4172443 4224108 4242484 4194378 4164890 4168485 4151981 4143513 4149944 4090440
8776 4090440 3946797 3769822 3625855 3557159 3527472 3496742 3472002 3408722 3234563 2970398
8766 2970398 2681277 2415058 2190366 1992609 1803102 1611826 1399479 1148964 906969 772949
8756 772949 796068 936925 1076652 1129379 1108602 1048660 974405 887867 813962 761182 685203
8745 685203 579925 491958 485170 564452 639413 645855 612454 610665 644840 678155 750333 911271
8733 911271 1130261 1321424 1441113 1500799 1550838 1633499 1629223 1424414 1167308 1044553 1123482
$$ packed form
8805B9672758m271718l479785k877572k432248k065829j673067j327606j154403
8797A0390530j104755j028520q46659o29560n03740n08115n33970m58533l13325
8788D463353j84317r6166j0427N1665J8376m8106k9488L595j6504q468O431n9504
8776D090440j43643j76975j43967o8696k9687l0730k4740o3280j74159k64165
8766B970398k89121k66219k24692j97757j89507j91276k12347k50515k41995j34020
8756G72949K3119J40857J39727N2727k0777n9942p4255q6538p3905n2780p5979
8745F85203j05278q7967o788P9282P4961O442l3401j789L4175L3315P2178J60938
8733I11271K18990J91163J19689N9686N0039Q2661m276k04809k57106j22755P8929
$$ plain form
8722 1123482 1353994 1595480 1770504 1885086 1984777 2087039 2194305 2320403 2478425 2630275
8712 2630275 2732817 2791151 2803472 2753647 2658619 2579241 2537729 2510417 2461488 2399397 2332931
8701 2332931 2225733 2098887 2012807 1960824 1936876 1970165 2065986 2183988 2299231 2415952
8691 2415952 2523912 2578762 2538202 2478027 2512495 2614381 2745820 2915850 3065739 3165153
8681 3165153 3278437 3441366 3641311 3844785 4070154 4343775 4591686 4805048 5091648 5506430
8671 5506430 6029659 6654365 7390552 8295852 9383287 10628905 12032276 13652089 15584993
8662 15584993 17916107 20721590 24045769 27958369 32597045 38085877 44507421 52046638
8654 52046638 60950194 71234313 82493193 93525028 102128121 105776644 103133451 95141325
$$ packed form
8722A123482K30512K41486J75024J14582R9691J02262J07266J26098J58022J51850
8712B630275J02542N8334J2321m9825r5028p9378m1512k7312m8929o2091o6466
8701B332931j07198j26846q6080n1983k3948L3289R5821J18002J15243J16721
8691B415952J07960N4850m0560o0175L4468J01886J31439J70030J49889R9414
8681C165153J13284J62929J99945K03474K25369K73621K47911K13362K86600M14782
8671E506430N23229O24706P36187R05300J087435J245618J403371J619813J932904
8662A5584993K331114K805483L324179L912600M638676N488832O421544P539217
8654E2046638Q903556J0284119J1258880J1031835Q603093L648523k643193p992126
$$ plain form
8646 95141325 84253938 72833645 62235233 52959086 45063885 38404351 32864923 28344315
8638 28344315 24694212 21781233 19453363 17508936 15779759 14211527 12806381 11570392
8630 11570392 10500532 9567783 8763833 8094881 7521260 6983615 6450720 5908303 5425652
8621 5425652 5080491 4827238 4591035 4322021 3986062 3617422 3273801 3033060 2928964 2847900
8611 2847900 2750464 2697001 2721046 2775128 2776437 2686504 2523797 2341597 2201360 2163775 2187069
8600 2187069 2175059 2107796 2033351 2004018 1980245 1931326 1862280 1743871 1553752 1364592 1299483
8589 1299483 1385581 1556759 1714337 1787066 1768364 1644284 1450639 1297217 1186165 1026894
8579 1026894 790328 549142 433560 453920 512823 572621 601032 553006 461952 420349 415230
$$ packed form
8646I5141325j0887387j1420293j0598412r276147p895201o659534n539428m520608
8638B8344315l650103k912979k327870j944427j729177j568232j405146j235989
8630A1570392j069860r32749q03950o68952n73621n37645n32895n42417m82651
8621E425652l45161k53253k36203k69014l35959l68640l43621k40741j04096q1064
8611B847900r7436n3463K4045N4082J309q9933j62707j82200j40237l7585K3294
8600B187069j2010o7263p4445k9333k3773m8919o9046j18409j90119j89160o5109
8589A299483Q6098J71178J57578P2729j8702j24080j93645j53422j11052j59271
8579A026894k36566k41186j15582K0360N8903N9798K8411m8026r1054m1603n119
$$ plain form
8568 415230 379068 307625 269744 280614 273948 277769 372343 488325 513663 476730 476353 544049
8556 544049 606429 573487 421560 217086 9160 -148016 -195283 -200279 -277930 -450873 -633475
8545 -633475 -716996 -680538 -590237 -443472 -220698 24576 209822 254071 165569 50567 -42892
8534 -42892 -122917 -136388 -44007 101593 234048 333027 361163 281827 163566 147700 247822
8523 247822 348904 371589 283978 106561 -28309 -40694 31874 114791 137513 69018 -33191
8512 -33191 -71721 -54360 -36711 -4038 69006 171338 274579 380411 511723 665511 837646
8501 837646 1009132 1124657 1160843 1200025 1328391 1480495 1521049 1430511 1292278 1156192
8491 1156192 1020541 876056 725183 613427 571938 593298 653649 735992 840760 912128
$$ packed form
8568D15230l6162p1443l7881J0870o666L821R4574J15982K5338l6933l77O7696
8556E44049O2380l2942j51927k04474k07926j57176m7267m996p7651j72943j82602
8545f33475q3521L6458R0301J46765K22774K45274J85246M4249q8502j15002r3459
8534d2892q0025j3471R2381J45600J32455R8979K8136p9336j18261j5866J00122
8523B47822J01082K2685q7611j77417j34870j2385P2568Q2917K2722o8495j02209
8512c3191l8530J7361J7649L2673P3044J02332J03241J05832J31312J53788J72135
8501H37646J71486J15525L6186L9182J28366J52104M0554r0538j38233j36086
8491A156192j35651j44485j50873j11756m1489K1360O0351Q2343J04768P1368
$$ plain form
8481 912128 905601 903059 970397 1063345 1126436 1170862 1256702 1376032 1417122 1341180 1190066 1023959
8469 1023959 927472 866756 788847 726891 703432 699774 664140 584461 475820 370463 351552
8458 351552 449405 550088 501860 342930 218541 184629 195909 227467 321642 417291 426458
8447 426458 355159 250928 188921 204230 274662 340208 298813 175376 103165 100391 86004
8436 86004 14791 -95465 -180681 -195048 -177172 -189437 -200735 -143369 -46866 39102 128715 230299
8424 230299 317007 382979 404626 370364 339677 348138 347650 330053 301734 206799 -16450 -324105
8412 -324105 -583005 -708218 -702465 -631484 -548979 -439389 -308400 -245993 -285460 -342288 -369581
8401 -369581 -414434 -434881 -366251 -289957 -276713 -288661 -289810 -274049 -274378 -274432 -177636 -16745 99798
$$ packed form
8481I12128o527k542O7338R2948O3091M4426Q5840J19330M1090p5942j51114j66107
8469A023959r6487o0716p7909o1956k3459l658l5634p9679j08641j05357j8911
8458C51552R7853J00683m8228j58930j24389l3912J1280L1558R4175R5649R167
8447D26458p1299j04231o2007J5309P0432O5546m1395j23437p2211k774j4387
8436H6004p1213j10256q5216j4367J7876j2265j1298N7366R6503Q5968Q9613J01584
8424B30299Q6708O5972K1647l4262l0687Q461m88j7597k8319r4935k23249l07655
8412c24105k58900j25213N753P0981Q2505J09590J30989O2407l9467n6828k7293
8401c69581m4853k0447O8630P6294J3244j1948j149J5761l29n4R6796J60891J16543
$$ plain form
8388 99798 160635 171627 130053 57747 2982 -1242 36559 87524 151168 210151 174217 -6264
8376 -6264 -261767 -487473 -647697 -718846 -660845 -505991 -338790 -220373 -221158 -384645 -598771
8365 -598771 -699744 -655972 -558670 -437124 -251668 -84630 -35625 -53440 -27170 47340 103512
8354 103512 149453 236442 396747 583103 725385 801794 812682 822711 883789 950653 964887
8343 964887 931968 905917 908606 911170 923345 995914 1098022 1193821 1269109 1288682 1223230 1092360
8331 1092360 954987 866920 847868 928121 1085386 1214822 1211629 1067074 863931 698415
8321 698415 641937 685173 799322 926364 987106 956913 912854 975338 1096270 1129482 1068124
8310 1068124 989914 917986 838526 745351 665477 640060 635967 614829 601377 625095 650384 613536
$$ packed form
8388I9798O0837J0992m1574p2306n4765m224L7801N0965O3644N8983l5934j80481
8376f264k55503k25706j60224p1149N8001J54854J67201J18417p85j63487k14126
8365e98771j00973M3772R7302J21546J85456J67038M9005j7815K6270P4510N6172
8354A03512M5941Q6989J60305J86356J42282P6409J0888J0029O1078O6864J4234
8343I64887l2919k6051K689K564J2175P2569J02108R5799P5288J9573o5452j30870
8331A092360j37373q8067j9052Q0253J57265J29436l193j44555k03143j65516
8321F98415n6478M3236J14149J27042O0742l0193m4059O2484J20932L3212o1358
8310A068124p8210p1928p9460r3175p9874k5417m093k1138j3452K3718K5289l6848
$$ plain form
8298 613536 472493 298307 184876 151308 172855 191622 146365 25579 -119373 -216100 -287337
8287 -287337 -392071 -528613 -663878 -748219 -694992 -504356 -326565 -257418 -281794 -337489 -358607
8276 -358607 -312594 -196259 -80014 -44794 -66589 -79056 -29250 94912 250029 358802 383334
8265 383334 382747 408410 422147 383730 283005 172352 113160 83259 10679 -92143 -143060
8254 -143060 -147793 -143757 -116910 -43357 43869 50420 -35523 -153034 -284160 -393318 -410695 -339574
8242 -339574 -254799 -211619 -184373 -137643 -125960 -152188 -111287 -11056 33880 -23603 -80854
8231 -80854 -72431 -48107 -23384 2811 -17023 -79965 -119710 -128893 -116612 -83477 -54107 -15625
8219 -15625 24727 17223 -31147 -78821 -46628 111867 364982 615054 743470 700996 545706
$$ packed form
8298F13536j41043j74186j13431l3568K1547J8767m5257j20786j44952r6727p1237
8287b87337j04734j36542j35265q4341N3227J90636J77791O9147k4376n5695k1118
8276c58607M6013J16335J16245L5220k1795j2467M9806J24162J55117J08773K4532
8265C83334n87K5663J3737l8417j00725j10653n9192k9901p2580j02822n0917
8254a43060m733M036K6847P3553Q7226O551q5943j17511j31126j09158j7377P1121
8242c39574Q4775M3180K7246M6730J1683k6228M0901J00231M4936n7483n7251
8231h0854Q423K4324K4723K6195j9834o2942l9745r183J2281L3135K9370L8482
8219a5625M0352p504m8370m7674L2193J58495K53115K50072J28416m2474j55290
$$ plain form
8208 545706 388741 311421 272322 150127 19530 -6435 7708 1497 1229 34274 103882 174273
8196 174273 190573 151911 94499 46702 -10586 -86406 -128887 -95530 -27197 -18698 -107400 -225737
8184 -225737 -273935 -166434 47804 174484 161102 69293 -21286 -9194 105203 243919 328193
8173 328193 348918 349292 350949 336059 257139 184202 239558 310419 241063 83136 -26990 -14387
8161 -14387 112022 313457 511903 634522 682432 676034 584183 370074 112730 -42608 -59998
8150 -59998 498 82147 174419 233649 208792 140611 91112 80287 99532 135982 104445 -47984
8138 -47984 -223796 -292708 -251624 -197449 -157141 -99970 -68077 -92574 -127656 -130264 -128203 -176335
8126 -176335 -218809 -155213 -4730 175600 392539 644546 908764 1187573 1497137 1736314
$$ packed form
8208E45706j56965p7320l9099j22195j30597k5965J4143o211k68L3045O9608P0391
8196A74273J6300l8662n7412m7797n7288p5820m2481L3357O8333Q499q8702j18337
8184b25737m8198J07501K14238J26680j3382r1809r0579J2092J14397J38716Q4274
8173C28193K0725L74J657j4890p8920p2937N5356P0861o9356j57927j10126J2603
8161a4387J26409K01435J98446J22619M7910o398r1851k14109k57344j55338j7390
8150e9998O0496Q1649R2272N9230k4857o8181m9499j0825J9245L6450l1537j52429
8138d7984j75812o8912M1084N4175M0308N7171L1893k4497l5082k608K061m8132
8126a76335m2474O3596J50483J80330K16939K52007K64218K78809L09564K39177
$$ plain form
8116 1736314 1784403 1646458 1459951 1316245 1180778 1052841 947146 834271 727904 717353
8106 717353 814836 904580 924169 893656 859599 850773 865813 880400 841608 701165 420062
8095 420062 96866 -73910 -71486 -33714 -4993 51962 111151 118150 95309 114128 141663 130249
8083 130249 97351 39090 -3066 33832 184764 390121 488397 418581 282977 152908 2739
8072 2739 -180328 -311452 -315545 -273923 -318996 -441529 -537085 -529350 -426951 -290149 -175879
8061 -175879 -136009 -160910 -192012 -166007 -69367 65057 200791 336834 483364 621194 682609
8050 682609 626776 503893 361734 196548 13844 -115671 -161916 -137662 -100088 -114562 -142237
8039 -142237 -137373 -105981 -85144 -140532 -224750 -249187 -250186 -238403 -166665 -60398 3705 6759
$$ packed form
8116A736314M8089j37945j86507j43706j35467j27937j05695j12875j06367j0551
8106G17353R7483Q9744J9589l0513l4057q826J5040J4587l8792j40443k81103
8095D20062l23196j70776K424L7772K8721N6955N9189O999k2841J8819K7535j1414
8083A30249l2898n8261m2156L6898J50932K05357R8276o9816j35604j30069j50169
8072B739j83067j31124m093M1622m5073j22533r5556P735J02399J36802J14270
8061a75879L9870k4901l1102K6005R6640J34424J35734J36043J46530J37830O1415
8050F82609n5833j22883j42159j65186j82704j29515m6245K4254L7574j4474k7675
8039a42237M864L1392K0837n5388q4218k4437r99J1783P1738J06267O4103L054
$$ plain form
8027 6759 -35611 -104238 -182944 -282285 -403919 -503938 -536428 -500892 -432468 -370449 -315800 -236498
8015 -236498 -128923 9112 202593 435596 644638 761674 754445 668227 553686 421979
8005 421979 308585 245198 260619 358725 499912 608103 652737 664179 685601 693721 648708
7994 648708 574325 526408 528243 532052 413011 106213 -287796 -584690 -692295 -670222 -604960
7983 -604960 -540510 -494233 -467308 -444830 -397458 -360770 -353440 -325575 -286781 -266502 -240757 -186863
7971 -186863 -176908 -289789 -445315 -469046 -293534 -17920 198170 253925 140548 -38952
7961 -38952 -214505 -355954 -421162 -427301 -390654 -335516 -330492 -417541 -581686 -746338 -837597
7950 -837597 -857997 -821223 -719142 -565809 -397391 -265055 -196112 -182216 -197276 -222470 -266895
$$ packed form
8027F759m2370o8627p8706r9341j21634j00019l2490L5536O8424O2019N4649P9302
8015b36498J07575J38035J93481K33003K09042J17036p229q6218j14541j31707
8005D21979j13394o3387J5421R8106J41187J08191M4634J1442K1422Q120m5013
7994F48708p4383m7917J835L809j19041l06798l94009k96894j07605K2073O5262
7983f04960O4450M6277K6925K2478M7372L6688P330K7865L8794K0279K5745N3894
7971a86863R955j12881j55526k3731J75512K75614K16090N5755j13377j79500
7961c8952j75553j41449o5208o139L6647N5138N024q7049j64145j64652r1259
7950h37597k0400L6774J02081J53333J68418J32336O8943J3896j5060k5194m4425
$$ plain form
7939 -266895 -327001 -367718 -359443 -307126 -235358 -157855 -60318 14024 -4774 -78528 -108130 -88591
7927 -88591 -69379 -79602 -126696 -205897 -352907 -596654 -831275 -926060 -855016 -682203 -490689
7916 -490689 -307930 -117600 75182 277597 511694 704091 757396 685702 546481 366624
7906 366624 187882 42527 -70191 -163819 -201499 -170795 -118716 -57901 35423 188304 389040
7895 389040 596622 767373 860560 866188 808830 669183 430741 154010 -72212 -221269
7885 -221269 -328415 -460802 -648567 -811018 -887179 -926794 -973636 -988057 -946074 -861232 -761756
7874 -761756 -688500 -690422 -694619 -572333 -378954 -260493 -264459 -338475 -421016 -478874 -510470 -524486
7862 -524486 -530618 -561374 -636702 -694009 -661274 -556700 -429205 -303834 -177923 -46571 47871
$$ packed form
7939b66895o0106m0717Q275N2317P1768P7503R7537P4342j8798p3754k9602J9539
7927h8591J9212j0223m7094p9201j47010k43747k34621r4785P1044J72813J91514
7916d90689J82759J90330J92782K02415K34097J92397N3305p1694j39221j79857
7906C66624j78742j45355j12718r3628l7680L0704N2079O0815R3324J52881K00736
7895C89040K07582J70751R3187N628n7358j39647k38442k76731k26222j49057
7885b21269j07146j32387j87765j62451p6161l9615m6842j4421M1983Q4842R9476
7874g61756P3256j922m197J22286J93379J18461l966p4016q2541n7858l1596j4016
7862e24486o132l0756p5328n7307L2735J04574J27495J25371J25911J31352R4442
$$ plain form
7851 47871 41487 -23293 -70810 -129296 -200859 -226272 -199048 -148807 -119402 -135541 -170219 -197846
7839 -197846 -148161 -10049 86066 54648 -49551 -170961 -323409 -512370 -701557 -829844
7829 -829844 -922864 -1059531 -1215658 -1260970 -1147847 -932462 -660554 -385856 -143000 63693
7819 63693 221376 332392 441098 549403 540176 366404 167813 96699 129601 161740 121785
7808 121785 -22965 -193054 -272209 -275238 -274979 -308369 -360805 -405650 -439402 -440267 -336683 -72521
7796 -72521 243721 428860 422369 273227 104611 7373 -83165 -253689 -482998 -662803 -647240
7785 -647240 -407969 -93638 107065 160661 191385 261136 294661 255302 171280 64703 -2286
7774 -2286 -1607 60304 156659 231892 240894 187600 124921 65578 4999 -46750 -92421 -105239 -80132
$$ packed form
7851D7871o384o4780m7517n8486p1563k5413K7224N0241K9405j6139l4678k7627
7839a97846M9685J38112R6115l1418j04199j21410j52448j88961j89187j28287
7829h29844r3020j36667j56127m5312J13123K15385K71908K74698K42856K06693
7819F3693J57683J11016J08706J08305r227j73772j98591p1114L2902L2139l9955
7808A21785j44750j70089p9155l029K59l3390n2436m4845l3752q65J03584K64162
7796g2521L16242J85139o491j49142j68616r7238r0538j70524k29309j79805J5563
7785f47240K39271L14331K00703N3596L0724O9751L3525l9359q4022j06577o6989
7774b286O79O1911R6355P5233R002n3294o2679n9343o0579n1749m5671j2818K5107
$$ plain form
7761 -80132 -76201 -160165 -299386 -368634 -323515 -222638 -125988 -34322 52492 79907 74709 124928
7749 124928 219586 301677 335046 310299 250203 197327 157022 84322 -9566 -26499 15496 -14921
7737 -14921 -173093 -407871 -606391 -709825 -739523 -700051 -627765 -578540 -521875 -360679 -125342
7726 -125342 28118 35462 -64827 -213286 -281071 -204532 -63911 54719 130333 209072 278639
7715 278639 276354 246736 260146 284201 315668 384769 444868 456275 461351 449046 352437 186495
7703 186495 33180 -53955 -84879 -77971 -52137 -14291 61035 216362 416659 546587 540069
7692 540069 420410 234922 41526 -90470 -138584 -173875 -226883 -267026 -306871 -359556 -388718
7681 -388718 -374588 -328744 -250964 -128609 22589 177206 327828 426391 416213 339328 267616
$$ packed form
7761h0132L931q3964j39221o9248M5119J00877R6650R1666Q6814K7415n198N0219
7749A24928R4658Q2091L3369k4747o0096n2876m0305p2700r3888j6933M1995l0417
7737a4921j58172k34778j98520j03434k9698L9472P2286M9225N6665J61196K35337
7726a25342J53460P344j00289j48459o7785P6539J40621J18630P5614P8739O9567
7715B78639k285k9618J3410K4055L1467O9101O0099J1407N076j2305r6609j65942
7703A86495j53315q7135l0924O908K5834L7846P5326J55327K00297J29928o518
7692E40069j19659j85488j93396j31996m8114l5291n3008m0143l9845n2685k9162
7681c88718J4130M5844P7780J22355J51198J54617J50622R8563j0178p6885p1712
$$ plain form
7670 267616 197068 126519 89273 50537 -76495 -296101 -528381 -692479 -793198 -860516 -873767
7659 -873767 -848389 -839421 -849189 -841205 -789299 -663761 -473019 -309909 -240628 -242824 -269023 -287693
7647 -287693 -226111 -119724 -120864 -215664 -291150 -314583 -306915 -260054 -211378 -217464 -262340 -304124
7635 -304124 -327221 -331821 -293457 -184624 -27906 114963 225218 341703 505252 689440
7625 689440 808045 791248 623739 385323 199792 126700 155967 211309 253823 344342 488788
7614 488788 544912 483125 430668 401721 325185 130274 -201855 -558064 -816956 -962948 -1023903
7603 -1023903 -1054187 -1068480 -1035714 -1017254 -1009647 -929535 -783042 -659325 -585891 -488507 -368344
7592 -368344 -254056 -192535 -240049 -341244 -391251 -352620 -254483 -138789 -50394 -22182 -35597
$$ packed form
7670B67616p0548p0549l7246l8736j27032k19606k32280j64098j00719o7318j3251
7659h73767K5378Q968r768P984N1906J25538J90742J63110O9281k196k6199j8670
7647b87693O1582J06387j140r4800p5486k3433P668M6861M8676o086m4876m1784
7635c04124k3097m600L8364J08833J56718J42869J10255J16485J63549J84188
7625F89440J18605j6797j67509k38416j85531p3092K9267N5342M2514R0519J44446
7614D88788N6124o1787n2457k8947p6536j94911l32129l56209k58892j45992o0955
7603a023903l0284j4293L2766J8460P607Q0112J46493J23717P3434R7384J20163
7592c68344J14288O1521m7514j01195n0007L8631R8137J15694Q8395K8212j3415
$$ plain form
7581 -35597 -37260 -1852 56828 64835 -43190 -226900 -409708 -572977 -723399 -844853 -937975
7570 -937975 -1011603 -1046014 -1066726 -1092931 -1063259 -902579 -646294 -436615 -393289 -485545 -577503
7559 -577503 -588858 -515892 -395230 -261154 -127239 -21755 23013 17270 -19233 -83574 -153329
7548 -153329 -201957 -181182 -62952 66260 122863 134730 161285 199811 231706 276083 335372
7537 335372 402984 423851 327067 171683 88940 88581 91066 10171 -127523 -237981 -300344 -338942
7525 -338942 -387369 -442306 -451866 -336922 -167818 -140491 -333989 -567563 -642219 -591667 -492158
7514 -492158 -383817 -333548 -354001 -406256 -454187 -442355 -394548 -361211 -288516 -169682 -110164
7503 -110164 -127596 -181343 -221170 -168386 -27077 96571 149019 158200 130170 36329 -111212
$$ packed form
7581c5597j663L5408N8680Q007j08025j83710j82808j63269j50422j21454r3122
7570i37975p3628l4411k0712k6205K9672J60680K56285K09679M3326r2256r1958
7559e77503j1355P2966J20662J34076J33915J05484M4768n743l6503o4341o9755
7548a53329m8628K0775J18230J29212N6603J1867K6555L8526L1895M4377N9289
7537C35372O7612K0867r6784j55384q2743l59K485q0895j37694j10458o2363l8598
7525c38942m8427n4937r560J14944J69104K7327j93498k33574p4656N0552R9509
7514d92158J08341N0269k0453n2255m7931J1832M7807L3337P2695J18834N9518
7503a10164j7432n3747l9827N2784J41309J23648N2448R181k8030r3841j47541
$$ plain form
7492 -111212 -210889 -205472 -134863 -61328 6410 81609 133700 133318 106194 34594 -105020 -260376
7480 -260376 -341799 -334851 -321385 -322078 -311423 -285606 -211939 -48856 169707 384434 527492
7469 527492 543307 473705 418083 394874 368071 351803 333511 276550 200555 131615 126381 231959
7457 231959 405915 552389 596993 537378 404483 220530 -886 -251389 -478307 -599848
7447 -599848 -594691 -493951 -346892 -179373 19969 195680 290780 307012 261742 191273 124893
7436 124893 105969 182395 295806 338998 367913 481759 619645 686582 691652 666514 630250
7425 630250 593788 536133 435285 284730 148409 110030 150037 190812 193519 153662 90092
7414 90092 22381 -64531 -152642 -218943 -236922 -199805 -152616 -100665 -10608 125011 257555
$$ packed form
7492a11212r9677N417P0609P3535O7738P5199N2091l82k7124p1600j39614j55356
7480b60376q1423O948J3466o93J0655K5817P3667J63083K18563K14727J43058
7469E27492J5815o9602n5622k3209k6803j6268j8292n6961p5995o8940n234J05578
7457B31959J73956J46474M4604n9615j32895j83953k21416k50503k26918j21541
7447e99848N157J00740J47059J67519J99342J75711R5100J6232m5270p0469o6380
7436A24893j8924P6426J13411M3192K8915J13846J37886O6937N070k5138l6264
7425F30250l6462n7655j00848j50555j36321l8379M0007M0775K707l9857o3570
7414I0092o7711q6912q8111o6301j7979L7117M7189N1951R0057J35619J32544
$$ plain form
7403 257555 325645 344501 394726 498277 607143 652453 628191 564098 518624 533673 631487
7392 631487 819434 1003763 1100083 1111880 1071898 1016813 910047 697636 464367 345552
7382 345552 320039 258185 53505 -241153 -502641 -661768 -656117 -441244 -75285 266921
7372 266921 508375 726478 944172 1103424 1167462 1150427 1109818 1072138 999842 881073 717112
7361 717112 495964 236592 -21512 -228464 -329594 -312407 -221375 -114652 -31208 -4601
7351 -4601 -37140 -77597 -98214 -79349 -7102 58119 80799 96216 111274 143361 247835 407855
7339 407855 534101 606833 631117 615289 590551 564673 542973 493275 363825 219800 151361
7328 151361 156774 183010 216719 254853 286659 346818 422878 406741 278187 130022 20108
$$ packed form
7403B57555O8090J8856N0225J03551J08866M5310k4262o4093m5474J5049R7814
7392F31487J87947J84329R6320J1797l9982n5085j06766k12411k33269j18815
7382C45552k5513o1854k04680k94658k61488j59127N651K14873L65959L42206
7372B66921K41454K18103K17694J59252O4038j7035m0609l7680p2296j18769j63961
7361G17112k21148k59372k58104k06952j01130J7187R1032J06723Q3444K6607
7351d601l2539m0457k0617J8865P2247O5221K2680J5417J5058L2087J04474J60020
7339D07855J26246P2732K4284j5828k4738k5878k1700m9698j29450j44025o8439
7328A51361N413K6236L3709L8134L1806O0159P6060j6137j28554j48165j09914
$$ plain form
7317 20108 -42727 -39539 75120 286587 508032 686182 802157 864150 886936 867379 785872
7306 785872 650607 535173 458093 374413 264136 128205 2735 -75533 -93492 -70390 -21730
7295 -21730 60685 140325 164126 122177 35790 -29631 -88703 -219898 -428129 -651071 -814435
7284 -814435 -869816 -855419 -812083 -737030 -630809 -531509 -481313 -451061 -422032 -429924 -472055 -471721
7272 -471721 -361192 -160308 2350 27761 -8588 -34158 -25902 70878 262767 471303 646041
7261 646041 736802 746902 756129 775581 745501 653166 535267 424909 313695 243116 294443
7250 294443 374255 346629 232477 128415 75871 46708 47430 74444 123417 129254 48718 -50421
7238 -50421 -159489 -295731 -406324 -427572 -355264 -267366 -254593 -334024 -412444 -376900 -219404
$$ packed form
7317B0108o2835L188J14659K11467K21445J78150J15975O1993K2786j9557q1507
7306G85872j35265j15434p7080q3680j10277j35931j25470p8268j7959K3102M8660
7295b1730Q2415P9640K3801m1949q6387o5421n9072j31195k08231k22942j63364
7284h14435n5381J4397M3336P5053J06221R9300N0196L0252K9029p892m2131L34
7272d71721J10529K00884J62658K5411l6349k5570Q256R6780J91889K08536J74738
7261F46041R0761J0100R227J9452l0080r2335j17899j10358j11214p0579N1327
7250B94443P9812k7626j14152j04062n2544k9163P22K7014M8973N837q0536r9139
7238e0421j09068j36242j10593k1248P2308Q7898J2773p9431p8420L5544J57496
$$ plain form
7227 -219404 -23875 94105 57869 -110915 -307219 -396219 -331119 -210234 -131720 -96394 -132914
7216 -132914 -216605 -235043 -162811 -65697 -39485 -122458 -241754 -312811 -296454 -239906 -187247
7205 -187247 -106363 41507 258669 432925 500153 506620 457927 351232 242196 193034 212613
7194 212613 230352 214340 171042 149197 181842 195239 153662 99601 91995 160591 284129 428450
7182 428450 589145 780049 955936 1070160 1153844 1271009 1404115 1496714 1593777 1731594
7172 1731594 1842876 1880766 1884280 1890479 1939158 2020908 2005031 1820185 1570875 1375165 1302190
7161 1302190 1372453 1570038 1803608 1959787 2039077 2087618 2098983 2051999 1969384 1936884 2014715
7150 2014715 2115842 2123178 2045657 1945539 1862193 1794943 1710471 1579350 1427894 1302691 1280754
$$ packed form
7227b19404J95529J17980l6236j68784j96304q9000O5100J20885P8514L5326l6520
7216a32914q3691j8438P2232R7114K6212q2973j19296p1057J6357N6548N2659
7205a87247Q0884J47870K17162J74256O7228O467m8693j06695j09036m9162J9579
7194B12613J7739j6012m3298k1845L2645J3397m1577n4061p606O8596J23538J44321
7182D28450J60695J90904J75887J14224Q3684J17165J33106R2599R7063J37817
7172A731594J11282L7890L514O199M8679Q1750j5877j84846k49310j95710p2975
7161A302190P0263J97585K33570J56179P9290M8541J1365m6984q2615l2500P7831
7150B014715J01127P336p7521j00118q3346o7250q4472j31121j51456j25203k1937
$$ plain form
7139 1280754 1383437 1487633 1434709 1204759 950665 843634 899366 1039858 1189157 1299761
7129 1299761 1387445 1469608 1549191 1610838 1599426 1536432 1505938 1520026 1575399 1686832 1844592
7118 1844592 2069581 2391885 2750636 3057510 3289260 3471838 3673341 3969544 4386993 4939454
7108 4939454 5674307 6641355 7871745 9420113 11307719 13543404 16264270 19687020 24051684
7099 24051684 29637706 36804335 46064301 58067742 72829966 87681950 95426011 90080468
7091 90080468 75662461 60193073 47442207 37763705 30476406 24931819 20677657 17389451
7083 17389451 14779430 12695837 11014504 9580029 8322088 7308588 6562519 5983642
7075 5983642 5452390 4915028 4345738 3769336 3284689 2954890 2737882 2534481 2264592 1957434
$$ packed form
7139A280754J02683J04196n2924k29950k54094j07031N5732J40492J49299J10604
7129A299761Q7684Q2163P9583O1647j1412o2994l0494J4088N5373J11433J57760
7118A844592K24989L22304L58751L06874K31750J82578K01503K96203M17449N52461
7108D939454P34853R67048J230390J548368J887606K235685K720866L422750M364664
7099B4051684N586022P166629R259966J2003441J4762224J4851984P744061n345543
7091I0080468j4418007j5469388j2750866r678502p287299n544587m254162l288206
7083A7389451k610021k083593j681333j434475j257941j013500p46069n78877
7075E983642n31252n37362n69290n76402m84647l29799k17008k03401k69889l07158
$$ plain form
7065 1957434 1704004 1587117 1575673 1546822 1489531 1454155 1431138 1448016 1526461 1667234 1888497
7054 1888497 2148567 2367410 2542212 2731355 2947290 3097296 3005709 2618952 2096879 1606443
7044 1606443 1198606 875451 648947 470936 328029 257230 283714 403416 588692 792332
7034 792332 941267 990260 940302 816711 665924 505095 401264 378500 397796 437550 466797
7023 466797 419874 250111 -18177 -302069 -485860 -529441 -482063 -398068 -327518 -313358 -301873
7012 -301873 -166177 99305 397691 677217 901492 987826 960540 902831 871621 912989 994933
7001 994933 1006936 902766 741298 568325 384635 167063 -38255 -123560 -70167 28092
6991 28092 91248 77583 -13869 -94277 -123082 -130805 -90321 19244 119451 184114 232265 270940
$$ packed form
7065A957434k53430j16887j1444k8851n7291l5376k3017J6878P8445J40773K21263
7054A888497K60070K18843J74802J89143K15935J50006r1587l86757n22073m90436
7044A606443m07837l23155k26504j78011j42907p0799K6484J19702J85276K03640
7034G92332J48935M8993m9958j23591j50787j60829j03831k2764J9296L9754K9247
7023D66797m6923j69763k68288k83892j83791m3581M7378Q3995P0550J4160J1485
7012c01873J35696K65482K98386K79526K24275Q6334k7286n7709l1210M1368Q1944
7001I94933J2003j04170j61468j72973j83690k17572k05318q5305N3393R8259
6991B8092O3156j3665r1452q0408k8805p723M0484J09565J00207O4663M8151L8675
$$ plain form
6979 270940 261411 149318 32237 33197 130557 240307 331253 385855 350507 231978 108049
6968 108049 40685 13962 -54464 -204281 -404246 -584061 -686228 -703448 -695987 -700546 -671087
6957 -671087 -548492 -365589 -229734 -174246 -157396 -208761 -346479 -458378 -471381 -408735 -322573
6946 -322573 -276592 -309353 -395434 -453963 -445050 -390336 -346103 -304248 -233588 -182080 -162591 -172780
6934 -172780 -171756 -105502 -3029 97965 226250 389365 522487 601623 640947 638151 612451
6923 612451 571808 466372 308561 173103 97857 61683 8965 -42744 -70804 -112957 -212164
6912 -212164 -318512 -292877 -89714 194740 432382 542107 514284 429702 398534 472433 584306
6901 584306 654423 624397 490966 342797 209715 67319 -48756 -71156 -1626 148207
$$ packed form
6979B70940r529j12093j17081R60R7360J09750R0946N4602l5348j18529j23929
6968A08049o7364k6723o8426j49817j99965j79815j02167j7220P461m559K9459
6957f71087J22595J82903J35855N5488J6850n1365j37718j11899j3003O2646Q6162
6946c22573M5981l2761q6081n8529Q913N4714M4233M1855P0660N1508J9489j0189
6934a72780J024O6254J02473J00994J28285J63115J33122P9136L9324k796k5700
6923F12451m0643j05436j57811j35458p5246l6174n2718n1709k8060m2153r9207
6912b12164j06348K5635K03163K84454K37642J09725k7823q4582l1168P3899J11873
6901E84306P0117l0026j33431j48169j33082j42396j16075k2400O9530J49833
$$ plain form
6891 148207 364960 553564 651283 657272 564897 376049 150530 7853 -50455 -117606 -217329
6880 -217329 -347013 -491685 -595383 -684590 -829176 -1013189 -1132672 -1130435 -1004794 -775917
6870 -775917 -591061 -584699 -664659 -706985 -653470 -478381 -247440 -59497 53650 82561 4264
6859 4264 -173948 -385183 -541445 -579474 -505947 -397425 -322289 -313184 -362330 -397392 -342708
6848 -342708 -204104 -58637 6172 -15752 -107030 -221140 -266038 -257186 -280737 -347179 -400481
6837 -400481 -342608 -145497 110460 332149 470758 599619 752516 854633 875248 795915
6827 795915 634871 502597 465490 482377 512249 553537 589198 578720 494894 340385 192369
6816 192369 146658 263642 480182 609487 576553 508750 536847 652713 765148 801274 722059
$$ packed form
6891A48207K16753J88604R7719N989r2375j88848k25519j42677n8308o7151r9723
6880b17329j29684j44672j03698q9207j44586j84013j19483K237J25641K28877
6870g75917J84856O362p9960m2326N3515J75089K30941J87943J13147K8911p8297
6859D264j78212k11235j56262l8029P3527J08522P5136R105m9146l5062N4684
6848c42708J38604J45467O4809k1924r1278j14110m4898Q852k3551o6442n3302
6837d00481N7873J97111K55957K21689J38609J28861J52897J02117K0615p9333
6827G95915j61044j32274l7107J6887K9872M1288L5661j0478q3826j54509j48016
6816A92369m5711J16984K16540J29305l2934o7803K8097J15866J12435L6126p9215
$$ plain form
6805 722059 545379 383173 333699 379824 433341 463977 499633 559352 633381 713043 754332
6794 754332 718517 639450 514834 303507 40010 -171500 -249683 -156879 103654 415245
6784 415245 621819 669287 632132 613789 657431 759790 900977 1079397 1234774 1302851 1309048
6773 1309048 1278451 1169785 946213 719598 655240 757105 915276 994868 935023 783689
6763 783689 595168 417136 309964 343026 505711 661979 701898 597527 382471 165476
6753 165476 37497 -24507 -96532 -202807 -289074 -292583 -198975 -25969 164919 312192 371226
6742 371226 297647 111986 -68429 -138723 -97167 22281 173964 324761 472409 623284
6732 623284 792109 950959 1057476 1123818 1182281 1214685 1205818 1180997 1146275 1116901 1160124
$$ packed form
6805G22059j76680j62206m9474M6125N3517L0636L5656N9719P4029P9662M1289
6794G54332l5815p9067j24616k11327k63497k11510p8183R2804K60533L11591
6784D15245K06574M7468l7155j8343M3642J02359J41187J78420J55377O8077O197
6773A309048l0597j08666k23572k26615o4358J01865J58171P9592n9845j51334
6763G83689j88521j78032j07172L3062J62685J56268L9919j04371k15056k16995
6753A65476j27979o2004p2025j06275q6267l509R3608J73006J90888J47273N9034
6742C71226p3579j85661j80415p0294M1556J19448J51683J50797J47648J50875
6732F23284J68825J58850J06517O6342N8463L2404q867k4821l4722k9374M3223
$$ plain form
6721 1160124 1301696 1462592 1549771 1561045 1527525 1464590 1407135 1364334 1334686 1340798 1369845
6710 1369845 1392341 1425751 1498119 1617011 1755212 1884994 2002164 2091385 2148670 2173728 2154497
6699 2154497 2073965 1947934 1852250 1847543 1945338 2116082 2307027 2449380 2543068 2608103 2637474
6688 2637474 2639222 2636215 2652210 2680369 2772823 2967356 3218789 3456656 3671420 3909209 4227064
6677 4227064 4613863 5002355 5403832 5850572 6245098 6450547 6466563 6434157 6513309 6739281
6667 6739281 6984174 7162429 7323641 7523883 7772032 8075477 8444464 8906186 9530012 10343378
6657 10343378 11340561 12522665 13889769 15472876 17321055 19498678 22022734 24916017
6649 24916017 28253731 32139269 36707191 42123353 48502616 55923200 64531411 74762539
$$ packed form
6721A160124J41572J60896Q7179J1274l3520o2935n7455m2801k9648O112K9047
6710A369845K2496L3410P2368J18892J38201J29782J17170Q9221N7285K5058j9231
6699B154497q0532j26031r5684m707R7795J70744J90945J42353R3688O5035K9371
6688B637474J748l007J5995K8159R2454J94533K51433K37867K14764K37789L17855
6677D227064L86799L88492M01477M46740L94526K05449J6016l2406P9152K25972
6667F739281K44893J78255J61212K00242K48149L03445L68987M61722O23826Q13366
6657A0343378R97183J182104J367104J583107J848179K177623K524056K893283
6649B4916017L337714L885538M567922N416162O379263P420584Q608211J0231128
$$ plain form
6641 74762539 87380143 103285607 123475260 149213661 182043372 223596469 274954549
6634 274954549 334471830 393257955 432023733 430876698 389677434 328578257 267530995
6627 267530995 215704303 174570349 142698917 118044187 98730994 83388137 71126862
6620 71126862 61313441 53421263 46963338 41600891 37125467 33307989 29943085 26980850
6612 26980850 24422720 22238095 20378078 18819615 17504577 16274398 15005374 13738554
6604 13738554 12570493 11572850 10799200 10221866 9741829 9276067 8784795 8271537 7739912
6595 7739912 7205076 6704241 6278969 5924506 5578414 5230025 4956899 4786028 4682201 4637912
6585 4637912 4646470 4664109 4703376 4820039 4961192 5012684 4911419 4675500 4421598 4249146
$$ packed form
6641G4762539J2617604J5905464K0189653K5738401L2829711M1553097N1358080
6634B74954549N9517281N8786125L8765778j147035m1199264o1099177o1047262
6627B67530995n1826692m1133954l1871432k4654730j9313193j5342857j2261275
6620G1126862r813421p892178o457925n362447m475424l817478l364904k962235
6612B6980850k558130k184625j860017j558463j315038j230179j269024j266820
6604A3738554j168061r97643p73650n77334m80037m65762m91272n13258n31625
6595G739912n34836n00835m25272l54463l46092l48389k73126j70871j03827m4289
6585D637912Q558J7639L9267J16663J41153N1492j01265k35919k53902j72452
$$ plain form
6575 4249146 4128252 3951565 3691598 3434989 3235089 3087801 2957968 2859041 2814049 2781584
6565 2781584 2703830 2581133 2441094 2287710 2169252 2171398 2328788 2517880 2574468 2501109
6555 2501109 2394472 2330211 2278622 2149946 1968848 1802056 1655038 1463201 1191056 902695
6545 902695 693870 582705 519454 501210 576207 729772 893527 1018686 1099785 1193398 1315355
6534 1315355 1386280 1367670 1318859 1254180 1139266 1031776 1018467 1094558 1177764 1208210 1181951
6523 1181951 1107674 999823 882037 772073 655753 579018 614121 708692 772064 769477 734782
6512 734782 704412 655253 600358 550083 489885 417582 321097 225370 190183 261226 369450
6501 369450 424024 433048 428791 455040 534509 658505 779935 829947 814806 768644 709267 650842
$$ packed form
6575D249146j20894j76687k59967k56609j99900j47288j29833r8927m4992l2465
6565B781584p7754j22697j40039j53384j18458K146J57390J89092N6588p3359
6555B501109j06637o4261n1589j28676j81098j66792j47018j91837k72145k88361
6545I02695k08825j11165o3251j8244P4997J53565J63755J25159Q1099R3613J21957
6534A315355P0925j8610m8811o4679j14914j07490j3309P6091Q3206L0446k6259
6523A181951p4277j07851j17786j09964j16320p6735L5103R4571O3372k587l4695
6512G34782l0370m9159n4895n0275o0198p2303r6485r5727l5187P1043J08224
6501C69450N4574R024m257K6249P9469J23996J21430N0012j5141m6162n9377n8425
$$ plain form
6489 650842 541949 336797 109427 -55646 -166044 -264183 -357280 -389018 -320900 -218537
6479 -218537 -170168 -145985 -77318 57860 261480 535139 850250 1116071 1304471 1473691
6469 1473691 1616848 1662059 1621020 1543069 1458379 1395471 1358480 1309160 1197664 1052930 962146
6458 962146 987904 1065495 1069601 997504 935437 912450 871090 751952 578668 452154 453879
6447 453879 536678 578545 511493 384737 300728 316307 417166 547904 670592 732414 644864
6436 644864 427306 170697 -77788 -233215 -231228 -141792 -52972 15583 68572 114997 206495
6425 206495 379508 641672 990837 1354685 1643125 1817670 1846928 1717254 1561729 1533761
6415 1533761 1594149 1613602 1535786 1396487 1196611 922528 654415 505920 522755 624044
$$ packed form
6489F50842j08893k05152k27370j65073j10398r8139r3097l1738O8118J02363
6479b18537M8369K4183O8667J35178K03620K73659L15111K65821J88400J69220
6469A473691J43157M5211m1039p7951q4690o2908l6991m9320j11496j44734r0784
6458I62146K5758P7591M106p2097o2067k2987m1360j19138j73284j26514J725
6447D53879Q2799M1867o7052j26756q4009J5579J00859J30738J22688O1822q7550
6436F44864k17558k56609k48485j55427J987Q9436Q8820O8555N2989M6425R1498
6425B06495J73013K62164L49165L63848K88440J74545K9258j29674j55525k7968
6415A533761O0388J9453p7816j39299j99876k74083k68113j48495J6835J01289
$$ plain form
6405 624044 698629 649458 482641 330267 214264 67741 -100290 -211493 -188272 -79274
6395 -79274 -1501 -7269 -73846 -146436 -168468 -114007 -12046 73545 127519 219174 375071 499693
6383 499693 508269 427558 334765 301970 386761 564341 715905 808149 900174 979612 995509
6372 995509 984231 962288 893058 796018 711743 639564 550332 420159 294930 213003 188668
6361 188668 231036 319462 399684 467164 586792 738149 816853 747286 540222 247549 -42844
6350 -42844 -215472 -215011 -105177 25288 129119 164181 127475 72632 14696 -55463 -118713
6339 -118713 -156149 -127847 -47960 43391 170613 365858 565250 691793 735606 718324 674680
6328 674680 585405 458084 400393 454774 522755 500443 369080 193255 64684 53831 155209
$$ packed form
6405F24044P4585m9171j66817j52374j16003j46523j68031j11203K3221J08998
6395g9274P7773n768o6577p2590k2032N4461J01961Q5591N3974R1655J55897J24622
6383D99693Q576q0711r2793l2795Q4791J77580J51564R2244R2025P9438J5897
6372I95509j1278k1943o9230r7040q4275p2179q9232j30173j25229q1927k4335
6361A88668M2368Q8426Q0222O7480J19628J51357P8704o9567k07064k92673k90393
6350d2844j72628M61J09834J30465J03831L5062l6706n4843n7936p0159o3250
6339a18713l7436K8302P9887R1351J27222J95245J99392J26543M3813j7282m3644
6328F74680q9275j27321n7691N4381O7981k2312j31363j75825j28571j0853J01378
$$ plain form
6317 155209 277196 337075 341498 356445 417861 469000 467926 438182 387178 357096 371152 373709
6305 373709 344945 346673 406453 484017 496200 397457 277578 252434 303650 332727 293246 253320
6293 253320 281603 363770 428601 429169 359504 227736 97618 20858 -58088 -193135 -298940
6282 -298940 -297379 -200341 -67813 59370 171454 262587 310067 314487 329314 379573 441318
6271 441318 454681 393767 262151 83822 -57407 -78263 -6746 45599 -15749 -159936 -282395
6260 -282395 -306486 -165578 70545 255261 326222 257552 66954 -150555 -266355 -230785
6250 -230785 -126470 20874 230711 488782 704632 745267 625812 461831 313196 164484
6240 164484 16598 -89700 -116638 -71665 -3774 61084 135367 244331 345816 341111 226714
$$ packed form
6317A55209J21987N9879M423J4947O1416N1139j074k9744n1004l0082J4056K557
6305C73709k8764J728N9780P7564J2183r8743j19879k5144N1216K9077l9481l9926
6293B53320K8283Q2167O4831N68o9665j31768j30118p6760p8946j35047j05805
6282b98940J561R7038J32528J27183J12084R1133M7480M420J4827N0259O1745
6271D41318J3363o0914j31616j78329j41229k0856P1517N2345o1348j44187j22459
6260b82395k4091J40908K36123J84716P0961o8670j90598k17509j15800L5570
6250b30785J04315J47344K09837K58071K15850M0635j19455j63981j48635j48712
6240A64484j47886j06298k6938M4973O7891O4858P4283J08964J01485m705j14397
$$ plain form
6229 226714 112903 70582 112025 221681 288653 202040 39453 -87176 -171741 -210492 -207388
6218 -207388 -210464 -272582 -337297 -307082 -213219 -143887 -99537 -16550 131773 252899 252241 153586
6206 153586 66342 90842 228503 365852 451479 553232 728295 923897 1025950 965207
6196 965207 782987 591315 476331 483920 577587 638062 599478 506024 424251 369166 315128
6185 315128 253233 192257 148830 151397 225837 324974 332033 235866 154154 162881 217017 255324
6173 255324 247005 179612 117073 117722 178318 238731 231641 163598 44002 -102601 -255011 -398327
6161 -398327 -461899 -392827 -256752 -181824 -197126 -266371 -356467 -452859 -529043 -584226 -632149
6150 -632149 -636376 -576500 -500893 -435525 -365550 -298901 -254135 -208782 -157361 -179583 -339705 -562939
$$ packed form
6229B26714j13811m2321M1443J09656O6972q6613j62587j26629q4565l8751L104
6218b07388l076o2118o4715L0215R3863O9332M4350Q2987J48323J21126o58r8655
6206A53586q7244K4500J37661J37349Q5627J01753J75063J95602J02053o0743
6196I65207j82220j91672j14984P589R3667O0475l8584r3454q1773n5085n4038
6185C15128o1895o0976m3427K567P4440R9137P059r6167q1712Q727N4136L8307
6173B55324q319o7393o2539O49O0596O0413p090o8043j19596j46603j52410j43316
6161c98327o3572O9072J36075P4928j5302o9245r0096r6392p6184n5183m7923
6150f32149m227N9876P5607O5368O9975O6649M4766M5353N1421k2222j60122k23234
$$ plain form
6138 -562939 -707193 -730053 -662880 -500288 -249138 11463 198851 290696 316315 344418 387432
6127 387432 371196 270116 118867 -64198 -233375 -294398 -256822 -188561 -126252 -124844 -172951
6116 -172951 -226480 -259143 -272900 -267729 -191587 -47701 71228 92548 54628 11524 -32128
6105 -32128 -61599 -53353 -25014 -22488 -54231 -123633 -248031 -378830 -444457 -462944 -468072 -422605
6093 -422605 -292975 -130849 -6180 79262 124664 100592 47453 37035 32911 -1464 -66362
6082 -66362 -161450 -257962 -300201 -288539 -238903 -177384 -157456 -175314 -174047 -121764 -56450 -14251
6070 -14251 6218 20751 13066 -19750 -1929 109600 289239 465303 572215 614684 582133
6059 582133 494421 392578 241493 7364 -257027 -482138 -591745 -531983 -385238 -308310
$$ packed form
6138e62939j44254k2860O7173J62592K51150K60601J87388R1845K5619K8103M3014
6127C87432j6236j01080j51249j83065j69177o1023L7576O8261O2309J408m8107
6116a72951n3529l2663j3757N171P6142J43886J18929K1320l7920m3104m3652
6105c2128k9471Q246K8339K526l1743o9402j24398j30799o5627j8487n128M5467
6093d22605J29630J62126J24669Q5442M5402k4072n3139j0418m124l4375o4898
6082f6362r5088r6512m2239J1662M9636O1519J9928j7858J267N2283O5314M2199
6070a4251K0469J4533p685l2816J7821J11529J79639J76064J06912M2469l2551
6059E82133q7712j01843j51085k34129k64391k25111j09607N9762J46745P6928
$$ plain form
6049 -308310 -329992 -378241 -404315 -395448 -354514 -285444 -222620 -194309 -164313 -118888 -126024 -202442
6037 -202442 -284942 -287440 -178020 -81125 -83846 -131605 -131680 -94239 -51288 -16601 -18302 -17782 47836
6024 47836 156201 244265 278021 248004 164653 57777 -72125 -214509 -315509 -341178 -266820
6013 -266820 -114842 39702 160852 251772 289227 267454 208822 130850 46409 43691 183224
6002 183224 392893 563860 647536 658134 636650 650009 702987 703502 565724 343133 161380
5991 161380 70880 28343 -65862 -256943 -470210 -619448 -653673 -582678 -456000 -313957 -189646
5980 -189646 -131445 -139518 -167306 -143874 -8216 163942 272681 296503 190548 -911 -135106
5969 -135106 -173231 -158953 -117151 -49881 52693 112732 55861 -64601 -199904 -322470 -381297
$$ packed form
6049c08310k1682m8249k6074Q867M0934O9070O2824K8311K9996M5425p136p6418
6037b02442q2500k498J09420R6895k721m7759p5L7441M2951L4687j701N20O5618
6024D7836J08365Q8064L3756l0017q3351j06876j29902j42384j01000k5669P4358
6013b66820J51978J54544J21150R0920L7455k1773n8632p7972q4441k718J39533
6002A83224K09669J70967Q3676J0598k1484J3359N2978N15j37778k22591j81753
5991A61380r0500m2537r4205j91081k13267j49238l4225P0995J26678J42043J24311
5980a89646N8201q073k7788K3432J35658J72158J08739K3822j05955j91459j34195
5969a35106l8125J4278M1802O7270J02574O0039n6871j20462j35303j22566n8827
$$ plain form
5958 -381297 -331770 -189848 -37399 4737 -152569 -402159 -528039 -493771 -400169 -306538 -221405
5947 -221405 -106387 30959 112838 126945 155306 235492 283042 246052 153569 82712 71096
5936 71096 111769 171754 209303 233893 262532 312669 399652 488084 569744 659611 720895 695715
5924 695715 596002 485856 363617 179550 -63996 -311374 -481921 -560272 -637282 -725978
5914 -725978 -767628 -757688 -753947 -732788 -658109 -586569 -530090 -473877 -465798 -512420 -565395 -584600
5902 -584600 -568935 -575527 -605516 -591973 -490668 -291069 -78466 1669 -46268 -69521 13172
5891 13172 129932 204421 243312 230058 142607 10358 -73947 -63157 -60945 -149106 -319495
5880 -319495 -526936 -704479 -792334 -846177 -905796 -895850 -771447 -575255 -363970 -179415 -52016
$$ packed form
5958c81297M9527J41922J52449M2136j57306k49590j25880L4268R3602R3631Q5133
5947b21405J15018J37346Q1879J4107K8361Q0186M7550l6990r2483p0857j1616
5936G1096M0673N9985L7549K4590K8639N0137Q6983Q8432Q1660Q9867O1284k5180
5924F95715r9713j10146j22239j84067k43546k47378j70547p8351p7010q8696
5914g25978m1650R940L741K1159P4679P1540N6479N6213Q079m6622n2975j9205
5902e84600J5665o592k9989J3543J01305J99599K12603Q0135m7937k3253Q2693
5891A3172J16760P4489L8891j3254q7451j32249q4305J0790K212q8161j70389
5880c19495k07441j77543q7855n3843n9619R946J24403J96192K11285J84555J27399
$$ plain form
5869 -52016 20332 77691 168261 273045 321407 289922 209803 63195 -149936 -316551 -364697
5858 -364697 -325934 -262531 -255576 -317210 -379870 -406656 -442409 -517238 -518823 -417201 -304758 -230657
5846 -230657 -212632 -229730 -255988 -268724 -200852 -42973 133056 248306 281678 265123 195876
5835 195876 54794 -131303 -296845 -402399 -446166 -404347 -262606 -82672 110104 275627
5825 275627 354647 364420 367222 391649 451811 581334 704764 743479 705918 613491 488999
5814 488999 377584 307540 258736 201336 165220 159249 146024 164409 218476 266513 267869 188526
5802 188526 44520 -104846 -191704 -188461 -90856 93185 310509 496488 671220 829926
5792 829926 902943 822454 596656 387225 311686 358943 475214 548849 517533 446166 394315
$$ packed form
5869e2016P2348N7359R0570J04784M8362l1485q0119j46608k13131j66615m8146
5858c64697L8763O3403O955o1634o2660k6786l5753p4829j585J01622J12443P4101
5846b30657J8025j7098k6258j2736O7872J57879J76029J15250L3372j6555o9247
5835A95876j41082j86097j65542j05554m3767M1819J41741J79934J92776J65523
5825B75627P9020R773K802K4427O0162J29523J23430L8715l7561r2427j24492
5814D88999j11415p0044m8804n7400l6116n971j3225J8385N4067M8037J356p9343
5802A88526j44006j49366q6858L243R7605J84041K17324J85979J74732J58706
5792H29926P3017q0489k25798k09431p5539M7257J16271P3635l1316p1367n1851
$$ plain form
5781 394315 367312 314270 196783 37264 -118782 -223056 -226169 -120756 52175 230957
5771 230957 337745 308040 170974 93782 198224 449673 685358 756070 612466 340259
5761 340259 85220 -45063 -32100 80575 190266 203031 125349 2912 -119750 -233554
5751 -233554 -332377 -395456 -411227 -374619 -251571 -64346 74286 128592 162789 209732 183206
5740 183206 26502 -165598 -294817 -313521 -190110 -8048 130950 201926 238001 280925
5730 280925 371342 513647 606537 538143 314283 20818 -270854 -468425 -496708 -398730 -276459
5719 -276459 -222569 -228719 -239819 -232651 -161179 -62008 -48996 -157323 -296075 -373660 -393490 -400373
5707 -400373 -409089 -433889 -459150 -437791 -371197 -252933 -95325 25894 57603 44435 6846
$$ packed form
5781C94315k7003n3042j17487j59519j56046j04274l113J05413J72931J78782
5771B30957J06788k9705j37066p7192J04442K51449K35685P0712j43604k72207
5761C40259k55039j30283J2963J12675J09691J2765p7682j22437j22662j13804
5751b33554r8823o3079j5771L6608J23048J87225J38632N4306L4197M6943k6526
5740A83206j56704j92100j29219j8704J23411J82062J38998P0976L6075M2924
5730B80925R0417J42305R2890o8394k23860k93465k91672j97571k8283R7978J22271
5719b76459N3890o150j1100P168P1472R9171J3012j08327j38752p7585j9830o883
5707d00373q716k4800k5261K1359O6594J18264J57608J21219L1709j3168l7589
$$ plain form
5696 6846 -75732 -210167 -399011 -604612 -775296 -872027 -882405 -798386 -653126 -552118 -500318
5685 -500318 -414837 -342414 -334154 -369233 -384728 -299034 -145056 -88846 -174656 -298407 -422592
5674 -422592 -540663 -613162 -618674 -563815 -477848 -393680 -321621 -272246 -227576 -131238 -16648
5663 -16648 -275 -116623 -275704 -398550 -459597 -438169 -376198 -332975 -311333 -320137 -333210
5652 -333210 -322465 -296490 -215847 -38221 168131 314339 441394 597126 731991 799714
5642 799714 819981 832866 854500 866417 891423 968325 1050568 1070856 1024566 949402 886344 853545
5630 853545 859916 889235 897822 833763 700464 543766 313613 54849 -61367 -8637 109246
5619 109246 226069 302571 289068 251722 259323 260345 202439 105284 61716 118537 177060 177677
$$ packed form
5696F846q2578j34435j88844k05601j70684r6731j0378Q4019J45260J01008N1800
5685e00318Q5481P2423Q260l5079j5495Q5694J53978N6210q5810j23751j24185
5674d22592j18071p2499n512N4859Q5967Q4168P2059M9375M4670R6338J14590
5663a6648J6373j16348j59081j22846o1047K1428O1971M3223K1642q804j3073
5652c33210J0745K5975Q0643J77626K06352J46208J27055J55732J34865O7723
5642G99714K0267J2885K1634J1917K5006P6902Q2243K0288m6290p5164o3058l2799
5630H53545O371K9319Q587o4059j33299j56698k30153k58764j16216N2730J17883
5619A09246J16823P6502j3503l7346P601J022n7906r7155m3568N6821N8523O17
$$ plain form
5607 177677 173273 219062 340224 472854 530145 463959 288850 85582 -50222 -75955 -14997
5596 -14997 68063 136559 167877 177194 158554 56593 -98742 -156802 -34006 163741 275302
5585 275302 276477 270642 313800 384109 480756 634870 779433 807673 674791 401850 103026
5574 103026 -96383 -182276 -250501 -381121 -529035 -604386 -597252 -559396 -533599 -536443 -520746
5563 -520746 -488319 -496267 -530542 -518801 -391597 -179338 -2159 85278 148669 215940 293891
5552 293891 383137 449531 480252 486115 491715 470383 401492 374378 448831 564510 643910 668742
5540 668742 619840 464134 275825 214582 273809 303608 249512 164463 84374 -10402 -118068
5529 -118068 -208556 -255983 -233230 -157959 -98108 -102359 -152799 -156768 -62452 97790 235948 277688
$$ packed form
5607A77677m404M5789J21162J32630N7291o6186j75109k03268j35804k5733O0958
5596a4997Q3060O8496L1318R317j8640j01961j55335n8060J22796J97747J11561
5585B75302J175n835M3158P0309R6647J54114J44563K8240j32882k72941k98824
5574A03026j99409q5893o8225j30620j47914p5351P134L7856K5797k844J5697
5563e20746L2427p948l4275J1741J27204K12259J77179Q7437O3391O7271P7951
5552B93891Q9246O6394L0721N863N600k1332o8891k7114P4453J15679P9400K4832
5540F68742m8902j55706j88309o1243N9227K9799n4096q5049q0089r4776j07666
5529a18068r0488m7427K2753P5271N9851m251n0440l969R4316J60242J38158M1740
$$ plain form
5517 277688 258057 254800 276712 284737 245625 176190 168482 214413 216840 156687 91092 75753
5505 75753 136055 256245 363290 386508 306285 207002 199789 286107 389412 439745 423752
5494 423752 337434 175824 5641 -86916 -80007 4479 161332 363782 506243 494466 331045
5483 331045 146192 64263 124355 298540 527160 707805 729652 627765 547084 564360 642774
5472 642774 708084 699438 602553 444766 314941 269141 214043 68222 -90334 -189664 -238908
5461 -238908 -283330 -379610 -482108 -495518 -363582 -74279 280116 530815 652957 714727
5451 714727 744974 741729 681380 539341 289739 -3440 -173938 -148456 -35082 5516 -91660
5440 -91660 -246669 -345841 -358858 -327302 -276702 -176210 -1767 203886 363145 422576 441320
$$ packed form
5517B77688j9631l257K1912Q025l9112o9435p708M5931K427o0153o5595j5339
5505G5753O0302J20190J07045K3218q0223r9283p213Q6318J03305N0333j5993
5494D23752q6318j61610j70183r2557O909Q4486J56853K02450J42461j1777j63421
5483C31045j84853q1929O0092J74185K28620J80645K1847j01887q0681J7276P8414
5472F42774O5310q646r6885j57787j29825m5800n5098j45821j58556r9330m9244
5461b38908m4422r6280j02498j3410J31936K89303L54395K50699J22142O1770
5451G14727L0247l245o0349j42039k49602k93179j70498K5482J13374M0598r7176
5440i1660j55009r9172j3017L1556N0600J00492J74443K05653J59259N9431J8744
$$ plain form
5429 441320 467401 493534 511797 551449 568382 460092 202734 -132379 -461547 -727727 -867183
5418 -867183 -815135 -609218 -388146 -248656 -224538 -213852 -125261 -7684 92847 182536 262161
5407 262161 331984 406508 436178 358352 190500 32077 -35968 -36711 -22 58878 100250 117496
5395 117496 158644 254430 365893 462642 523370 530166 520903 504096 415251 241828 55380
5384 55380 -86389 -175241 -196150 -127952 -12742 49502 21598 -38057 -110432 -204075 -256538
5373 -256538 -217437 -120161 4657 123353 241150 377279 500648 561607 528284 445369 394309
5362 394309 412435 455744 460710 388221 251965 142642 91223 5086 -170940 -361183 -435378
5351 -435378 -370053 -299179 -342656 -487245 -604636 -614965 -571491 -525223 -447964 -363302 -333160
$$ packed form
5429D41320K6081K6133J8263L9652J6933j08290k57358l35113l29168k66180j39456
5418h67183N2048K05917K21072J39490K4118J0686Q8591J17577J00531Q9689P9625
5407B62161O9823P4524K9670p7826j67852j58423o8045p43L6689N8900M1372J7246
5395A17496M1148R5786J11463R6749O0728O796r263j6807q8845j73423j86448
5384E5380j41769q8852k0909O8198J15210O2244k7904n9655p2375r3643n2463
5373b56538L9101R7276J24818J18696J17797J36129J23369O0959l3323q2915n1060
5362C94309J8126M3309M966p2489j36256j09323n1419q6137j76026j90243p4195
5351d35378O5325P0874m3477j44589j17391j0329M3474M6268P7259Q4662L0142
$$ plain form
5340 -333160 -335645 -313030 -234176 -99378 24627 32352 -64922 -180920 -331529 -567379 -789316
5329 -789316 -888473 -895374 -854868 -784171 -687370 -593472 -587332 -689988 -772364 -701488 -514892 -323360
5317 -323360 -204098 -165359 -143366 -135927 -185387 -260548 -330828 -395930 -480769 -610181 -684303
5306 -684303 -596663 -345135 -35568 197340 261823 170633 50047 -1082 12129 4741 -68571
5295 -68571 -162364 -252254 -391069 -565550 -697193 -718630 -628313 -501032 -389408 -264381 -117224
5284 -117224 16761 70019 23321 -96746 -275351 -478927 -626616 -617003 -439195 -212769
5274 -212769 -58396 -32633 -146787 -328389 -494343 -598919 -623153 -592490 -520625 -397936
5264 -397936 -235475 -86361 -31216 -41526 -23087 61516 194356 293045 287776 188554 37553
$$ packed form
5340c33160k485K2615P8854J34798J24005P725r7274j15998j50609k35850k21937
5329g89316r9157o901M0506P0697R6801R3898O140j02656q2376P0876J86596J91532
5317c23360J19262L8739K1993P439m9460p5161p0280o5102q4839j29412p4122
5306f84303Q7640K51528L09567K32908O4483r1190j20586n1129J3211p388p3312
5295f8571r3793q9890j38815j74481j31643k1437R0317J27281J11624J25027J47157
5284a17224J33985N3258m6698j20067j78605k03576j47689R613J77808K26426
5274b12769J54373K5763j14154j81602j65954j04576k4234L0663P1865J22689
5264c97936J62461J49114N5145j0310J8439Q4603J32840R8689n269r9222j51001
$$ plain form
5253 37553 -102438 -179278 -169935 -43543 173377 337863 335302 234926 171560 188363 245369
5242 245369 287701 325073 337517 264162 106028 -31192 -52500 6274 86872 152646 177270
5231 177270 207434 256051 252962 181044 99464 54288 334 -99075 -225055 -365888 -524065
5220 -524065 -646558 -641083 -470449 -177052 110350 251232 190328 -7174 -198390 -260928
5210 -260928 -233829 -245765 -258266 -177922 -37394 106624 250459 345860 352313 318367 311253
5199 311253 302390 226696 109301 10121 -25186 -20623 -50089 -78555 4441 170113 273565
5188 273565 261734 209805 194489 158627 55951 -33384 -70342 -86483 -134015 -220727 -309635
5177 -309635 -324965 -237732 -85573 85524 252975 436262 595461 671301 707228 736249 757769
$$ packed form
5253C7553j39991p6840R343J26392K16920J64486k561j00376o3366J6803N7006
5242B45369M2332L7372J2444p3355j58134j37220k1308N8774Q0598O5774K4624
5231A77270L0164M8617l089p1918q1580m5176n3954r9409j25980j40833j58177
5220e24065j22493N475J70634K93397K87402J40882o0904j97502j91216o2538
5210b60928K7099j1936j2501Q0344J40528J44018J43835R5401O453l3946p114
5199C11253q863p5694j17395r9180l5307M563k9466k8466Q2996J65672J03452
5188B73565j1831n1929j5316l5862j02676q9335l6958j6141m7532q6712q8908
5177c09635j5330Q7233J52159J71097J67451J83287J59199P5840L5927K9021K1520
$$ plain form
5166 757769 774373 728339 573925 389444 279359 221750 145025 30585 -83581 -100954 -1328
5155 -1328 115051 207148 298870 370995 387621 344220 327989 426709 572104 690433 788725
5144 788725 873734 887414 799152 665734 492001 271639 58037 -107257 -213733 -257752
5134 -257752 -246457 -195507 -120933 -60384 -55936 -84156 -49870 47724 112573 111883 57253 -401
5122 -401 -7166 30141 96799 177991 213797 154656 20767 -95058 -112145 -32231 45365 53949
5110 53949 20922 -26954 -82731 -142359 -138990 -26048 117741 234125 319244 366681 374276 323820
5098 323820 244126 185115 148323 124780 125111 128870 78205 -52852 -221055 -333000 -319777 -195318
5086 -195318 -49598 19334 16998 25645 95925 205220 285133 292154 285429 297207 270449 189768
$$ packed form
5166G57769J6604m6034j54414j84481j10085n7609p6725j14440j14166j7373R9626
5155a328J16379R2097R1722P2125J6626m3401j6231R8720J45395J18329R8292
5144G88725Q5009J3680q8262j33418j73733k20362k13602j65294j06476m4019
5134b57752J1295N0950P4574O0549M448k8220L4286R7594O4849o90n4630n7654
5122d01o765L7307O6658Q1192L5806n9141j33889j15825j7087P9914P7596Q584
5110E3949l3027m7876n5777n9628L369J12942J43789J16384Q5119M7437P595n0456
5098C23820p9694n9011l6792k3543L31L759n0665j31057j68203j11945J3223J24459
5086a95318J45720O8932k336Q647P0280J09295P9913P021o725J1778k6758q0681
$$ plain form
5074 189768 71026 -30340 -25297 106304 315473 506753 584187 554785 479178 431404 470859
5063 470859 562891 633218 619687 511266 367209 235892 111531 -17598 -121788 -154580
5053 -154580 -111965 -27087 42656 69619 104319 178658 262120 339268 416501 478988 490980 464995
5041 464995 473380 515096 521202 487035 479608 506926 546240 602367 671988 708534 673903 596705
5029 596705 486333 372883 305295 315932 396160 486918 534022 518485 418663 270760 181960
5018 181960 184372 267552 423249 562066 556542 401839 197048 16404 -109218 -136196 -56705
5007 -56705 61209 142001 192193 271673 404856 616603 925771 1236670 1396573 1379546 1293946
4996 1293946 1174269 982929 743071 547894 458912 470043 540132 587722 503479 271015
$$ packed form
5074A89768j18742j01366N043J31601K09169J91280P7434k9402p5607m7774L9455
5063D70859R2032P0327j3531j08421j44057j31317j24361j29129j04190l2792
5053a54580M2615Q4878O9743K6963L4700P4339Q3462P7148P7233O2487J1992k5985
5041D64995Q385M1716O106l4167p427K7318L9314N6127O9621L6546l4631p7198
5029E96705j10372j13450o7588J0637Q0228R0758M7104j5537r9822j47903q8800
5018A81960K412Q3180J55697J38817n524j54703k04791j80644j25622k6978P9491
5007e6705J17914Q0792N0192P9480J33183K11747L09168L10899J59903j7027q5600
4996A293946j19677j91340k39858j95177q8982J1131P0089M7590q4243k32464
$$ plain form
4986 271015 -34346 -319181 -484994 -500793 -437999 -421606 -505092 -657139 -724920 -575224 -296316
4975 -296316 -34194 138745 255211 396960 580966 755222 877821 928935 955632 992044
4965 992044 989727 896475 748381 636144 550619 459702 328838 146995 3800 -43590 -26233
4954 -26233 20218 77701 123711 130054 112602 105309 146646 267495 405749 520206 614185 688000
4942 688000 783221 904732 1062990 1249131 1306550 1114050 777569 449461 186355 12052
4932 12052 -50987 7992 133760 244759 330857 434512 516857 515675 482779 473189 443539 336073
4920 336073 144201 -116675 -336626 -424772 -396141 -259806 -60577 112013 276955 464765
4910 464765 626922 702568 674894 547208 337785 131011 52001 120106 215934 255247 256623
$$ packed form
4986B71015l05361k84835j65813j5799O2794J6393q3486j52047o7781J49696K78908
4975b96316K62122J72939J16466J41749J84006J74256J22599N1114K6697L6412
4965I92044k317r3252j48094j12237q5525r0917j30864j81843j43195m7390J7357
4954b6233M6451N7483M6010O343j7452p293M1337J20849J38254J14457R3979P3815
4942F88000R5221J21511J58258J86141N7419j92500l36481l28108k63106j74303
4932A2052o3039N8979J25768J10999Q6098J03655Q2345j182l2896r590k9650j07466
4920C36073j91872k60876k19951q8146K8631J36335J99229J72590J64942J87810
4910D64765J62157P5646k7674j27686k09423k06774p9010O8105R5828L9313J376
$$ plain form
4899 256623 234002 182260 105866 46169 58766 127850 207475 291492 376626 435636 455668 402219
4887 402219 243305 55143 -88739 -181579 -244457 -319021 -422041 -516297 -531408 -435277 -310053
4876 -310053 -249290 -232591 -214462 -185019 -133937 -47969 17612 18616 -52361 -162813 -258945 -322727
4864 -322727 -339520 -301905 -242137 -212647 -203917 -170498 -113430 -20329 130006 327339 439806
4853 439806 358207 154975 -50058 -239390 -401332 -471776 -449431 -400862 -370359 -369152 -404411
4842 -404411 -425137 -381965 -291158 -178551 -96387 -69605 -115897 -251205 -392540 -446370 -420107
4831 -420107 -372667 -320200 -294549 -330870 -361804 -328043 -231652 -86870 71201 192277 208042
4820 208042 166614 155997 206616 290477 370433 405627 367373 305043 248001 175048 114841 106577
$$ packed form
4899B56623k2621n1742p6394n9697J2597O9084P9625Q4017Q5134N9010K0032n3449
4887D02219j58914j88162j43882r2840o2878p4564j03020r4256j5111R6131J25224
4876c10053O0763J6699J8129K9443N1082Q5968O5581J004p0977j10452r6132o3782
4864c22727j6793L7615N9768K9490Q730L3419N7068R3101J50335J97333J12467
4853D39806q1599k03232k05033j89332j61942p0444K2345M8569L0503J207l5259
4842d04411k0726M3172R0807J12607Q2164K6782m6292j35308j41335n3830K6263
4831d20107M7440N2467K5651l6321l0934L3761R6391J44782J58071J21076J5765
4820B08042m1428j0617N0619Q3861P9956L5194l8254o2330n7042p2953o0207q264
$$ plain form
4808 106577 172121 321571 490639 553421 491217 403810 358681 363601 367170 344386 336191 307159
4796 307159 177234 -44184 -246823 -276933 -115448 110929 336158 504171 516525 417305
4786 417305 349559 331072 285917 208752 140239 85947 53970 71989 171659 346378 539278
4775 539278 694367 814916 907456 964128 967257 905231 809361 733536 711548 697233 665107
4764 665107 601752 500699 360562 220920 105111 -49469 -229174 -335950 -371424 -349629
4754 -349629 -299443 -273280 -280978 -306281 -329565 -369481 -426604 -506320 -599069 -627606 -516890 -287357
4742 -287357 -66454 43191 66355 52369 -4063 -55900 -48468 -21977 -20952 -44369 -59374 -35760
4730 -35760 -5405 -12543 -73066 -171323 -316849 -563109 -862624 -1049486 -1004148 -783271 -536010
$$ packed form
4808A06577O5544J49450J69068O2782o2204q7407m5129M920L569k2784q195k9032
4796C07159j29925k21418k02639l0110J61485K26377K25229J68013J2354r9220
4786D17305o7746j8487m5155p7165o8513n4292l1977J8019R9670J74719J92900
4775E39278J55089J20549R2540N6672L129o2026r5870p5825k1988j4315l2126
4764F65107o3355j01053j40137j39642j15809j54580j79705j06776l5474K1795
4754c49629N0186K6163p698k5303k3284l9916n7123p9716r2749k8537J10716K29533
4742b87357K20903J09645K3164j3986n6432n1837P432K6491J025k3417j5005K3614
4730c5760L0355p138o0523r8257j45526k46260k99515j86862M5338K20877K47261
$$ plain form
4719 -536010 -373795 -352102 -468353 -599521 -614667 -514051 -359902 -208020 -149994 -265305
4709 -265305 -494958 -659615 -626834 -460864 -291203 -192999 -174981 -191169 -236330 -356801 -513519
4698 -513519 -636723 -706805 -739290 -775644 -802628 -774985 -679703 -559088 -508950 -561496 -606472
4687 -606472 -534515 -409626 -405727 -549801 -694144 -751942 -690451 -520980 -323013 -168698 -119362
4676 -119362 -145080 -143105 -107717 -102655 -92518 -16967 54872 47597 5493 -5030 13517 24533
4664 24533 5981 -88558 -217334 -270945 -255080 -239337 -223946 -220405 -278954 -308715 -221142 -102267
4652 -102267 -53166 -69849 -133988 -266150 -378811 -389437 -321839 -218568 -143457 -138910 -182849
4641 -182849 -255604 -366957 -484999 -546250 -560008 -534927 -445010 -324764 -232451 -144514 -15834
$$ packed form
4719e36010J62215K1693j16251j31168j5146J00616J54149J51882N8026j15311
4709b65305k29653j64657L2781J65970J69661R8204J8018j6188m5161j20471j56718
4698e13519j23204p0082l2485l6354k6984K7643R5282J20615N0138n2546m4976
4687f06472P1957J24889L899j44074j44343n7798O1491J69471J97967J54315M9336
4676a19362k5718J975L5388N062J0137P5551P1839p275m2104j0523J8547J1016
4664B4533j8552r4539j28776n3611J5865J5743J5391L541n8549k9761Q7573J18875
4652a02267M9101j6683o4139j32162j12661j0626O7598J03271P5111M547m3939
4641a82849p2755j11353j18042o1251j3758K5081Q9917J20246R2313Q7937J28680
$$ plain form
4630 -15834 134075 243118 271382 250774 233827 212640 186553 210687 259131 224984 124372
4619 124372 71906 130764 280655 462659 602327 628268 568766 527580 456013 310554 215540
4608 215540 206039 157378 -8947 -197927 -265809 -209639 -95328 34420 118673 159867 205944
4597 205944 260522 304694 322562 322951 277298 178953 118886 136361 133049 83940 48970 68307
4585 68307 127947 198985 261984 279461 241697 152449 87317 87363 174871 376701 580050 663066
4573 663066 674828 689879 667892 629112 643157 676582 642047 510049 350659 217148 83418
4562 83418 -9573 8842 98369 206798 344431 469471 536962 545710 520720 554365 693831
4551 693831 873031 1020264 1101948 1116833 1081909 989428 885999 805568 728497 663431 642847
$$ packed form
4630a5834J49909J09043K8264k0608j6947k1187k6087K4134M8444l4147j00612
4619A24372n2466N8858J49891J82004J39668K5941n9502m1186p1567j45459r5014
4608B15540r501m8661j66325j88980o7882N6170J14311J29748Q4253M1194M6077
4597B05944N4578M4172J7868L89m5653r8345o0067J7475l312m9109l4970J9337
4585F8307N9640P1038O2999J7477l7764q9248o5132M6Q7508K01830K03349Q3016
4573F63066J1762J5051k1987l8780J4045L3425l4535j31998j59390j33511j33730
4562H3418r2991J8415Q9527J08429J37633J25040O7491Q748k4990L3645J39466
4551F93831J79200J47233Q1684J4885l4924r2481j03429q0431p7071o5066k0584
$$ plain form
4540 642847 670907 700704 699167 649369 544883 403800 244898 105796 15803 -70233 -207419
4529 -207419 -355504 -428675 -362444 -216037 -95577 -80929 -175340 -295414 -371099 -400074 -353444
4518 -353444 -216138 -105311 -79427 -40975 44699 70101 -42941 -248369 -423443 -507152 -544485
4507 -544485 -613504 -695970 -666135 -492598 -249388 -14869 141443 196534 195245 182675 133887
4496 133887 39385 -8311 52625 155086 226834 264113 273678 265249 232886 127469 -50285
4485 -50285 -217150 -302633 -319364 -294966 -241561 -171446 -94430 -64990 -108897 -178305 -227018 -239671
4473 -239671 -240303 -228612 -159834 -18224 197365 475397 780223 1025826 1138728 1083694 890245
4462 890245 704879 623083 636448 695634 725625 703656 650263 594501 536466 473401 429614
$$ packed form
4540F42847K8060K9797j537m9798j04486j41083j58902j39102q9993q6036j37186
4529b07419j48085p3171O6231J46407J20460J4648r4411j20074p5685k8975M6630
4518c53444J37306J10827K5884L8452Q5674K5402j13042k05428j75074q3709l7333
4507e44485o9019q2466K9835J73537K43210K34519J56312N5091j289j2570m8788
4496A33887r4502m7696O0936J02461P1748L7279R565q429l2363j05417j77754
4485e0285j66865q5483j6731K4398N3405P0115P7016K9440m3907o9408m8713j2653
4473b39671o32J1691O8778J41610K15589K78032L04826K45603J12902n5034j93449
4462H90245j85366q1796J3365N9186K9991k1969n3393n5762n8035o3065m3787
$$ plain form
4451 429614 417154 411770 352322 239389 119239 22972 -37718 -80135 -167028 -303529 -422772
4440 -422772 -445209 -333026 -193993 -173313 -260205 -324440 -303129 -200300 -90775 -63812 -73401
4429 -73401 -52326 -44706 -100359 -176006 -224787 -201083 -64636 117470 228479 242775 207071
4418 207071 144578 60412 -4657 11824 110549 224834 353108 542845 749315 861814 857439
4407 857439 812450 784555 738385 623121 467406 290904 118468 55670 132298 262984 348466
4396 348466 339979 246076 89689 -39463 -97837 -71809 56850 208602 272642 228119 103368
4385 103368 -18657 -64017 -68701 -99898 -176602 -265779 -348974 -442323 -574163 -700181 -745276
4374 -745276 -698248 -591437 -488071 -435009 -366510 -250471 -148447 -59790 68220 213890
$$ packed form
4451D29614j2460n384n9448j12933j20150r6267o0690m2417q6893j36501j19243
4440d22772k2437J12183J39033K0680q6892o4235K1311J02829J09525K6963r589
4429g3401K1075P620n5653p5647m8781K3704J36447J82106J11009J4296l5704
4418B07071o2493q4166o5069J6481R8725J14285J28274J89737K06470J12499m375
4407H57439m4989k7895m6170j15264j55715j76502j72436o2798P6628J30686Q5482
4396C48466q487r3903j56387j29152n8374K6028J28659J51752O4040m4523j24751
4385A03368j22025m5360m684l1197p6704q9177q3195r3349j31840j26018m5095
4374g45276M7028J06811J03366N3062O8499J16039J02024Q8657J28010J45670
$$ plain form
4364 213890 339374 436762 491251 563171 651093 696657 677232 605597 501011 398224 336679
4353 336679 279805 192803 116900 79852 14325 -106497 -225077 -345124 -535207 -820682 -1122935
4342 -1122935 -1342808 -1434571 -1425591 -1408437 -1395710 -1302556 -1061911 -710594 -386763 -176856 -82942
4331 -82942 -66018 -69477 -45469 -15875 -5704 -6765 13240 60864 123333 193042 239829 281676
4319 281676 354710 446057 513607 506215 427723 305152 184424 148588 158784 88113 -68580
4308 -68580 -219769 -361647 -464548 -431153 -297033 -181196 -131955 -128968 -127919 -144377 -204944
4297 -204944 -260444 -291383 -314678 -338201 -392887 -481063 -536031 -497662 -421843 -378841 -357370 -366860
4285 -366860 -449291 -539051 -524058 -398561 -238841 -101366 -9999 19747 -8390 -81895 -167499
$$ packed form
4364B13890J25484R7388N4489P1920Q7922M5564j9425p1635j04586j02787o1545
4353C36679n6874q7002p5903l7048o5527j20822j18580j20047j90083k85475l02253
4342a122935k19873r1763Q980J7154J2727R3154K40645L51317L23831K09907R3914
4331h2942J6924l459K4008K9594J0171j061K0005M7624O2469O9709M6787M1847
4319B81676P3034R1347O7550p392p8492j22571j20728l5836J0196p0671j56693
4308f8580j51189j41878j02901L3395J34120J15837M9241K987J049j6458o0567
4297b04944n5500l0939k3295k3523n4686q8176n4968L8369P5819M3002K1471r490
4285c66860q2431q9760J4993J25497J59720J37475R1367K9746k8137p3505q5604
$$ plain form
4274 -167499 -230392 -314986 -421137 -480692 -459509 -390510 -341870 -293116 -192893 -54389 33951
4263 33951 26135 -29857 -124124 -257765 -346309 -319061 -227563 -108008 -25904 -34711 -71384 -86753
4251 -86753 -68541 13901 173680 345182 409872 347544 227855 123212 107503 234163 495175
4240 495175 769411 911449 914578 806744 624131 456114 395921 425257 473521 573394 715599
4229 715599 823890 875453 855064 730837 520385 305666 139984 -8345 -126468 -194389
4219 -194389 -228674 -260499 -331873 -418205 -473296 -495252 -502757 -468377 -341586 -165047 -13802
4208 -13802 82098 126543 132774 111698 114859 199778 330186 431799 444704 369867 258740 180623
4196 180623 149304 114123 111097 173219 214039 170256 67837 -49569 -158366 -243400 -279979
$$ packed form
4274a67499o2893q4594j06151n9555K1183O8999M8640M8754J00223J38504Q8340
4263C3951p816n5992r4267j33641q8544K7248R1498J19555Q2104q807l6673j5369
4251h6753J8212Q2442J59779J71502O4690o2328j19689j04643j5709J26660K61012
4240D95175K74236J42038L129j07834j82613j68017o0193K9336M8264R9873J42205
4229G15599J08291N1563k0389j24227k10452k14719j65682j48329j18123o7921
4219a94389l4285l1825p1374q6332n5091k1956p505L4380J26791J76539J51245
4208a3802R5900M4445O231k1076L161Q4919J30408J01613J2905p4837j11127p8117
4196A80623l1319l5181l026O2122M0820m3783j02419j17406j08797q5034l6579
$$ plain form
4185 -279979 -219344 -55493 112608 191625 214202 251216 240226 87887 -159917 -371556 -496610
4174 -496610 -594756 -724147 -825401 -865880 -881799 -853838 -795833 -773880 -783924 -807151 -834503
4163 -834503 -791384 -655007 -508838 -382798 -248190 -125983 -48166 29180 126729 185273 173331
4152 173331 123287 91538 60764 3501 -51631 -128252 -262254 -392059 -495413 -591565 -655582
4141 -655582 -684389 -682683 -653584 -640960 -671952 -723011 -758764 -746841 -706169 -669164 -623584 -538231
4129 -538231 -432713 -361582 -328425 -298213 -253009 -173229 -119943 -192307 -368017 -535027 -575283
4118 -575283 -489928 -359560 -223247 -96211 -8328 21204 16534 -22012 -117329 -272169 -439664
4107 -439664 -577460 -647617 -648411 -650905 -676422 -685027 -687718 -708519 -692533 -612952 -537031 -533536 -557581
$$ packed form
4185b79979O0635J63851J68101P9017K2577L7014j0990j52339k47804k11639j25054
4174d96610r8146j29391j01254m0479j5919K7961N8005K1953j0044k3227k7352
4163h34503M3119J36377J46169J26040J34608J22207P7817P7346R7549N8544j1942
4152A73331n0044l1749l0774n7263n5132p6621j34002j29805j03354r6152o4017
4141f55582k8807J706K9099J2624l0992n1059l5753J1923M0672L7005M5580Q5353
4129e38231J05518P1131L3157L0212M5204P9780N3286p2364j75710j67010m0256
4118e75283Q5355J30368J36313J27036Q7883K9532m670l8546r5317j54840j67495
4107d39664j37796p0157p94k494k5517q605k691k0801J5986P9581P5921L495k4045
$$ plain form
4094 -557581 -540061 -567432 -678912 -757412 -760287 -731454 -682707 -589990 -441560 -289707 -167351
4083 -167351 -52999 49118 82333 38856 18114 94198 206298 198505 53594 -61056 -23783
4072 -23783 107576 253951 360395 345069 194648 24575 -115252 -289415 -462620 -555929
4062 -555929 -576186 -536053 -446543 -371107 -310439 -184718 25957 222579 290477 257111 213882
4051 213882 211376 240175 242642 159498 -7513 -124087 -54720 132356 270947 345123 431139
4040 431139 532782 603672 607935 536871 404340 270856 215236 198219 150636 108187 115168
4029 115168 150881 160347 115280 41120 -17680 -20107 60960 193548 327169 407911 452330 499030
4017 499030 524992 529606 563542 646954 733740 812988 905852 995354 1032221 968741 838549 746138
$$ packed form
4094e57581J7520k7371j11480p8500k875K8833M8747R2717J48430J51853J22356
4083a67351J14352J02117L3215m3477k0742P6084J12100p793j44911j14650L7273
4072b3783J31359J46375J06444j5326j50421j70073j39827j74163j73205r3309
4062e55929k0257M0133Q9510P5436O0668J25721K10675J96622O7898l3366m3229
4051B13882k506K8799K467q3144j67011j16574O9367J87076J38591P4176Q6016
4040D31139J01643P0890M263p1064j32531j33484n5620j7017m7583m2449O981
4029A15168L5713R466m5067p4160n8800k427Q1067J32588J33621Q0742M4419M6700
4017D99030K5962M614L3936Q3412Q6786P9248R2864Q9502L6867o3480j30192r2411
$$ plain form
4005 746138 723686 709451 630581 485358 315332 114752 -116160 -319660 -459865 -492861
3995 -492861 -419340 -263519 -51519 187357 408666 501368 436159 284642 118520 -32302
3985 -32302 -165598 -245776 -266935 -271232 -281398 -269406 -179669 -73746 -17984 12935 56294 104406
3973 104406 126661 157158 259884 402159 506222 503065 379054 218366 111002 94296 151382
3962 151382 231335 245110 171409 68808 -14612 -54227 -65295 -54926 -31400 -46708 -124574
3951 -124574 -195076 -219464 -223178 -190984 -124499 -96729 -132062 -155550 -107434 -6614 81568 95710
3939 95710 22387 -105762 -225162 -297138 -319136 -287608 -228138 -174259 -162242 -222150 -339962
3928 -339962 -474862 -553360 -496839 -324571 -129861 6475 9403 -112912 -296036 -465876
$$ packed form
4005G46138k2452j4235p8870j45223j70026k00580k30912k03500j40205l2996
3995d92861P3521J55821K12000K38876K21309R2702o5209j51517j66122j50822
3985c2302j33296q0178k1159m297j0166J1992Q9737J05923N5762L0919M3359M8112
3973A04406K2255L0497J02726J42275J04063l157j24011j60688j07364j6706N7086
3962A51382P9953J3775p3701j02601q3420l9615j1068J0369K3526j5308p7866
3951a24574p0502k4388l714L2194O6485K7770l5333k3488M8116J00820Q8182J4142
3939I5710p3323j28149j19400p1976k1998L1528N9470N3879J2017n9908j17812
3928c39962j34900p8498N6521J72268J94710J36336K928j22315j83124j69840
$$ plain form
3918 -465876 -552694 -482852 -275038 -96375 -56554 -108752 -154890 -142524 -93454 -85564 -161097
3907 -161097 -272294 -357757 -371230 -308867 -225532 -149146 -88567 -16692 126697 288490 336761
3896 336761 271549 192182 146002 101759 25721 -65692 -109106 -97873 -29993 102746 219896
3885 219896 227192 141147 13661 -128856 -259045 -352627 -394292 -395951 -385317 -397961 -473495
3874 -473495 -596506 -721179 -779919 -698194 -506421 -332379 -267732 -273908 -269212 -238572 -232907
3863 -232907 -294715 -451288 -709355 -942808 -1029053 -992136 -872704 -752800 -712372 -710343 -687896
3852 -687896 -643653 -564467 -408162 -206180 -29839 78446 69818 -11216 -70939 -68777 33692
3841 33692 203296 310074 243826 11014 -273902 -520575 -668912 -732635 -779116 -811755 -792057
$$ packed form
3918d65876q6818O9842K07814J78663L9821n2198m6138J2366M9070P890p5533
3907a61097j11197q5463j3473O2363Q3335P6386O0579P1875J43389J61793M8271
3896C36761o5212p9367m6180m4243p6038r1413m3414J1233O7880J32739J17150
3885B19896P296q6045j27486j42517j30189r3582m1665j659J0634j2644p5534
3874d73495j23011j24673n8740Q1725J91773J74042O4647o176M696L0640N665
3863b32907o1808j56573k58067k33453q6245L6917J19432J19904M0428K029K2447
3852f87896M4243P9186J56305K01982J76341J08285q628q1034n9723K162J02469
3841C3692J69604J06778o6248k32812k84916k46673j48337o3723m6481l2639J9698
$$ plain form
3830 -792057 -715636 -622394 -551669 -529835 -550111 -607477 -650059 -561811 -310262 14752 305310
3819 305310 490354 551413 483844 311897 105686 -70612 -176599 -230926 -266245 -293568 -284240
3808 -284240 -211665 -91181 56460 185127 190393 -2331 -310904 -634053 -917627 -1107418
3798 -1107418 -1187489 -1174326 -1063626 -921600 -841747 -808166 -812498 -831048 -860564 -876810 -815505
3787 -815505 -701613 -616622 -603141 -642048 -628413 -498670 -314446 -158143 -102080 -166150 -300792
3776 -300792 -413775 -461140 -469756 -486794 -482935 -368781 -179042 -32023 27309 94700 217968
3765 217968 321477 350233 330853 360525 484696 604147 631635 620484 622806 610145 538441
3754 538441 401392 249287 133543 65222 43957 61598 69832 47883 51893 135594 214625
$$ packed form
3830g92057P6421R3242P0725K1834k0276n7366m2582Q8248K51549L25014K90558
3819C05310J85044O1059o7569j71947k06211j76298j05987n4327l5319k7323R328
3808b84240P2575J20484J47641J28667N266j92724l08573l23149k83574j89791
3798a107418q0071J3163J10700J42026P9853L3581m332j8550k9516j6246O1305
3787h15505J13892Q4991J3481l8907J3635J29743J84224J56303N6063o4070j34642
3776c00792j12983m7365q616j7038L859J14154J89739J47019N9332O7391J23268
3765B17968J03509K8756j9380K9672J24171J19451K7488j1151K322j2661p1704
3754E38441j37049j52105j15744o8321k1265J7641Q234k1949M010Q3701P9031
$$ plain form
3743 214625 201179 126492 -32700 -279392 -499953 -631618 -721570 -810216 -873267 -877905 -838560
3732 -838560 -830746 -897235 -953351 -921997 -870495 -911067 -1007280 -1036229 -938994 -724819 -488854
3721 -488854 -327410 -258314 -234997 -186855 -144158 -170786 -223976 -205761 -115619 -48785 -45576 -71678
3709 -71678 -66801 -2036 59149 130100 264221 421161 514275 512291 488606 500750 520585 501849
3697 501849 457519 386545 261143 149334 129878 198520 292912 336883 310561 271806 299381
3686 299381 388135 450857 459885 451858 426611 355883 219719 27347 -145926 -229357 -210783
3675 -210783 -109318 -7137 32321 18234 -43141 -119411 -147943 -84657 3045 39937 26756
3664 26756 -9748 -31107 -47227 -99166 -172784 -198604 -149833 -95737 -82184 -109357 -145395 -130768
$$ packed form
3743B14625j3446p4687j59192k46692k20561j31665q9952q8646o3051m638L9345
3732h38560P814o6489n6116L1354N1502m0572r6213k8949R7235K14175K35965
3721d88854J61444O9096K3317M8142M2697k6628n3190J8215R0142O6834L209k6102
3709g1678M877O4765O1185P0951J34121J56940R3114j984k3685J2144J9835j8736
3697E01849m4330p0974j25402j11809j9456O8642R4392M3971k6322l8755K7575
3686B99381Q8754O2722R028q027k5247p0728j36164j92372j73273q3431J8574
3675b10783J01465J02181L9458j4087o1375p6270k8532O3286Q7702L6892j3181
3664B6756l6504k1359j6120n1939p3618k5820M8771N4096J3553k7173l6038J4627
$$ plain form
3652 -130768 -46027 54235 51778 -82514 -237129 -310937 -290205 -243981 -261975 -321697 -350102
3641 -350102 -394985 -526536 -689690 -771948 -776376 -748763 -707379 -699044 -695882 -600605 -426125 -239806
3629 -239806 -122595 -112699 -168814 -200334 -138736 -23063 72360 125742 176466 237747 297666
3618 297666 349171 331521 178271 -44066 -175217 -142286 -32767 75901 158530 180467 134649
3607 134649 -16723 -273994 -544331 -741970 -817404 -781474 -666618 -483565 -256740 -67490
3597 -67490 25545 47196 41302 31940 22667 13024 1328 -2073 -19410 -109842 -278317 -481414
3585 -481414 -619582 -602696 -473802 -346335 -289049 -281074 -259247 -204034 -144217 -134300 -193871
3574 -193871 -260396 -303083 -335513 -317173 -238639 -160593 -133390 -122368 -105645 -77776 -33449 -7082
$$ packed form
3652a30768Q4741J00262k457j34292j54615p3808K0732M6224j7994n9722k8405
3641c50102m4883j31551j63154q2258m428K7613M1384Q335L162R5277J74480J86319
3629b39806J17211R896n6115l1520O1598J15673R5423N3382N0724O1281N9919
3618B97666N1505j7650j53250k22337j31151L2931J09519J08668Q2629K1937m5818
3607A34649j51372k57271k70337j97639p5434L5930J14856J83053K26825J89250
3597f7490R3035K1651n894r362r273r643j1696l401j7337r0432j68475k03097
3585d81414j38168J6886J28894J27467N7286P975K1827N5213N9817R917n9571
3574a93871o6525m2687l2430J8340P8534P8046K7203J1022J6723K7869M4327K6367
$$ plain form
3562 -7082 -13888 9937 74465 96521 56874 -6745 -93792 -172467 -196463 -177741 -161274 -165769
3550 -165769 -170060 -150887 -133699 -126930 -66468 81253 268383 392681 380578 298265 243221
3539 243221 191462 136639 91134 23740 -85996 -193893 -242560 -243315 -246581 -259551 -239056 -141158
3527 -141158 41328 232816 370274 483266 568885 620322 656021 700059 737571 738528 707105
3516 707105 639848 521091 362761 189302 74929 125674 274932 387665 407133 371173
3506 371173 365104 474500 679781 850587 907093 889825 857434 821377 766388 681979 582331
3495 582331 464476 336174 251295 257830 333914 398549 410737 410563 384957 268733 126937
3484 126937 92217 153952 205652 218144 151041 -31624 -217706 -266639 -199676 -109249 -34752
$$ packed form
3562g082o806K3825O4528K2056l9647o3619q7047p8675k3996J8722J6467m495
3550a65769m291J9173J7188O769O0462J47721J87130J24298j2103q2313n5044
3539B43221n1759n4823m5505o7394j09736j07897m8667p55l266j2970K0495R7898
3527a41158J82486J91488J37458J12992Q5619N1437L5699M4038L7512R57l1423
3516G07105o7257j18757j58330j73459j14373N0745J49258J12733J9468l5960
3506C71173o069J09396K05281J70806N6506j7268l2391l6057n4989q4409r9648
3495E82331j17855j28302q4879O535P6084O4635J2188j74k5606j16224j41796
3484A26937l4720O1735N1700J2492o7103j82665j86082m8933O6963R0427P4497
$$ plain form
3473 -34752 -38004 -107613 -122160 2220 248001 463084 443263 178065 -183796 -515910 -697388
3462 -697388 -689169 -611673 -582240 -635348 -758930 -865490 -894100 -894589 -922717 -995491 -1084371 -1100244
3450 -1100244 -1008284 -859069 -723566 -649787 -674537 -765084 -809488 -725486 -543881 -333240 -165180
$$ packed form
3473c4752l252o9609j4547J24380K45781K15083j9821k65198l61861l32114j81478
3462f97388Q219P7496K9433n3108j23582j06560k8610m89k8128p2774q8880j5873
3450a100244R1960J49215J35503P3779k4750r0547m4404Q4002J81605K10641J68060
$$ [...]
##END NTUPLES=NMR SPECTRUM
##END=
