##TITLE=C13_Pr 5148
 CDcl3, 21800 sc

 21.9.2022
##JCAMPDX= 6.0         $$ Bruker NMR JCAMP-DX V2.0
##DATA TYPE= NMR SPECTRUM
##DATA CLASS= NTUPLES
##ORIGIN= UXNMR, Bruker Analytische Messtechnik GmbH
##OWNER= root
$$ XWIN-NMR		Version 3.5
$$ Thu Sep 22 13:29:43 2022 Russian Standard Time (UT+4h)  she@DPX200
##.OBSERVE FREQUENCY= 50.327896
##.OBSERVE NUCLEUS= ^13C
##.ACQUISITION MODE= SIMULTANEOUS
##.ACQUISITION SCHEME= undefined
##.AVERAGES= 21801
##.DIGITISER RES= 17
##SPECTROMETER/DATA SYSTEM= spect
##.PULSE SEQUENCE= zgpg30
##.SOLVENT NAME= DMSO
##.SHIFT REFERENCE= (INTERNAL, DMSO, 0, 222.653)
##AUDIT TRAIL= $$ (NUMBER, WHEN, WHO, WHERE, WHAT)
$$ ##TITLE= Audit trail, XWIN-NMR		Version 3.5
$$ ##JCAMPDX= 5.01
$$ ##ORIGIN= Bruker BioSpin GmbH
$$ ##OWNER= she
$$ F:/spectra/data/she/nmr/c13/1/pdata/1/auditp.txt
$$ ##AUDIT TRAIL=  $$ (NUMBER, WHEN, WHO, WHERE, WHAT)
(   1,<2022-09-22 13:15:41.54 +0400>,<she>,<DPX200>,
      <created by zg, POWCHK disabled, PULCHK disabled
       terminated by command 'halt'
       configuration hash MD5:
       00 E9 B6 7A A2 85 ED C7 34 08 36 98 17 FE 4E 26
       data hash MD5: 32K
       64 41 42 FC 06 25 C7 18 2A B2 01 FF FB 4A 46 4A>)
(   2,<2022-09-22 13:15:43.78 +0400>,<she>,<DPX200>,
      <Start of raw data processing
       efp BC_mod = 2 LB = 1 FT_mod = 6 PKNL = 1 PHC0 = -319.6501 PHC1 = 45.48469 SI = 32K 
       data hash MD5: 32K
       17 71 85 6F AE CA 66 36 9F 9E BF A1 6C 2C 78 3B>)
(   3,<2022-09-22 13:28:09.03 +0400>,<she>,<DPX200>,
      <pk PHC0 = 8.953201 PHC1 = -21.2 
       data hash MD5: 32K
       A2 BE B4 7E 61 1C 6E 5E C7 E9 4D 3E 51 E9 9D 3D>)
(   4,<2022-09-22 13:28:14.50 +0400>,<she>,<DPX200>,
      <abs ABSG = 5 
       data hash MD5: 32K
       82 B1 BB E8 8A 7A FC F9 7A B5 F6 D4 7B 69 01 61>)
$$ ##END=
$$ 
$$ hash MD5
$$ 4F 17 91 6B F3 45 94 43 34 6F AA DD 38 2F 02 9A
##$RELAX= 
##$RELAX= 
##$RELAX= 
##$RELAX= 
##$RELAX= 
##$RELAX= 
##$RELAX= 
##$RELAX= 
$$ Bruker specific parameters
$$ --------------------------
##$DU= <F:/spectra>
##$EXPNO= 1
##$NAME= <c13>
##$PROCNO= 1
##$TYPE= <nmr>
##$USER= <she>
##$AMP= (0..31)
100 100 100 100 100 100 100 100 100 100 100 100 100 100 100 100 100 100 
100 100 100 100 100 100 100 100 100 100 100 100 100 100 
##$AQSEQ= 0
##$AQ_mod= 1
##$AUNM= <au_zg>
##$AUTOPOS= <>
##$BF1= 50.322709
##$BF2= 200.13
##$BF3= 50.322709
##$BF4= 500.13
##$BF5= 500.13
##$BF6= 500.13
##$BF7= 500.13
##$BF8= 500.13
##$BYTORDA= 1
##$CFDGTYP= 0
##$CFRGTYP= 5
##$CHEMSTR= <none>
##$CNST= (0..31)
1 1 145 1 1 1 1 1 1 1 1 1 1 1 1 1 1 1 1 1 1 1 1 1 1 1 1 1 1 1 1 1 
##$CPDPRG= <waltz16>
##$CPDPRG1= <>
##$CPDPRG2= <waltz16>
##$CPDPRG3= <>
##$CPDPRG4= <mlev>
##$CPDPRG5= <mlev>
##$CPDPRG6= <mlev>
##$CPDPRG7= <mlev>
##$CPDPRG8= <mlev>
##$CPDPRGB= <>
##$CPDPRGT= <>
##$D= (0..31)
0 2 0.00345 0 0 0 0 0 0 0 0 0.03 2e-05 3e-06 0 0 0 0 0 0 0 0 0 0 0 0 0 
0 0 0 0 0 
##$DATE= 1663763722
##$DBL= (0..7)
120 120 120 120 120 120 120 120 
##$DBP= (0..7)
150 150 150 150 150 150 150 150 
##$DBP07= 0
$$ [...]
##$SUBNAM4= <"">
##$SUBNAM5= <"">
##$SUBNAM6= <"">
##$SUBNAM7= <"">
##$SUBNAM8= <"">
##$SUBNAM9= <"">
##$SW= 239.972175391363
##$SWIBOX= (0..15)
0 1 3 0 0 0 0 0 0 0 0 0 0 0 0 0 
##$SW_h= 12077.2946859903
##$TD= 32768
##$TD0= 1
##$TE= 0
##$TE2= 300
##$TE3= 300
##$TEG= 300
##$TL= (0..7)
120 120 120 120 120 120 120 120 
##$TP= (0..7)
150 150 150 150 150 150 150 150 
##$TP07= 0
##$TPNAME0= <>
##$TPNAME1= <>
##$TPNAME2= <>
##$TPNAME3= <>
##$TPNAME4= <>
##$TPNAME5= <>
##$TPNAME6= <>
##$TPNAME7= <>
##$TPOAL= (0..7)
0.5 0.5 0.5 0.5 0.5 0.5 0.5 0.5 
##$TPOFFS= (0..7)
0 0 0 0 0 0 0 0 
##$TUNHIN= 0
##$TUNHOUT= 0
##$TUNXOUT= 0
##$USERA1= <user>
##$USERA2= <user>
##$USERA3= <user>
##$USERA4= <user>
##$USERA5= <user>
##$V9= 5
##$VALIST= <valist>
##$VCLIST= <CCCCCCCCCCCCCCC>
##$VD= 0
##$VDLIST= <DDDDDDDDDDDDDDD>
##$VPLIST= <PPPPPPPPPPPPPPP>
##$VTLIST= <TTTTTTTTTTTTTTT>
##$WBST= 1024
##$WBSW= 4
##$XGAIN= (0..3)
0 0 0 0 
##$XL= 0
##$YL= 0
##$YMAX_a= 158758392
##$YMIN_a= -54057244
##$ZGOPTNS= <>
##$ZL1= 120
##$ZL2= 120
##$ZL3= 120
##$ZL4= 120
##$ABSF1= 222.6533
##$ABSF2= -17.34351
##$ABSG= 5
##$ABSL= 3
##$ALPHA= 0
##$AQORDER= 0
##$ASSFAC= 0
##$ASSFACI= 0
##$ASSFACX= 0
##$ASSWID= 0
##$AUNMP= <proc_1d>
##$AZFE= 0.1
##$AZFW= 0.5
##$BCFW= 0
##$BC_mod= 2
##$BYTORDP= 0
##$COROFFS= 0
##$CY= -3
##$DATMOD= 1
##$DC= 0
##$DFILT= <>
##$DTYPP= 0
##$F1P= 0
##$F2P= 0
##$FCOR= 0.5
##$FTSIZE= 32768
##$FT_mod= 6
##$GAMMA= 0
##$GB= 0
##$INTBC= 1
##$INTSCL= 4.134877e-10
##$ISEN= 128
##$LB= 1
##$LEV0= 0
##$LPBIN= 0
##$MAXI= 10000
##$MC2= 0
##$MEAN= 0
##$ME_mod= 0
##$MI= 0.1934396
##$NCOEF= 0
##$NC_proc= 4
##$NLEV= 6
##$NOISF1= 120.0001
##$NOISF2= 80.00006
##$NSP= 0
##$NTH_PI= 0
##$NZP= 0
##$OFFSET= 222.6533
##$PC= 1.4
##$PHC0= -310.6969
##$PHC1= 24.28469
##$PH_mod= 1
##$PKNL= yes
##$PPARMOD= 0
##$PSCAL= 0
##$PSIGN= 0
##$REVERSE= no
##$SF= 50.322730123286
##$SI= 32768
##$SIGF1= 140
##$SIGF2= 120
##$SINO= 11.81781
##$SIOLD= 32768
##$SREGLST= <13C.CDCl3>
##$SSB= 0
##$STSI= 32768
##$STSR= 0
##$SW_p= 12077.2946859903
##$SYMM= 0
##$S_DEV= 0
##$TDeff= 32768
##$TDoff= 0
##$TI= <>
##$TILT= no
##$TM1= 0
##$TM2= 0
##$TOPLEV= 0
##$USERP1= <user>
##$USERP2= <user>
##$USERP3= <user>
##$USERP4= <user>
##$USERP5= <user>
##$WDW= 1
##$XDIM= 32768
##$YMAX_p= 338134936
##$YMIN_p= -650588
$$ End of Bruker specific parameters
$$ ---------------------------------
##NTUPLES= NMR SPECTRUM
##VAR_NAME=  FREQUENCY,     SPECTRUM/REAL,   SPECTRUM/IMAG
##SYMBOL=    X,             R,               I
##VAR_TYPE=  INDEPENDENT,   DEPENDENT,       DEPENDENT
##VAR_FORM=  AFFN,          ASDF,            ASDF
##VAR_DIM=   32768,         32768,           32768
##UNITS=     HZ,            ARBITRARY UNITS, ARBITRARY UNITS
##FACTOR=    0.368581032318806, 1,           1
##FIRST=     11204.5221812756, 0,            0
##LAST=      -872.772504714734, 0,           0
##MIN=       -872.772504714734, -650588,     0
##MAX=       11204.5221812756, 338134936,    0
$$ Real data points
##PAGE= N=1
##DATA TABLE= (X++(R..R)), XYDATA
$$ [...]
22656a7367r0012m6443K760J3505k4217m8165J6844L4406K842J746L7400K8569
$$ -17367 -107379 -153822 -151062 -137557 -161774 -209939 -193095 -158689 -155847 -154101 -116701 -88132
22644h8132q5491r9037J18470J68398R0680J46421N4747k1214p6416j82962p1589
$$ -88132 -173623 -272660 -154190 14208 104888 251309 306056 284842 208426 25464 -46125
22633d6125O0310J6795l2210p1762K3844J02902o8360k6065l750k8892J1000J1177
$$ -46125 14185 30980 -1230 -72992 -49148 53754 -14606 -40671 -44421 -73313 -62313 -51136
22621e1136j07434q2371J34830P5955J6831m0483j4001R4626J30682N1128q7626
$$ -51136 -158570 -240941 -106111 -30156 -13325 -53808 -67809 26817 157499 208627 121001
22610A21001j03195J5812R9515N1921K1220r8308j80187j6713N643L1956M5088
$$ 121001 17806 33618 133133 185054 206274 107966 -72221 -88934 -83291 -51335 -6247
22599f247j0863R4717Q7722m1051j5350j2314m1325o0984Q15j1056j3944O7944
$$ -6247 -17110 77607 165329 124278 108928 96614 55289 -5695 -4880 -15936 -29880 38064
22587C8064o563n4515j5056J3515K2660J5593l4564k4037J3823P4557R1640P960
$$ 38064 31501 -23014 -38070 -24555 -1895 13698 -20866 -44903 -31080 43477 135117 143077
22575A43077k5918k3838o4125o7169k2222M7472N0619M1134M7667K3818L7837
$$ 143077 117159 93321 29196 -37973 -60195 -12723 37896 79030 126697 150515 188352
22564A88352m0012j55883r3909R8514J00724K8599l1924l1408J8309P753O3270
$$ 188352 148340 -7543 -101452 -2938 97786 126385 94461 63053 81362 89115 152385
22553A52385P6462M7184K1721j21185j04264l1921N863k4581j14666m2167J63540
$$ 152385 228847 276031 297752 176567 72303 40382 46245 21664 -93002 -135169 28371
22542B8371J80263M9669r2774j59970k8593q9670j18180L1585R0425O6285O732
$$ 28371 208634 258303 165529 5559 -23034 -112704 -230884 -199299 -108874 -42589 -35857
22531c5857K210M1225O7118M9384q2574j65247j15013j10261l6121R0961J00526
$$ -35857 -33647 7578 74696 124080 41506 -123741 -238754 -349015 -385136 -294175 -193649
22520a93649P981M0146J37166K7718l5939o0811j06960n3139L6834L4178O5461
$$ -193649 -185668 -145522 -8356 19362 -16577 -77388 -184348 -237487 -200653 -166475 -101014
22509a01014N4513N7361N017K5287M4977k8040J5863J8715j9877l3626o0831p1295
$$ -101014 -46501 10860 15877 41164 86141 58101 73964 92679 72802 39176 -21655 -92950
22497i2950M259M5768N2779M0698J066r3076o9462l6651k7819Q7927J36325l430
$$ -92950 -88691 -42923 9856 50554 51620 -41456 -110918 -147569 -175388 -87461 48864 45434
22485D5434j03504q1129O978K7185j9108j032P8128N8420O3980J23244J07805
$$ 45434 -58070 -139199 -132221 -105036 -124144 -125176 -47048 11372 75352 198596 306401
22474C06401j691o6170p6821m0083k0160l0315m9620J1885m7709n1908J4785O8480
$$ 306401 304710 238540 161719 121636 101476 71161 21541 33426 -14283 -66191 -51406 17074
22462A7074J01896j1002N0099L1017l315M5524k8975o1085l2985l8090L9395J7428
$$ 17074 118970 107968 158067 189084 185769 231293 202318 141233 108248 70158 109553 126981
22450A26981L6521O7682o707J6921J6780j25755j06868l5349k9034j8440J9095
$$ 126981 163502 231184 224477 241398 258178 132423 25555 -9794 -38828 -57268 -38173
22439c8173j1484q0099j09051k380k5948l5300L7589l4437K3805K0218J07571
$$ -38173 -49657 -129756 -238807 -241187 -267135 -302435 -264846 -299283 -275478 -255260 -147689
22428a47689R8834O9148L6018r3518k04438j02634R0970J45927J9446K537R8288
$$ -147689 -48855 20293 56311 -37207 -241645 -344279 -253309 -107382 -87936 -85399 12889
22417A2889R1684P321n2306p2499j52782n8596M7581Q238R071r5102j1507J34617
$$ 12889 104573 111894 59588 -12911 -165693 -224289 -176708 -168470 -159399 -254501 -266008 -131391
22405a31391P0751P984k0545m167J34598K02879J21392L2071j8747M2925J15871
$$ -131391 -60640 -52656 -73201 -77368 57230 260109 381501 413572 394825 437750 553621
22394E53621J13061j17m5583n9686J1995R3569J12671J97377L58561L85725L17591
$$ 553621 666682 666565 620982 561296 573291 666860 779531 976908 1335469 1721194 2038785
22383B038785N9208l14362m83600m35098k84170o4909N9314O2199J54890K12426
$$ 2038785 2097993 1783631 1300031 864933 580763 515854 575168 637367 792257 1004683
22373A004683Q7991M0243l6146j09168q8086j64548r3444P1289M7952J884J27628
$$ 1004683 1092674 1132917 1096771 987603 899517 734969 641525 712814 760766 762650 890278
22362H90278K90040L75821L73535J01548k54336m50656m44597k95266j52656j14953
$$ 890278 1180318 1556139 1929674 2031222 1776886 1326230 881633 586367 433711 318758
22352C18758J8335K4175k4515l4261J6489Q5178r1822j27848O0938P5748M2178
$$ 318758 337093 361268 336753 302492 318981 404159 312337 184489 245427 321175 363353
22341C63353r8392j15812k2831J4284n5931k7307R9176Q6348o6180q0642J7298
$$ 363353 264961 149149 126318 140602 84671 57364 156540 242888 176708 96066 113364
22330A13364N4140K8984M5252N2558P5988J7596k0240m4615q7709m8198J39558
$$ 113364 167504 196488 241740 294298 370286 387882 367642 323027 235318 187120 326678
22319C26678Q3415N4333J7266m6342N5236L1727l8038j60194j14770O069k847
$$ 326678 410093 464426 481692 435350 490586 522313 484275 324081 209311 215380 212533
22308B12533m3292K0706Q8195l6902o1672l2185n7768J4P1597Q4441Q0722M6162
$$ 212533 169241 189947 278142 241240 179568 147383 89615 89629 161226 245667 326389 372551
22296C72551q2526j13140k2699O2671J68603J09134K3903L8718L1598R757j4179
$$ 372551 290025 176885 154186 216857 385460 494594 518497 557215 588813 598570 584391
22285E84391Q3761Q3865J21204K23077J95405J9803j65754m5926n465j79397k42338
$$ 584391 668152 752017 873221 1096298 1291703 1311506 1145752 1099826 1094361 914964 672626
22274F72626k25839k22363j23572n4491m2533j0781p6002M2023J00620K4579j4086
$$ 672626 446787 224424 100852 46361 3828 -6953 -82955 -40932 59688 84267 70181
22263G0181l4661j1269O5168j0329L4939N9465o9392j02424n7557m1898k9896
$$ 70181 35520 24251 89419 79090 114029 173494 104102 1678 -55879 -97777 -127673
22252a27673j0729J0362M0045n0773q2893K0786O7083N1586L0497K3596o1392
$$ -127673 -138402 -128040 -87995 -138768 -221661 -200875 -133792 -82206 -51709 -28113 -89505
22241h9505k9373J0466m4870L199l0336m6401O3331J25735J00310R0525Q2706
$$ -89505 -118878 -108412 -153282 -150083 -180419 -226820 -163489 -37754 62556 153081 235787
22230B35787R0114Q6650n5135j48581j12415k426O0889P2396J8523m5732r739
$$ 235787 325901 412551 357416 208835 96420 93994 154883 227279 245802 200070 190331
22219A90331l035R0665K13722J99878J88036K31609M45067M17917j06268m82339
$$ 190331 187296 277961 491683 691561 879597 1111206 1556273 1974190 1867922 1385583
22209A385583l26586k39770j37603j40285j44469j50204j77798l8182N8068Q461
$$ 1385583 1058997 819227 681624 541339 396870 246666 68868 30686 88754 97215
22199I7215n984M377m0100q7585K4191K2719K0993R7775P1617K3568j11881r7624
$$ 97215 91231 95608 55508 -32077 -7886 14833 35826 133601 205218 228786 116905 19281
22187A9281J9591O8658m5719N1751L7464j17606j7596M7028j6679K3379l2329
$$ 19281 38872 107530 61811 113562 151026 33420 15824 62852 46173 69552 37223
22176C7223j28025p4487K0690J29194Q6151p2021o4333o4423p318M2846O428P426
$$ 37223 -90802 -165289 -144599 -15405 70746 -1275 -65608 -130031 -137349 -94503 -88075 -80649
22164h0649J2896L156M1073R1183J04610k1564m4335n2159l6210K5961J3539N3187
$$ -80649 -67753 -64597 -23524 67659 172269 150705 106370 54211 18001 43962 57501 110688
22152A10688M6475N9044L5697o7458p0762q8403p2276k4938m6610J0399L6810
$$ 110688 157163 216207 251904 184446 113684 25281 -46995 -71933 -118543 -108144 -71334
22141g1334M1359P5802J01731J13902J4139l6202j19120j39890j6856j3954k8397
$$ -71334 -29975 45827 147558 261460 275599 239397 120277 -19613 -36469 -50423 -78820
22130g8820r4244k9292Q3050j9960q3940j2961K5907J28257J13860o946N2808
$$ -78820 -173064 -202356 -119306 -139266 -223206 -236167 -210260 -82003 31857 24911 77719
22119G7719K8899R858P328L204J5075m3978j8290l3171p8820r676N6195P2727
$$ 77719 106618 116476 123804 127008 142083 98105 79815 46644 -32176 -41852 14343 87070
22107H7070P4949N3275N6196J19893R4305K07927M67859J53863l01405l00924
$$ 87070 162019 215294 271490 391383 485688 693615 1161474 1315337 1013932 713008
22097G13008r7652p9281q6522n1781J7876K6540r6527j02386j2730o9809n7791
$$ 713008 615356 536075 449553 397772 415648 442188 345661 243275 230545 160736 102945
22086A02945O3896J04466n5130j63197j00657Q137Q892j14574N0554J45663l9469
$$ 102945 166841 271307 216177 52980 -47677 -39540 -30648 -145222 -94668 50995 11526
22075A1526r962R5527N8456q2401m6459r8327k6427N3830N1508o8642k30638j13372
$$ 11526 1564 97091 155547 73146 26687 -71640 -98067 -44237 7271 -61371 -292009 -405381
22063d05381K23093K54347J7186j27101r3487j9919P2108R8339K8902J4746o9454
$$ -405381 -182288 72059 89245 -37856 -131343 -151262 -79154 19185 48087 62833 -6621
22052f621o5100P3358R772j0866J58564l90j58182m3836N0870L0689L8226P692
$$ -6621 -71721 1637 11409 543 159107 158717 535 -43301 7569 38258 76484 84176
22040H4176l3002L5911n2178p0157l9224K7809J28328Q9710J5491l5548L5255
$$ 84176 51174 87085 34907 -35250 -74474 -46665 81663 171373 186864 151316 186571
22029A86571M8952r5095p2195K2276o0364l9433j01650j33630o6910K890M3213
$$ 186571 235523 140428 68233 90509 30145 -9288 -110938 -244568 -311478 -308588 -265375
22018b65375Q6921R7537Q2539N3950O7360p1718k42695j79888R0851J81353J65744
$$ -265375 -178454 -80917 1622 55572 122932 51214 -191481 -371369 -280518 -99165 66579
22007F6579P0436j3236O0813J70873R6859N3195q8962j78143j06554q0741q3350
$$ 66579 137015 123779 184592 355465 452324 505519 416557 238414 131860 51119 -32231
21996c2231q4220J3042N0171j101q0055o6607j0511K7802J8478j9663m3587K6548
$$ -32231 -116451 -103409 -53238 -54339 -134394 -201001 -211512 -183710 -165232 -184895 -228482 -201934
21984b01934L7022L2610K0034l6612O831J26622J34484m8143j09365j00973p7483
$$ -201934 -164912 -132302 -112268 -148880 -142049 -15427 119057 70914 -38451 -139424 -216907
21973b16907l2740K1361Q1103Q3726M7663l1989k5987p826O346l158m9522P3768
$$ -216907 -249647 -228286 -147183 -63457 -15794 -47783 -73770 -81596 -75250 -78408 -127930 -54162
21961e4162k1022j43678p397L3190k1617M8242Q2552M4853P780l9231o0970J3355
$$ -54162 -75184 -218862 -226259 -193069 -214686 -166444 -83892 -39039 -31259 -70490 -131460 -118105
21949a18105l6591k6724M2196l6137R8736P0587k2879r4387o3646m864m1883j08100
$$ -118105 -154696 -181420 -139224 -175361 -76625 -6038 -28917 -123304 -186950 -191814 -233697 -341797
21937c41797p7483R4134J85043P5549K0451N0818M5507J07254J7054o1442M6293
$$ -341797 -419280 -325146 -140103 -64554 -44103 6715 52222 159476 176530 115088 161381
21926A61381n2490j49559n6741k897N9082N8055j00284j18083M8474J26866K0389
$$ 161381 108891 -40668 -97409 -100306 -41224 16831 -83453 -201536 -153062 -26196 -5807
21915e807K3530k4659j60266r8147M036J0690l506O1849J11867M1846K8839j01293
$$ -5807 17723 -6936 -167202 -265349 -261313 -250623 -254129 -192280 -80413 -38567 -9728 -111021
21903a11021j09460J4810J00215M6201m0188p0526j5804M9046N1743q416o1727
$$ -111021 -220481 -205671 -105456 -59255 -99443 -169969 -185773 -136727 -84984 -93400 -155127
21892a55127j12945j02251R0190J50341J60556O1132q679m3917p625J4474p4328
$$ -155127 -268072 -370323 -280133 -129792 30764 91896 83217 39300 31675 46149 -28179
21881b8179j27748n7224k1739J00704J36587J5489j3004J8161n2206q0198j42172
$$ -28179 -155927 -213151 -234890 -134186 2401 17890 4886 23047 -29159 -109357 -251529
21870b51529n0440J17602k040q2681Q77o866o799R4356j5026K228J34325L8041
$$ -251529 -301969 -184367 -186407 -269088 -268211 -275077 -281876 -187520 -202546 -200318 -65993 -27952
21858b7952n7832J1578J4630R9870J37310j3529p1397j70432p5593K1162Q9562
$$ -27952 -85784 -74206 -59576 40294 177604 164075 92678 -77754 -153347 -132185 -42623
21847d2623J25941L5330n5572j02408k4652j10087j17565P4581J08163L2936L0451
$$ -42623 83318 118648 63076 -39332 -63984 -174071 -291636 -217055 -108892 -75956 -45505
21836d5505R9013J9423M3470n9069o4863P2269K1232q3278j89736j80886L5459
$$ -45505 53508 72931 116401 57332 -7531 64738 85970 2692 -187044 -367930 -332471
21825c32471J06168J5742K6734J50923Q0233o5834p6043m0698l6577J5810J4602
$$ -332471 -226303 -210561 -183827 -32904 47329 -18505 -94548 -135246 -171823 -156013 -141411
21814a41411k4159N1706J09605p1258j58229r18Q0146r496q9033l8507O3689P8289
$$ -141411 -165570 -113864 -4259 -75517 -233746 -234664 -154518 -164014 -253047 -291554 -227865 -149576
21802a49576l7302j07188N0999O8700l3077K1337N9338K8289q5088n7892L6448
$$ -149576 -186878 -294066 -243067 -174367 -207444 -186107 -126769 -98480 -183568 -241460 -205012
21791b05012J43529Q9647Q208m5303o2610L5270R0443l2807p9465o3752l2714
$$ -205012 -61483 28164 36372 -8931 -71541 -36271 54172 21365 -58100 -121852 -154566
21780a54566j5791L2612L2754M4208j3977l1645O586J08684J85660J05269j31026
$$ -154566 -170357 -137745 -104991 -60783 -74760 -106405 -99819 8865 194525 299794 168768
21769A68768j19748K6019Q5820O9891q0894j33094q3583n8182m8440k2484L1140
$$ 168768 49020 75039 160859 230750 149856 16762 -66821 -125003 -173443 -195927 -164787
21758a64787N8834K1328J9377Q4556N000j38030j56243p0644J25420J12335n6654
$$ -164787 -105953 -84625 -65248 19308 24308 -113722 -269965 -340609 -215189 -102854 -159508
21747a59508K8211J20612M6932M9169j0679J835k9316o329K091l7366l4723o2207
$$ -159508 -131297 -10685 36247 85416 74737 76572 47256 40927 43018 5652 -29071 -91278
21735i1278j5057K7125L8131N9231K1846k3227j1289K986l1912l5417j32102M8688
$$ -91278 -106335 -79210 -41079 18152 39998 16771 5482 8468 -23444 -58861 -190963 -142275
21723a42275J01209O8539L1131l7548j2800K1846n8601j7010J09345J73164O8548
$$ -142275 -41066 27473 58604 21056 8256 30102 -28499 -45509 63836 237000 305548
21712C05548j01161p2748j06216n3132l6312k3419J6855Q9638J1785p319O405
$$ 305548 204387 131639 25423 -27709 -64021 -87440 -70585 19053 30838 23519 29924
21701B9924k4478m2369J2408J10855Q0105l5623p6386L4918M4994M4617N8298
$$ 29924 5446 -36923 -24515 86340 166445 130822 54436 89354 134348 178965 237263
21690B37263K8575J1748o6380j13338q2297o5362o9983K4072N6072N2107j3241
$$ 237263 265838 277586 211206 97868 15571 -49791 -119774 -95702 -39630 12477 -764
21679g64r169Q576N4903P9419n6098j37603j37718m2979Q2253O2023L2055k8539
$$ -764 -9933 -1357 53546 132965 76867 -60736 -198454 -241433 -159180 -97157 -65102 -93641
21667i3641J1968O1111q2654j17669M6820J47212O3684L5284n2936o4727p7321
$$ -93641 -81673 -20562 -103216 -220885 -174065 -26853 36831 72115 19179 -45548 -122869
21656a22869r1100J756M9471J53314M2122r1863j31454k4704J18564M920k4931
$$ -122869 -213969 -212213 -162742 -9428 32694 -59169 -190623 -215327 -96763 -91843 -116774
21645a16774o839O2832J5661M2369O8414j0468o661O4649J1229Q22P8011L59q1750
$$ -116774 -123613 -60781 -45120 -2751 65663 55195 48534 113183 124412 125234 203245 203604 121854
21632A21854p598j5988j33583q1076O6917R8037J05421J82106R2610p3773j16067
$$ 121854 114256 98268 -35315 -116391 -49474 48563 153984 336090 428700 354927 238860
21621B38860n9537m0437J26782K17930K4388j22492Q008m1739l8125k298j18542
$$ 238860 179323 138886 265668 483598 507986 385494 393502 351763 313638 311340 192798
21610A92798q3092P056l0940k5140K9927N4133P0787M1174l2010m0406n6038r551
$$ 192798 109706 116762 85822 60682 90609 144742 215529 256703 224693 184287 128249 118698
21598A18698O5259l764j01761j23519k4347J00359Q6328n0704j0906N0024M5916
$$ 118698 183957 180193 78432 -45087 -69434 30925 117253 66549 55643 105667 151583
21587A51583L6278M7179M5120q522M3395J32449M1966n8168K3970m8982o8481
$$ 151583 187861 235040 280160 271638 315033 447482 489448 431280 455250 406268 337787
21576C37787n5061j26626j1391j2722N2265J51953N9536m5536m2549n5721n8230
$$ 337787 282726 156100 144709 131987 184252 336205 395741 350205 307656 251935 193705
21565A93705M5540P6880J54563J98437J36690j02750j66851l2287n637p2864o9994
$$ 193705 239245 316125 470688 669125 805815 703065 536214 503927 498290 425426 355432
21554C55432j2918M1500R2498n1988j17034o4698o6459O2646J28557K5985k5203
$$ 355432 342514 384014 476512 424524 307490 242792 176333 238979 367536 393521 368318
21543C68318O8375J23968Q4319R0033k309j6271l1700p585M7260J4972J60035
$$ 368318 436693 560661 644980 735013 732704 716433 684733 677148 724408 739380 899415
21532H99415O8716j36749j08089k7756n9982p7200l1001j2239o6979j3040J6060
$$ 899415 968131 831382 723293 695537 635555 558355 527354 515115 448136 435096 451156
21521D51156M671j6163N6943N1305N035P7007o894N0367L2999m379J2110m913
$$ 451156 455827 439664 496607 547912 552947 629954 623060 673427 706426 702047 714157 709244
21509G09244k4897P0312J02026J24453P9474J21028K3490p4283J26857J56549
$$ 709244 684347 754659 856685 981138 1060612 1181640 1205130 1130847 1257704 1414253
21499A414253J28468J01898J05756J61700J81411N6085K27171K58309K16064L37887
$$ 1414253 1542721 1644619 1750375 1912075 2093486 2149571 2376742 2635051 2851115 3189002
21489C189002K83040K59442L71547N63192O50261P06843P30995R06956J204309
$$ 3189002 3472042 3731484 4103031 4666223 5316484 6023327 6754322 7661278 8865587
21480H865587J474207J667113J926947K325548K742154L088923L146286K784593
$$ 8865587 10339794 12006907 13933854 16259402 19001556 22090479 25236765 28021358
21472B8021358J611517j53431j871929k992020l327282l168578k670066k235247
$$ 28021358 29632875 29479444 27607515 24615495 21288213 18119635 15449569 13214322
21464A3214322j929686j610075j367937j083615p61117o03288o61626n67259l40707
$$ 13214322 11284636 9674561 8306624 7223009 6461892 5858604 5196978 4629719 4289012
21455D289012k32440l10466l21574k19367k28466k67047k69190j50886j04912
$$ 4289012 4056572 3746106 3424532 3205165 2976699 2709652 2440462 2289576 2184664
21446B184664j96940j80495j01254K3391n6012j39952j42669m7301o5360j18253
$$ 2184664 1987724 1807229 1705975 1729366 1673354 1533402 1390733 1343432 1278072 1159819
21436A159819k4412o7023n9124l4400j05997o9353N5032J04128P3741j7258L5832
$$ 1159819 1135407 1068384 1009260 974860 868863 799510 854542 958670 1032411 1015153 1050985
21425A050985O0737Q4850j4127o9488l9410l875l6450j0432K4306Q236O5703Q8232
$$ 1050985 1111722 1196572 1182445 1112957 1073547 1069672 1033222 1022790 1047096 1055332 1121035 1209267
21413A209267J10144P0272J3851j167R0711P4313J13840J83803K00045l6397j00772
$$ 1209267 1319411 1389683 1403534 1402367 1493078 1567391 1681231 1865034 2065079 2028682 1927910
21402A927910N1841P8845P0598N235J64476K46216K89643K25650J58772J54139
$$ 1927910 1979751 2058596 2129194 2134429 2298905 2545121 2834764 3060414 3219186 3373325
21392C373325P1111J50889L04580M09701M85464N30048M72435L62588M92141O36713
$$ 3373325 3444436 3595325 3899905 4309606 4795070 5325118 5797553 6160141 6652282 7288995
21382G288995O92660R05594J149142J278257J453515J707101J936503K299294
$$ 7288995 7981655 8887249 10036391 11314648 12768163 14475264 16411767 18711061
21374A8711061K809209L236957L804634M594738N571235O813446Q190387R730095
$$ 18711061 21520270 24757227 28561861 33156599 38727834 45541280 53731667 63461762
21366F3461762J1680371J3768664J4634274J2555209O215062l260057j1436982
$$ 63461762 75142133 88910797 103545071 116100280 122315342 119055285 107618303
21359A07618303j5407412j5385576j3415221j1083534q748204o973486n665146
$$ 107618303 92210891 76825315 63410094 52326560 43578356 36604870 30939724
21352C0939724m556461l658153l079927k449930j996418j759196j482090j281537
$$ 30939724 26383263 22725110 19645183 17195253 15198835 13439639 11957549 10676012
21344A0676012j241181j013852p51761o55909o34642n84565m66334l88858l80900
$$ 10676012 9434831 8420979 7669218 7013309 6378667 5794102 5327768 4938910 4558010
21335D558010l27366l13798l28693k48789k59187j89937j02130P3193O0320j25274
$$ 4558010 4230644 3916846 3588153 3339364 3080177 2890240 2788110 2861303 2921623 2796349
21325B796349k47068k90871j56978r6463j44980k30677j83771L5908n9545j01553
$$ 2796349 2549281 2258410 2101432 2004969 1859989 1629312 1445541 1481449 1421904 1320351
21315A320351L0740J106L2388L3534p8907k35975j42062k827j13082j11367O4474
$$ 1320351 1351091 1352197 1384585 1418119 1339212 1103237 961175 958348 845266 733899 798373
21304G98373P4831M6385L4890o5117k42538j17553K506J8991J49225J26890K4818
$$ 798373 873204 919589 954479 889362 646824 529271 531777 550768 699993 826883 851701
21293H51701o3203k1947j8514m9727j74756j20202l6106R3122J2316k3384K2217
$$ 851701 788498 766551 748037 698310 523554 403352 367246 460368 472684 449300 471517
21282D71517K1854J32231O6580o3356n7791K8904P1615Q1259M8315r581O65K2094
$$ 471517 493371 625602 692182 628826 571035 599939 671554 752813 801128 791547 792212 814306
21270H14306m0507j04973q6649m0244j4050K2788L0875q5861p6893j26169p1054
$$ 814306 773799 668826 582177 541933 527883 550671 581546 495685 418792 292623 221569
21259B21569j9496j21532p7952M3436J24104R0039l1115j8635J00078N8852l8352
$$ 221569 202073 80541 2589 46025 170129 260168 229053 210418 310496 369348 330996
21248C30996k1491j1135p9133r8877n3659M7987J10223P320p24J8430l3331l9595
$$ 330996 309505 298370 219237 120360 66701 114688 224911 232231 231507 249937 216606 177011
21236A77011k805j48615j12127l8853L3891O317k3750m7860m6129j7698L4039
$$ 177011 174206 25591 -86536 -125389 -91498 -85181 -108931 -156791 -202920 -220618 -186579
21225a86579J00574Q8109J02948O2369R4782J23546n0294j53768n3130m2613M0311
$$ -186579 -86005 2104 105052 167421 262203 385749 335455 181687 128557 85944 126255
21214A26255J8724K3906P3654M365m9305j08935j08051L4224R3303K3703m5892
$$ 126255 144979 168885 242539 246904 197599 88664 -19387 14837 108140 131843 85951
21203H5951q0967M5735j9445o7166j2318o3174k9297P1781R1443J1188p2396j12682
$$ 85951 4984 50719 31274 -35892 -48210 -111384 -140681 -68900 22543 33731 -38665 -151347
21191a51347j01815L3675J61212K00875J64162n9560j75139j3091M2958p5368
$$ -151347 -253162 -219487 -58275 142600 306762 247202 72063 58972 101930 26562
21181B6562k4246j02122p0940N3538Q8244J22664J02080L6049J3886j0025j9003
$$ 26562 2316 -99806 -170746 -117208 -28964 93700 195780 231829 245715 235690 216687
21170B16687r958L8036j1795p4540o2198N9691R9947N8529J8077L505k6472P091
$$ 216687 206729 244765 232970 158430 96232 155923 255870 314399 332476 335981 309509 316600
21158C16600L4855N8643J0942j4207J0896k6062k2319k9259J1517l9443j11863
$$ 316600 351455 410098 421040 406833 417729 391667 369348 340089 351606 312163 200300
21147B00300q9204j7696K4456n8919j02402O1216O5951j44068o4453k2522K9814
$$ 200300 111096 93400 117856 58937 -43465 17751 83702 -60366 -124819 -147341 -117527
21136a17527P8872M5335L5844k17q8853j7792j1262P1127J25643J37878P8371
$$ -117527 -38655 6680 42524 42307 -46546 -64338 -75600 -4473 121170 259048 337419
21125C37419p6518r8319j55333j31572l3354M7096J95259R5101q0991m3976p6398
$$ 337419 260901 162582 7249 -124323 -157677 -110581 84678 179779 98788 54812 -21586
21114b1586j22348j1889J9496Q1491Q5765O7633O1239n2508n8934n7784j12671
$$ -21586 -143934 -155823 -136327 -54836 30929 98562 159801 107293 48359 -9425 -122096
21103a22096q7110M334J2316P9977R4201J35738J65627r40j52427j20074j3086
$$ -122096 -209206 -204872 -192556 -112579 -18378 117360 282987 282047 129620 9546 -3540
21092c540L8874N7327k5273m9041J1440k6180o7477L709L7771n0095N312M4942
$$ -3540 35334 92661 67388 18347 29787 3607 -63870 -60161 -22390 -72485 -67173 -22231
21080b2231p552J624o5181j03300j0667j3762P0652N3371n0085k5265k0828J1673
$$ -22231 -29783 -28159 -93340 -196640 -207307 -221069 -150417 -97046 -147131 -172396 -193224 -181551
21068a81551L5305J2920J9002J8740L7300Q8114n569K558N3775p3374o2982R3759
$$ -181551 -146246 -133326 -114324 -95584 -58284 29830 24261 26819 80594 7220 -55762 37997
21056C7997M6666j22772l3067Q206n6065K3307J62139K8333k7525R631n8559l8860
$$ 37997 84663 -38109 -71176 -62970 -119035 -95728 66411 94744 67219 76850 18291 -20569
21044b0569q6414K6189J74187M4092o8775l7524M0923k7431m5725n3563j66028
$$ -20569 -106983 -80794 93393 137485 68710 31186 72109 44678 -1047 -54610 -220638
21033b20638j33793j0733O7157L4402o8871l8335M5648K3454N9111J40803O3532
$$ -220638 -354431 -365164 -298007 -263605 -332476 -370811 -325163 -301709 -242598 -101795 -38263
21022c8263k2151L2635M1975L5795p9904q0972O3551J14049J0640j20827j43333
$$ -38263 -60414 -27779 14196 49991 -29913 -110885 -47334 66715 77355 -43472 -186805
21011a86805n5357P3609M0510K00J34164J01657m3667j93548o6022N2390K9236
$$ -186805 -242162 -168553 -128043 -127843 6321 107978 64311 -129237 -195259 -142869 -113633
21000a13633O9547M8102l3284n0363N0587J05038Q9903j4632r2493j24873k5199
$$ -113633 -44086 4016 -29268 -79631 -29044 75994 165897 151265 58772 -66101 -91300
20989i1300M7272J04874O5116M077L0884M5821m795j25187l5671j7585J2047M8062
$$ -91300 -44028 60846 125962 130039 160923 206744 201949 76762 41091 23506 35553 83615
20977H3615p8153r170k2081q3972L1720P0234J06005J65214J22380j09956j89982
$$ 83615 5462 -3708 -25789 -109761 -78041 -7807 98198 263412 385792 275836 85854
20966H5854J8292k0616m1731M0804O5785J04281J41318J40804P4548m2364j15671
$$ 85854 104146 83530 41799 82603 148388 252669 393987 534791 609339 566975 451304
20955D51304n2402q8610p2123n9172m2613q558m7027k0139l469N8960q2691q2002
$$ 451304 398902 310292 238169 178997 136384 127826 80799 60660 57191 116151 33460 -48542
20943d8542J04809N5733P5826Q0897j8141j11885p7167K8911j8196o8640k9966
$$ -48542 56267 112000 187826 268723 250582 138697 61530 90441 72245 3605 -26361
20932b6361o6912l202O2923K4969N4767k4804o3320J2981N5268m5360m8956o4997
$$ -26361 -93273 -96475 -33552 -8583 46184 21380 -41940 -28959 26309 -19051 -68007 -133004
20920a33004n8421J04507J02572R2640N3925k9560L4409J61650L5867l0509l8931
$$ -133004 -191425 -86918 15654 108294 162219 132659 167068 328718 364585 334076 295145
20909B95145l6032J7664Q160K6981O9697o592k4377Q3625O6323P7480p1823j6181
$$ 295145 259113 276777 284937 311918 381615 375023 350646 434271 500594 578074 506251 490070
20897D90070J68288Q6239J14717J54065J10131R3240R0802Q4838K9284O8315K60330
$$ 490070 658358 744597 859314 1013379 1123510 1216750 1307552 1392390 1421674 1489989 1750319
20886A750319K67179K88532K72485R6566J946J01625J96321K36414M18146O57948
$$ 1750319 2017498 2306030 2578515 2675081 2677027 2778652 2974973 3211387 3629533 4287481
20876D287481O97055O90729J025326J458713J725506K010582K705841L721110
$$ 4287481 4984536 5675265 6700591 8159304 9884810 11895392 14601233 18322343
20868A8322343M778423O477131Q775294J0209072P467802p0037p791330j0952669
$$ 18322343 23100766 29577897 38353191 48562263 56030065 55960028 48168698 37216029
20860C7216029r381494o493747m439019l227028k471243k094747j743649j341708
$$ 37216029 27834535 21340788 16901769 13674741 11203498 9108751 7365102 6023394
20852F023394j059079r06819n33562l25832l99743l44095j86091j01871j57873
$$ 6023394 4964315 4057496 3523934 3198102 2798359 2454264 2268173 2166302 2008429
20843B008429k25908j76291j94726j99662j26471p7331r5573j43965o9579k4542
$$ 2008429 1782521 1606230 1411504 1211842 1085371 1008040 912467 768502 698923 674381
20833F74381M874j4747j75526J1009N0091p0254j13646j8479l49P7267J41650
$$ 674381 679255 664508 488982 499991 550082 479828 366182 347703 347354 424621 566271
20822E66271K1179j34844j27098l5548k1904n1202n3394O4996M0157n2544j06586
$$ 566271 587450 452606 325508 289960 268056 216854 163460 228456 268613 216069 109483
20811A09483j12253R867J05110J31133J0756j1263J178O7062J17705m8829q4570
$$ 109483 -2770 7097 112207 243340 254096 242833 244011 311073 428778 379949 295379
20800B95379j7591J0870N9476J20341J10578J4467o2002q1668o5295p1669l0501
$$ 295379 277788 288658 348134 468475 579053 593520 531518 449850 384555 312886 282385
20789B82385m1417r6447P768P0168K40112K73578j140l1665k2787n7543k0048
$$ 282385 240968 144521 152289 222457 462569 736147 735007 703342 680555 623012 602964
20778F02964k8026j26683k33993j55193n3985l6494N5128N7456R5445J21091n9296
$$ 602964 574938 448255 214262 59069 5084 -31410 23718 81174 176619 297710 238414
20767B38414q5034k2830l6358l1650L9479J05067P1234L0954j573o1006j65739
$$ 238414 153380 130550 94192 62542 102021 207088 278322 309276 307703 246697 80958
20756H0958k48961p1817j4451k2261k6691k2873M6932O0238k8513L6017J28100
$$ 80958 -168003 -239820 -254271 -276532 -303223 -326096 -279164 -218926 -247439 -211422 -83322
20745h3322N6875K5023p358J0217K3089j35506j14477Q3163R3147J16438J25334
$$ -83322 -26447 -1424 -8782 1435 24524 -110982 -225459 -142296 -49149 67289 192623
20734A92623O3821J9773K3604q5671o7492R7856O0465M8415j53637j49133J1798
$$ 192623 256444 276217 299821 214150 146658 244514 304979 353394 199757 50624 62422
20723F2422M4321J2101n5082p5837m2984j28897k9111J11011J27897P6386R8302
$$ 62422 106743 118844 63762 -12075 -55059 -183956 -213067 -102056 25841 102227 200529
20712B00529M8688l6K3137j8816q2559j39090j6073l8080o1062K4494J20025R1960
$$ 200529 249217 249181 272318 253502 170943 31853 15780 -22300 -83362 -58868 61157 153117
20700A53117k1871j80365j52193J2879Q8777J2166j20013n4915M0030J8741l7667
$$ 153117 131246 -49119 -201312 -188433 -99656 -87490 -207503 -262418 -222388 -203647 -241314
20689b41314j9518N54n8551N0061J66320L1608o863L4726J219r8590j06099r2061
$$ -241314 -260832 -260278 -318829 -268768 -102448 -70840 -77703 -42977 -41758 -140348 -246447 -338508
20677c38508R00J02653j8641j8358P7082J51137J71958j7736j55066q9941n8936
$$ -338508 -337608 -234955 -253596 -271954 -194872 -43735 128223 110487 -44579 -134520 -193456
20666a93456q0649j1971J7447L2820P8193M6333K008q9296j13820J4193K7691
$$ -193456 -274105 -286076 -268629 -235809 -157616 -111283 -109275 -198571 -312391 -298198 -270507
20655b70507k2819m574N8772J71083J23972o2976j52218j08941N8304R4575r7382
$$ -270507 -293326 -297900 -239128 -68045 55927 -7049 -159267 -268208 -209904 -115329 -212711
20644b12711q8636N6330J43407O2494r4560j40155k454J8103n189Q6795O7517
$$ -212711 -301347 -245017 -101610 -39116 -133676 -273831 -276285 -258182 -263371 -176576 -109059
20633a09059k7363K2082M8993k2719J8349R8191Q5846j640r8550m1965O6388P4411
$$ -109059 -136422 -114340 -65347 -88066 -69717 28474 114320 112680 14130 -27835 38553 112964
20621A12964n0993l689Q3950k3643k7086K4073K7026L351n9642p3557r6237q8753
$$ 112964 61971 58282 142232 118589 91503 115576 142602 145953 86311 12754 -83483 -172236
20609a72236l2982Q9363R6423j3020p8102R073M7578O0120R7990M7969l6837o4196
$$ -172236 -205218 -115855 -19432 -32452 -110554 -101481 -53903 6217 104207 152176 115339 51143
20597E1143l1392K6469L3926O0888k4164M0592M8622O9916M5414j7544o6176r2723
$$ 51143 19751 46220 80146 141034 116870 157462 206084 276000 321414 303870 237694 144971
20585A44971p6662N387l022j04038k6904L023Q0191N4826m5916M1734J39039R4519
$$ 144971 68309 73696 70674 -33364 -60268 -57245 22946 77772 31856 73590 212629 307148
20573C07148R4914n4539j26061j50505l1203J06806J71665M7134o4897j40938
$$ 307148 402062 347523 221462 70957 39754 146560 318225 365359 300462 159524
20563A59524j3589R2818Q8465N2616m6423j28367j19977n9246O4408j1078N7169
$$ 159524 145935 238753 327218 379834 333411 205044 85067 25821 90229 79151 136320
20552A36320N4895l7320n2892l6232j05865k2824r90j4499j2046j15689n1662
$$ 136320 191215 153895 101003 64771 -41094 -63918 -64908 -79407 -91453 -207142 -258804
20541b58804n4058m8760J39775K70270M4086j61337l8629J23655Q1538o1898j0015
$$ -258804 -312862 -361622 -221847 48423 92509 -68828 -107457 16198 97736 35838 25823
20530B5823P3650n3090j40762j79991j73293K9122J63021J89999J84413Q7879
$$ 25823 99473 46383 -94379 -274370 -447663 -418541 -255520 -65521 118892 206771
20520B06771j11390q9924j2206J8560j08905j02954N0097J12037J20232J84717
$$ 206771 95381 5457 -6749 11811 -97094 -200048 -149951 -37914 82318 267035
20510B67035J5340J053P0502K6749J17022J58914K46334N8071j41497j21733p6743
$$ 267035 282375 283428 353930 380679 497701 656615 902949 961020 819523 697790 621047
20499F21047m0612m2957o1865q4966o6915P3269N3163L6873J44020J52769L04788
$$ 621047 580435 537478 475613 390647 323732 397001 450164 487037 631057 783826 1088614
20488A088614M18458M15284K28024l09363o07094m43542k03796j57694j27763
$$ 1088614 1507072 1922356 2150380 1841017 1233923 790381 586585 428891 301128
20479C01128j54741m7582R9006N9054q5974o3051L2695O7369P6756j8621j7709
$$ 301128 146387 98805 197811 256865 170891 107840 140535 207904 284660 266039 248330
20468B48330q295n0518l1348R002Q54p7127l0322L6973N5424O2634k401l5484
$$ 248330 240035 189517 158169 167171 168025 90898 60576 97549 152973 215607 213206 177722
20456A77722m6155r6417p7178J4996J01959R4333J15717P4223m6423l9187L2990
$$ 177722 131567 35150 -42028 -27032 74927 169260 284977 359200 312777 273590 306580
20445C06580J1022r3432o5419K7834Q9358M0633p7596p2140J9863P1234J2635
$$ 306580 317602 224170 158751 186585 275943 316576 238980 166840 186703 257937 270572
20434B70572J00373J03935J40598K22119L24208L35006L40814K19000o002l19613
$$ 270572 370945 474880 615478 837597 1161805 1496811 1837625 2056625 2050623 1731010
20424A731010m79316l54924j61742o3878r1291j49088j17795J7123J8212P2049
$$ 1731010 1251694 896770 735028 671150 579859 430771 312976 330099 348311 420360
20414D20360J53613J18700J19846J20431J81494K41030P1257j81025l43477l40356
$$ 420360 573973 692673 812519 932950 1114444 1355474 1426731 1245706 902229 561873
20404E61873k04799m5119O1573j7424j38461j13152r119j34790J9738J41118P7035
$$ 561873 357074 311955 373528 356104 217643 104491 95372 -39418 -19680 121438 198473
20393A98473K4428K2629K8194J9159M9548l5387p403J5025l865P0364J89082J6020
$$ 198473 222901 245530 273724 292883 342431 307044 299641 314666 310801 381165 570247 586267
20381E86267l3862J18173J28706l587J47797M66025N76675N19180K21815k81692
$$ 586267 552405 670578 799284 795697 943494 1409519 1986194 2505374 2727189 2445497
20371B445497n99732n52811l24436k09697j96537q4499o076N918M1024l6930p989
$$ 2445497 1845765 1292954 968518 758821 562284 477785 471709 477627 518651 481721 473732
20360D73732R902r3746j74514q3008j6122J14411N8502K842K5249J10605k0119
$$ 473732 483634 389888 215374 132366 116244 230655 289157 291999 317248 427853 407734
20349D07734p3001J37540J01617J31257O1978N4107R2969P5091J91469M89871
$$ 407734 334733 472273 573890 705147 767125 821232 914201 989292 1180761 1670632
20339A670632N50861K97151J02015j67690l41817j50175J02908J65001j24053
$$ 1670632 2221493 2518644 2620659 2452969 2111152 1960977 2063885 2228886 2104833
20330B104833l18850m25625k85067o3429o7009j22187o769J09228J44094K16390
$$ 2104833 1785983 1360358 1075291 1011862 944853 822666 815897 925125 1069219 1285609
20320A285609K84316K14009p2856l60658k78807k69203j66254r8379j50033r5597
$$ 1285609 1569925 1783934 1711078 1350420 1071613 802410 636156 537777 387744 292147
20310B92147r034M6936M2121P3730R2909M3800L6431o5670q7493n8236l6500M5489
$$ 292147 283113 330049 372170 445900 538809 582609 619040 553370 465877 407641 371141 416630
20298D16630L5017R017Q5805P7700P0510j059N0172J09434J95819J16505O9614
$$ 416630 451647 460664 546469 624169 694679 693620 743792 853226 1049045 1165550 1235164
20287A235164Q2562J21009K1976P8209J75484K16676K79652L66312L62046M19385
$$ 1235164 1317726 1438735 1460711 1538920 1714404 1931080 2210732 2577044 2939090 3358475
20277C358475O19052P87473P58690Q35829J035610J174590J289764J610009K035556
$$ 3358475 3977527 4765000 5523690 6359519 7395129 8569719 9859483 11469492 13505048
20268A3505048K821334L913754N535045P916321J1883428J8016959K4549457J8661651
$$ 13505048 16326382 20240136 25775181 33691502 45574930 63591889 88141346 106802997
20260A06802997l906734k2734803k4602188j7098962j0772533o797103m555173
$$ 106802997 102896263 80161460 55559272 38460310 27687777 20890674 16335501
20253A6335501l123572k207758j635765j292193j066033r69594o57168n39379
$$ 16335501 13211929 11004171 9368406 8076213 7010180 6040586 5383418 4844039
20245D844039m59872m44509m49208l12723j92760j85239k94420l82629k89431
$$ 4844039 4384167 3939658 3490450 3177727 2984967 2799728 2505308 2122679 1833248
20236A833248k29905j70865o0433M592l1984j18919j22867o9749j22547k3265
$$ 1833248 1603343 1432478 1372045 1376637 1344653 1225734 1102867 1033118 910571 887306
20226H87306j9780n1024O5025R5026M1225n4596L9835R0605q713P1342P1503P082
$$ 887306 867526 816502 881527 976553 1017778 963182 1003017 1093622 1084909 1156251 1227754 1234836
20214A234836p8711k35225j68415p1941j97134j50633O9363J62261L2013K7557
$$ 1234836 1156125 920900 752485 680544 483410 332777 402140 564401 596414 623971
20204F23971P5685J23619K8208m3209k6044j49481j77194r8546l652n854l8763
$$ 623971 699656 823275 851483 808274 782230 632749 455555 357009 353357 347503 308740
20193C08740L7127M2092M8424m0121m8833k364n3052m3966R6569L7726P2175O6910
$$ 308740 345867 387959 436383 396262 347429 345065 292013 248047 344616 382342 454517 521427
20181E21427j3123k9733k10468q0656J57890Q8099k3735j06292o5830j7919j35704
$$ 521427 508304 478571 268103 187447 345337 433436 409701 303409 237579 219660 83956
20170H3956p5797K7625J27503O5277R1894P9154j6299m2012L4732L4573q3805
$$ 83956 8159 35784 163287 228564 320458 399612 383313 341301 376033 410606 326801
20159C26801J9967R9003k798l0O5398O6517J15807L9452j27936k49861j20488
$$ 326801 346768 445771 442973 442943 508341 574858 690665 730117 602181 352320 231832
20148B31832m6851J8044L9163m1921K3764L6667J2229J7729j3013o3423j11744
$$ 231832 184981 203025 242188 200267 224031 260698 272927 290656 277643 214220 102476
20137A02476k7339J29430J91969P6183m0784j5947J13909M9660k3041M6104L1122
$$ 102476 75137 204567 396536 472719 431935 415988 529897 579557 556516 602620 633742
20126F33742n7552l188P5471N6962J29021K49827L87699M85365M74163L76727
$$ 633742 576190 573002 648473 705435 834456 1084283 1471982 1957347 2431510 2808237
20116B808237O1002m92152o25640l96576k35122k77593j84288p5385m305O326
$$ 2808237 2869239 2377087 1751447 1354871 1119749 842156 657868 582483 578178 584504
20106E84504P061M4112m4037j33093j69658n4541j3897r678r9424j24008k0948
$$ 584504 591565 635677 591640 458547 288889 234348 220451 210773 111349 -12659 -33607
20095c3607L6716O9337L508l7746j39547j6696M7704N4149N9359j6638j03847
$$ -33607 3109 72446 75954 38208 -101339 -118035 -70331 -16182 43177 26539 -77308
20084g7308q197R588P7957L4067k1779M7758P9100O8875J0422K6812N5955k2431
$$ -77308 -85505 -75917 2040 36107 14328 62086 141186 210061 220483 247295 303250 280819
20072B80819O220L4588J08631L00570L33754J57926j71382k72645j60966r4228
$$ 280819 287039 321627 430258 730828 1064582 1222508 1051126 778481 617515 523287
20062E23287j75619k01420L6432J24191M1765K5869n5061p9397n9821m7120P8471
$$ 523287 347668 146248 182680 306871 348636 374505 319444 240047 180226 133106 211577
20051B11577J98844L5188l3846n2469j30458r9454q2459m9950l3624j5848J1033
$$ 211577 410421 445609 411763 359294 228836 129382 46923 -3027 -36651 -52499 -41466
20040d1466k2088Q988N7707n3497o9628K685J25304Q7864m503J7280n2569p4338
$$ -41466 -63554 -54566 3141 -50356 -119984 -117299 8005 95869 91366 108646 56077 -18261
20028a8261n1268L9441J1467q223k1993J8330j5973k5383o8498l0244L7398K4921
$$ -18261 -69529 -30088 -18621 -26844 -48837 -30507 -46480 -71863 -140361 -170605 -133207 -108286
20016a08286L211O4828J49817M3624q0544k5173J5493r144M7819K7582r1899j62388
$$ -108286 -105075 -40247 109570 153194 72650 47477 62970 53826 101645 129227 37328 -125060
20004a25060n0154K6717N1618J29700J28152M3951P5202N7413L6763o3000j67875
$$ -125060 -175214 -148497 -96879 32821 160973 204924 280126 337539 374302 311302 143427
19993A43427j01286J2496k867M0442m226q6488k9270K6133O8878K095R4137q367
$$ 143427 42141 54637 51770 92212 87986 1498 -27772 -1639 67239 69334 163471 155104
19981A55104j17196Q5821Q1028O1029l0070o3320L4960L7235L1006o4675j30963
$$ 155104 37908 123729 204757 265786 235716 172396 207356 244591 275597 210922 79959
19970G9959O595L5825J22248J35982L6729o97O389r3406o2456J25378J15987N789
$$ 79959 86554 122379 244627 380609 417338 416641 423030 329624 267168 392546 508533 514322
19958E14322J4221m2801k9848M7074J2220K985l5853n7686P1998J01881K4817
$$ 514322 528543 485742 455894 502968 515188 518173 482320 424634 496632 598513 623330
19947F23330l4116r519q1446l7496J28950J24889l0535J4100N5800K9091Q4498
$$ 623330 589214 579695 498249 460753 589703 714592 684057 698157 753957 783048 867546
19936H67546J02834J59269J97142J98463J31840J21632J18038O1704J04411J98761
$$ 867546 970380 1129649 1326791 1525254 1657094 1778726 1896764 1958468 2062879 2261640
19926B261640L28699N28839P24929P03545M7608o37429o90335l79131k41032k00892
$$ 2261640 2590339 3119178 3844107 4547652 4595260 3957831 3267496 2888365 2647333 2446441
19916B446441k51884j91473j9471P9917J39451J58925J93592K87853K23038L2416
$$ 2446441 2194557 2003084 1983613 2063530 2202981 2361906 2555498 2843351 3066389 3098805
19906C098805Q3181J33560K3922j16343j08540j42298k57951m93949m53012k75263
$$ 3098805 3181986 3315546 3339468 3223125 3114585 2972287 2714336 2220387 1767375 1492112
19896A492112k16317j40857q6723J31o7436K4620j2640k59858k27986j37548j34433
$$ 1492112 1275795 1134938 1048215 1048346 980910 1005530 992890 733032 505046 367498 233065
19885B33065q455M5648Q3619P7907j11202k07862m3242L7252o9378o430P6697
$$ 233065 224610 270258 353877 431784 320582 112720 69478 106730 37352 30922 107619
19874A07619R8159K1321j84783j42282P3158P9847P2257N6806m234m6005L310
$$ 107619 205778 227099 42316 -99966 -26808 53039 125296 182102 177868 131863 135173
19863A35173o24m8153J5555j069K6133R8960J26239Q7658L1556k3454o2850J9878
$$ 135173 134549 86396 101951 100882 127015 225975 352214 439872 471428 447974 385124 405002
19851D05002P8431n1034j29020p5032N6437l4702k0829P188N1728P6201R1652
$$ 405002 483433 432399 303379 228347 284784 250082 229253 236441 288169 364370 456022
19840D56022O9649l1630q530l9414Q746N5405m1767k0100M2953J7803r218r1708
$$ 456022 525671 494041 485511 446097 454843 510248 468481 448381 491334 509137 499919 408211
19828D08211q6151K2156J02831J56641R7087r5437j53592m9365k7487N752p8719
$$ 408211 322060 344216 447047 603688 700775 605338 451746 402381 374894 380646 301927
19817C01927j50570r4064K5588J05176M5718n8019k0285k7843k2291P3761J8883
$$ 301927 151357 57293 82881 188057 233775 175756 155471 127628 105337 179098 197981
19806A97981R2397J40201J4088n718p2168p8479l8372J1117M3189m8415o8142
$$ 197981 290378 430579 444667 438949 366781 288302 249930 261047 304236 255821 187679
19795A87679Q597J10083N5580M1336P4154q824N4053J16031l32j35014r2371K1377
$$ 187679 196276 306359 361939 403275 477429 468605 522658 638689 638357 503343 410972 432349
19783D32349N4446K9779N5002K9357r8106j61546r1012N4463J22373J01975K9539
$$ 432349 486795 516574 571576 600933 502827 341281 250269 304732 427105 529080 558619
19772E58619O1509O5352K1053p5562r9479q0003q0381R182J24756J61461J25113
$$ 558619 620128 685480 706533 630971 531492 451489 371108 380290 505046 666507 791620
19761G91620Q2004M5603O1855P0040m0247J28108K95165K52571M04040N37003
$$ 791620 873624 919227 981082 1051122 1010875 1138983 1434148 1686719 2090759 2627762
19751B627762N37711M09115k6477m06989n40792n44002l75516k71579k18546j48790
$$ 2627762 3165473 3574588 3548111 3141122 2600330 2056328 1680812 1409233 1190687 1041897
19741A041897j19246m2159o626l1861O0810M3438r7865j16385p5795k18152j61483
$$ 1041897 922651 880492 873866 842005 902815 946253 848388 732003 656208 438056 276573
19730B76573l3435n3706L722O8926N6945o2587o6396l7660j2137J28836J10787
$$ 276573 243138 189432 193154 262080 319025 256438 190042 152382 140245 269081 379868
19719C79868P8801l0563l2385P1363J9448J2009O6894j2121j4813l3667p8908
$$ 379868 458669 428106 395721 467084 486532 498541 565435 553314 538501 504834 425926
19708D25926r3277l8787M7311p1186r3276n883n0915p8608j6346j0766k7540O3756
$$ 425926 332649 293862 341173 269987 176711 170828 119913 41305 24959 14193 -13347 50409
19696E0409O1715k8680J6254J89138K16959K8850l6361L0349K952n3314J14594
$$ 50409 112124 83444 99698 288836 505795 534645 498284 528633 531585 478271 592865
19685E92865J48566J18861L30457N76836O40548L06116l05666n87115m33332k55611
$$ 592865 741431 860292 1190749 1767585 2408133 2714249 2408583 1821468 1388136 1132525
19675A132525k44527j85469p1840K146n8242j03473p4673j9261J04417R6412J27425
$$ 1132525 887998 702529 630689 632835 574593 471120 396447 377186 481603 578015 705440
19664G05440J86374R2566R4198K41854L50582M72209N44871K18424k92970n17584
$$ 705440 891814 984380 1078578 1320432 1671014 2143223 2688094 2906518 2613548 2095964
19654B095964m75638k57460j30649j89359j86801j03632n406j6114m0559r0256
$$ 2095964 1620326 1362866 1232217 1042858 856057 752425 747019 730905 690346 600090
19644F00090j12368M2740J12379M324m9189j15147k14449j84389L8553J09144
$$ 600090 487722 530462 642841 647165 597976 482829 268380 83991 122544 231688
19634B31688L6585O2978R030K9492J14080J0146n1070j4740k1048j31607k6260
$$ 231688 268273 331251 340281 369773 483853 493999 442929 428189 407141 275534 249274
19623B49274R3348J03982N6680P7504n171q6173m6199l0758O9204J05764j292
$$ 249274 342622 446604 503284 580788 575617 489444 443245 412487 481691 587455 586163
19612E86163Q2938J1946p4813j9670R3951K0999K4414R0214M2985M0158K1602
$$ 586163 669101 681047 606234 586564 680515 701514 725928 816142 859127 899285 920887
19601I20887p477q7106N338R1298J02825J13938J38647P9534p3759q2206Q9227
$$ 920887 913410 826304 831642 922940 1025765 1139703 1278350 1357884 1284125 1201919 1291146
19590A291146J70112J98776K62457K87362J93831k2237o7851j03066o5718J71480
$$ 1291146 1461258 1660034 1922491 2209853 2403684 2381447 2313596 2210530 2144812 2316292
19580B316292K31372L13527M02442M23070L42278J04519K7959J12166j10751n44844
$$ 2316292 2547664 2861191 3263633 3686703 4028981 4133500 4161459 4273625 4162874 3618030
19570C618030p37921n42104k41466j57289j64614j36762o4890k0252j396M3329
$$ 3618030 2880109 2338005 2096539 1939250 1774636 1637874 1572984 1552732 1551336 1594665
19560A594665J16436Q6034J08395J18274J92989J94969J53245O132J4848k8349
$$ 1594665 1711101 1797135 1905530 2023804 2216793 2411762 2565007 2571139 2585987 2557638
19550B557638r8849j54988k33078j09805J8822J08369P2536L7015J35639J94302
$$ 2557638 2458789 2303801 2070723 1960918 1979740 2088109 2160645 2197660 2333299 2527601
19540B527601J93442J58469J23022K50702L89813K74806K46982M00512N58050
$$ 2527601 2721043 2879512 3002534 3253236 3643049 3917855 4164837 4565349 5123399
19531E123399M46371L34501L84194M10978N71498P89443R54590J191362J473268
$$ 5123399 5569770 5904271 6288465 6699443 7270941 8060384 9014974 10206336 11679604
19522A1679604J686721J541427J252920J534548J966374K559788L384164M318604
$$ 11679604 13366325 14907752 16160672 17695220 19661594 22221382 25605546 29924150
19514B9924150N452428O582682P883034J0042052J3111209J7429071K3609823
$$ 29924150 35376578 41959260 49842294 59884346 72995555 90424626 114034449
19507A14034449L2279470M3593562N4138580N1026917J9862733k6029756n4876779
$$ 114034449 146313919 189907481 244046061 295072978 314935711 288905955 234029176
19500B34029176n6140441m3868222l1416641k2173000j5765660j1456258q539710
$$ 234029176 177888735 134020513 102603872 80430872 64665212 53208954 44669244
19493D4669244o463933n129585m079154l202086k383442j622655r60248m80900
$$ 44669244 38205311 33075726 28996572 25794486 23411044 21788389 20828141 20347241
19485B0347241L0806M23227R86128J776784K892318M208588N986331Q729953J3368161
$$ 20347241 20378047 20801274 21787402 23564186 26456504 30665092 36651423 45381376 58749537
19476E8749537J9040099K0597631R974785o952778k0697155k2790802j6261734
$$ 58749537 77789636 98387267 108362052 101409274 80712119 57921317 41659583
19469D1659583j0505438o885792m876680l552456k599361j885575j620275j289663
$$ 41659583 31154145 24268353 19391673 15839217 13239856 11354281 9734006 8444343
19461H444343j055951r13485p41938m85857k64429k79793m17043k47516j27316
$$ 8444343 7388392 6474907 5732969 5247112 4982683 4702890 4285847 4038331 3911015
19452C911015j81271j88970k03516k57851j51579j27777p3439j69309j05239q6062
$$ 3911015 3729744 3540774 3337258 3079407 2927828 2800051 2726612 2557303 2452064 2366002
19442B366002j01142N395J14701J10999J24934J32198J52752K83568L19142J63307
$$ 2366002 2264860 2270255 2384956 2495955 2620889 2753087 2905839 3189407 3508549 3671856
19432C671856J62901J62621Q7859Q7441P7418R7790J00639L3039L1570l3008k51928
$$ 3671856 3834757 3997378 4085237 4172678 4250096 4347886 4448525 4481564 4513134 4480126 4228198
19421D228198l30992k99129k88408k63897l23887k53880k79175k63686j71790
$$ 4228198 3897206 3598077 3309669 3045772 2721885 2468005 2188830 1925144 1753354
19412A753354j50399j47683j66643j93990o462r8215j82732r5358l5615r9410
$$ 1753354 1602955 1455272 1288629 1094639 1088177 989962 807230 711872 676257 576847
19402E76847m9234j065N2692P0978P6410N4358N4206P7820J05109M3287J4215
$$ 576847 527613 526548 579240 650218 726628 780986 835192 913012 1018121 1061408 1075623
19391A075623n169J2351J60884J65429R4239J21870M7787q8572p4685J64387L01294
$$ 1075623 1070454 1082805 1243689 1409118 1503357 1625227 1673014 1584442 1509757 1674144 1975438
19380A975438K47005K96978M10836N92231P91492Q00650K77365l30173n13478
$$ 1975438 2222443 2519421 2930257 3522488 4313980 5114630 5391995 5061822 4548344
19371D548344n39573n05202m33353l14732k00363m2561j67759l04937l69275k80991
$$ 4548344 4008771 3503569 3070216 2755484 2555121 2512560 2344801 2039864 1670589 1389598
19361A389598k42306k50514j35514n4478r5598j35383p0936o8362o6767J1921
$$ 1389598 1147292 896778 761264 706786 611188 475805 404869 336507 269740 281661
19351B81661m8099J6336M4977j9580l8232o3755K8636J52195R1632k8919R3576
$$ 281661 233562 249898 294875 275295 237063 173308 201944 354139 445771 416852 510428
19340E10428J79404J92838O5767p3673j51783j56389j23623n1892R9277J0176
$$ 510428 689832 882670 948437 874764 722981 566592 442969 391077 490354 500530
19330E00530q7202J2442N8472L6110L1405k8953j02973j45325m4797O3098K6473
$$ 500530 413328 425770 484242 520352 551757 522804 419831 274506 229709 292807 319280
19319C19280m0855N205Q5402N1871M9449K9790K1746J7279k1754j5525R2816J2632
$$ 319280 278425 283630 369032 420903 470352 500142 521888 539167 517413 501888 594704 607336
19307F07336k2465o2030j28042j02436K0840J44761K15116P4669m9272n1181r8228
$$ 607336 584871 522841 394799 292363 313203 457964 673080 747749 698477 647296 549068
19296E49068j25808j10578q280Q1547M5374m8886k5131j3888o5733m7892p1802
$$ 549068 423260 312682 304402 385949 431323 382437 357306 343418 277685 229793 157991
19285A57991j48229j1300K3807L7589j0872n639k3470o9563k2969m5544J6323
$$ 157991 9762 -1538 22269 59858 48986 43347 19877 -49686 -72655 -118199 -101876
19274a01876J28986J21529Q1729k9396o2452o2941J073Q2026k3170q9786p4860
$$ -101876 27110 148639 230368 200972 138520 75579 76652 158678 135508 45722 -29138
19263b9138K8658J2362q2759l9354n74J48831J07366k7216j01973l8634J1408
$$ -29138 -480 11882 -70877 -110231 -110805 38026 145392 118176 16203 -22431 -11023
19252a1023l4258J5558k8095j9673r375j7095m2847l4385j2159M5142p094J8009
$$ -11023 -45281 -29723 -57818 -77491 -86866 -103961 -146808 -181193 -193352 -148210 -155304 -137295
19240a37295P8390L3613M5211P638k2703k638Q7204j7751q7696j05101j58162
$$ -137295 -58905 -25292 19919 27557 4854 2216 89420 71669 -16027 -121128 -279290
19229b79290o4108K6643N6291P4287K5101j4264J20016N0886L3855O2466M3083
$$ -279290 -343398 -316755 -260464 -186177 -161076 -175340 -55324 -4438 29417 91883 134966
19218A34966k2148L2522J13570J23219P888R083p2955j33715o6193p1466q2922
$$ 134966 112818 145340 258910 382129 390017 399100 326145 192430 126237 54771 -28151
19207b8151m35k945j9142K7588m4700k9994M1280K5785N5788L7131R148L9708
$$ -28151 -28586 -31531 -50673 -23085 -67785 -97779 -56499 -30714 25074 62205 71353 111061
19195A11061R5957O1131l3034p6078l2620n0858l9051N807J2656j64850j04599
$$ 111061 207018 268149 235115 159037 126417 75559 36508 42315 54971 -109879 -214478
19184b14478L8840J38847P7368j0829k6477r952j9361j9408J2690J2194L1978
$$ -214478 -175638 -36791 40577 29748 3271 -6681 -26042 -45450 -32760 -20566 11412
19173A1412J0254K9834R7375o0844l5321m843K868K9269J6506M9429J11083J31235
$$ 11412 21666 51500 148875 88031 52710 47867 50735 80004 96510 145939 257022 388257
19161C88257J0552l650k2069p8714o9278J30132K69243K47628K70079L60396L82457
$$ 388257 398809 395159 373090 294376 225098 355230 624473 872101 1142180 1502576 1885033
19150A885033K70261J63295o1902m33886m19651k52576k51822k27995k15173k00043
$$ 1885033 2155294 2318589 2256687 1822801 1403150 1150574 898752 670757 455584 255541
19140B55541j79762j81014p0717J05409J69745N4532K2504L1238J66841O4013
$$ 255541 75779 -105235 -175952 -70543 99202 153734 176238 207476 374317 438330
19130D38330o7703j30363j9659K3353M3629k1766j01188j29625j2801J08133L4093
$$ 438330 370627 240264 220605 243958 287587 265821 164633 35008 22207 130340 164433
19119A64433r2718O6839O7336j06585j20288r4114q0377L9798Q2444M7329P6845
$$ 164433 71715 138554 205890 99305 -20983 -115097 -195474 -155676 -73232 -25903 50942
19108E0942J8663j0027J1650K4589R6177Q640j22956p7942p1235q4405k5471R081
$$ 50942 69605 59578 71228 95817 191994 200634 77678 -264 -71499 -155904 -181375 -172294
19096a72294K6508J08889J48464J15448K8814r5551k3513l021l2292O3404K4126
$$ -172294 -145786 -36897 111567 227015 255829 160278 136765 133744 101452 164856 188982
19085A88982j027j5492L4771J9128r5648j09229j25337N6400J84829J13687n9626
$$ 188982 187955 172463 207234 226362 130714 21485 -103852 -47452 137377 251064 191438
19074A91438j30678n8920l3197k4423J399P4930Q3803O0378L6682J073q4709j17867
$$ 191438 60760 1840 -31357 -55780 -54381 20549 104352 164730 201412 202485 117776 -91
19062i1p2207k1554J3718M7717R0017J01596P377J6290l0866j36020L7539J65929
$$ -91 -72298 -93852 -80134 -32417 57600 159196 166573 182863 151997 15977 53516 219445
19050B19445K1503j3707l2471k4660k4146O4541Q408p8960j26024p9404M2433
$$ 219445 240948 227241 194770 170110 145964 210505 218913 139953 13929 -65475 -23042
19039b3042M3825J7340K3661k6176L4928L7720m2733o1570j24179j9658J11860
$$ -23042 20783 38123 61784 35608 70536 108256 65523 3953 -120226 -139884 -28024
19028b8024R8702R2303K6419m3298l8405J2126k142j80505p2122R9367K4803m8461
$$ -28024 70678 162981 189400 146102 107697 119823 117681 -62824 -134946 -35579 -10776 -59237
19016e9237l4687l3862p6571j7973J13040Q7875r362m5972n1011r228N2425L4586
$$ -59237 -93924 -127786 -204357 -222330 -109290 -21415 -30777 -76749 -127760 -136988 -84563 -49977
19004d9977J8319N3637O3399M1427p870m1213p8638n0889q6726n8442o2399m4640
$$ -49977 -31658 21979 85378 126805 118935 77722 -916 -51805 -138531 -196973 -259372 -304012
18992c04012J18769J49138L3478L2486r2372j65106l3971R1905K7300N9729J03522
$$ -304012 -185243 -36105 -2627 29859 -62513 -227619 -261590 -169685 -142385 -82656 20866
18981B0866m349j6539l5053M4206J3442J2751K089L9149J74306J42992J79779
$$ 20866 16517 -22 -35075 9131 22573 35324 37413 76562 250868 393860 573639
18970E73639L13379L57897L57386L47605L67515r6762n20128n62229m74970k88163
$$ 573639 887018 1244915 1602301 1949906 2317421 2220659 1700531 1138302 663332 375169
18960C75169o5755K9082l824k4555n249M3375N978j3336J244n2418j19331j47894
$$ 375169 309414 338496 334672 310117 304868 348243 354221 340885 342129 289711 170380 22486
18948B2486K1269R9715l7931j24450q848P4332J3305K432p8615k3846L5479J16706
$$ 22486 43755 143470 105539 -18911 -27759 46573 59878 62310 -16305 -40151 -4672 112034
18936A12034J62619o9324j67842j6589J04898P0779K1091q2628o6410l712o4921
$$ 112034 274653 205329 37487 20898 125796 196575 217666 135038 68628 64916 -5
18925el6109L6089R498M3018K822j46330q6632N0522L2780O7440M6529K2504P961
$$ -5 -36114 -25 9473 52491 55313 -91017 -177649 -127127 -94347 -26907 19622 42126 50087
18912E0087j8661m4097j9327R689l1704O3334N3996m8022k8305O5713k6719j23370
$$ 50087 31426 -12671 -31998 -22309 -54013 9321 63317 15295 -13010 52703 25984 -97386
18900i7386q2080m6014J1240M1775N0079N1125K8805L6710N4349L6839o8154k6654
$$ -97386 -179466 -225480 -214240 -172465 -122386 -71261 -42456 -5746 48603 85442 17288 -9366
18888i366M6841R6564J442j06956l5531O4303O7955q455j23771j38533k8228L442
$$ -9366 37475 134039 135481 28525 -7006 57297 125252 116797 -6974 -145507 -173735 -170293
18876a70293L698o110J9903N6683O0822K6961L032K9723O6965M8426n1231j71783
$$ -170293 -166595 -172705 -152802 -96119 -35297 -8336 -5304 24419 91384 139810 88579 -83204
18864h3204j37890o327N1232K8866n7029r1057O9599J16560L8608N5861R8252
$$ -83204 -221094 -227421 -176189 -147323 -204352 -295409 -225810 -109250 -70642 -14781 83471
18853H3471L998P1864K4080r2194r5427l1428N9887J82369R4972m1798k5091R10
$$ 83471 87469 159333 183413 91219 -4208 -35636 24251 206620 301592 259794 234703 235613
18841B35613K1653k6254k7537N3149Q3110P231l8224K4189M6059j317n9205n9393
$$ 235613 257266 231012 203475 256624 339734 346965 308741 332930 378989 377672 318467 259074
18829B59074k2229p7808j61833m7472l237k9641j0608n7207o753K6712J55219
$$ 259074 236845 159037 -2796 -50268 -53505 -83146 -93754 -150961 -157714 -131002 24217
18818B4217J97636J9481j49466j67452r3164K7809J35297N7244L9937J01635k0415
$$ 24217 221853 241334 91868 -75584 -168748 -140939 -5642 51602 91539 193174 172759
18807A72759m7702o480M4893K2852l7138q9437j8282m4767Q2504K68512P3781
$$ 172759 125057 118577 163470 186322 149184 59747 41465 -3302 79202 347714 421495
18796D21495o5745r2749r7511P4864Q1324M7062J14815J28598M3945K4856J26554
$$ 421495 355750 263001 165490 240354 321678 368740 483555 612153 656098 680954 807508
18785H07508J21208J00174K59763L40957M97287N81698M01564J3731l59702m93944
$$ 807508 928716 1028890 1288653 1629610 2126897 2708595 3110159 3123890 2764188 2270244
18775B270244n43556m12215j69463l9533p0705j66042j41533p7382J66367J33016
$$ 2270244 1726688 1314473 1145010 1105477 1034772 868730 727197 649815 816182 949198
18765I49198L9902J3939n6419J75729M19184L25229K31274L75155L76380N7802
$$ 949198 989100 1003039 946620 1122349 1541533 1866762 2098036 2473191 2849571 2907373
18755B907373j83306l32846l50667k62769j15089k8773J0658J77087K21168L03294
$$ 2907373 2724067 2391221 2040554 1777785 1662696 1633923 1644581 1821668 2042836 2346130
18745B346130L05452J98510P4506l3543k58240l16340j00133k5857j10800j01570
$$ 2346130 2651582 2850092 2924598 2891055 2632815 2316475 2216342 2190485 2079685 1978115
18735A978115j73672l00200k37450n9432m6849o8517p2464j34106j58971j11472
$$ 1978115 1804443 1504243 1266793 1207361 1160512 1091995 1019531 885425 726454 614982
18725F14982m2019L8085L4612P064P3853J7111k7954o1423q0013p3594m6675j7660
$$ 614982 572963 611048 645660 652724 726577 743688 715734 654311 574298 500704 454029 436369
18713D36369j05869k03230j83858l7879J45446J27640J46715L4012L9800K448
$$ 436369 330500 127270 -56588 -94467 50979 178619 325334 359346 399146 401594
18703D01594j0594O5473M6601R6546J275j48803j46574n7077n7242K9416J62755
$$ 401594 391000 456473 503074 599620 600895 452092 305518 248441 191199 220615 383370
18692C83370J03197k1563l4298k9446N6545M9416L8996K8946J49545J55877J25129
$$ 383370 486567 465004 430706 401260 457805 507221 546217 575163 724708 880585 1005714
18681A005714J21932R4264J11284J13884j6058r5539j28603k37601k23853j89365
$$ 1005714 1127646 1221910 1333194 1447078 1431020 1335481 1206878 969277 745424 556059
18671E56059p6325K2440P7301l3320p9705L1067n6465k02516r5485J34417K5784
$$ 556059 479734 502174 579475 546155 466450 497517 441052 238536 143051 277468 303252
18660C03252j29881j43570L7336R7736L1768m3670N7545J39954p5166j88119o7495
$$ 303252 173371 29801 67137 164873 196641 152971 210516 350470 275304 87185 19690
18649A9690P5715J26862L2041L1988j5314k1714m2982r0765j2029K043k3588j7931
$$ 19690 95405 222267 254308 286296 270982 249268 206286 115521 103492 105535 81947 64016
18637F4016J7135J2202n9582Q405J6399j9297j2385K0058q4775p6575m040M913
$$ 64016 81151 93353 33771 42176 58575 39278 26893 46951 -37824 -114399 -118439 -113526
18625a13526K4142L4922P1662J74538O5519n7036j7930j10419p8365p8839k8405
$$ -113526 -89384 -54462 17200 191738 257257 200221 182291 71872 -6493 -85332 -113737
18614a13737n3775R168Q9731l6012Q0401M9619k2530J3751l958J8772O1927q541
$$ -113737 -167512 -158344 -68613 -104625 -24224 25395 2865 16616 12658 31430 93357 84816
18602H4816j25000o6617J32620L5148n3075L7103k678J8196N5159k5989o469J5754
$$ 84816 -40184 -106801 25819 60967 7892 44995 42317 60513 115672 89683 83214 98968
18590I8968k2990j01979j11644l5068J21061M6939p6123n5147j34526m6318M7067
$$ 98968 75978 -26001 -137645 -172713 -51652 -4713 -80836 -135983 -270509 -316827 -269760
18579b69760P0039K4701K6815M0786M6781J30241K17385P9995J0525J3053j8929
$$ -269760 -199721 -175020 -148205 -107419 -60638 69603 286988 366983 377508 390561 371632
18568C71632q3839r2090r6083p5538Q121o320o879J2085K3383L6448N5332l0008
$$ 371632 287793 195703 99620 24082 32203 25883 19004 31089 54472 90920 146252 116244
18556A16244p0331K4066R5778M4832R302j3375m4413J0636J0515K4088M4168O5393
$$ 116244 45913 69979 165757 210589 219891 206516 162103 172739 183254 207342 251510 316903
18544C16903O9613N37L3546J89558J04042J71787J84786K90130M99209N17797
$$ 316903 386516 387053 420599 610157 714199 885986 1070772 1360902 1860111 2377908
18534B377908M14964J6622n41537o40126m72731k09129j14508k27073j35043l3699
$$ 2377908 2792872 2809494 2267957 1627831 1155100 945971 831463 604390 469347 435648
18524D35648n770l4408q3168m2887p9683r2279K2085J02825K6198L931o8310r3073
$$ 435648 429878 395470 312302 269415 189732 97453 119538 222363 248561 252492 184182 91109
18512I1109r1601o6844j04891m8716M0411O3953N551r7851P2580N9909n4845j7403
$$ 91109 -492 -67336 -172227 -220943 -180532 -116579 -111028 -208879 -136299 -76390 -131235 -148638
18500a48638n5959n6013P6427O3760n5163k4237J37565J36651J20269n3663j15220
$$ -148638 -204597 -260610 -184183 -120423 -175586 -199823 -62258 74393 194662 140999 25779
18489B5779K1916L7728q361r3217r6139o0224M9725O5045Q0804N6551R257j6869
$$ 25779 47695 85423 77062 -16155 -112294 -172518 -122793 -57748 23056 79607 88864 71995
18477G1995J2365O9301O7444Q336j3157j7979n9071n6917k5520N7252o0951o3767
$$ 71995 84360 153661 221105 229441 216284 198305 139234 82317 56797 114049 53098 -10669
18465a0669M6802R6185l4031j37160n1395O0439O7041L829R5992J67598O9714
$$ -10669 36133 132318 98287 -38873 -90268 -29829 37212 41041 137033 304631 374345
18454C74345r3046j75509r0867M9262m4572n4585L3555J34523R5791j1912J1692
$$ 374345 281299 105790 14923 64185 19613 -34972 -1417 133106 228897 216985 228677
18443B28677L8809M7475l6105k22287k18650r5002n0246n198P9869O4480k5557
$$ 228677 267486 314961 278856 56569 -162081 -257083 -307329 -312527 -232658 -168178 -193735
18432a93735l3777k4249Q9541K28746J54360Q4669J3829r6476p6893n4884m1460
$$ -193735 -227512 -251761 -162220 66526 220886 305555 319384 222908 146015 91131 49671
18421D9671r2367j04179q86J55671R4596l1588J4024K3427n5439n1575K5680M163
$$ 49671 -42696 -146875 -147761 7910 102506 70918 84942 108369 52930 1355 27035 31198
18409C1198M5232R2268r5847j07205O3639J37628K7835n2092P0500j5003j01484
$$ 31198 76430 168698 72851 -34354 29285 166913 194748 142656 213156 198153 96669
18398I6669L1345J26768O9579l4176o5744p8988j20396k1366Q3757k0272n2880
$$ 96669 128014 254782 324361 290185 224441 145453 25057 3691 87448 67176 14296
18387A4296N3230J66172J94791o8675k08519q1476J1076p1221r4113j37732M216
$$ 14296 67526 233698 428489 359814 151295 69819 80895 9674 -84439 -222171 -217955
18376b17955Q5260P7949J02140P3077K0088J5501l6302k7393p1732n2896P6142
$$ -217955 -132695 -54746 47394 120471 140559 156060 119758 92365 20633 -32263 43879
18365D3879K3711M6140L4567r4062N495R2747K9487P8621R0776M1071j15222j84732
$$ 43879 67590 113730 148297 54235 59730 152477 181964 260585 351361 392432 277210 92478
18353I2478q0084R0421Q2386K4838P52M0849K3905L962l9184p4786j34668q6002
$$ 92478 12394 102815 185201 210039 210791 251640 275545 279507 240323 165537 30869 -55133
18341e5133k3435R838j7866M3440M9676N7530k6292L9798Q0133K1588n544k6407
$$ -55133 -78568 -68730 -86596 -43156 6520 64050 37758 77556 157689 179277 173733 147326
18329A47326K048N780o5924k3219k9264k2561K3782O0220O6784O2410L826j15678
$$ 147326 149374 155154 89230 66011 36747 14186 37968 98188 164972 227382 231208 115530
18317A15530j54895k6222O8258M6576K3264K2033j3807L3863J00333J1103p6444
$$ 115530 -39365 -65587 2671 49247 72511 94544 80737 114600 214933 226036 149592
18306A49592r3687q0483M818J6711K885N6157O672R1054L7333n9765P790k9921
$$ 149592 55905 -24578 -19760 -3049 -164 55993 62665 153719 191052 131287 139077 109156
18294A09156J6164K6050N3449P2572j24012r4116J43856J58157L3483o9765R4981
$$ 109156 125320 151370 204819 277391 153379 59263 203119 361276 394759 324994 419975
18283D19975P9762n4926P4442l5374j33390j5072P6951M9409P6687o3891p1961
$$ 419975 499737 444811 519253 483879 350489 335417 412368 461777 538464 474573 402612
18272D02612m3697j80671j83222p4416M1107J9086P3785R3532j0153p509k7428
$$ 402612 358915 178244 -4978 -79394 -38287 -19201 54584 148116 137963 130454 103026
18261A03026m4049l21L4811M1416J859k7912M3803K4536K3594o043j19870m2852
$$ 103026 58977 58656 93467 134883 136742 108830 152633 177169 200763 194720 74850 31998
18249C1998O1869k5848J9675L6119J08630J83156J01134R1526K3406j16278j49672
$$ 31998 93867 68019 87694 123813 232443 415599 516733 608259 631665 515387 365715
18238C65715o8692P536K2733O5219J16079J52475M9242L614K37156K96372J83744
$$ 365715 297023 304559 327292 392511 508590 661065 710307 713921 951077 1247449 1431193
18227A431193J08214K7474m1743j45051j97209k49936k18275j35134j24303j00659
$$ 1431193 1539407 1566881 1525138 1380087 1182878 932942 714667 579533 455230 354571
18217C54571k7857m378k3601L4606L665o8335r4206J568p854L6270K613m4035
$$ 354571 326714 322336 298735 333341 337006 268671 174465 176033 168179 204449 207062 163027
18205A63027n433M3008K5253q534p8192m57L6126l1814P277o966J3137N6301O1575
$$ 163027 157594 200602 225855 217321 139129 138672 174798 142984 150261 143295 156432 212733 274308
18192B74308l4122m0189L8557N1654l9366p1219l623J20505P5668k996J8123O1059
$$ 274308 240186 199997 238554 290208 250842 179623 176000 296505 372173 369177 387300 448359
18180D48359J64221K18365J86781J79580Q0496r7876j70752k00371j39354j1339
$$ 448359 612580 830945 1017726 1197306 1277802 1179926 1009174 808803 669449 658110
18170F58110M6656L9833K6093Q5268J2181m9373o2572n6211L3374Q5437R0665
$$ 658110 704766 744599 770692 855960 868141 818768 756196 699985 733359 818796 909461
18159I09461M535K8097P8036j4327o0584O1689M7611p085J66445J27686J18189
$$ 909461 913996 942093 1020129 1005802 945218 1006907 1054518 1047433 1213878 1341564 1459753
18148A459753J45020J09697N1589O1488R6389L8148r4618j68553j48772r8272
$$ 1459753 1604773 1714470 1766059 1827547 1923936 1962084 1867466 1698913 1550141 1451869
18138A451869m8863J59166L47822J99647K5874j2488n4942j99480k41903k04942
$$ 1451869 1403006 1562172 1909994 2109641 2135515 2123027 2068085 1868605 1626702 1421760
18128A421760l1046P1479K6830j00744r7412o3918P688m2976o0831k186N6288
$$ 1421760 1390714 1462193 1489023 1388279 1290867 1226949 1234637 1191661 1130830 1128644 1184932
18117A184932J02288L6166R8510J24039J9289n5759q5166Q8641K05534J67409
$$ 1184932 1287220 1323386 1421896 1545935 1565224 1509465 1424299 1512940 1718474 1885883
18107A885883N6745P220J56168J33708P7377J73091J68890J25935J84267K01949
$$ 1885883 1942628 1949848 2106016 2239724 2317101 2490192 2659082 2785017 2969284 3171233
18097C171233R5774P8552J58678J83196K35081L77949M47519M11537M34195L73197
$$ 3171233 3267007 3345559 3504237 3687433 3922514 4300463 4747982 5159519 5593714 5966911
18087E966911M08184M84021O44747P15712Q74938R99060J058279J161900J389568
$$ 5966911 6375095 6859116 7503863 8219575 9094513 10093573 11151852 12313752 13703320
18078A3703320J663879J964106K377630K851926L347198L901708M645217N732306
$$ 13703320 15367199 17331305 19708935 22560861 25908059 29809767 34454984 40187290
18070D0187290O945200Q533741J0619477J3088397J6194780J9982107K4248484
$$ 40187290 47132490 55666231 66285708 79374105 95568885 115550992 139799476
18063A39799476K7854837K8422160K2170963P122321j1963342k6068918l0814276
$$ 139799476 167654313 196076473 218247436 225369757 213406415 187337497 156523221
18056A56523221k8747538k4077077j9250723j5138656j1978349r330148p313174
$$ 156523221 127775683 103698606 84447883 69309227 57330878 48000730 40687556
18049D0687556n866071m835020l965871l246084k705142k246613j912970j705876
$$ 40687556 34821485 29986465 26020594 22774510 20069368 17822755 15909785 14203909
18041A4203909j453761j150194j081999j059761q78798o33662n70957o04943n99444
$$ 14203909 12750148 11599954 10517955 9458194 8579396 7945734 7374777 6769834 6170390
18032F170390m53284l77998m44294l94800l85029m21971l30774k52917k12391
$$ 6170390 5717106 5339108 4894814 4500014 4114985 3693014 3362240 3109323 2896932
18023B896932j31375p8669k2402n8684o9861K3734l5688k05633j42035q5126j31251
$$ 2896932 2765557 2686888 2664486 2605802 2535941 2559675 2523987 2318354 2176319 2091193 1959942
18012A959942r7693j55634k23348j38021p7576p9332K7875K9083L4364J06891
$$ 1959942 1862249 1706615 1483267 1345246 1267670 1188338 1216213 1245296 1279660 1386551
18002A386551j2913p6351j4822k838j08279q9975n420J0757r979n3734j03035
$$ 1386551 1373638 1297287 1282465 1279627 1171348 1081373 1075953 1086710 1076731 1022997 919962
17991I19962o4331N0138N3232j0184j142O5888J66091N9243J947K4277k8358N9856
$$ 919962 855631 905769 959001 948817 947675 1013563 1179654 1238897 1240844 1265121 1236763 1296619
17979A296619Q1157J8506J1024N5926J40254J94593J55591J28385Q9651M8406
$$ 1296619 1377776 1396282 1407306 1463232 1603486 1798079 1953670 2082055 2171706 2220112
17969B220112o6798L159R0514K1781j54124k64743j32043r6856j80287k23756
$$ 2220112 2153314 2156473 2246987 2268768 2114644 1849901 1717858 1621002 1440715 1216959
17959A216959j19955m6796o056k6382j32417m9027j6220n5687p9309o7528j8263
$$ 1216959 1097004 1050208 1044152 1017770 885353 836326 820106 764419 685110 617582 599319
17948E99319j5827J2960M7684Q556k9921K998P9251J3605r557p0689p0280m6573
$$ 599319 583492 596452 644136 652692 622771 625769 705020 718625 709068 638379 568099 521526
17936E21526r7885j12783m4124k9557P9865O9069k571p0193l61N6883N4435L275
$$ 521526 423641 310858 266734 237177 317042 386111 383540 313347 312986 369869 424304 427579
17924D27579k445j6635j13627p8731N515R4279J33491j5743J8426J9863J12939
$$ 427579 425134 408499 294872 216141 221656 315935 449426 433683 452109 471972 584911
17913E84911P2699q3767j20757p4401N0396P8898L6750J4402M7365L3186M1330
$$ 584911 657610 573843 453086 378685 429081 507979 544729 559131 606496 639682 681012
17902F81012r201N7227Q9422J25480K23307K82152L71965M25276K11343r8368
$$ 681012 671811 729038 818460 943940 1167247 1449399 1821364 2246640 2457983 2359615
17892B359615k73794l33693l24851k24239j35548j61824j16058j39813j57738
$$ 2359615 2085821 1752128 1427277 1203038 1067490 905666 789608 649795 492057
17883D92057o1850m7648q3134j2003l8219O4963J65588L0169n5917k0246K4417
$$ 492057 430207 382559 299425 287422 249203 314166 479754 509923 454006 433760 458177
17872D58177K1332n1857j63424j29025j08356m5570r89K4861O2889R7589R4068
$$ 458177 479509 427652 264228 135203 26847 -18723 -19712 5149 68038 165627 259695
17861B59695J9184n37K3162O0880K3632l3398L600k2940K102M8091o919j07523
$$ 259695 278879 278342 301504 362384 386016 352618 356218 333278 335380 383471 376552 269029
17849B69029r1279l1687l1156M7026R6893k9981o9805L5924K174l92J7800M0052
$$ 269029 177750 146063 114907 161933 258826 228845 159040 194964 197138 196746 214546 254598
17837B54598L5025K4835k2267j33064j07472L1834J02698J28244O9248j5496q7667
$$ 254598 289623 314458 292191 159127 51655 83489 186187 314431 383679 368183 280516
17826B80516j68532p0989M9150M3604q2981n4097M5506J3060n2733j1279j6562
$$ 280516 111984 40995 90145 133749 50768 -3329 42177 55237 2504 -8775 -25337
17815b5337J5357P9158J8935l2951j3227l9374n5889k6379n9438o5522Q0774J40149
$$ -25337 -9980 69178 88113 55162 41935 2561 -53328 -79707 -139145 -204667 -123893 16256
17803A6256J408p4396j5083L280J2765m185P0441J51312J32745O120r7194K3178
$$ 16256 17664 -56732 -71815 -68535 -55770 -59955 10486 161798 294543 300663 203469 226647
17791B26647J01197n5612j61415r6980l2885L6656Q9517K9296l3243j20667q6323
$$ 226647 327844 272232 110817 13837 -19048 17608 107125 136421 103178 -17489 -103812
17780a03812M7542p688Q1118Q1820j066j1281K9152J10398M2396l586j3745q4681
$$ -103812 -56270 -63958 17160 98980 97914 86633 115785 226183 268579 264993 251248 166567
17768A66567r1059k4819m9225j0748J2696P1595j4447m9781j6629m4984L4404
$$ 166567 75508 50689 1464 -9284 3412 75007 60560 10779 -5850 -50834 -16430
17757a6430O6075J9672R4988K9017n5101p9127j97098j64169o0488J12191R3045
$$ -16430 49645 69317 164305 193322 138221 59094 -138004 -302173 -362661 -250470 -157425
17746a57425M2864r635p4909k6503j6456R4121P2494l6697P2732L9997P3460M7430
$$ -157425 -114561 -124196 -199105 -225608 -242064 -147943 -75449 -112146 -39414 583 74043 121473
17734A21473p1904r1455L7145L2956l6885m3138n8677J5205P3074L3211j08921
$$ 121473 49569 -41886 -4741 28215 -8670 -51808 -110485 -95280 -22206 11005 -97916
17723i7916l2180R9874J21162K6296K4567J66j0542R3732J07460l5535m8021r963
$$ -97916 -130096 -30222 90940 117236 141803 141969 131427 225159 332619 297084 249063 239100
17711B39100m7383L5465J5833r6070j49249j72141j47467K097M6291p2920M6419
$$ 239100 191717 227182 243015 146945 -2304 -174445 -321912 -319815 -273524 -346444 -300025
17700c00025O1298K6319l1396l2308P135l8035J46R5822J13025M3562m5742J2945
$$ -300025 -238727 -212408 -243804 -276112 -268977 -307012 -306866 -211044 -98019 -54457 -100199 -87254
17688h7254P8206K9025k2509l2560l8825l7612O3502J0386l0839Q1624R1655J095
$$ -87254 -9048 19977 -2532 -35092 -73917 -111529 -48027 -37641 -68480 13144 104799 105894
17676A05894n253j5101K4044M0640k9019q7015m4520P6801R3677p1400m3371J57999
$$ 105894 100641 85540 109584 150224 121205 34190 -10330 66471 160148 88748 45377 203376
17664B03376J87476M3745j02070r7900n8530n3127O7725J79511K9958q757J62173
$$ 203376 390852 434597 332527 234627 176097 122970 190695 370206 400164 391407 553580
17653E53580K70324K05759P1408p4995j46639j27850p6689K6286J13961J06435
$$ 553580 823904 1029663 1101071 1026076 879437 751587 674898 701184 815145 921580
17643I21580M7282q6944j42487q2118r4878n6985m8179r5918k3846l1757k31234
$$ 921580 968862 881918 739431 657313 562435 505450 457271 361353 337507 305750 74516
17632G4516k43425p5124o149l9330j22154j7252R8806O8605K2224J8798K51J5377
$$ 74516 -168909 -244033 -250182 -289512 -411666 -428918 -330112 -261507 -239283 -220485 -220234 -204857
17620b04857K4758J17984R7478o87j4503k3950K1992j4144l1515o6935M748J31524
$$ -204857 -180099 -62115 35363 34676 20173 -3777 18215 4071 -27444 -94379 -89631 41893
17608D1893m7141j35407O0693J35587R6052m6010n7029l0571j22643m2872M4982
$$ 41893 -5248 -140655 -79962 55625 151677 105667 48638 18067 -104576 -147448 -102466
17597a02466j8814o3677O9081M0677l0949L460m7104m9683m8394l0178J0254n7866
$$ -102466 -121280 -184957 -115876 -75199 -106148 -102688 -149792 -199475 -247869 -278047 -267793 -325659
17585c25659j043J18779N1949j4436o719J15947J40838J15691O9228o1753n3727
$$ -325659 -326702 -207923 -155974 -170410 -177129 -61182 79656 195347 264575 202822 149095
17574A49095L2050j5021j902J9566K0632N2110l7116j41653m9331J1539J5480
$$ 149095 181145 166124 164222 183788 204420 256530 219414 77761 28430 39969 55449
17563E5449r9441r4745k8386K532O4468l151L2734J63312J66504j22732l19600
$$ 55449 -43992 -138737 -167123 -164591 -100123 -103274 -70540 92772 259276 136544 -183056
17552a83056j33358L9061J03962j5417j3898L6314J41045J17456R603q3600p1811
$$ -183056 -316414 -277353 -173391 -188808 -202706 -166392 -25347 92109 101712 18112 -53699
17541e3699r6308k5923O393J27369J83440K7714j06087j72016o1728J59421J40815
$$ -53699 -150007 -175930 -169537 -42168 141272 168986 62899 -109117 -170845 -11424 129391
17530A29391n0921j5276K5091r9179r8194L012M7238Q5495M5306O3088L3920l7229
$$ 129391 78470 63194 88285 -10894 -109088 -106076 -58838 26657 71963 135051 168971 131742
17518A31742k0355k8934m4014J3393j1202j11645j63678j6973R2718N4291O4599
$$ 131742 111387 82453 38439 51832 40630 -71015 -234693 -251666 -158948 -104657 -40058
17507d0058K7314m180J741j4451K7859J8710r3806j96141M5735P7186Q9181O7733
$$ -40058 -12744 -16924 -15183 -29634 -1775 16935 -76871 -273012 -227277 -150091 -60910 6823
17495F823K1295R4364J50310M9039n5318o3894j3672k1512M2706M5866o9497K5691
$$ 6823 28118 122482 272792 321831 266513 202619 188947 167435 210141 256007 186510 212201
17483B12201L5798k5446P5699J42760J73026K30030J39507p8911K8389N6761p2353
$$ 212201 247999 222553 298252 441012 614038 844068 983575 904664 933053 989814 917461
17472I17461r9165k03540j35578l0029J5268O262m1108J1297J81528K28493k159
$$ 917461 818296 614756 479178 449149 464417 470679 429571 440868 622396 850889 848730
17461H48730j05416j56047j99311j34917j47851j61951j04658O3341J50739M6717
$$ 848730 743314 587267 387956 253039 105188 -56763 -161421 -98080 52659 99376
17451I9376J9055P0351N4707L9768j18189k05200l5344P4634Q9901l3966n4203
$$ 99376 118431 188782 243489 283257 165068 -40132 -75476 -842 89059 55093 890
17440H90J11177L6607l7717K8555M4784q3031m8479Q203L6866K0710l4519p0325
$$ 890 112067 148674 110957 139512 184296 101265 52786 60989 97855 118565 84046 13721
17428A3721j26157j16486L662J56929r990j15250k7464O9299N9449K3722P1873
$$ 13721 -112436 -228922 -225260 -68331 -78321 -193571 -221035 -151736 -92287 -68565 3308
17417C308N6476R167n4037j5833n4468m7555N8117J14594J13156o3130r2355K1560
$$ 3308 59784 68951 14914 -919 -55387 -102942 -44825 69769 182925 119795 27440 49000
17405D9000n6455j02633J8353M6878P5812J15346P8494N5156j7493m0301M590
$$ 49000 -7455 -110088 -91735 -44857 30955 146301 224795 279951 262458 222157 226747
17394B26747l8341r9908k3958R9907J24034M7682k7295J1388L1284Q1177N0353
$$ 226747 188406 88498 64540 164447 288481 336163 308868 320256 351540 432717 483070
17383D83070R7823O6500n0153p7831l5068N5093L43812M74675L83615N90222P62553
$$ 483070 580893 647393 597240 519409 484341 539434 883246 1357921 1741536 2331758 3094311
17372C094311N42034j25520o77824p03074n79431l57386k90782k15426j16463
$$ 3094311 3636345 3510825 2833001 2129927 1550496 1193110 902328 686902 570439
17363E70439n7325p5377j91223j30210j6930M6023J9532l5209j3577M5251P4151
$$ 570439 513114 437737 246514 116304 99374 145397 164929 129720 116143 161394 235545
17352B35545p4020j09895q5609m0166j1657o2406k3296k2250N070J46731K7514
$$ 235545 161525 51630 -33979 -74145 -85802 -148208 -171504 -193754 -188684 -41953 -14439
17341a4439j44285q1282k4127O2115J41061K9083q600K0895M4899M7765O8603
$$ -14439 -158724 -240006 -264133 -202018 -60957 -31874 -40474 -19579 25320 73085 141688
17330A41688K0255j32642j14242O2799K6845L2679R2646J9515Q4976J03655P6466
$$ 141688 161943 29301 -84941 -22142 4703 37382 130028 149543 234519 338174 414640
17319D14640j56547j12510N2684P1321p7111j15985p5669K8436R5651L4278k906
$$ 414640 258093 145583 198267 269588 192477 76492 823 29259 124910 159188 156282
17308A56282k9506L4732k1564q4381N5300J21261M418n2411o6769j13923m9760
$$ 156282 126776 161508 139944 55563 110863 232124 236542 184131 117362 3439 -46321
17297d6321m1251j4608M1416J25054L6687L9894R633r572r4482k6229K0917L3722
$$ -46321 -87572 -102180 -60764 64290 100977 140871 150504 140932 46450 20221 41138 74860
17285G4860P2614k1403m9750L8798j6187j65842o5962M9366p5306k9246J19512
$$ 74860 147474 126071 76321 115119 98932 -66910 -132872 -83506 -158812 -188058 -68546
17274f8546O3239r6842k5876J19101O1983m8184p0284o1660P4154P3796l0069
$$ -68546 -5307 -102149 -128025 -8924 53059 4875 -65409 -127069 -52915 20881 -9188
17263i188j5014L8529J07804J27732k3191j09293N5685K4874K7708L3088n2357
$$ -9188 -24202 14327 122131 249863 226672 117379 173064 197938 225646 258734 206377
17252B06377m4194j1328P407r8128j11485L5007R0006K7503k1848k4134O007J24411
$$ 206377 162183 150855 158262 60134 -51351 -16344 73662 101165 79317 55183 61190 185601
17240A85601J45010N0162m6763j90927j34394p6688r7297m210K1728J15269Q3619
$$ 185601 330611 380773 334010 143083 8689 -67999 -165296 -169506 -147778 -32509 51110
17229E1110J9106Q4097o4550k01996o6045p9985q5041j3115R9837J42605J9130
$$ 51110 70216 154313 89763 -112233 -178278 -258263 -343304 -356419 -256582 -113977 -94847
17218i4847L4338J39191Q4959Q2034j6632m9358M1847k7608j62780k01429j23209
$$ -94847 -60509 78682 163641 245675 229043 179685 221532 193924 31144 -170285 -293494
17207b93494J0310J90367J46286J5504o5462n098P8051Q7900n0301j26948j20485
$$ -293494 -283184 -92817 53469 68973 3511 -1587 76464 164364 114063 -12885 -133370
17196a33370j04880q739K7943l0847q0652J8210L8426O3857J19006O4216j7694
$$ -133370 -238250 -246989 -219046 -249893 -330545 -312335 -273909 -210052 -91046 -26830 -44524
17185d4524n4364j4145L0685l5995j6159j8140m8318n7512P1351M9602k7830j50075
$$ -44524 -98888 -113033 -82348 -118343 -134502 -152642 -200960 -258472 -187121 -137519 -165349 -315424
17173c15424o5607R6311M5236R2034P1166r9642q2927J7447Q8688O4351k7720
$$ -315424 -381031 -284720 -239484 -147450 -76284 -175926 -258853 -241406 -152718 -88367 -116087
17162a16087p2459j03339n1998K5333P8239J78068J42287P0375p4261r5752p2603
$$ -116087 -188546 -291885 -343883 -318550 -240311 -62243 80044 150419 76158 -19594 -92197
17151i2197k2996K1047J9179M7711L4344n8626n8565N3864O7075q263k3508L1212
$$ -92197 -115193 -94146 -74967 -27256 7088 -51538 -110103 -56239 10836 2573 -20935 10277
17139A0277j9828m7058n1661l5252N623M4139M2606p8231j30866R82L2678j2993
$$ 10277 -9551 -56609 -108270 -143522 -137899 -93760 -51154 -129385 -260251 -259269 -226591 -239584
17127b39584m5273j13031N4779J70065O5928j003j8108n1050p4335j24102K9205
$$ -239584 -284857 -397888 -343109 -173044 -107116 -108119 -126227 -177277 -251612 -375714 -346509
17116c46509J36312l9772j03859O2718J31982R2402O5245J30152J39435l9588
$$ -346509 -210197 -249969 -353828 -291110 -159128 -66726 -1481 128671 268106 228518
17106B28518n6455m1558j1406K896R4698J17053J8451M321k547n3618j10448o7355
$$ 228518 172063 130505 119099 121995 216693 333746 352197 356518 353971 300353 189905 122550
17094A22550l7552m2801q5202r3630L5007J22745N5018j17212r3901J5525K572
$$ 122550 84998 42197 -43005 -136635 -101628 21117 76135 -41077 -134978 -119453 -116881
17083a16881n0046J6930K0902o0064o2784L6508R4452l5729j08085K8164P5692
$$ -116881 -166927 -149997 -129095 -189159 -251943 -215435 -120983 -156712 -264797 -236633 -160941
17072a60941O2550L7170J8202l7931o9008o7751n9873N1045J32932P2616J1208
$$ -160941 -98391 -61221 -43019 -80950 -149958 -217709 -277582 -226537 -93605 -20989 -9781
17061i781N4860j44868j21692P0015m4751r571J53286J21575n0271j04677o2612
$$ -9781 45079 -99789 -221481 -151466 -196217 -205788 -52502 69073 18802 -85875 -148487
17050a48487j8866n8980l507m914p6484m633M7210R1097K4431m829j3071N0056
$$ -148487 -167353 -226333 -229840 -234754 -311238 -315871 -268661 -177564 -153133 -157962 -171033 -120977
17038a20977L5871j0033R0876J06594k961r8142j32372j18760J6981P6395L7514
$$ -120977 -85106 -95139 -4263 102331 99370 1228 -131144 -249904 -232923 -156528 -119014
17027a19014N0127N7824m413n7992M2590P1732R6793N3779o6680n4362L2005o4160
$$ -119014 -68887 -11063 -15476 -73468 -30878 40854 137647 191426 124746 70384 102389 38229
17015C8229Q870J03327j4738m0090q4037j50595o0889L2899M8820M6773J206L4736
$$ 38229 47099 150426 135688 95598 11561 -139034 -199923 -167024 -118204 -71431 -70225 -35489
17003c5489O4045K6039M889j6205p9035o1581K0768Q9268L7149q3014r0633o1205
$$ -35489 28556 54595 59484 43279 -35756 -97337 -76569 12699 49848 -33166 -123799 -185004
16991a85004j21089j26224P3995J24033Q7483j227m3984P1200K3092p466P3605
$$ -185004 -306093 -432317 -358322 -234289 -146806 -148033 -192017 -120817 -97725 -105191 -31586
16980c1586J32816M6897J4311p035M4621O1125l6110j7663j13881j18616l570
$$ -31586 101230 148127 162438 155403 200024 261149 225039 207376 93495 -25121 -28691
16969b8691M8816j2044j08172O1861J01735m0458n1262r942l0938k1227k9207
$$ -28691 20125 8081 -100091 -38230 63505 23047 -28215 -38157 -69095 -90322 -119529
16958a19529q3542j25765j04300p1512j6071N1144R1812J45264J01714N8281M3877
$$ -119529 -203071 -328836 -433136 -504648 -520719 -469575 -377763 -232499 -130785 -72504 -28627
16947b8627P2030L1457l0575n9249n7902l063n3052Q3522m348K2442K2672P210
$$ -28627 43403 74860 44285 -14964 -72866 -75929 -128981 -45459 -49807 -27365 -4693 2517
16935B517J16341Q3497p9577j56030k3636M0077J9945r6493o8039J14785N5972
$$ 2517 118858 202355 122778 -33252 -56888 -16811 3134 -93359 -161398 -46613 9359
16924I359j07581P416J10708r669k6589L0323Q6246J32615P1108o7714j69957
$$ 9359 -98222 -90806 19902 10233 -16356 13967 100213 232828 303936 236222 66265
16913F6265o4784L1129q4728j04943K1655j5832o5317o1024j5793M6628Q4767
$$ 66265 1481 32610 -52118 -157061 -135406 -151238 -216555 -277579 -293372 -246744 -161977
16902a61977Q8758J6947m0935K5342J07731n445k11409j59210j2777L6569M8690
$$ -161977 -73219 -56272 -97207 -71865 35866 30421 -180988 -340198 -352975 -316406 -267716
16891b67716K8254J42827J31428j18326j06879Q439l1917l5506j5382O014L673
$$ -267716 -239462 -96635 34793 -83533 -190412 -181973 -213890 -249396 -264778 -258764 -255091
16880b55091J06845J09562L0152m137p012m4476q9582j29395j50506j1154J18849
$$ -255091 -148246 -38684 -8532 -12669 -19681 -64157 -153739 -283134 -433640 -444794 -325945
16869c25945l4005l9813R979K01840K71842M5689j37240j52307q9720N6177J165
$$ -325945 -359950 -399763 -389784 -187944 83898 129587 -7653 -159960 -249680 -193503 -192338
16858a92338k3834N884m1495l520J61485K46059J02957j06637k07858n8269n9089
$$ -192338 -216172 -210288 -251783 -255303 -93818 152241 255198 148561 -59297 -117566 -176655
16847a76655J2811K3216l5258P0024N4001m9304n5674M9116J11463l9926j23231
$$ -176655 -163844 -140628 -175886 -105862 -51861 -101165 -156839 -107723 3740 -36186 -159417
16836a59417n7529K6532l954n8278O5912R5697j19575q8480J16861J06279J5357
$$ -159417 -216946 -190414 -194368 -252646 -186734 -91037 -210612 -299092 -182231 -75952 -60595
16825f0595L27O0151n1898j54600j2068Q7562P5415j0852J6263J8462j0411K7396
$$ -60595 -60268 -117 -52015 -206615 -218683 -131121 -55706 -66558 -50295 -31833 -42244 -14848
16813a4848k069l5320m0679p8785k9148K4598J5650N7482J54391J3659M8803o3069
$$ -14848 -16917 -52237 -92916 -171701 -200849 -176251 -160601 -103119 51272 64931 113734 50665
16801E0665j70134j63891m8544M4691K9671j5980m0567k056J0765K3242L8241
$$ 50665 -119469 -283360 -331904 -287213 -257542 -273522 -314089 -316145 -305380 -282138 -243897
16790b43897Q046j7615O1198J19905O7728j5210M343q2649q3628m9572P8064L7436
$$ -243897 -235851 -253466 -192268 -72363 -4635 -19845 -15502 -98151 -181779 -231351 -153287 -115851
16778a15851q3815L2634O8759m162m4753J013K5796L0510N1618n1956j0791N2465
$$ -115851 -199666 -167032 -98273 -102435 -147188 -146175 -120379 -89869 -38251 -90207 -100998 -48533
16766d8533M3013k9639k2362j16586j19393J4570J39935K70352R6817L735J952
$$ -48533 -5520 -35159 -57521 -174107 -293500 -278930 -138995 131357 228174 231909 233861
16755B33861r3305p1145p8147q0424n8460r0756k2917J4390p6587n0872P0406
$$ 233861 140556 69411 -8736 -89160 -147620 -238376 -261293 -246903 -323490 -374362 -303956
16744c03956Q9605J10836K1551Q0916M1824m9485M2469J0312J6362M1695r036
$$ -303956 -214351 -103515 -81964 -1048 40776 -8709 33760 44072 60434 102129 93093
16733I3093l0302p8018m8694j03824j0142N2481J2350L594j19766q4141j09722
$$ 93093 62791 -15227 -63921 -167745 -177887 -125406 -113056 -109462 -229228 -313369 -423091
16722d23091m4284R2456P4054k1766M078Q0430O8643P0825O973L3041M0274J0691
$$ -423091 -467375 -374919 -300865 -322631 -318553 -238123 -169480 -98655 -91682 -58641 -18367 -7676
16710g676J4088K4825N4055k4502j35316n807R6547J00860l302k8589r1040k416
$$ -7676 6412 31237 85292 60790 -74526 -80333 16214 117074 113772 85183 -5857 -8273
16698h273L5353R332R83n6050m236M2774P7199R9358N5514n4792j37651m1526
$$ -8273 27080 36412 37395 -18655 -22891 19883 97082 196440 251954 197162 59511 17985
16686A7985J21727N2846p5901j12997q9424p981J9772m9805K3016J03097P0855
$$ 17985 139712 192558 116657 3660 -85764 -93745 -73973 -123778 -100762 2335 73190
16675G3190m0279k7408k5654p0561j9859J79646Q7497o3254J7533j03263j70362
$$ 73190 32911 5503 -20151 -90712 -110571 69075 156572 93318 110851 7588 -162774
16664a62774N279M478R5092P3872k603M2101J3035K6973L5447K6258r183j37267
$$ -162774 -157495 -153017 -57925 15947 13344 55445 68480 95453 130900 157158 147975 10708
16652A0708l1511K7244o0412k6505j1829k1038m2151K5317K6241l1415j4623R6829
$$ 10708 -20803 6441 -53971 -80476 -92305 -113343 -155494 -130177 -103936 -135351 -149974 -53145
16640e3145J00780P8260m4413j35058k7243M701k9565k6627k2321k9804j3045
$$ -53145 47635 125895 81482 -53576 -80819 -76118 -105683 -132310 -154631 -184435 -197480
16629a97480R7617J27187j7615j81290j38156N0419J60311O9338n6977p484O21
$$ -197480 -99863 27324 9709 -171581 -309737 -259318 -99007 -29669 -86646 -94130 -93509
16618i3509O8337K398m2390L6600N5580k2433r7967o2257N2679M6529p3101K912
$$ -93509 -25172 -22774 -65164 -28564 27016 4583 -93384 -155641 -102962 -56433 -129534 -126622
16606a26622Q0935M1026p9855N1863P0670Q0564n2582o936J29761J08427k7856
$$ -126622 -45687 -4661 -84516 -32653 38017 118581 65999 59063 188824 297251 269395
16595B69395j18655k9267m2098q5041m7805l2757n821K8796R8852J6874j56176
$$ 269395 150740 121473 79375 -5666 -53471 -86228 -92049 -63253 35599 52473 -103703
16584a03703j01085J4478N0735K3153j184l8506L219k159M9660M1336l8422j8693
$$ -103703 -204788 -190310 -139575 -116422 -117606 -156112 -152893 -155052 -105392 -64056 -102478 -121171
16572a21171k2534j0797K6527N47K7038N0987K8066K3926K8170M5617N697M5632
$$ -121171 -143705 -154502 -127975 -127428 -100390 -49403 -21337 2589 30759 76376 82073 127705
16560A27705M0045q5055p4498o9761J4746Q5482K691p738L6926o7335j07670j5020
$$ 127705 167750 82695 8197 -61564 -46818 38664 41355 33617 70543 3208 -104462 -119482
16548a19482J27074R5376m3569p021K9179p8307j25047l5636k393M728Q0249K8516
$$ -119482 7592 102968 59399 52378 81557 3250 -121797 -157433 -159826 -155098 -74849 -46333
16536d6333j3349L3430m9856o9O5293J47958N8724o5326j84721j73783k3127O8361
$$ -46333 -59682 -26252 -76108 -76177 -10884 137074 195798 130472 -54249 -228032 -251159 -182798
16524a82798J81215R3860m3777p3501l2183p931P7419J8378m8529m8406k5441
$$ -182798 -1583 92277 48500 -25001 -57184 -65115 12304 30682 -17847 -66253 -91694
16513i1694P9625P3621p7252j43051k5226M6040J03778k4373p8108p5862j29029
$$ -91694 -12069 61552 -15700 -158751 -183977 -137937 -34159 -58532 -136640 -212502 -341531
16502c41531r504O4475P7275J19707J5469j42317r8182M3193J18161Q02M9124
$$ -341531 -351035 -286560 -209285 -89578 -74109 -216426 -314608 -271415 -153254 -152452 -103328
16491a03328M9074j3017n3046j5980p9853j00151m1771j369P3399O0064j3028
$$ -103328 -54254 -67271 -120317 -136297 -216150 -316301 -358072 -359441 -286042 -225978 -239006
16480b39006K6037P8920K6342o5538r9755q7790J6375R8560Q8893N7698J23659
$$ -239006 -212969 -134049 -107707 -173245 -273000 -360790 -344415 -245855 -156962 -99264 24395
16469B4395J09223J4659j20240j01571q0163l0929j3132k4411N0534R3282J11547
$$ 24395 133618 148277 28037 -73534 -153697 -184626 -197758 -222169 -171635 -78353 33194
16458C3194Q0590q8357r7074K513o656n3648r2276j2563J805L9319K01922O6987
$$ 33194 113784 25427 -71647 -69134 -75790 -129438 -221714 -234277 -232472 -193153 8769 75756
16446G5756p7934k3582J4694k2254m9768K9837P2037J38190P1867r6157j48302
$$ 75756 -2178 -25760 -11066 -33320 -83088 -53251 18786 156976 228843 132686 -15616
16435a5616q9205p9915m704L9330J28635O6430l8430o0389q4581j02456L0316
$$ -15616 -104821 -184736 -189440 -150110 -21475 44955 6525 -53864 -138445 -240901 -210585
16424b10585J51461M4092o6857l6621K7380N194J04916J6319j35877j96886k2771
$$ -210585 -59124 -15032 -81889 -118510 -91130 -85936 18980 35299 -100578 -297464 -320235
16413c20235Q5728Q2129P5112N1788Q5016k1576j38640k7404L6663p5650l2965
$$ -320235 -234507 -152378 -77266 -25478 59538 37962 -100678 -128082 -91419 -167069 -200034
16402b00034K9608l6606l1627O1292O672l3289N9723l4469k032N6613J536m8256
$$ -200034 -170426 -207032 -238659 -177367 -170695 -203984 -144261 -178730 -180762 -124149 -122613 -170869
16390a70869q206q77l5892j279L3187J79644L05813P0801k33811j61230J9475
$$ -170869 -179075 -179952 -215844 -217123 -183936 -4292 301521 372322 138511 -22719 -3244
16379c244j691J8687K4772J18403R5382L1875L3689L0412r099j75849j86503q5432
$$ -3244 -4935 13752 38524 156927 252309 284184 317873 348285 339186 163337 -23166 -108598
16367a08598m2717m6862K6749O4507J4827N607l3940p4416l7616K2760L8466J3344
$$ -108598 -151315 -198177 -171428 -106921 -92094 -86487 -120427 -194843 -232459 -209699 -171233 -157889
16355a57889K9992J3348J2284L6470P6676N453K1820o4647n1514n53N1840P5802
$$ -157889 -127897 -114549 -102265 -65795 10881 16334 38154 -26493 -78007 -78560 -26720 49082
16343D9082M4843O9003M3865m082j19354k52307j78442J1688N6734L1686J2008
$$ 49082 93925 162928 206793 202711 83357 -168950 -347392 -335704 -278970 -247284 -235276
16332b35276n0328j1387J5114L7387m3174K9061J00347o850R655J35784O2606
$$ -235276 -285604 -296991 -281877 -244490 -287664 -258603 -158256 -165106 -155451 -19667 42939
16321D2939j13335r7554o0957l0401N3292J17885Q9475l038O222q0475o9298P6714
$$ 42939 -70396 -167950 -228907 -259308 -206016 -88131 1344 -1694 4528 -75947 -145245 -68531
16309f8531R9526m0196r7184n6593M8267J18733J47519P4119P349Q442K8562o377
$$ -68531 30995 -9201 -106385 -162978 -114711 4022 151541 225660 233009 241451 270013 263636
16297B63636j5330o2386r9101n5836L081j6883q3532j8060L5761k8341R568M4868
$$ 263636 248306 185920 86819 30983 34064 17181 -66351 -84411 -48650 -76991 -67423 -22555
16285b2555J4762L7816P1537r9329j50670p1163N2096J14360Q0372j4120j42690
$$ -22555 -7793 30023 101560 2231 -148439 -219602 -167506 -53146 27226 13106 -129584
16274a29584j35539o6478J7399Q2208N3566o919l4853k8559m1490l4912l5262
$$ -129584 -265123 -331601 -314202 -231994 -178428 -185347 -220200 -248759 -290249 -325161 -360423
$$ [...]
##END NTUPLES=NMR SPECTRUM
##END=
