##TITLE=C13_Pr 5075
 CDCl3+CD3OD, 22300 sc

 13.12.2021
##JCAMPDX= 6.0         $$ Bruker NMR JCAMP-DX V2.0
##DATA TYPE= NMR SPECTRUM
##DATA CLASS= NTUPLES
##ORIGIN= UXNMR, Bruker Analytische Messtechnik GmbH
##OWNER= root
$$ XWIN-NMR		Version 3.5
$$ Tue Dec 14 10:57:32 2021 Russian Standard Time (UT+4h)  she@DPX200
##.OBSERVE FREQUENCY= 50.327896
##.OBSERVE NUCLEUS= ^13C
##.ACQUISITION MODE= SIMULTANEOUS
##.ACQUISITION SCHEME= undefined
##.AVERAGES= 22301
##.DIGITISER RES= 17
##SPECTROMETER/DATA SYSTEM= spect
##.PULSE SEQUENCE= zgpg30
##.SOLVENT NAME= CDCl3
##.SHIFT REFERENCE= (INTERNAL, CDCl3, 0, 222.961)
##AUDIT TRAIL= $$ (NUMBER, WHEN, WHO, WHERE, WHAT)
$$ ##TITLE= Audit trail, XWIN-NMR		Version 3.5
$$ ##JCAMPDX= 5.01
$$ ##ORIGIN= Bruker BioSpin GmbH
$$ ##OWNER= she
$$ F:/spectra/data/she/nmr/c13/1/pdata/1/auditp.txt
$$ ##AUDIT TRAIL=  $$ (NUMBER, WHEN, WHO, WHERE, WHAT)
(   1,<2021-12-14 10:55:25.62 +0400>,<she>,<DPX200>,
      <created by zg, POWCHK disabled, PULCHK disabled
       terminated by command 'halt'
       configuration hash MD5:
       00 E9 B6 7A A2 85 ED C7 34 08 36 98 17 FE 4E 26
       data hash MD5: 32K
       BF BC 6C 7A D6 25 E5 CC B7 3B F7 1A F9 1F 5B 07>)
(   2,<2021-12-14 10:55:45.65 +0400>,<she>,<DPX200>,
      <Start of raw data processing
       efp BC_mod = 2 LB = 1 FT_mod = 6 PKNL = 1 PHC0 = -319.7405 PHC1 = 26.76237 SI = 32K 
       data hash MD5: 32K
       86 62 FF 07 31 02 3E 9B FE 4F B4 59 A2 CF A9 76>)
(   3,<2021-12-14 10:55:58.04 +0400>,<she>,<DPX200>,
      <abs ABSG = 5 
       data hash MD5: 32K
       C3 EC 58 93 32 F0 D4 DA FA DD 8F 70 97 A2 66 72>)
(   4,<2021-12-14 10:56:36.62 +0400>,<she>,<DPX200>,
      <pk PHC0 = 0.3906193 PHC1 = 0 
       data hash MD5: 32K
       1F 8A CA DD C0 F9 40 C1 70 80 C7 6B 75 4F D2 05>)
(   5,<2021-12-14 10:56:53.71 +0400>,<she>,<DPX200>,
      <abs ABSG = 5 
       data hash MD5: 32K
       B0 CC 58 30 F3 34 C2 C4 16 F2 C8 50 2A E8 48 43>)
$$ ##END=
$$ 
$$ hash MD5
$$ 59 A9 B3 EF C9 66 5F 0B 8A 88 95 CE 5E 2F EC BB
##$RELAX= 
##$RELAX= 
##$RELAX= 
##$RELAX= 
##$RELAX= 
##$RELAX= 
##$RELAX= 
##$RELAX= 
$$ Bruker specific parameters
$$ --------------------------
##$DU= <F:/spectra>
##$EXPNO= 1
##$NAME= <c13>
##$PROCNO= 1
##$TYPE= <nmr>
##$USER= <she>
##$AMP= (0..31)
100 100 100 100 100 100 100 100 100 100 100 100 100 100 100 100 100 100 
100 100 100 100 100 100 100 100 100 100 100 100 100 100 
##$AQSEQ= 0
##$AQ_mod= 1
##$AUNM= <au_zg>
##$AUTOPOS= <>
##$BF1= 50.322709
##$BF2= 200.13
##$BF3= 50.322709
##$BF4= 500.13
##$BF5= 500.13
##$BF6= 500.13
##$BF7= 500.13
##$BF8= 500.13
##$BYTORDA= 1
##$CFDGTYP= 0
##$CFRGTYP= 5
##$CHEMSTR= <none>
##$CNST= (0..31)
1 1 145 1 1 1 1 1 1 1 1 1 1 1 1 1 1 1 1 1 1 1 1 1 1 1 1 1 1 1 1 1 
##$CPDPRG= <waltz16>
##$CPDPRG1= <>
##$CPDPRG2= <waltz16>
##$CPDPRG3= <>
##$CPDPRG4= <mlev>
##$CPDPRG5= <mlev>
##$CPDPRG6= <mlev>
##$CPDPRG7= <mlev>
##$CPDPRG8= <mlev>
##$CPDPRGB= <>
##$CPDPRGT= <>
##$D= (0..31)
$$ [...]
##$SUBNAM4= <"">
##$SUBNAM5= <"">
##$SUBNAM6= <"">
##$SUBNAM7= <"">
##$SUBNAM8= <"">
##$SUBNAM9= <"">
##$SW= 239.972175391363
##$SWIBOX= (0..15)
0 1 3 0 0 0 0 0 0 0 0 0 0 0 0 0 
##$SW_h= 12077.2946859903
##$TD= 32768
##$TD0= 1
##$TE= 0
##$TE2= 300
##$TE3= 300
##$TEG= 300
##$TL= (0..7)
120 120 120 120 120 120 120 120 
##$TP= (0..7)
150 150 150 150 150 150 150 150 
##$TP07= 0
##$TPNAME0= <>
##$TPNAME1= <>
##$TPNAME2= <>
##$TPNAME3= <>
##$TPNAME4= <>
##$TPNAME5= <>
##$TPNAME6= <>
##$TPNAME7= <>
##$TPOAL= (0..7)
0.5 0.5 0.5 0.5 0.5 0.5 0.5 0.5 
##$TPOFFS= (0..7)
0 0 0 0 0 0 0 0 
##$TUNHIN= 0
##$TUNHOUT= 0
##$TUNXOUT= 0
##$USERA1= <user>
##$USERA2= <user>
##$USERA3= <user>
##$USERA4= <user>
##$USERA5= <user>
##$V9= 5
##$VALIST= <valist>
##$VCLIST= <CCCCCCCCCCCCCCC>
##$VD= 0
##$VDLIST= <DDDDDDDDDDDDDDD>
##$VPLIST= <PPPPPPPPPPPPPPP>
##$VTLIST= <TTTTTTTTTTTTTTT>
##$WBST= 1024
##$WBSW= 4
##$XGAIN= (0..3)
0 0 0 0 
##$XL= 0
##$YL= 0
##$YMAX_a= 145002176
##$YMIN_a= -35475032
##$ZGOPTNS= <>
##$ZL1= 120
##$ZL2= 120
##$ZL3= 120
##$ZL4= 120
##$ABSF1= 222.961
##$ABSF2= -17.03589
##$ABSG= 5
##$ABSL= 3
##$ALPHA= 0
##$AQORDER= 0
##$ASSFAC= 0
##$ASSFACI= 0
##$ASSFACX= 0
##$ASSWID= 0
##$AUNMP= <proc_1d>
##$AZFE= 0.1
##$AZFW= 0.5
##$BCFW= 0
##$BC_mod= 2
##$BYTORDP= 0
##$COROFFS= 0
##$CY= -3
##$DATMOD= 1
##$DC= 0
##$DFILT= <>
##$DTYPP= 0
##$F1P= 0
##$F2P= 0
##$FCOR= 0.5
##$FTSIZE= 32768
##$FT_mod= 6
##$GAMMA= 0
##$GB= 0
##$INTBC= 1
##$INTSCL= 4.134877e-10
##$ISEN= 128
##$LB= 1
##$LEV0= 0
##$LPBIN= 0
##$MAXI= 10000
##$MC2= 0
##$MEAN= 0
##$ME_mod= 0
##$MI= 0.1934396
##$NCOEF= 0
##$NC_proc= 2
##$NLEV= 6
##$NOISF1= 120.0001
##$NOISF2= 80.00006
##$NSP= 0
##$NTH_PI= 0
##$NZP= 0
##$OFFSET= 222.961
##$PC= 1.4
##$PHC0= -319.3499
##$PHC1= 26.76237
##$PH_mod= 1
##$PKNL= yes
##$PPARMOD= 0
##$PSCAL= 0
##$PSIGN= 0
##$REVERSE= no
##$SF= 50.3227146458226
##$SI= 32768
##$SIGF1= 140
##$SIGF2= 120
##$SINO= 11.81781
##$SIOLD= 32768
##$SREGLST= <13C.CDCl3>
##$SSB= 0
##$STSI= 32768
##$STSR= 0
##$SW_p= 12077.2946859903
##$SYMM= 0
##$S_DEV= 0
##$TDeff= 32768
##$TDoff= 0
##$TI= <>
##$TILT= no
##$TM1= 0
##$TM2= 0
##$TOPLEV= 0
##$USERP1= <user>
##$USERP2= <user>
##$USERP3= <user>
##$USERP4= <user>
##$USERP5= <user>
##$WDW= 1
##$XDIM= 32768
##$YMAX_p= 386293002
##$YMIN_p= -6277176
$$ End of Bruker specific parameters
$$ ---------------------------------
##NTUPLES= NMR SPECTRUM
##VAR_NAME=  FREQUENCY,     SPECTRUM/REAL,   SPECTRUM/IMAG
##SYMBOL=    X,             R,               I
##VAR_TYPE=  INDEPENDENT,   DEPENDENT,       DEPENDENT
##VAR_FORM=  AFFN,          ASDF,            ASDF
##VAR_DIM=   32768,         32768,           32768
##UNITS=     HZ,            ARBITRARY UNITS, ARBITRARY UNITS
##FACTOR=    0.368581032318806, 1,           1
##FIRST=     11220.0027064323, 0,            0
##LAST=      -857.291979557962, 0,           0
##MIN=       -857.291979557962, -6277176,    0
##MAX=       11220.0027064323, 386293002,    0
$$ Real data points
##PAGE= N=1
##DATA TABLE= (X++(R..R)), XYDATA
$$ [...]
15851d09324m0361L09584N11305K70655R4692k57007m67947M2306M45171j4347
15841D84727l46764j40910K14925K27687k04300l25827k32608l30706j73622K93364
15831e34034M18417m5500j58648K066l09335j32822K14652K50363K80847O76833
15821F62839P25531J22212o07352p86728p80086k09405J68498K09757M74943o9816
15811h9607k84781j50647k81516m3668L55562M68053P2697j03424j91305j72277
15801d20913M3425j01286j34977j48709k16215J07865M10396J67156m6854K2523
15791c17589j31015k72901j7756n4254J69543O98528O64960J47130k37412m90972
15781A58262k30641o0902l10251n73803l45503K98112N88293J06284J24887M84039
$$ y = [-409324, -449685, -140101, 371204, 641859, 736551, 479544, 11597, 53903, 499074, 484727, 137963, -2947, 211978, 439665, 235365, -90462, -323070, -653776, -827398, -534034, -115617, -161117, -319765, -317699, -627034, -759856, -545204, -294841, -13994, 662839, 1388370, 1510582, 903230, 116502, -663584, -872989, -704491, -494734, -19791, -89607, -374388, -525035, -806551, -850219, -494657, -26604, 46093, -57331, -248636, -420913, -377488, -478774, -613751, -762460, -978675, -870810, -460414, -293258, -340112, -317589, -448604, -721505, -739261, -793515, -623972, 74556, 739516, 886646, 649234, 158262, -72379, -133281, -443532, -1017335, -1362838, -1064726, -476433, -370149, -245262, 238777]
15771B38777N73963L31538m12808n78295k00549J78195n4882l77986m96503j19246
15761i17796N04152N38301N03761n2118k79452K68115P86978N22556j88762m36930
15751A248805o7398j18659j5591L77720J49218k69737q9911J42028k91958j99554
15741H64963k28624n08654q8803K27552j49160P5956O9934K07818J164m85341
15731a3195l62261m08358o8293M91870N01454l45514l88420l01831k50095r5460
15721a240103K756L47491M30569P2172l6054K98570M69998K7674l65646l50764
15711c43337k45265K52850L96954K93296L86414L58306l7605k89119r2411j60166
15701E19917k50472j93740M7191J08921J33060r349m31404n78665m03305j71209
$$ y = [238777, 812740, 1144278, 731470, 153175, -47374, 130821, 75939, -302047, -798550, -917796, -413644, 124657, 628418, 576300, 296848, 564963, 1351941, 1874497, 1685735, 1248805, 1181407, 1062748, 1047157, 1424877, 1574095, 1304358, 1214447, 1356475, 1064517, 864963, 636339, 127685, 38882, 266434, 117274, 193230, 263164, 470982, 472146, -13195, -375456, -783814, -852107, -360237, 141217, -204297, -592717, -894548, -1144643, -1240103, -1237347, -889856, -459287, -387115, -423169, -124599, 345399, 373073, 7427, -343337, -588602, -335752, 61202, 354498, 740912, 1099218, 1061613, 772494, 680083, 519917, 269445, 75705, 122896, 231817, 364877, 355528, -75876, -654541, -1057846, -1229055]
15691a229055P0840n1001L6843N0430k4033J67700K40965L23294K03519Q999J10155
15680i1344M31214J73320N6379l29903j89586M4916K51150j91147r31839j59766
15670i36606O14581J13314k25024N6596j78883L50o1528o6498R6707K95170L83426
15659I1605K77100l45833m39071l52019k26172M3767K57157O48617R00263N66190
15649A421604N1504l06030m26109o90772m56580J49009K96004l8162j96999K1873
15639a74658j41413n34188q0286M36809M34418R2779k50788N7716L80773K46149
15629D67311n31282l86260j7053P642O3568M4231j04311p0791J46955J84669N19580
15618C24259R1677J86918L15003K83503k3493k89011k87183m21336n66666o82913
$$ y = [-1229055, -1158215, -1209216, -1172373, -1121943, -1145976, -978276, -737311, -414017, -210498, -201499, -91344, 339870, 513190, 569569, 239666, 50080, 94996, 346146, 154999, -776840, -936606, -322025, -208711, -433735, -377139, -556022, -555672, -617200, -683698, -586991, -291821, 91605, 368705, 22872, -416199, -768218, -994390, -950623, -693466, -44849, 855414, 1421604, 1473108, 1167078, 740969, 50197, -406383, -257374, 38630, 468, -196531, -174658, -316071, -850259, -930545, -493736, -59318, 33461, -217327, -159611, 221162, 467311, -63971, -450231, -467284, -459642, -396074, -351843, -456154, -526945, -379990, -195321, 324259, 415936, 602854, 917857, 1201360, 1177867, 888856, 601673, 180337, -386329, -1069242]
15608a069242o7013K24804K10723L64819M19725J31721K0171j63907J47388K33055
15598D52244J58229m6315j58863K36714N53957n9459l24626j70075l40442k65595
15588C5769j10637k13394n9372K56912M6796l5908l8086K21186r0253k51119q8191
15577c26297K67724N24999P9403m24410k62929K67164q7258j99357j89111l14687
15567f64759l40169L6015K86166J14507m4249K51187K63755j49524L7903J31609
15557g7559j57135k96218k50494l48620k43251J95695M62561M96371J77218M16206
15547C74774J45789l49670n48251k02416J53520J19328K39650k83659l12709k36381
15537i00025k48628L7277R2861M6362N93023J029802J13158k48147K5700J54953
$$ y = [-1069242, -1136255, -911451, -700728, -335909, 83816, 215537, 235708, 71801, 219189, 452244, 610473, 564158, 405295, 642009, 1195966, 1136507, 811881, 641806, 301364, 35769, -74868, -288262, -347634, -90722, -43926, -79834, -117920, 103266, 13013, -238106, -326297, -58573, 466426, 545829, 121419, -141510, 125654, 38396, -160961, -350072, -664759, -1004928, -968913, -682747, -568240, -612489, -361302, -97547, -247071, -209168, -77559, -234694, -530912, -781406, -1130026, -1373277, -1177582, -715021, -218650, -41432, 374774, 520563, 170893, -377358, -579774, -426254, -306926, -67276, -350935, -663644, -900025, -1148653, -1111376, -1018515, -972153, -379130, 650672, 763830, 515683, 541383, 696336]
15527F96336j05734K8358L66692q5834o08014o81129n02734O7879K25715K34044
15517c64421J61593k08987j91164k05261j37577Q9633L22371K87574l31473l83973
15507i61685J08442K63768j46292K414J28030K60092L25823l424K12588N82095
15497G71851L69989j11444m92200k92096p2573j73984R3411k79243m56173j8040
15487f60502O6342k2088M6650L5035R8648M12507K35947r623k02778m32653j15182
15476e47697L21371O42194q6594m09827l22483l1869k10650k35385K7985L44924
15466e08031N27497J81763M6177K61560N7048l99366n06868n56217l51907L30574
15456i17770K80313j36979j88204K44366M83131K71787K8801N4199r2873p3033
$$ y = [696336, 590602, 618960, 985652, 899818, 291804, -389325, -892059, -824180, -598465, -364421, -202828, -411815, -602979, -808240, -945817, -856184, -533813, -246239, -577712, -961685, -853243, -589475, -735767, -733353, -605323, -345231, -19408, -22832, 189756, 771851, 1141840, 1030396, 538196, 246100, 173527, -457, 92954, -186289, -642462, -660502, -594160, -616248, -569598, -534563, -435915, -23408, 212539, 202916, 138, -432515, -547697, -226326, 415868, 329274, -80553, -403036, -434905, -645555, -880940, -852955, -508031, 19466, 201229, 247406, 508966, 566014, 166648, -340220, -896437, -1248344, -917770, -637457, -774436, -962640, -718274, -235143, 36644, 65445, 119644, 26771, -46262]
15446d6262J77850r4846m35768l90150k64733K35701R35270M67344k5971m11102
15436A47333m38111j28791j52917O0959l4234P995J53147K09556O0836k20056
15426c34283M70976P66615K45310M2059K3361j50350n5120j2199J28868l5410
15416A089827K5780k80427l53833K65071J60611j29457m27576l57983Q3168J45994
15406B21175L66064J97138l98342o15278l37919j35266K35344L87843L75320K44483
15396E40562p6341N5395M9928L08065P2117J61883K50880j12249n31890j66642
15386E51708P8274l6943j13594l43915J28882J37543j36797k66881j0998J67191
15376A54470J52484J24291K58355k01715k40522L2328k08545l51817p3619J95774
$$ y = [-46262, 131588, 36742, -399026, -789176, -1053909, -818208, 117062, 584406, 558435, 147333, -290778, -419569, -572486, -511527, -545761, -537766, -384619, -175063, -114227, -334283, 136693, 903308, 1148618, 1190677, 1214038, 1063688, 1008568, 996369, 1125237, 1089827, 1115607, 835180, 481347, 746418, 907029, 777572, 349996, -7987, 75181, 221175, 587239, 784377, 386035, -229243, -567162, -702428, -467084, -79241, 296079, 540562, 464221, 519616, 569544, 877609, 949726, 1111609, 1362489, 1250240, 718350, 551708, 629982, 593039, 479445, 135530, 264412, 401955, 265158, -1723, -12721, 154470, 306954, 431245, 689600, 487885, 247363, 279691, 71146, -280671, -354290, -158516]
15366a58516j07195k8077r9769j56424L42585L15152L04279J40608j05015R0891
15356E38519l20275k84171N5238J84265l10837k10547L30283N9602k44723Q1807
15346a20839K83502j73226n31838k69587J69734r3453n51144p5958K1305j39493
15336a480997L9437K43070M35446J68298N6092l29852k52821L5077j97722k03520
15326a487492L03731K13654O5345M73271K71232Q6976L7404L2412K06137M9188
15316B51858r9840p2887k66221n97988l64770j5918P638J7586N2512P8374O03702
15305d05954M52930j2334m04435l44976J39280M22934K95747J53023J13996n2168
15295C58043J76514M09682J64614j62452p07258p69779n6991O95089L41598k5176
$$ y = [-158516, -265711, -293788, -393557, -549981, -207396, 107756, 412035, 552643, 447628, 538519, 218244, -65927, -10689, 173576, -137261, -347808, -17525, 42077, -202646, -120839, 162663, -10563, -542401, -811988, -642254, -735707, -1286851, -1362809, -1341504, -1480997, -1441560, -1198490, -763044, -594746, -538654, -868506, -1121327, -1086250, -1283972, -1487492, -1183761, -970107, -904762, -431491, -160259, -73283, -35879, -3467, 202670, 251858, 152018, 79131, -187090, -785078, -1149848, -1165766, -1158128, -1140542, -1088030, -1009656, -405954, 46976, 34642, -369793, -714769, -575489, -152555, 143192, 296215, 410211, 358043, 534557, 944239, 1108853, 946401, 239143, -530636, -587627, 107462, 449060, 423884]
15285D23884m3961k24947k55818j61603J08386K8145J93198P031l10976r0233
15275c26894n1853l97815j63204Q7515n2796p1619J9781M45319R8901M2006K76014
15264i4645L71623J29338k67962j78263j13654J29780J17850k01473m40189J03887
15254d43708N93991L74618j33244j33389m97M17734J53395l56890j38310j30224
15244B03476k48927n58917k70119p9398L5223L29850N3347j46029R6048M90623
15234i4823L97531k48886n64895j71240k7401M9349k56423p75906k95601Q26793
15224a161502J112797J59876j43681m88611k53850K16385J48447O1014J40693
15215b08432J87228j20702o1243J68956N2097N93613L71742l68103m38780n65936
$$ y = [423884, 379923, 154976, -100842, -262445, -154059, -125914, 67284, 74315, -236661, -326894, -378747, -776562, -939766, -852251, -905047, -976666, -956885, -511566, -412665, -370659, -94645, 276978, 406316, 138354, -39909, -153563, -23783, 94067, -107406, -547595, -443708, 150283, 524901, 391657, 258268, 257771, 675505, 828900, 472010, 333700, 203476, -45451, -604368, -874487, -953885, -918662, -588812, -535465, -681494, -585446, -94823, 302708, 53822, -511073, -682313, -709714, -660365, -916788, -1692694, -1988295, -1161502, -48705, 111171, -32510, -521121, -774971, -558586, -410139, -349125, -208432, -21204, -141906, -203149, -34193, 17904, 611517, 983259, 615156, 176376, -389560]
15205c89560q4182K71623q8297j56679M52225R0479l48871k55926J66196M64361
15195A21369K98749m1233J01733L88j89711l21043K31518L91766L1271K23217
15185H48024n16m93620m63237j90153k90984k54886J95195J25281n688Q3512R0265
15174c56807R1787J67876K4458r3106j50227Q4470k26496n82359j6037M27705
15164f28736J07242P4373J93837L05603L3010l24492k03357k21194n29633k04827
15154a398174L03352L33871K68547J17976L20952Q9852J20325o5113p93380o69991
15144a371783j28880n8159K68696N78066N40288L37538J26937O2112j49258r8514
15134A07043k54173k97901j51554J38347K43187L02768l74915p14604k42264J12824
$$ y = [-389560, -473742, -202119, -290416, -447095, 5130, 95609, -253262, -509188, -342992, 121369, 420118, 378885, 480618, 481006, 291295, -29748, 201770, 593536, 624807, 848024, 847508, 353888, -109349, -299502, -590486, -845372, -650177, -524896, -530584, -447072, -356807, -265020, -97144, -72686, -165792, -316019, -231549, -458045, -1040404, -1056441, -628736, -521494, -447121, -253284, 52319, 85329, -239163, -442520, -663714, -1193347, -1398174, -1094822, -760951, -492404, -374428, -53476, 36376, 156701, 91588, -701792, -1371783, -1500663, -1558822, -1290126, -712060, -171772, 165766, 292703, 354815, 205557, 107043, -147130, -445031, -596585, -458238, -215051, 87717, -287198, -1001802, -1244066, -1131242]
15124a131242J35449J38181K73073J16926K94808M09888J29376l94391k81083
15115c09015J69474M57287L03368J3849n8016J6712k07971n03120k71260L9152
15105c49540J0357J77878P7095j91745j56165q991O9095K66044J41729L2751L69262
15094D37770K14120k04952j11076J31290l00610m93965k32430o3947N7844J08473
15084d57483J45489L72701J18590L0606K27762K34913j66056j07442P1103k84507
15074A85676k70291k07228L1541J37589o6320L5838k41300J18756K92124R4418
15064A10803k2977j06156M1160k86343n71012l43489K60586P2790k50979P2928
15054a022689K41940J49085J74463J264Q2415J13596L84116K32921J16761m17353
$$ y = [-1131242, -995793, -857612, -584539, -467613, -172805, 237083, 366459, -27932, -309015, -139541, 317746, 621114, 634963, 576947, 593659, 385688, -117432, -388692, -349540, -339183, -161305, -84210, -275955, -432120, -441111, -372016, -105972, 35757, 68508, 437770, 651890, 446938, 335862, 467152, 166542, -327423, -559853, -623800, -565956, -457483, -311994, 60707, 179297, 209903, 437665, 672578, 506522, 399080, 470183, 185676, -84615, -291843, -260302, -122713, -189033, -153195, -394495, -275739, 16385, 110803, 87826, -18330, 22830, -263513, -834525, -1178014, -917428, -844638, -1095617, -1022689, -780749, -631664, -457201, -455937, -373522, -259926, 124190, 357111, 473872, 56519]
15044E6519k78871L84919J17538k57776l83266l48296K838Q7165K89851M0131
15034b89248l16017N4641J93976J81891K69614J27459j89664l15877k75741N2230
15024e06736K46475j81430J84023K6866k66665k36027o2242o4520L03915M08984
15014a47357J94509p1280k21897n14783l03731L06237J45633J08110L18941K24464
15004C8846K69901O2436R708J9146Q3554J22917n3109k5014k27985k52708j05529
14993e7837K47089k94599n31060j225J07654J07852P0980k36484p5717l43684
14983a007031j46144K32593M21497K13757J81101J25965Q3834k48446l03542n2599
14973d99015n3293M75739M13512l27249n88997l78766k78301n6296j22044M80109
$$ y = [56519, -222352, 162567, 280105, 22329, -360937, -709233, -706395, -619230, -329379, -289248, -605265, -550624, -356648, -174757, 94857, 222316, 32652, -283225, -558966, -506736, -260261, -441691, -257668, -230802, -497467, -733494, -795736, -860256, -556341, -147357, 47152, -24128, -246025, -760808, -1064539, -758302, -612669, -504559, -185618, 38846, 308747, 371183, 380891, 400037, 483591, 606508, 553399, 528385, 300400, 47692, -57837, 189252, -105347, -636407, -637632, -529978, -422126, -351146, -587630, -663347, -1007031, -1153175, -920582, -499085, -285328, -104227, 21738, 105572, -142874, -446416, -499015, -552308, -76569, 336943, 9694, -579303, -958069, -1236370, -1292666, -1414710, -934601]
14963i34601M48202l7673K4587L33994J83050l17941j7124n923J24201J95803
14953c425j86870m3345O36231L29827K16419o7850p7969j1992K38629N2519J3279
14942A095453j19932l45187P2716L13821j88848o04215o51626l55813K95997K95581
14932a92053j19563l69861J0036K85499j85330o40196k70360O91391J005454L61555
14922E76572P9072l58758q26502m95461k16256p9648N35391L34714j00543j88378
14912g39797Q7874R8941j31207j84956K16549M93115N81569L54654l31543m96222
14902e1023m45887k13865N03465M01728m05957k20977J37955j3095j29547j93421
14892f30624l645J31748p315j34830K0258K07048M12417j15037k6459R0223j75851
$$ y = [-934601, -486399, -524072, -499485, -165491, 17559, -300382, -317506, -323429, -199228, -3425, -190295, -233640, 402591, 732418, 948837, 880987, 803018, 791026, 1029655, 1082174, 1095453, 975521, 630334, 703050, 1016871, 828023, 223808, -427818, -783631, -487634, -192053, -311616, -681477, -671441, -385942, -571272, -1211468, -1481828, -790437, 215017, 576572, 655644, 296886, -529616, -1025077, -1241333, -1320981, -785590, -450876, -551419, -739797, -651923, -552982, -684189, -869145, -652596, -159481, 422088, 776742, 445199, -51023, -496910, -710775, -207310, 194418, -211539, -432516, -294561, -307656, -437203, -630624, -634269, -502521, -509836, -644666, -624408, -417360, -4943, -119980, -146439, -56216, -232067]
14881b32067P1004M66005J15199o14398m00217q0674j6784J31667k17399n49324
14871a326988k20101N51315P91934J11887n93819l84604M31267N00644k59712
14862c98177j29212J29607l34210n4352K12228J34032J56085K67033J58435M3885
14852A85354m5827Q1813N7373j78487l03465Q0909J40125L4559J18883P7535r0947
14841A57825k3928J47864j52364m51670q7764O09337L40666j90774k36665k35731
14831a23204p5264k31732J1997M81580L89781R0329o4414j04324J32260K08261
14821G15270K06996j4673o08948m20183k23809l13938L89419M17728j29330P9665
14811I8197R1261j69794k72312N389p3993N5030L00352O9576K19984J73803n64644
$$ y = [-232067, -161063, 304942, 420141, -194257, -594474, -675148, -691932, -560265, -777664, -1326988, -1547089, -995774, -203840, -91953, -685772, -1070376, -639109, -138465, -398177, -527389, -397782, -731992, -786344, -574116, -440084, -283999, -16966, 141469, 185354, 139527, 221340, 278713, 100226, -203239, -122330, 17795, 52354, 171237, 248772, 157825, 133897, 281761, 129397, -322273, -410037, 199300, 539966, 349192, 112527, -123204, -198468, -430200, -418203, 63377, 453158, 543487, 479073, 374749, 507009, 715270, 922266, 907593, 298645, -121538, -345347, -659285, -269866, 147862, 18532, 98197, 189458, 19664, -252648, -247259, -321252, -266222, 34130, 103706, 323690, 497493, -67151]
14800f7151o18259k73356L7746P4216K39124M74929K69693m94296l57231M96636
14790b17949M64976M42835K34815q8578l73224j24167j60817l44330k6032j25044
14780c17515q6296K6370k67219l38668r692K7317p1470J19962N34196K64406j90847
14769c09456J08524K31521j7563p4780J80427K35382n3603k42756K75862N63100
14759H96658K79089j84363l70463p66182m36286J05126q908j81787r5396o38L50249
14748d12901O7357m51919k16634Q3616O0896J00399L53276k22732l35696j78700
14738a153038k64964k4236K98172L35468m29144m78899K04174O17761L32806R1865
14728d70035N6790j83148J89488K88588J01544J84559N400J15328j29632l08956
$$ y = [-67151, -685410, -958766, -921020, -846804, -607680, -132751, 136942, -357354, -714585, -217949, 247027, 689862, 924677, 836099, 462875, 338708, 177891, -166439, -192471, -317515, -403811, -377441, -644660, -983328, -993020, -965703, -1037173, -917211, -383015, -118609, -309456, -200932, 30589, 13026, -61754, 118673, 354055, 300452, 57696, 333558, 896658, 1175747, 991384, 620921, -145261, -581547, -476421, -485329, -667116, -762512, -763150, -412901, -345544, -797463, -1014097, -930481, -869585, -769186, -415910, -638642, -974338, -1153038, -1418002, -1442238, -1144066, -808598, -1237742, -1716641, -1512467, -894706, -561900, -470035, -413245, -596393, -406905, -118317, -16773, 167786, 173186, 288514, 158882, -150074]
14718a50074J51191L00838Q2195j93230m22191l96097J12608J10469r1221o0317
14708e55829J42479L12900J60239l5476K13323k6852k8608j06833k86099j6061
14698b26817q6662k49505m69009k6592K07905K8191N9011k76294k19802K08410
14688a051164L95357J20142J15776K6402K25600P0036k9746q7294l41978k75115
14678h31984J23226M26811k3578J85609M20071M86215K88960k43652l92536r3626
14668C45516k09933j70223r255l82481l19602K81886M46139m376l42832j76229
14658e41390J46331N5663j35593l20379l67276o4452k14199k6373M03334O90544
14648c73790M43697K1955k85490j30729l31157n43211l2042J00767L20005N22239
$$ y = [-150074, 1117, 301955, 384150, 190920, -231271, -627368, -514760, -404291, -495512, -555829, -413350, -100450, 59789, 24313, 237636, 210784, 182176, 75343, -210756, -226817, -313479, -562984, -1031993, -1058585, -850680, -822489, -763478, -1039772, -1259574, -1051164, -655807, -535665, -419889, -393487, -167887, -97851, -127597, -214891, -556869, -831984, -708758, -281947, -305525, -119916, 300155, 786370, 1075330, 831678, 439142, 345516, 135583, -34640, -43895, -426376, -745978, -464092, -17953, -22329, -365161, -541390, -395059, -339396, -474989, -795368, -1162644, -1227096, -1441295, -1467668, -1064334, -373790, 69907, 91862, -193628, -324357, -655514, -1198725, -1230767, -1130000, -809995, -287756]
14638b87756P3846p93259p88405K2987L51172J69445L21999K27715J26628K74109
14628c01519L11341P8339K48141K69806j19477k28310l59740k46610J28195K6339
14618a93495J51842J12293q4376J29671M82380J26949l47811l18155K3786j9720
14608F3364m37372m73989J08372N28794O2792j0264M7776K24752M88339N09888
14598A112452P7116m17946p79289l25670J15315K20695J71064R1191K04590J10583
14588E80101m567q7639p2658K3612k61993j8048n9928l83187j7309N30906N87005
14577H16295P3638L80524J47181j80261l40050l56121o40730J116L52339j95712
14567E8219j12041J23082j36123k32643k34182N4812K19153N00774J10478l98353
$$ y = [-287756, -213910, -1007169, -1795574, -1772587, -1421415, -1251970, -929971, -702256, -575628, -301519, 9822, 88161, 336302, 606108, 486631, 258321, -101419, -348029, -219834, -193495, -41653, 70640, -13736, 115935, 598315, 725264, 377453, 59298, 83084, 63364, -374008, -847997, -739625, -210831, -148039, -158303, -110527, 114225, 602564, 1112452, 1189568, 771622, -7667, -333337, -218022, 2673, 173737, 264928, 469518, 580101, 575534, 487895, 415237, 438849, 176856, 158808, 98880, -284307, -301616, 229290, 816295, 889933, 1270457, 1417638, 1237377, 897327, 541206, -99524, -98408, 253931, 58219, -53822, 69260, -66863, -299506, -533688, -478876, -259723, 241051, 351529, -46824]
14557d6824k43058j22082K32667O1101m63740p2521N01529M53879M8083Q0107
14547D29141j2685j13799L2938J76351Q7968J16875J10875j73526p0889J57428
14537G40677J51156j45047r9849O5432J64359J27421L96290L99482k22387q99721
14527F77813m23439J70074J94649J16191l5282j79656j71436k29742k60803J29484
14517a2147j28526j54692J39832M43523O35565Q3349j86044J04017L5245l51752
14507F08370j51967j00060J35688L41957L95777j20066q18665m46488L91310M31359
14497F67215j88835n038p9467l27764k27210J83878O59816N9836j87068J3591
14487E68954L884r0451Q5875o0625j29520J70938m7470m79656l37498k78157K1288
$$ y = [-46824, -289882, -411964, -179297, -118196, -581936, -654457, -152928, 300951, 349034, 429141, 416456, 302657, 335595, 511946, 599914, 716789, 827664, 654138, 583249, 740677, 891833, 746786, 646937, 712369, 876728, 1004149, 1400439, 1799921, 1577534, 677813, 254374, 424448, 619097, 735288, 700006, 520350, 348914, 119172, -141631, -12147, -140673, -295365, -155533, 287990, 923555, 1006904, 820860, 924877, 960122, 608370, 456403, 356343, 492031, 833988, 1229765, 1109699, 291034, -155454, 235856, 667215, 478380, 473342, 393875, 66111, -161099, 22779, 682595, 742431, 555363, 568954, 572838, 482387, 568262, 507637, 378117, 549055, 501585, 21929, -315569, -593726, -572438]
14476e72438K25783K78459J75640N21043L70197q8666j96951r8128j76555j43324
14466B95060Q6009K62604K65942L40494k30475m47636j89588n33685p03770n99779
14456a454824k40216K51205N90324J47777k60616J20793O19005P13057K79305
14447G65810m43053j84110J52137o9997o6047K8051J79573K67109k03372j04249
14437C21852J38635J83902P0078n6862R4528O7137k36135n71905n99683k01510
14427g89963K82637N49399K48020m17808k87718j13224m23170l23669M39792N06303
14417c29401N2170N2176P8403K30J24711O9245k56747k01263J24509K39598L01976
14406B55607j22043n58270M9881N73283J83722j85459l26079k80063J0715K39920
$$ y = [-572438, -346655, -68196, 107444, 628487, 998684, 910018, 713067, 614939, 438384, 295060, 381069, 643673, 909615, 1250109, 1019634, 571998, 382410, -151275, -855045, -1454824, -1695040, -1443835, -853511, -705734, -966350, -845557, -226552, 486505, 765810, 322757, 138647, 290784, 220787, 154740, 182791, 362364, 629473, 426101, 321852, 460487, 644389, 714467, 657605, 752133, 819270, 583135, 11230, -588453, -789963, -507326, 42073, 290093, -127715, -415433, -528657, -951827, -1275496, -835704, -329401, -277231, -225055, -146652, -146422, -21711, 47534, -209213, -410476, -285967, -46369, 255607, 133564, -424706, -374825, 198458, 382180, 196721, -129358, -409421, -398706, -158786]
14396a58786J04417j87296l32405n6551q5248J07353N37439q5755n40968p358
14386g05158J33835J40658j03314L9709l5513L12808P55042N67621K04664l65380
14376I44972n71583l83088k99660k30080p0636j46673J91533K87927K59345p9206
14366i7149k25381l28002l62775K12049P3039K8073K55832J53795n8292P8932
14356b69879J52415O543L65348M9076k78488m06260k13047N0265J74853q6782
14346d55956r200J59613l8811k72093k04876K46073M17710k9431j85984k56419
14336f29374k24826J60871P59588N97246l9603j14508J30391R6098k91454l63975
14326H0454r3625r8590r8822J69054M01861J03031l74359j94510L55388Q0619
$$ y = [-158786, -54369, -241665, -574070, -630621, -715869, -608516, -71077, -156832, -697800, -705158, -571323, -430665, -533979, -494270, -529783, -216975, 538067, 1105688, 1310352, 944972, 373389, -9699, -309359, -539439, -610075, -756748, -565215, -277288, -17943, -97149, -322530, -650532, -1013307, -801258, -728219, -700146, -444314, -290519, -348811, -269879, -117464, -110921, 254427, 303503, 25015, -381245, -594292, -544027, -369174, -455956, -465156, -305543, -344354, -616447, -821323, -575250, -157540, -186971, -372955, -629374, -854200, -693329, 66259, 663505, 623902, 509394, 639785, 735883, 444429, 80454, -13171, -111761, -210583, -41529, 360332, 463363, 89004, -105506, 249882, 330501]
14316C30501j92466k2799l64905l67061j20654j48822K44161N76501L4595p9791
14306a10740j21390k11710j23866l51372m85707J33406L31680K7266L05511L14079
14296b92843K4016n47008m22116J00525K82737K4036j44099J89263L99704K93620
14286i2165L45653j55576O1921j8279l69059k82838j45698M0614L40493J57228
14276a17706K36094M82641N3939M2649K4520m74744l49535K73612J96912m2492
14266C25890l86839k83126j55624K53207L61050n0114j967K27954J92893R163
14256D92487k96463n47666m9300k4568l1070L76542K18732L6679J93861r4458
14246B74776j00251K64934K99181N8296m03323l15555j74361N42648M72589m3909
$$ y = [330501, 138035, 115236, -249669, -616730, -737384, -886206, -642045, -65544, -30949, -110740, -232130, -443840, -567706, -919078, -1404785, -1271379, -939699, -912433, -606922, -292843, -268827, -815835, -1237951, -1137426, -854689, -830653, -974752, -785489, -385785, -92165, 253488, 97912, 159833, 141554, -227505, -510343, -656041, -615427, -274934, -117706, 118388, 601029, 654968, 697617, 722137, 247393, -102142, 171470, 368382, 325890, -60949, -344075, -499699, -246492, 114558, 64444, 62477, 290431, 483324, 492487, 196024, -351642, -400942, -425510, -456580, -80038, 138694, 175373, 369234, 274776, 174525, 439459, 738640, 796936, 393613, 78058, -96303, 446345, 918934, 875025]
14236H75025j68841m59180m05139k98749k8551J75329j7820k0158k6859j8696
14226c93639J17085L20155L21040O8206k63318j79351j26273j82536j03890Q3393
14216c39128L57907J35694m3280K59145J31671m75920j50574J33473K8428L12209
14206C49625J10322j95907l51518k22972K96030K29388p1012q5212O9900L80491
14196E09135L24231K30279j27900m15094j79283J95103j446j8644k2327K48053
14186G42107J35296j38901l55025n12214o8286K50626L48709j98013n03339n29134
14176h28174j81597L3620L62626K83475n14760k26029N95623L55635K57520L78889
14166E16828K33328l06418n01171k02633L61583j0012k22130j99421K60888J82384
$$ y = [875025, 706184, 247004, -158135, -456884, -485435, -310106, -327926, -348084, -374943, -393639, -276554, 43601, 364641, 432847, 169529, -9822, -136095, -318631, -422521, -339128, 18779, 154473, 111193, 370338, 502009, 26089, -124485, 8988, 37416, 349625, 459947, 264040, -87478, -310450, -14420, 214968, 143956, 58744, 128644, 509135, 833366, 1063645, 935745, 520651, 341368, 536471, 535025, 516381, 494054, 742107, 877403, 738502, 383477, -128737, -197023, 53603, 402312, 204299, -299040, -828174, -1009771, -976151, -613525, -330050, -844810, -1070839, -475216, -119581, 137939, 516828, 750156, 443738, -57433, -260066, 101517, 91505, -130625, -330046, -69158, 113226]
14156A13226o6264j60823j86796M63881K53148k85911q3082L07710j10297q4988
14146A59804j29820j97224j42336O4367K56229N87029N84740Q2457k53790j16000
14136H95456J08731n16138q21331j61453P1830k7368l7603K62728J48056j2959
14126i0051L28887K64353J15236O6811k97373j56291O0133j97005l28546l33679
14116e67525O1332L40643L19059K39976K16416O6687P2819l7892n6773J46056
14106H00798j18529l45690k60289J86492K53186n6766R6060l3183l82424k43358
14096a03703J60362J04743k27039k85920k18845O8362K57245j73864n32737m77770
14086a429166R6218J97638o1143q2991J8953L52607M73744K67394L18788J54390
$$ y = [113226, 46962, -113861, -300657, 163224, 416372, 130461, 47379, 355089, 244792, 159804, 29984, -167240, -309576, -245209, 11020, 598049, 1182789, 1265246, 1011456, 895456, 1004187, 488049, -333282, -494735, -422905, -450273, -487876, -225148, -77092, -90051, 238836, 503189, 618425, 685236, 387863, 231572, 291705, 94700, -233846, -567525, -506193, -165550, 153509, 393485, 609901, 676588, 749407, 711515, 654742, 800798, 682269, 336579, 76290, 262782, 515968, 459202, 555262, 522079, 139655, -103703, 56659, 161402, -65637, -351557, -570402, -502040, -244795, -418659, -951396, -1429166, -1332948, -1135310, -1196453, -1279444, -1260491, -907884, -434140, -166746, 152042, 306432]
14076C06432p0887l09093m33400j80441K19025K86964K70444P5472j60208k8229
14066b3921j21026k12307p792j61798j99740p6106j743L68806L08100J65089j74923
14055a37361n9785J74734M79923O9173m53817m38747j68178L6972k11020M0993
14045f67113J25332M44924O76552M41174k02855q26357o67735l27924M92883M98323
14035a2796K67485k55694k47902J35277J94297K01963j47876j23470J13784L81179
14025E06247J48801m83603O6864L58887l9963o58386n28213M5322N8384j93082
14015g18742M275L07804q178j72659L5698k78745J95726M66126R5773R9682R0621
14004A17381j21203j29041L22651K87338r1586l05821q4917M33257J60606m81540
$$ y = [306432, 235545, -73548, -506948, -687389, -468364, -181400, 89044, 164516, 4308, -23921, -144947, -357254, -365046, -526844, -726584, -802690, -804433, -435627, -127527, 37562, -137361, -197146, -22412, 457511, 526684, 72867, -365880, -534058, -497086, -708106, -667113, -541781, -96857, 579695, 1020869, 818014, -8343, -676078, -1004002, -511119, -12796, 254689, -1005, -248907, -113630, 80667, 282630, 134754, 11284, 125068, 506247, 655048, 171445, 238309, 597196, 557233, -101153, -629366, -584044, -525660, -718742, -714467, -406663, -414841, -587500, -551802, -830547, -634821, -168695, -72922, 26760, 117381, -3822, -132863, 189788, 477126, 385540, 79719, -5198, 428059, 588665, 107125]
13994A07125k13574L47615J27561L1600k41540m49250k10473q160k4509N8647
13984d74958J18605L97362N91214K31245k30402n88014m51491J0771N12607K95120
13974D12059m83179m02955k16140o4877K45269M69488L56811K08991n3768j22832
13964C48867N6973r4378j99586L0558j90401m41128k07275K6716L21990L87151
13954C9487L32456j68601l15737O8800O9011r7411L31690O32802N40210K14336
13944A647043o10457r53642m69610K26928P85816M34570n1361L6193J30605p3567
13934A102518k30500n50281m88971j33241n2067k45087l60180O5201L04546Q8545
13924d99517k41529l37161R8807J72689L17260L90529k65094l67008L20335L61202
$$ y = [107125, -106449, 241166, 368727, 400327, 158787, -290463, -500936, -509096, -533605, -474958, -356353, 41009, 632223, 863468, 633066, 45052, -406439, -395668, 116939, 412059, -71120, -474075, -690215, -755092, -509823, -40335, 316476, 525467, 471699, 348867, 405840, 311462, 111876, 142434, -47967, -489095, -696370, -669654, -347664, 39487, 371943, 203342, -112395, -43595, 25416, -71995, 259695, 892497, 1432707, 1647043, 1036586, 82944, -386666, -159738, 626078, 1060648, 1009287, 1045480, 1176085, 1102518, 872018, 321737, -167234, -300475, -352542, -597629, -957809, -892608, -588062, -499517, -741046, -1078207, -979400, -806711, -489451, -98922, -364016, -731024, -410689, -49487]
13914d9487K51290J9001J6562j17539k95781k01124K03065J90489M5636J43397
13904B05509L7468m42356n98495l82198J3075J82977J05805M15288L63812l04235
13894d03350l83232J43265M22777j73644p0427N63768N18782K93758M56491M2641
13884A410829m21118m44006o90849n64939l76018j49614M19979M44626N42913
13875A71803L62357k24981j76509k41849n12590Q3264K01904Q7309L23614R9453
13865A73775k54460l8213j03011j61266K7678l95404r9195L93528L05800R0926
13855e9842k64002J47777O6635k44032O991L05700L44618Q7256j18088J39858
13845D12871N1810k11970o34474n24216l41572K05859P13763M38357J90799m05608
$$ y = [-49487, 201803, 220804, 237366, 119827, -175954, -377078, -174013, 16476, 62112, 205509, 242977, -199379, -797874, -1180072, -1166997, -984020, -878215, -462927, -99115, -403350, -786582, -643317, -220540, -394184, -464611, 99157, 617939, 911697, 1368188, 1410829, 989711, 545705, -145144, -710083, -1086101, -1235715, -815736, -371110, 171803, 534160, 309179, 132670, -109179, -621769, -538505, -336601, -249292, 74322, 173775, -80685, -118898, -221909, -383175, -355497, -750901, -850096, -456568, -150768, -59842, -323844, -176067, -109432, -353464, -346473, -40773, 303845, 391101, 273013, 412871, 464681, 252711, -381763, -905979, -1247551, -1041692, -327929, 110428, 301227, -104381]
13835a04381l07707r8385n9603J03237M85095J94536l39145l37886L96274K61655
13825A93690q8661m4958M40106L23472J26543K8161j86164l22837k46459N9060
13815B81953K18282j05892k13529O5008J59811k62064l60691l20687l01589l34675
13805a174073l3310J2117K66193P50615O70367L5346l1691n32349p59408J0694
13795g85499J77125O9213K36573p1568l53674J94284J00878k22041p2504K11476
13785e15737M81223M67267R0754j49329P4572K13157n27257o43876o3164K20886
13775c51504K19849N067k54457J9507J29749K05088j44667j78813j12047O1664
13765d00564j85182P792K85847L6654l87378q8053L1251l1781O7222k03734k83394
$$ y = [-104381, -412088, -510473, -570076, -466839, 18256, 212792, -126353, -464239, -67965, 193690, 105029, 60071, 500177, 823649, 950192, 978353, 792189, 469352, 222893, 281953, 500235, 394343, 180814, 245822, 405633, 143569, -217122, -537809, -839398, -1174073, -1207383, -1195266, -929073, -178458, 491909, 527255, 495564, -36785, -796193, -785499, -608374, -539161, -302588, -374156, -727830, -533546, -432668, -654709, -727213, -515737, -34514, 432753, 523507, 374178, 448750, 661907, 134650, -509226, -572390, -351504, -131655, -126588, -381045, -361538, -231789, -26701, -171368, -350181, -462228, -400564, -585746, -577954, -292107, -255453, -642831, -730884, -699633, -731414, -664192, -867926, -1151320]
13754a151320J07688K25823q9624J45541o5246j04868K83496K93376K79879P1293
13744c962k54615n5396J13510N29098J94580l64935J11360J46053m6654J09058
13734D78097Q6033J17822M18443J69562m36682m52707Q6432k5507J27552N5304
13724F24349m19384j67815K18730o2619j66101J00757O8827l5623p2103m91744
13714d02726l20548m59879l73723L9099K96091L49134L69142M55017K90410k61456
13704a9439n31787K16996J59567j75473R3293l8658k30478j31223j00645q2702
13694h40549J56097J37737j7693K22781M03785K97325o0868k2862k9156l7139
13684B09458P4565m27612n88790N4235J9622j15440r3551K02045M35360M20173
$$ y = [-1151320, -1043632, -817809, -907433, -761892, -827138, -932006, -648510, -355134, -75255, -3962, -258577, -313973, -200463, 328635, 523215, 158280, 269640, 415693, 369039, 478097, 564130, 681952, 1100395, 1269957, 833275, 380568, 467000, 441493, 569045, 624349, 204965, 37150, 255880, 193261, 27160, 127917, 196744, 161121, 89018, -402726, -723274, -1183153, -1556876, -1517777, -1221686, -872552, -503410, -48393, 242017, -19439, -551226, -334230, -174663, -350136, -256843, -295501, -525979, -657202, -757847, -840549, -684452, -546715, -564408, -341627, 62158, 359483, 298615, 275753, 246597, 209458, 284023, -143589, -732379, -678144, -658522, -773962, -867513, -665468, -230108, 190065]
13674A90065L68613j55015k20840N3595k86921l9838J48437J75572J40600j51420
13664B22848J03348J69397k95688k25156j03608R9050J30129K24163r7221m72272
13654b45010k99054J4685r9975n24707l02294J09408O91252M96425j24282k21747
13644e05299m1950j26828J58789J70944k35631k17001J47823M04268J00314l78831
13634e23402k36745J03087r5626p5513J53462J63556K62618L58839J63955k08835
13624F5396n96342k28847J60033P09631O87134L2282j53547L6954J50142l71919
13614D90917m66178j60407k2118n9429m19385j48236j12932p0665J81597L28281
13604d58555K19443J11291Q9218k07045k28439O8060K7025K65605N05842M00820
$$ y = [190065, 558678, 403663, 182823, 236418, -50503, -90341, 58096, 233668, 374268, 222848, 326196, 495593, 199905, -25251, -128859, -29809, 100320, 324483, 227262, -245010, -544064, -529379, -629354, -1154061, -1456355, -1346947, -655695, -159270, -283552, -505299, -547249, -674077, -515288, -344344, -579975, -796976, -649153, -244885, -144571, -523402, -760147, -657060, -752686, -828199, -674737, -511181, -248563, 110276, 274231, 65396, -530946, -759793, -599760, 109871, 797005, 829287, 675740, 712694, 862836, 490917, 24739, -135668, -157786, -217215, -636600, -784836, -897768, -968433, -786836, -458555, -239112, -127821, -38603, -245648, -474087, -406027, -379002, -113397, 392445, 793265]
13594G93265r6510j98298o15774j10240K50490p5351J91874J70047k30493m80716
13584d01706l06263N5506L46244r7723k71673k38980j06193M65952N0356l38114
13574h42594k6097R5351J96934J28381R4589k57136k51068L52552K16053J53461
13564a39574L33657N09847j25225q29723o1654R6288j03268n7708o2342J15425
13554c24277L43067M09332q2462k51621k9893J12915K96782J32259k01633q4743
13544C19726J80264m4015j9089j56753l19877J24361n1072o294o4901o53486k14666
13533i05802M69300Q04718O2158k90539K31612K61854k34580j58603j14492q5312
13523D0314l58834m16836L76051M66367K81725q8451l4663K26684k9671n36393
$$ y = [793265, 696755, 498457, -117317, -227557, 22933, -52418, 139456, 309503, 79010, -401706, -707969, -652463, -306219, -403942, -675615, -914595, -1020788, -554836, -504480, -842594, -868691, -773340, -576406, -448025, -353436, -610572, -861640, -509088, -293035, -139574, 194083, 703930, 578705, -251018, -312672, -216384, -319652, -377360, -439702, -324277, 18790, 428122, 345660, 94039, 64146, 177061, 473843, 606102, 404469, 319726, 499990, 455975, 436886, 280133, -39744, 84617, 33545, 27251, -37650, -691136, -905802, -436502, 368216, 430374, 139835, 371447, 633301, 398721, 240118, 125626, 40314, -318520, -735356, -359305, 107062, 388787, 300336, 265673, 492357, 462686, -73707]
13513g3707k30971r6918l06604r8678J68151k9722J27461K33801O6471l10324
13503e51040k28356N6086Q8511M069j32813R608N09227M39225j82762m2224p8263
13492a08732O7991j93843o02974k70743O2704J91192J52208L60765J82627J90638
13482C1833L14766M4011k05872k02343l52994j63563j70451k4339M7785n1866
13472g33033J5222j25883j24642M79409N94014K71035L0916r1951j27955p26872
13462e39740l83515L6539K59609L28113K91254j03663k62168J9070j00873j59259
13452f14633N5565J77786L48948L57610q2408k08552p2822R3076j49010o39195
13442g33635m23130K22635j00862m21033j34924j00959J71324M71166N51287K46372
$$ y = [-73707, -304678, -401596, -708200, -806878, -638727, -668449, -540988, -307187, -240716, -551040, -779396, -723310, -634799, -630730, -763543, -753935, -244708, 194517, 11755, -30469, -108732, -40741, -234584, -837558, -1108301, -1045597, -854405, -702197, -341432, -158805, 31833, 346599, 390610, 184738, -17605, -370599, -534162, -704613, -728952, -681167, -733033, -717811, -843694, -968336, -488927, 105087, 376122, 407038, 315087, 187132, -539740, -923255, -886716, -627107, -298994, -7740, -111403, -373571, -354501, -455374, -614633, -559068, -381282, -32334, 325276, 242868, 34316, -38506, 54570, -94440, -733635, -1156765, -934130, -1034992, -1456025, -1590949, -1691908, -1520584, -1049418, -498131, -251759]
13432b51759L31533l43047j04186N03628M10498L26209M3960r4042k23698n01358
13422I7738l70006R8041L98636M6186k39882j55558L6586J82967J6975K7289Q194
13411A47166m67538l28787K25483J18373o1224M20138M10673j89564J14389N98698
13401I87807J36216m36362j50496J98249j95458m87561l88982k02498j69289M6946
13391f61428K58694J10190j25506J240K25175N19976J69480l27365l63103O1695
13381a30952j41340l68780L03968N59782p9055j54111j72125j22872L54916K19813
13371B69244l6892L3761J39485j48691r428j4453o2994j70520l1520L79018J79911
13360E26921k59362l15834R8487M8672K75489K13636l35203j69492j20157j9711
$$ y = [-251759, 79774, -263273, -367459, 136169, 546667, 872876, 916836, 822794, 599096, 97738, -272268, -174227, 224409, 270595, 30713, -124845, -88259, 94708, 111683, 138972, 147166, -320372, -649159, -423676, -305303, -366527, 53611, 464284, 274720, 389109, 987807, 1124023, 687661, 537165, 735414, 539956, 52395, -336587, -539085, -708374, -661428, -402734, -292544, -418050, -416810, -191635, 328341, 497821, 170456, -192647, -130952, -272292, -641072, -337104, 222678, 143623, -10488, -182613, -305485, 49431, 269244, 232352, 266113, 405598, 256907, 247479, 233026, 170032, -488, -32008, 347010, 526921, 267559, -48275, 50212, 98884, 374373, 588009, 252806, 83314, -36843, -56554]
13350e6554K33545Q0528p1093O5522L35260L2534k95547l60111n97729k54000
13340h87645o6917L11086K7466k85804j67761R9788K33537L85217L96283j27789
13330h2539k84525j15462J0229j53418j45946j8476J42919J34947J62693l3109
13320c82687J52270N92454L60095K4216m39805m20922j83158l66836l52293l74941
13310a391607j227K75609M86563M31233M04009K41579K1418r4860O349L7736n3771
13299C63031o6746j70455N1617k1192j99416j04341n3071j20371K50651L97968
13289C27675J60245L4955J2527l72973m69189N5545J51836K41849r1094j65395
13279a14019m8347j00288J07659M13733M55422L5516L8681M97874J68011k31893
$$ y = [-56554, 176991, 257519, 186426, 251948, 587208, 619742, 324195, -35916, -633645, -887645, -954562, -643476, -616010, -901814, -1069575, -969787, -736250, -351033, 45250, -82539, -367064, -482526, -472297, -625715, -771661, -790137, -647218, -512271, -349578, -382687, -230417, 362037, 722132, 746348, 306543, -114379, -297537, -664373, -1016666, -1391607, -1392834, -1117225, -630662, -199429, 204580, 446159, 467577, 372717, 379066, 416802, 363031, 296285, 125830, 177447, 156255, -43161, -147502, -200573, -320944, -70293, 327675, 487920, 522875, 535402, 162429, -306760, -251215, -99379, 142470, 51376, -114019, -162366, -262654, -154995, 258738, 714160, 749676, 788357, 1286231, 1454242, 1222349]
13269A222349l65666r9011j27175p8983R358k73450k06672J31858J13699K5045
13259C51352m9969L37025P0362Q9648P43408L43255j9067n8828L7576j92656k26279
13248A425827R9721J19161l47837p5206J32027k31615m35015j41535K69074M25037
13238A239639r3705j53160j09454m43539k36808L26555L84832M29476o4445l57370
13228I22021n21380j51986J61082J97570J24567j43948l03458m40288p0605L33916
13218A07491J17175M11078L92832n7220k27167k78853M6889J5984n4674k34793
13208B38742k4107K41414k69509m62827L13667M28092l31078l13293K02390K36784
13198B60275O1520j16865j99680k91530j02466K0746J66328N56065J45335m5449
$$ y = [1222349, 856683, 757672, 630497, 551514, 560872, 287422, 80750, 212608, 326307, 351352, 301383, 638408, 708770, 798418, 1541826, 1885081, 1866014, 1807186, 1844762, 1652106, 1425827, 1525548, 1644709, 1296872, 1221666, 1353693, 1122078, 687063, 545528, 814602, 1239639, 1145934, 992774, 883320, 439781, 202973, 529528, 914360, 1343836, 1279391, 922021, 400641, 248655, 409737, 607307, 731874, 587926, 284468, -155820, -226425, 107491, 224666, 635744, 1028576, 971356, 744189, 465336, 512225, 528209, 473535, 238742, 214635, 456049, 186540, -276287, 37380, 465472, 134394, -178899, 23491, 260275, 321795, 204930, 5250, -286280, -388746, -368000, -201672, 354393, 499728, 454279]
13188D54279K47084J98328n0577l63971j99760J12510M65072m5370n91463k05714
13178B0418l445k33251j41343k86706p8083O54026N09711L72405L65313k3904
13168A155141k05211O1524P7731l2473j08272J4047J53137q9800k14355j79087
13158F32382M48202L20350j39539j51098j43182j37760K46438L26531q8463L8064
13148A351925M3313l91541r8956r1881k48664P3568k15215M4383N03182K97926
13138A268040j7555J3762j57041J40542M83002K73404j99097k61325k3182j79080
13128A341470J76732J22657j65221l20755k15185M05913M06796l70638m68262
13119I13507l96662q5801K36419p0429k83917J22664L21397r3889J00362j8391
$$ y = [454279, 701363, 899691, 849114, 485143, 285383, 397893, 862965, 817595, 226132, 20418, 16973, -216278, -357621, -644327, -722410, -68384, 441327, 813732, 1179045, 1155141, 949930, 1011454, 1089185, 1056712, 948440, 962487, 1115624, 1025824, 811469, 632382, 1080584, 1400934, 1261395, 1110297, 967115, 829355, 1075793, 1402324, 1313861, 1351925, 1395238, 1003697, 904741, 812860, 564196, 637764, 422549, 466932, 970114, 1268040, 1250485, 1264247, 1107206, 1247748, 1730750, 2004154, 1805057, 1543732, 1520550, 1341470, 1518202, 1640859, 1475638, 1154883, 939698, 1345611, 1752407, 1381769, 913507, 516845, 431044, 667463, 597034, 313117, 435781, 757178, 663289, 763651, 745260]
13109G45260K77709J8870j02847k70554k58255j96498N0805L77462p8172j85258
13099C78522M57344K58696K56001K39112J67791K5821n598J74204O7473J0613
13089B029979p9115m67139o00254k548K50747R9605O2434P8270K05905J43393
13079A721277O8545J29973n23274o09553k6051L48050M42354O2358j14188k04666
13069A294825l50654n8441K10260N1390l8618L20438M06805J52227L5143L9289
13059B062664r7634P4780l0522l66483m9095L10670K49599J20438P5870j01040
13049B249247m78219P1305J05355l05187K53196K84640o5006K86112O3569P5248
13039B540260n5303n10374k38989K42260N37286N61050M22470M23186L29922N3903
$$ y = [745260, 1022969, 1041839, 938992, 668438, 410183, 213685, 264490, 641952, 563780, 378522, 835866, 1094562, 1350563, 1589675, 1757466, 1783287, 1777689, 1951893, 2019366, 2029979, 1950864, 1483725, 883471, 880923, 1131670, 1231275, 1293709, 1371979, 1577884, 1721277, 1789822, 1919795, 1396521, 786968, 760917, 1108967, 1551321, 1613679, 1499491, 1294825, 944171, 885730, 1095990, 1147380, 1108762, 1429200, 1836005, 1988232, 2023375, 2062664, 1965030, 2039810, 2009288, 1642805, 1593710, 1904380, 2153979, 2274417, 2350287, 2249247, 1771028, 1842333, 1947688, 1642501, 1895697, 2180337, 2115331, 2401443, 2465012, 2540260, 2484957, 1974583, 1735594, 1977854, 2515140, 3076190, 3498660, 3921846, 4251768, 4305671]
13029D305671J78131Q3682J41674J5092l8942K19100P9779J61236K04910J37583
13019E487916N57058L74511r564J39136O45730Q46980O59930N16073N18257M27931
13009A0163958P03917J012649P50304J016158J833816K035304J634367K005441
13001B1155914K859330L242147L831887M956846O127573P505388R054349J1601951
12993G0335385J5092948J9401316K5462577L4309658M5749591N7555711O2232675
12986C30139861M4220915l5575m3572438o0449527n5621956m4129008l3404950
12979A37147322k5336061j9184992j4590993j1352199q924215p385835o470301
12972D3902726n325143m203092l321063l132116k595554k028768j965319j714152
$$ y = [4305671, 4483802, 4567484, 4709158, 4724250, 4685308, 4904408, 4984187, 5145423, 5350333, 5487916, 6044974, 6419485, 6409921, 6549057, 7194787, 8041767, 8701697, 9217770, 9736027, 10163958, 10867875, 11880524, 12630828, 13646986, 15480802, 17516106, 19150473, 21155914, 24015244, 27257391, 31089278, 36046124, 42173697, 49679085, 58733434, 70335385, 85428333, 104829649, 130292226, 164601884, 210351475, 267907186, 330139861, 374360776, 374325201, 330752763, 270303236, 214681280, 170552272, 137147322, 111811261, 92626269, 78035276, 66683077, 57758862, 50373027, 43902726, 38577583, 34374491, 31053428, 27921312, 25325758, 23296990, 21331671, 19617519]
12964A9617519j115131q62834j383573j150611q46055j152839o62680k16666m72353
12955A1754777o78147o27207o21708n88308k81951N8515K36635m26643p92501
12946H033462k39433J20722j18575j20297r4557k9159L66479J81296J03152J54856
12936H357946N14051O16180Q50891J153229Q27337N98747Q34910J734672K553086
12927A8041049K827720J937353M38454r79937j369836j133415m49050j40194J51825
12918A9323969P42591J207139J366952J191035J415747K671042L676511M850775
12910C6445761N802159P100448R052997J1243619J4203269J8582977K4170689
12903A26601919L1662297M2640588N5438274O4470550N3709978J1769396l8088008
$$ y = [19617519, 18502388, 17639554, 16255981, 15105370, 14259315, 13106476, 12443796, 12227130, 11754777, 11076630, 10449423, 9827715, 9239407, 8957456, 9015971, 9252606, 8825963, 8033462, 7794029, 7914751, 7796176, 7675879, 7581322, 7552163, 7918642, 8099938, 8203090, 8357946, 8871997, 9488177, 10339068, 11492297, 12319634, 12918381, 13753291, 15487963, 18041049, 20868769, 22806122, 23244576, 22264639, 20894803, 19761388, 19312338, 19172144, 19323969, 20066560, 21273699, 22640651, 23831686, 25247433, 27918475, 31594986, 36445761, 42247920, 49348368, 58401365, 69644984, 83848253, 102431230, 126601919, 158264216, 200904804, 256343078, 320813628, 374523606, 386293002, 348204994]
12896C48204994o1974858n9945085m7316886l5249119k6992952k0621628j5712290
12889H0392176j2439220r981939q275158o476440n045414l983710l453099l104005
12881B7633191k783366k470189j735384j258868j290003j714807j622062r78242
12873A3780270o54674r74796o56631k30114m26153n36639l00298k59422l59236
12864I382307m69128m62115l56662K21488P41781K40019j88623j07341j75887
12855H825839j22759j93530j21045j713j34844q6669k22358j68192j93536l00866
12845G280327j44598K66166L68015O08747P71378O74600L98104L01359L03070
12836A0827168K83309M72257O76044N38987J061404J407613J454929J948331K059185
$$ y = [348204994, 286230136, 226285051, 178968165, 143719046, 116726094, 96104466, 80392176, 67952956, 57971017, 49695859, 43219419, 38174005, 34190295, 30737196, 27633191, 24849825, 22379636, 20644252, 19385384, 18095381, 16380574, 14758512, 13780270, 13125596, 12150800, 11494169, 11264055, 10837902, 10301263, 10000965, 9741543, 9382307, 8913179, 8451064, 8094402, 8315890, 9057671, 9297690, 9109067, 9001726, 8825839, 8703080, 8509550, 8388505, 8386792, 8251948, 8165279, 7942921, 7774729, 7581193, 7280327, 7135729, 7401895, 7769910, 8378657, 9150035, 9824635, 10222739, 10524098, 10827168, 11110477, 11582734, 12258778, 12797765, 13859169, 15266782, 16721711, 18670042, 20729227]
12827B0729227K212661K989751M203933N536828O273284P295507Q799533J0691782
12819F8732506J3295867J7042382K2123262K9565200L9963685N2123769O1555229
12812C04401900N5608224K1289539k7539679n6898055n9246370m9689582l8394543
12805A49531434k8762383k1474692j6557912j3177777j0410573q067157o541207
12798D4539733n394658m388558m153547l287266k294512k008979j882079k021691
12790A9108443j898024j587697j281490q77392n24154o08052p21438p51100p21421
12781A0137675p52299q88921n69561j76245l87891n65954l40056j66849l90545
12772E899354p10911k81878j87657m78138m63181J35134k7913p16438o18908L81623
$$ y = [20729227, 22941888, 25931639, 30135572, 35672400, 41945684, 49241191, 58040724, 68732506, 82028373, 99070755, 121194017, 150759217, 190722902, 242846671, 304401900, 360010124, 381299663, 353759984, 296861929, 237615559, 187925977, 149531434, 120769051, 99294359, 82736447, 69558670, 59148097, 51080940, 44539733, 39145075, 34756517, 30602970, 27315704, 25021192, 23012213, 21130134, 19108443, 17210419, 15622722, 14341232, 13463840, 12939686, 12331634, 11610196, 10859096, 10137675, 9385376, 8496455, 7926894, 7750649, 7362758, 6796804, 6456748, 6289899, 5899354, 5188443, 4906565, 4718908, 4240770, 3777589, 3912723, 3884810, 3168372, 2549464, 2931087]
12762B931087P39818J18621J59470J94332p6954l54881j66936q7636k06516m95503
12752B754902m54807k2355k08576m20054l58720l17581M2077J59301K96019J70525
12742A640731L3787j73032l5634m87275k79938k41873p2088J52503l3692J37874
12732F41363m9938r3467L06140K76078K29191N4611k09369j10911j06812P8617
12722A015503m37379m56910p2509N3848j42764L830K03084J6481M68800K22608
12712H74592j19380J28389P7963r4664j38958J59747Q0771J9556K65548j09543
12702A144021J68317N93435J5293l35059p27238n15568j38772m2833j49162k46528
12692b34094l3941K68338K90350J36508L94454N11543K96718j59534n59008l46250
$$ y = [2931087, 3670905, 3789526, 3948996, 4143328, 4066374, 3711493, 3544557, 3456921, 3250405, 2754902, 2300095, 2277740, 2069164, 1649110, 1290390, 972809, 1014886, 1174187, 1470206, 1640731, 1674518, 1501486, 1465852, 978577, 698639, 456766, 384678, 537181, 503489, 641363, 591425, 497958, 804098, 1080176, 1309367, 1363978, 1154609, 1043698, 936886, 1015503, 578124, 121214, 48705, 102553, -40211, -36381, 166703, 183184, 651984, 874592, 755212, 883601, 961564, 866900, 727942, 887689, 968460, 988016, 1253564, 1144021, 1312338, 1905773, 1921066, 1586007, 858769, 343201, 204429, 161596, 12434, -234094, -268035, 303, 290653, 427161, 821615, 1333158, 1629876, 1470342, 911334, 565084]
12682E65084j8226Q3978r4751p7936j29660L12408M20666L50334L13858J34723
12672A860478l83682o16793m34606j72720o3186J18948L70635O04746J93431l59313
12662A117938j4518k84229m28696J47890P7670k59693n08310j15520K80571K52746
12652B65849J42539K07958K48280o0407k40047q2392K29021R267k50517k9676
12642D39875k26666k40450J50086M55915M83058M2472m91785q91282k66640M32785
12632a12632M20607K54513K89334K3021m68351p8875K85130m53118l35775J61913
12622a4233J33836M72210M16034m7094l38721k35763k3344J52687J15601j75880
12612D55333q2438n7254j12557M1927Q9592K14171j52169k88976N8899O41728
$$ y = [565084, 546858, 630836, 536085, 458149, 328489, 640897, 1061563, 1411897, 1725755, 1860478, 1476796, 860003, 425397, 252677, 189491, 308439, 679074, 1283820, 1477251, 1117938, 1103420, 819191, 390495, 538385, 616055, 356362, -151948, -267468, 13103, 265849, 408388, 616346, 864626, 804219, 564172, 481780, 710801, 720068, 469551, 439875, 213209, -27241, 122845, 578760, 1061818, 1104290, 612505, -278777, -545417, -112632, 307975, 562488, 851822, 874843, 406492, 327617, 612747, 159629, -176146, -14233, 119603, 591813, 1007847, 960753, 622032, 386269, 362925, 515612, 631213, 455333, 372895, 315641, 203084, 245011, 334603, 548774, 396605, 107629, 166528, 808256]
12602H08256P69161Q334q82629o13687l07748l37022q3392N24292O28602j08878
12592D05289l8073K60774M7263n6538J14392K32148J40093J3707r9841j88372
12582H30842N3806j47605l16579j77893k32390p129p3173K40664J31109j71411
12572A30241l33670j25580J5865M6492N36699N55749P8250J7044m89138l41803
12562I0149r405K85586K86056M05007l6725l93241m80410m15948M62299L01843
12552D95211J79182K50318l89129m01339k60683j79207J85373K88644J14973K56936
12542E40279j43013j33806k43222l03413k23458j03009K90806K51676O3341N4643
12532E0824j4492l93365k77917o874l40420P1848J32142p9503n5345k73582j63835
$$ y = [808256, 1577417, 1585751, 703122, 89435, -218313, -555335, -638727, -114435, 514167, 405289, 367216, 627990, 675253, 618715, 733107, 965255, 1105348, 1119055, 1019214, 830842, 884648, 737043, 420464, 242571, 10181, 3052, -70121, 170543, 301652, 130241, -203429, -329009, -313144, -266652, 270047, 825796, 904046, 921090, 431952, 90149, 80744, 366330, 652386, 1057393, 1020668, 627427, 147017, -268931, 193368, 495211, 674393, 924711, 535582, 134243, -126440, -305647, -120274, 168370, 283343, 540279, 397266, 263460, 20238, -283175, -506633, -609642, -318836, -67160, -3819, 50824, 36332, -357033, -634950, -641824, -982244, -910396, -778254, -857757, -913102, -1186684, -1350519]
12521a350519N38297P15091J64205o7420o70655m83018L37599M40085K30460J7209
12511a28666k51583k70915K48467O88622K54854j21035m41822k10694m7470l22791
12501f03033r4168K94250L88063J66549k78236k06504J00717L44865K88522K95077
12491F96102J46353l39420k84296J27627K32440O0021k90888k33528J599J76105
12481B92115L24850K49020q6632j89234m12303k18876m3164K23630K69075M20743
12471H29224L26492M4917Q0412q343k64038m6864K45461J49636k80023l03253
12461G73621k95528l60658k47527J24246n275j03607J45774M36335J29487J62533
12451G59401P5212M5928l39717l43482k31821k85583m04881k27724J86605N90237
$$ y = [-1350519, -812222, -97131, 67074, -346, -671001, -1154019, -816420, -376335, -145875, -128666, -380249, -651164, -402697, 285925, 540779, 419744, -22078, -232772, -280242, -603033, -697201, -402951, -14888, 151661, -126575, -333079, -232362, 112503, 401025, 696102, 842455, 503035, 218739, 346366, 578806, 638827, 347939, 114411, 116010, 292115, 616965, 865985, 779353, 590119, 177816, -41060, -84224, 139406, 408481, 829224, 1155716, 1200633, 1281045, 1272702, 1008664, 961800, 1207261, 1356897, 1076874, 773621, 478093, 117435, -130092, -5846, -11121, -114728, 31046, 467381, 596868, 759401, 834613, 880541, 540824, 197342, -34479, -320062, -724943, -952667, -766062, -175825]
12441a75825N69730Q7219k80444j88516L45155R48324K06274k46394j15078K01591
12431A352036p8939k82502M1850J58728J72310k39113l79925n13717j61172J89274
12421B58830M6828K5359p8043m15914l20712J46721K68961j23929l26291p6014
12411e94204L37088N10897K08336N4767q7736m21605P1119O8524m8723k08412
12401a09949J70109L07259j99294m45508j03658k18772O9954K51236Q0614p7744
12391b75753Q8687l61381q1990N39681K07093m0421k49046k08229l36196j29763
12381h47318q0982j89852M1948M45171M02376j93414J45581K89920j43835m883
12371a35288J83146j30111l30998j00702p4075r6725K75714M33810j87566R5881
$$ y = [-175825, 393905, 481124, 200680, 12164, 357319, 1305643, 1511917, 1265523, 1150445, 1352036, 1273097, 990595, 1032445, 1191173, 1363483, 1124370, 744445, 230728, 69556, 258830, 305658, 331017, 252974, -162940, -483652, -336931, -67970, -191899, -518190, -594204, -257116, 253781, 462117, 516884, 429148, 7543, 78662, 147186, 98463, -109949, 60160, 367419, 168125, -277383, -381041, -599813, -529859, -278623, -198009, -275753, -187066, -548447, -630437, -90756, 116337, 75916, -173130, -381359, -717555, -847318, -928300, -1118152, -1076204, -631033, -228657, -422071, -276490, 13430, -130405, -135288, 47858, -82253, -413251, -513953, -588028, -684753, -409039, 24771, -162795, -66914]
12361f6914j41820j9123O88672Q03914K60741k60930m67664N3304R9947o2036
12351H88091K42629Q2531Q04J19942k77432l97503j28923l58052J3891M11834
12341E97812j35122k35256K71L08885K75777J26887r720l53407j07734K37024
12331G05417P9703k59139k79800r9628j18031P6864K57832P8676j22809p5470
12321B43615n5371k55713k56176l38181l6782L77744Q1417O0436M02307K97l63518
12310a39925q4239K76674L8676o5024j80468k89388L14321O36344M6987m26046
12300A27912j80407J35728J80609l22758j82334n987J23769O69997N22605L8957
12290A108091l38266j0378k7825l41563o4382L44418m41345q61161o57481j91124
$$ y = [-66914, -208734, -227857, 460815, 1264729, 1525470, 1264540, 796876, 850180, 950127, 888091, 1130720, 1213251, 1214055, 1333997, 1056565, 659062, 530139, 172087, 185978, 597812, 462690, 227434, 227705, 536590, 812367, 939254, 929534, 576127, 468393, 705417, 785120, 525981, 246181, 146553, 28522, 105386, 363218, 441894, 319085, 243615, 188244, -67469, -323645, -661826, -698608, -320864, -239447, -179011, 223296, 223593, -139925, -224164, 52510, 91186, 26162, -154306, -443694, -129373, 506971, 553958, 127912, -52495, 83233, 263842, -58916, -241250, -247237, -123468, 546529, 1069134, 1108091, 769825, 759447, 731622, 390059, 325677, 670095, 228750, -632411, -1289892, -1481016]
12280a481016M73485L97433K32443j88439k88929K51782J33137j39778L8615j52285
12270g23552J85509L85024J95494J84635Q7645l3865J71320M2586l26993k36321
12260f8518J54356J4870k25516K18466M66059L06096K24480n63595r07708M1498
12250c39512O645J79491L07524L88351J87160k65235k19458J88986J54041r0839
12240D97154J0472L53945j20068k58599q0461r5891p6502K07469K97681j08714
12230F26486l11424r0310K86713M37300R111j31639j52043k13375j64315o2453
12220B34051j73172l4314J30591k84764l1573J38935j3481K69714J38341R9211
12210D73539L9794J01277J38645l48017k32106Q0862K15244J93061m03040m10689
$$ y = [-1481016, -1007531, -610098, -377655, -566094, -855023, -603241, -470104, -609882, -571267, -723552, -538043, -153019, 42475, 227110, 314755, 280890, 452210, 494796, 167803, -68518, 85838, 100708, -124808, 93658, 559717, 865813, 1090293, 526698, -381010, -339512, -332867, -153376, 154148, 542499, 729659, 464424, 244966, 433952, 587993, 497154, 507626, 861571, 741503, 482904, 402443, 306552, 230050, 437519, 735200, 626486, 315062, 224752, 511465, 948765, 957876, 826237, 674194, 460819, 296504, 234051, 60879, 26565, 157156, -127608, -159181, -20246, -33727, 235987, 374328, 473539, 513333, 614610, 753255, 405238, 173132, 253994, 469238, 662299, 259259, -151430]
12200a51430J89150K41809P4407J02406K73120L75189J57351r7799o24356l83769
12190A56078J23730j33232p9265k97541j01555J97338j25867l84912j21706R6152
12180f70780L55453M67101J36583K4668r0949o4965l2532m82094l57599K64773
12170d50341N64778J33540k02254m4482j5254j92250j55467L6164Q9577L2693
12160b03296o9074j25240k72306J71514L24284p5688N7882R3343J22121l62747
12150c39207k16380r6682K14335M22062P8921l48161k75369J39824M25938M45246
12140D50527Q6l99293k96732j11807j91017K91179L49424o3139J34701r4406n58184
12129d88661k46681j14118j8032J18245L42497K41491L12301M3444L20311K70278
$$ y = [-151430, 37720, 279529, 353936, 456342, 729462, 1104651, 1262002, 1164203, 539847, 156078, 279808, 146576, 67311, -230230, -331785, -134447, -260314, -645226, -766932, -670780, -315327, 151774, 288357, 313025, 222076, 157111, 124579, -357515, -715114, -450341, 114437, 247977, 45723, 1241, -14013, -206263, -361730, -325566, -235989, -203296, -272370, -397610, -669916, -498402, -174118, -249806, -191924, -98581, 23540, -339207, -555587, -652269, -437934, -15872, 63049, -285112, -560481, -420657, 5281, 450527, 450613, 51320, -245412, -357219, -548236, -257057, 92367, 29228, 163929, 69523, -488661, -735342, -849460, -867492, -749247, -406750, -165259, 147042, 190486, 510797, 781075]
12119G81075m0773n792k14537Q0701K34456k8421k53589j98072J46433l8125m78322
12108a4966n00847N0438O41932P4842n02350q4561J18287N6554O9753r3520j21375
12097c05813l0105J13098K39857L92178j18976M4710L44262K70141j03804l29425
12087E16123n0427R5620j60262k54679k79429j6768J03767k35790m0991J38046
12077a84790L01031N6185j04575j42157J02661l40272k31500K51364K65091J16047
12067H9085O259j77468l48470l13540j12315M7383R8069K08K0094M29055K62066
12056D26J72528K9749k0987L9683M55540L42269m25092j51901j62935l22150m22402
12045d65272l53952K55773L02503o9404k1752k28022k14378Q0109K17858J36918
$$ y = [781075, 740302, 734510, 519973, 600674, 835130, 806709, 553120, 355048, 501481, 463356, -14966, -515813, -465375, 176557, 251399, -250951, -335512, -217225, -160671, -90918, -184438, -305813, -335918, -222820, 17037, 409215, 290239, 334949, 679211, 949352, 845548, 516123, 465696, 561316, 401054, 146375, -133054, -149822, -46055, -281845, -322836, -184790, 116241, 172426, 67851, -74306, 28355, -311917, -543417, -292053, -26962, 89085, 95344, -82124, -430594, -744134, -856449, -809066, -710997, -710789, -690695, -261640, 426, 172954, 202703, 181716, 221399, 676939, 1019208, 594116, 442215, 279280, -42870, -465272, -819224, -563451, -260948, -330352, -352104, -580126, -794504, -714395, -496537, -359619]
12035c59619l9188l87307m29825M4201L66653Q4145k13253l75583j93367O05238
12025h97905L17803K26042L71311L53401N06128Q5614M932K33701r3361k55218
12015H52448l45201p0603L2626n9093j43759J05135K47945L37012J76157j91027
12005I41640l44538n1792Q0825K17930k58077m04634k78619j03589n1354k64831
11995e17039j24091k42317l41427p9906M07861J1638Q817j17462k86352n9544
11985a339822K17615M00440M8399J31160K52380j8555l5734j6097J37091o3997
11975b87120M2721j29601n47499j46289M68638N33350J52157j5321J21782K04885
11965C97703K77520O1359j24497l25827l2205J74686m1110k13165r6316P9071
$$ y = [-359619, -398807, -786114, -1215939, -1171738, -805085, -720940, -934193, -1309776, -1503143, -897905, -580102, -354060, 17251, 370652, 876780, 962394, 967326, 1201027, 1107666, 852448, 507247, 436644, 469270, 410177, 266418, 371553, 619498, 956510, 1132667, 941640, 597102, 545310, 626135, 844065, 585988, 181354, -97265, -200854, -252208, -517039, -641130, -883447, -1224874, -1304780, -896919, -885281, -876464, -993926, -1280278, -1339822, -1122207, -721767, -673368, -542208, -289828, -308383, -344117, -360214, -223123, -287120, -244399, -374000, -921499, -1067788, -599150, -65800, 86357, 71036, 192818, 397703, 675223, 736582, 612085, 286258, 254053, 428739, 387629, 174464, 78148, 157219]
11955A57219r7637n3055k44364o06321k34295O77472K99788K42718K94466L26396
11945G62387L55116j5547k57741m84166k64665n97800m70689J08512M75642K67343
11935a21608L17787m8595j14562j14218j12087N6846p2523K8861j74932j55731
11925e10762j26971O9102K33155K57951L11025k13608n77749k98347r1242m14602
11915a362048n08243P8142L52279K85811J20378N61493J33806J34845K29657m9535
11905b3415k11750O7953J3368n35446m97596Q2904M44508L82703J71944k9971
11895a34798J31069p6196j16578j32115L11J42942j01357J12082Q2596j30155
11885b22199j03734J51284J48752j08708P3180J42701M4727K82266K7899k51109
$$ y = [157219, 59582, 6527, -237837, -844158, -1078453, -400981, -101193, 141525, 435991, 762387, 1117503, 1101956, 844215, 360049, 95384, -502416, -973105, -864593, -388951, -121608, 196179, 147584, 33022, -81196, -193283, -136437, -208960, -180099, -355031, -510762, -637733, -568631, -335476, -77525, 233500, 19892, -557857, -856204, -947446, -1362048, -1870291, -1792149, -1439870, -1154059, -1033681, -472188, -338382, -203537, 26120, -23415, -235165, -167212, -153844, -689290, -1186886, -1103982, -659474, -276771, -104827, -134798, -3729, -79925, -196503, -328618, -328307, -185365, -286722, -174640, -92044, -222199, -325933, -174649, -25897, -134605, -61425, 81276, 126003, 408269, 436168, 185059]
11875A85059l7715k09262j63606L21028M94828J73238j92579k52710P41j9994
11865B99028n90822m20110O6125j84015k12786J83985K63874K33179L32707O3042
11855C4207m46275k47151J40329K0540j39290m23884l04139N35752N45020k80428
11845e65319j99441K20711j1607k6066K84910J7030j00426j89749P0337K26420
11835b73200j05038n6721l51131o84102j60718N51388K00650j24392j8992J67021
11825h55235J91j49912J28612J2337L0418M72603M79288K3794j99114j47101J44857
11814e9262R0225p2583l04067k8054K22489m86784r1933O36340M64894K94356
11804F65621m51380l74882R1791J91435j83805m82080J46615N77751K56895j18323
$$ y = [185059, 147344, -61918, -225524, 95504, 590332, 763570, 570991, 318281, 319022, 299028, -291794, -711904, -645779, -829794, -1042580, -858595, -594721, -361542, -28835, 34207, -412068, -659219, -518890, -498350, -637640, -1061524, -1365663, -829911, -284891, -565319, -764760, -544049, -555656, -581722, -296812, -279782, -380208, -569957, -499620, -273200, -378238, -434959, -786090, -1470192, -1630910, -1079522, -878872, -1003264, -1022256, -855235, -855044, -1004956, -876344, -864007, -833589, -360986, 118302, 142096, -57018, -204119, -59262, 30963, -41620, -345687, -373741, -151252, -638036, -729969, -93629, 371265, 665621, 214241, -160641, -68850, 122585, -61220, -543300, -396685, 181066, 437961, 319638]
11794C19638l41429k21487k06023K86221N71152j59904n20486l98957K22355J41739
11784c07181L9853j5433J10899n8649o4127K4820Q912l04885n72678j82071O05010
11773g15530O42076L21304k60412l21855l10200N0594J97218k63518q3210n1259
11763g94792L06926M51305J37445J51603M41483m0967k04773J06150j98312l07757
11753D8311k62152k33900r3748Q7307L27701J61953Q0091m31104j15746j85169
11743f16456k32756J81065N29346N70871J14484k89369k03982j25912j90768J32706
11733a30771k40859p1368M20654K05379k34477l09987R549N52855K3758m62831
11723b38098j29079k4188p1764l49291m00882M56726J593076R96353l32589q09121
$$ y = [319638, -21791, -243278, -449301, -163080, 408072, 248168, -272318, -671275, -448920, -307181, -267328, -282761, -171862, -230511, -294638, -269818, -260906, -565791, -1138469, -1320540, -715530, -73454, 247850, -12562, -334417, -644617, -594023, -396805, -660323, -743533, -794792, -487866, -36561, 100884, 252487, 693970, 653003, 448230, 554380, 356068, 48311, -213841, -447741, -541489, -454182, -126481, 35472, 115563, -315541, -431287, -616456, -849212, -668147, -138801, 432070, 546554, 257185, 53203, -72709, -263477, -130771, -371630, -442998, -22344, 183035, -51442, -361429, -351880, 200975, 224733, -238098, -367177, -391365, -463129, -812420, -1213302, -756576, 836500, 1832853, 1500264, 691143]
11713F91143k68706Q859l34399m14281M7151O02555O86037M53019K20031p3617
11703A617792k72597l78950l78896k13662l0753k868J78055P704p08800k95620
11693d78595N22545N94555O4633N4820J04108k26668k02590l2299m7024k38126
11683A15359j35631k13403j11997m8213r8137n294K38N7445J21462r4892j80016
11672e93079k18395K69591N41487K33786R3196k36051l32456l80105p2827J85820
11662e09033j8533k97740l73391L3811M3899N9783M17412L22124L91075J01392
11652A70799n40787m45837L46714N68910P24019K47347q55849o27300P7150M42037
11642A07203M31365j92469m00596j65376q3110k01127l15682m3736K06234K27586
$$ y = [691143, 422437, 431296, 96897, -317384, -270233, 332322, 1018359, 1471378, 1691409, 1617792, 1345195, 966245, 587349, 373687, 342934, 340066, 518121, 525825, -182975, -478595, 43950, 638505, 703138, 757958, 862066, 635398, 432808, 400509, 353485, 115359, -20272, -233675, -345672, -393885, -492022, -497316, -497078, -439633, -318171, -413063, -593079, -811474, -541883, -396, 233390, 326586, 90535, -241921, -622026, -694853, -509033, -527566, -825306, -1198697, -1164886, -1120987, -1061204, -643792, -321668, 69407, 170799, -369988, -815825, -469111, 99799, 823818, 1071165, 215316, -411984, -334834, 107203, 538568, 346099, -54497, -219873, -302983, -504110, -819792, -863528, -657294, -429708]
11632d29708J81771N4676k86520J64658L65036J34830j57702k74797l43247m01634
11622i92637K95051j6635N9520M14682K15933M33577K81360J57966L2387k01918
11612F79286l63321l63380j29574L0446q5036K88119Q5722O8278n6198j3968l9830
11601A00544k35488P5120k26072o94321m80634J06427L25121M21621K57449J48036
11591b02197O1602j01751k72267j71653j39910Q0922N58159L54449j21933J80827
11581B26248K56636J11552R3836j79120o13000m38778N2392J43188m10931m03708
11571a161685M30824L64423N1097q5041l3145O55825M95306m0843o4k55665j62121
11560B58911R5446K69989J35869L4970k13858k97180J87524r5491p46337p50489
$$ y = [-429708, -247937, -193261, -479781, -315123, 49913, 184743, 27041, -247756, -591003, -992637, -697586, -714221, -654701, -240019, -24086, 409491, 690851, 848817, 881204, 679286, 315965, -47415, -176989, -146543, -231579, 56540, 142262, 210540, 154342, 140374, 100544, -134944, -59824, -285896, -980217, -1460851, -1354424, -1029303, -607682, -350233, -202197, -140595, -242346, -514613, -686266, -826176, -745254, -187095, 167354, 45421, 226248, 482884, 594436, 688272, 509152, -103848, -542626, -490234, -347046, -757977, -1161685, -730861, -366438, -315341, -400382, -433527, 222298, 717604, 676761, 676697, 421032, 258911, 354357, 624346, 760215, 795185, 581327, 284147, 471671, 376180, -370157, -1120646]
11550a120646J18802O23857L46820N2900L1523j6185J32806J41905L17417N4592
11540F83791p59926m83712J61539K81180K1766N2918q1597N9093k24007J63231
11530a25724N71294j26017n93409n26344n66260m20047K31942N65172K53950p8626
11520h14069J65984K69177L06252K26044r2110j88752M03024J15841l92526M76140
11510D75005Q0735n84818r1516K31914J6957r6548m88345m54718L392J31904j24893
11499i00931R7438K58024K7641j60217K1927J24622J19872K15623l37521l10233
11489h43755j57756m9525K2721L91173M44994O8438l9981N0264N9027J25666n6239
11478A5027k76685l99450l3594J71250o7546P0993K97900j59807l20943j54439
$$ y = [-1120646, -1001844, -377987, -31167, 21733, 53256, 37071, 169877, 311782, 629199, 683791, -76135, -559847, -398308, -117128, -95362, -42444, -124041, -64948, -288955, -125724, 445570, 319553, -273856, -800200, -1366460, -1786507, -1554565, -989393, -735443, -814069, -648085, -378908, -72656, 153388, 61278, -127474, 275550, 391391, -1135, 475005, 555740, -29078, -120594, 111320, 128277, 31729, -456616, -911334, -907942, -776038, -900931, -803493, -545469, -517828, -678045, -656118, -531496, -411624, -196001, -533522, -843755, -1001511, -1051036, -1028315, -637142, -192148, -123710, -163691, -113427, -54400, 71266, 15027, -261658, -661108, -694702, -523452, -590998, -520005, -222105, -381912, -702855, -857294]
11468h57294l8982N86370M23462l98615o74282o2517n6681j3432M94503O48662
11458E1194N5017k73591j31773q4900K58330L35001N1563k23481k39099j16993
11448c18732J86681J00389J22864k79125j19458L86016O5628J0554J66834k22420
11438I9231o4191j14216J9124M21716M11995L07276j88434o52706l11384M8002
11428b3587j71203l14018j35684M25915M54117Q8483J12552O1991j69857j01912
11418B26797j45435r3903L00805N09978k44009n59869k92175K66092J143702P32018
11408A844001q55371o93656K67623j25518m71662J71088k08999l49796K34207
11399a88083r2816l33380J0132P4899j77900O3269J02980J34182J41844J30104
$$ y = [-857294, -896276, -309906, 113556, -285059, -959341, -1021858, -1078539, -1091971, -597468, 51194, 106211, -167380, -299153, -384053, -125723, 209278, 260841, 37360, -201739, -318732, -132051, -31662, 91202, -187923, -307381, 78635, 144263, 154817, 321651, 99231, 35040, -79176, -60052, 361664, 773659, 1080935, 892501, 239795, -71589, -23587, -194790, -508808, -644492, -218577, 235540, 324023, 436575, 498566, 328709, 226797, 81362, -12541, 288264, 798242, 554233, -5636, -297811, -31719, 1111983, 1844001, 988630, 294974, 562597, 437079, -34583, 136505, -72494, -422290, -188083, -280899, -614279, -604147, -529248, -707148, -643879, -540899, -406717, -264873, -134769]
11389a34769k46391L7963j1208l7236j27560j88992L0412l7183L30756L78800
11379e408K3014j52517P7640L83872N0410l95469k32203J21723M35424L40112
11369F46598L09199J15862n7808o0403k33017l63338o7644N7223k72102l31457
11359b56887O0399K27956J0402J06408J34488j42725l22314K59544L95707k6095
11349D46883L907L09630N9661j82408q8184k41907Q0918L47628Q13J24579p3466
11338G88054l22889j01608k4991j03679l79023k10715J53728J62260j51554j95039
11328c85456j21673P0040L1651j84682k57096O4067J43456m079r3689J65526L06864
11317b65071J25457L2595J04384p4022j27363K14179K33780J78957J60047k44090
$$ y = [-134769, -381160, -343197, -354405, -391641, -519201, -708193, -677781, -714964, -384208, -5408, 17606, -134911, -57271, 326601, 377011, -18458, -250661, -128938, 306486, 646598, 955797, 1071659, 1013851, 953448, 720431, 357093, 289449, 346672, 74570, -256887, -196488, 31468, 41870, 148278, 282766, 140041, -182273, 77271, 472978, 446883, 450790, 760420, 820081, 637673, 549489, 307582, 388500, 736128, 736941, 861520, 788054, 465165, 363557, 338566, 234887, -144136, -354851, -201123, -38863, -190417, -385456, -507129, -437089, -405438, -590120, -847216, -783149, -639693, -643772, -737461, -571935, -265071, -139614, -107019, -2635, -76657, -204020, 10159, 243939, 422896, 582943, 338853]
11307C38853o23577j03476L47227L76433J35825k40651l6584K94782J69190k14333
11297D43689l56680j38609j54395j5627Q1413J33952P3778k17030k2923L05772
11287A33340K50264k50606k83677O2884J79341k5411j45321O688J40051K05772
11277B73325j23920m51054l35472j80869J68841K47877j49538j27873k42248n08564
11267a429495M9105P54148L58364K08747q5064j19817j25546k40568q3936P8996
11257f35066K58152j7332n23178o3841M86227L76363k0386j3487J87957R6496
11247A31905j78725j66437m70667l96180n0434j8834J29584M10464M33719O67058
11237D91453N71872j75622j36226q9343j62899J12262J68907l58654j27116k33450
$$ y = [338853, -284724, -388200, -40973, 335460, 471285, 230634, 194050, 488832, 658022, 443689, 87009, -51600, -205995, -221622, -140209, -6257, 67521, -149509, -172432, 133340, 383604, 132998, -150679, -87795, 91546, 66135, -79186, -72498, 67553, 273325, 149405, -301649, -637121, -817990, -649149, -401272, -550810, -678683, -920931, -1429495, -1380390, -626242, -267878, -59131, -144195, -264012, -389558, -630126, -714062, -635066, -376914, -394246, -917424, -981265, -495038, -118675, -139061, -152548, 35409, 131905, -46820, -213257, -683924, -1080104, -1130538, -1149372, -1019788, -609324, -175605, 491453, 1063325, 887703, 751477, 662134, 499235, 611497, 780404, 421750, 294634, 61184]
11227F1184j00625j76208P1834J87272j47160m20112j45988J90713J876l57537
11217h34751o51124j84746L32972K47535K72497J55634J36281N52642M67949m3831
11207D51058k38336r4047L5119J87097M5455O4464K04954J70937k00319l96601
11197B29781k9635K08236L23449L20702k29413m89313j59796j05735O708l07888
11187b32904n2197N7348k78027j98397L05625K53904L10526M60149P2497J98452
11177H96976J15611o6951k45747j66325M57335L91947m10439m81127j33992N4387
11167D11675J12044K1176K06512J04614J07479j1495k75797k93262p09102p05836
11157a031992K56700O55508J15927L37240K24293r9633k42852J49335K62741n3435
$$ y = [61184, -39441, -215649, -143815, 43457, -103703, -523815, -669803, -479090, -477214, -834751, -1485875, -1670621, -1337649, -1090114, -817617, -661983, -525702, 26940, 494889, 451058, 212722, 118675, 153794, 340891, 386346, 450810, 655764, 826701, 626382, 229781, 200146, 408382, 731831, 1052533, 823120, 333807, 174011, 68276, 74984, -232904, -285101, -227753, -505780, -704177, -398552, -144648, 165878, 626027, 698524, 896976, 1012587, 945636, 699889, 533564, 990899, 1382846, 972407, 491280, 357288, 411675, 523719, 544895, 751407, 856021, 963500, 952005, 676208, 382946, -326156, -1031992, -775292, -119784, -3857, 333383, 557676, 458043, 215191, 364526, 627267, 573832]
11147E73832j93169k9740K6828P8549N1305k48553j04338j5203l13462J00206
11137g3745N37702L29725J42544l42412l32135p7566l73487p058P5075L4252L03808
11126B16703J33534k14371j07539K6208O0331p2290m69131p78409m41794M37812
11116a208946M99684M28685j9817p1734K31384q928p1218q9493n3694J96155j27172
11105b95094m54565q1910K4408J34251L57636J41495j92960k4199K99962J50012
11095E9036j77134k52500K7711j24295P2466J36281q7616j14503K76934O79684
11085D96064M89280N3615j340j95176k99833k65071r4190n6169K11699N59176
11075H98055j17239k02238j00319k22151j74369l81201M5331N14509p2110J69997
$$ y = [573832, 380663, 350923, 377751, 456300, 507605, 259052, 154714, 139511, -173951, -73745, 463957, 793682, 936226, 593814, 261679, 184113, -189374, -196432, -121357, -87105, 216703, 350237, 135866, 28327, 54535, 114866, 42576, -426555, -1204964, -1646758, -1208946, -709262, -280577, -300394, -372128, -140744, -149672, -220890, -310383, -364077, -167922, -295094, -749659, -831569, -807161, -672910, -315274, -173779, -366739, -390938, -90976, 59036, -118098, -370598, -342887, -467182, -394716, -258435, -346051, -460554, -183620, 496064, 985344, 1038959, 1037619, 842443, 542610, 277539, 183349, 127180, 338879, 898055, 780816, 578578, 478259, 256108, 81739, -299462, -254131, 260378, 188268, 358265]
11065C58265J57844m25595n28640j39969P8914J2680Q3441K06826j20108k42784
11055e59126r8867L57228L39440J91457O1081j84004m52704j87867J92987J87945
11045a52430K17265O0269J98805K00232l81174o03783k77329L57735L25008j93391
11035b48793n06146k40850j64003l9354L31311P13583O36285k24062n28422j79326
11025d49777m6674p2766K91749L33785J75425q4903J71027J64356K6063K13675
11015G21960J85045j0481l03705m0668r2353k28178j10885l90398m04061J17999
11005e55725J27661O6767R2557q2203j3074r3243J09541K03947m5598k3726K0046
10994a93050k20360L8020Q4585o9209Q4056j87631r7770J46275O6675L37869K22937
$$ y = [358265, 516109, 90514, -438126, -578095, -499181, -486501, -403060, -196234, -316342, -559126, -657993, -300765, 38675, 230132, 291213, 107209, -345495, -533362, -340375, -152430, 64835, 125104, 323909, 524141, 142967, -460816, -738145, -380410, -55402, -248793, -754939, -995789, -1159792, -1199146, -867835, -154252, 482033, 257971, -270451, -449777, -496451, -569217, -277468, 56317, 231742, 146839, 317866, 482222, 508285, 721960, 907005, 896524, 592819, 552151, 459798, 231620, 120735, -269663, -673724, -555725, -428064, -361297, -268740, -350943, -364017, -457260, -347719, -143772, -189370, -213096, -193050, -413410, -375390, -290805, -360014, -275958, -463589, -561359, -415084, -348409, -10540, 212397]
10983B12397k20122n46634k40833J44385L66952J51176R9464K62778K57087k6639
10973D60011m20367l08568J97164J44186k2209j35251k16946M175Q1906O3606
10963a52293k66057m76724q6627L57617J92175j87095K179J3084R0660O1939J37709
10952c13433R9743K79560Q6698k58036R869P5384l26973l34961J31394k3087l6645
10941f10487O48443N76386j32034k64810K2919K04198j64188l46919q3896K16442
10931F6054M0671J5570M68102j19742l71667j93775n191K27058M87069K05118
10921H19267M1640j96176R453J06163k25227n76980l35606j47385j87036o4000
10911g55887J17707O6273J82634K14048L38326J34360l45944Q970M00125M68248
$$ y = [212397, -7725, -554359, -795192, -650807, -283855, -132679, -33215, 229563, 486650, 460011, 39644, -268924, -71760, 72426, 50217, -85034, -301980, -297805, -215899, -152293, -418350, -895074, -981701, -624084, -431909, -619004, -616825, -603741, -513081, -451142, -313433, -213690, 65870, 152568, -105468, -95599, -20215, -347188, -682149, -550755, -573842, -610487, 37956, 614342, 482308, 217498, 240417, 444615, 280427, -66492, -150388, 66054, 106725, 122295, 590397, 470655, 98988, -94787, -99978, 127080, 614149, 819267, 860907, 664731, 674184, 780347, 555120, -21860, -357466, -504851, -691887, -755887, -638180, -571907, -389273, -175225, 163101, 297461, -48483, -39513, 360612, 828860]
10901H28860N01534J12215p41478n34407k52632J19489J07654J29531J55917l36148
10891I0535m78950m82841J1865M12333j00182J48097K69021J07131m9309l6696
10881a08996K20880k47674m71949j69322J83806N0277j63686k62288L8636K23148
10871g07168K13971K02220P5913p29J22905j49107j16770K64670K30402m24185
10861b87878k50597M60211K25695k8821j44287j56421l30481r5340L6744N1332
10851e19843R6625q0968o1718J76380N10180M58020J4423l23196j72728Q3950
10841A81125k68723k22156O1681K50777J48049j15199l41044r7909K55352L29693
10831A81646L043m78789m14740k42697n5006N16670L52106k8065m4290K53691
$$ y = [828860, 1330394, 1442609, 701131, 166724, -85908, 33581, 141235, 270766, 426683, 90535, -388415, -871256, -859391, -447058, -547240, -399143, -130122, -22991, -72300, -108996, 111884, -135790, -607739, -777061, -593255, -542978, -706664, -968952, -930316, -707168, -493197, -290977, -215064, -215793, -92888, -241995, -358765, -94095, 136307, -287878, -538475, -78264, 147431, 118610, -25677, -182098, -512579, -607919, -571175, -519843, -423218, -504186, -565904, -389524, 120656, 578676, 593099, 269903, 97175, 181125, -87598, -309754, -248073, 2704, 150753, 35554, -305490, -403399, -148047, 181646, 184689, -294100, -708840, -951537, -1006543, -489873, -137767, -165832, -210122, 43569]
10821D3569M92507J47609k33654l08515o91925o36910K2324L38027R7804J04594
10811f24570J42715J99167j99818j06806q9118K6095K85597K42779J88091L26302
10801C90434L62177k6342k18301k60907k24661n2720k0023o8857k71311k59839
10791f50350R2850M70487k62220o55028j51850L0991K95139N18083J53680L19229
10781A61011N02406k30943n15174j18951p8627l44943k26149K1974k5623r265
10771h64284M4071r1254J2000O66807J032076K60656n44089n04417o81854o17703
10761a287991J93942O28030K07076N3142R4870K01619m5108k11860l02080N5218
10751d13142L29276k34616l67698m82034k97606N17134O85855M95143K61452L6143
$$ y = [43569, 536076, 683685, 450031, 141516, -550409, -1187319, -1164995, -826968, -729164, -624570, -481855, -282688, -482506, -589312, -678430, -652335, -366738, -123959, 64132, 390434, 752611, 726269, 507968, 247061, 22400, -30320, -50343, -119200, -390511, -650350, -557500, -87013, -349233, -1004261, -1156111, -1125120, -829981, -311898, -158218, 161011, 663417, 432474, -82700, -201651, -280278, -625221, -851370, -829396, -855019, -864284, -820213, -911467, -899467, -232660, 799416, 1060072, 515983, 11566, -670288, -1287991, -1094049, -466019, -258943, -205801, -110931, 90688, 45580, -166280, -468360, -413142, -83866, -318482, -686180, -1168214, -1465820, -948686, -262831, 232312, 493764, 529907]
10741E29907k95060o0040j22249n12912m78928l68295j84585l38021j73571N04456
10731a499298Q07315M38755K42630K57625J97998q7090k87566n3385J20729N29060
10721F66773M78177l5036l34590k30021k17148k18864K14317j54965q25058q17354
10711a473769L9459Q30663P40596L04170k41192m70641J47477J12039p8371N2066
10701c7503J02349J95221M06989R1884n31554n35194J50050L30560M31073K63233
10691H67108l33207k31645K58183R3984j93125j77600k0604O3396K87238j9599
10681E94129q11500p78000j15342P9711n3187L00477L31786L10310L32533J80729
10671C71646K26911k89560l88162k25594P7816l9538O1437N88380M48740K36176
$$ y = [529907, 234847, 174807, 52558, -460354, -939282, -1307577, -1492162, -1830183, -2003754, -1499298, -691983, -253228, -10598, 247027, 445025, 357935, 70369, 16984, 137713, 666773, 1144950, 1109914, 775324, 545303, 328155, 109291, 323608, 168643, -656415, -1473769, -1434310, -603647, 136949, 441119, 199927, -270714, -123237, -11198, -89569, -37503, 64846, 260067, 667056, 758940, 227386, -307808, -157758, 172802, 603875, 867108, 533901, 302256, 560439, 654423, 461298, 283698, 263094, 326490, 613728, 594129, -217371, -995371, -1110713, -1031002, -1084189, -783712, -451926, -141616, 190917, 371646, 598557, 308997, -79165, -304759, -226943, -266481, -205044, 383336, 832076, 1068252]
10661A068252j6628p5623j07692k28879l97210m89049j58466j58994k8022K40765
10651c51546J69603k95553l5720P9232J01661K71828K49568M20805M36720M4502
10641A091100k46518l85412o28019o01046l83929o0136o9626M15396L57717K34882
10631b75591M53394j68060m04343J30719j99873j11680P15026N66220p921l68198
10621C29693o23373n78423m80801k52781L9547j47392l0000j11490Q4900N42858
10611a227262m8897j89939J64891K46489K85850M71198M61554J49054k39739j4327
10601E8872J72523l58357m62854J90091L33058L84331K70456O8150J3093m23800
10591B45563m45549O6432M8675j90605J59171L46275M5426l01338m24111m54144
$$ y = [1068252, 1051624, 976001, 868309, 639430, 242220, -246829, -405295, -564289, -592311, -351546, -181943, -477496, -513216, -433984, -332323, -60495, 189073, 609878, 1046598, 1091100, 844582, 459170, -168849, -769895, -1153824, -1213960, -1283586, -868190, -510473, -275591, 177803, 9743, -394600, -263881, -463754, -575434, 139592, 705812, 697891, 329693, -293680, -872103, -1352904, -1605685, -1566138, -1713530, -1743530, -1855020, -1770120, -1227262, -1276159, -1466098, -1301207, -1054718, -768868, -297670, 163884, 312938, 73199, 58872, 231395, -126962, -589816, -399725, -66667, 317664, 588120, 656270, 669363, 245563, -199986, -133554, -84879, -275484, -116313, 229962, 275388, -25950, -450061, -904205]
10581i04205l3231P09966O21395K85340K00987n0532k60742n99413m71510n1221
10571e53166K17246L6815j03195O13J51327l7034j75550J83079R0442j49526J29204
10560b09745K49593J55299o0607l40447p1072L34069O398j69984P9543L99173
10550C72220O13798L50221l06723l60086l13881O3585K83133o0928k52923q5084
10540C03332J05758o4694m94988p08755O5578M47334K9044K46483L62230N1097
10530C42419K7284J31851k20626j86049M56509L0490l08932K34469K15518J0595
10520G33528q7438J2395O1923k15390m63520j00415K08000K78709L6397J48859
10510F13048J64149n0285k31947j15816k34244k9944j19558j63311q2589j96797
$$ y = [-904205, -937436, -227470, 393925, 679265, 880252, 829720, 568978, -30435, -501945, -553166, -335920, -299105, -402300, -401687, -250360, -287394, -462944, -279865, -189423, -338949, -209745, 39848, 195147, 134540, -205907, -276979, 57090, 63488, -106496, -26953, 372220, 986018, 1336239, 1029516, 669430, 355549, 419134, 702267, 641339, 388416, 303332, 409090, 344396, -150592, -859347, -793769, -346435, -317391, -70908, 291322, 342419, 369703, 501554, 280928, 94879, 551388, 581878, 272946, 507415, 722933, 733528, 646090, 658485, 720408, 505018, 41498, -58917, 149083, 427792, 464189, 613048, 777197, 726912, 494965, 379149, 144905, 114961, -4597, -167908, -250497, -447294]
10500d47294k8227O986O0894J79751M19307L20985N6076j82133K5299k9171m87805
10489a05332l19260K9876K45968K29849j47027K82495M52732j43268j50512p0827
10479C04694k87720j32762K28891K83537P5489P0003J60382K92522J72548l85921
10469G81663j53407k78128j23030K89487K46419Q0948j37574l88404l61212Q4880
10459D1642J20656M73648L01498k94631l07890k55058j82909j77108l35676J11526
10449e04302n9232m34061j85016P1136q2390p415K16700L11704K04295J48510
10439c20071j49265j50603j84743J06126L53822R1798j62804n9723k534J48763
10429c29234J65474j63837k40613j9578L93419M83389j7214k69932K8850M10422
$$ y = [-447294, -475521, -468535, -407641, -227890, 191417, 512402, 568478, 386345, 411644, 382473, -105332, -424592, -394716, -148748, 81101, -65926, 216569, 669301, 526033, 375521, 304694, 16974, -115788, 113103, 396640, 472129, 542132, 702514, 995036, 1167584, 781663, 628256, 350128, 227098, 516585, 763004, 843952, 706378, 317974, -43238, 41642, 162298, 635946, 937444, 642813, 334923, 79865, -103044, -280152, -615828, -504302, -563534, -997595, -1182611, -1111475, -1193865, -1201280, -984580, -672876, -468581, -320071, -469336, -619939, -804682, -698556, -344734, -252936, -415740, -475463, -477997, -329234, -163760, -327597, -568210, -587788, -194369, 289020, 271806, 1874, 30724, 441146]
10419D41146L26319J66690J92541j80955k46355o854m79507p75255q9119K62250
10409c89099J35731L11793j12567m62969m50170J57626K7868L7766L09332J18888
10399c15801L01423J41053p4103j01084p976L71498j23273k14591K61756q3354
10389A55548o3385J18756R9042k17939k40203Q5542N842K53054K24880m519J62001
10378E78619k15983n22377m86438k26156q5084m0996l37631j2918N25184K53970
10368e69810K60380p3044N5651L38975j19589l72448l33333K20039M14879J73259
10358e041k18586j72862k89444m1363K74663J17285P6198m4911J82167p8835m82220
10347f82949n1208M8946m1440M8564K65796J62160l48780k11991K53829N63514
$$ y = [441146, 767465, 934155, 1126696, 945741, 699386, 692532, 213025, -562230, -651349, -389099, -253368, 58425, -54142, -517111, -967281, -809655, -781787, -744021, -434689, -315801, -14378, 126675, 52572, -48512, -56488, 315010, 191737, -22854, 238902, 155548, 92163, 210919, 309961, 92022, -148181, -62639, -56797, 196257, 421137, 416618, 578619, 362636, -159741, -646179, -872335, -957419, -998415, -1336046, -1348964, -823780, -569810, -309430, -382474, -326823, 12152, -107437, -479885, -813218, -593179, -178300, -5041, -223627, -396489, -685933, -727296, -452633, -335348, -259150, -304061, -121894, -200729, -682949, -734157, -685211, -726651, -678087, -412291, -250131, -598911, -810902, -557073, 6441]
10337F441M04865j86917m20420l49915m4856J13216l5766N26326L14326j76487
10327A50813l32844k42100q5802M19642M40557j97470l82043l85454J0144M45242
10317a59315M08807K83787Q2340o1716k05505n9430J77227j68586k94630k52411
10307b49432k27885N6042L59666L88945K68401J03007k25780l85467j93098k53375
10297c58976j760J28589K42397O22262N06103o1994k35688M2124l48992k53440
10287B80625R2419j42901k2186m7552P2154R2105J26945p9059j42551J03389J41458
10276D74846k23952j069K42564j49094k93901k8592L56240K83429k35053l77755
10266D7663n04191q9602K41732K7458l91570n91615j36569k5518k4110K22109
$$ y = [6441, 411306, 224389, -196031, -545946, -590802, -477586, -513352, 12974, 327300, 150813, -182031, -424131, -509933, -90291, 350266, 152796, -229247, -614701, -604557, -159315, 249492, 533279, 615619, 553903, 348398, 288968, 466195, 297609, 2979, -249432, -477317, -421275, -61609, 327336, 595737, 698744, 472964, 87497, -105601, -358976, -360736, -232147, 10250, 632512, 1138615, 1076621, 840933, 883057, 534065, 280625, 373044, 230143, 207957, 160405, 232559, 324664, 451609, 372550, 229999, 333388, 474846, 250894, 249825, 492389, 343295, 49394, 20802, 377042, 660471, 425418, 47663, -456528, -546130, -304398, -276940, -668510, -1260125, -1396694, -1422212, -1446322, -1224213]
10256a224213P01010O52487N6411R5853n5952j14820Q1178l02084m59596l91179
10246i60905p8270J74951n4142O9540L68176L7825j40688j8953L84284N96551
10236C78369R1552q9621L0164j86322m88547n65602r0392M21556M25834K36621
10226A63612L63252J29962n17580n49499m23727k15591l69838j90939K90779J57618
10216a161951L61475Q10619O02044j6894n26106k59211J70862J5034j54964N2920
10206a06172j78927k02094j82131k78479P9559J22209J34513M03427P7554j66093
10196b96634J59481L96126j74320m43942q0688R1660J85101k28855k94597k94715
10186i81383j61767Q6149J53011J8188J93056L07002J35506k08910l07841R334
$$ y = [-1224213, -523203, 129284, 185695, 281548, 225596, 110776, 191954, -110130, -569726, -960905, -1039175, -864224, -918366, -848826, -480650, -442825, -583513, -602466, -218182, 378369, 469921, 380300, 410464, 224142, -264405, -830007, -920399, -498843, -73009, 163612, 526864, 656826, 139246, -410253, -833980, -1049571, -1419409, -1610348, -1319569, -1161951, -800476, 10143, 612187, 595293, 69187, -190024, -19162, -4128, -159092, -106172, -285099, -487193, -669324, -947803, -868244, -746035, -611522, -208095, -130541, -296634, -137153, 258973, 84653, -359289, -439977, -348317, -163216, -392071, -686668, -981383, -1143150, -1057001, -903990, -885802, -692746, -385744, -250238, -459148, -766989, -757655]
10176g57655N1511q2980L82701K98816J82794K20289q8402O324k00017n15288
10166e01907j71407k12436m73848j05162K95368N05025N79901j33084l16969j2830
10156e47349L29025M40735N82550J64644n30171p08679O7619N88733L15215j83475
10146E18847l82945o37986l72587K07422r0643l18423j21264J82275J49114L48657
10136e17533N26257J11008l53385K2255M35653J47449k8535O9524p8238k99834
10126C4621k77152P17L50428J90556k42793r9078J33358O70929L44926j02626
10116A003886j85546k57274n68166m91111Q4480j04125o62319l98962j50077K4424
10106a704790K19877m5703k45211R2276K81191r4612K46686M33614K60719j28386
$$ y = [-757655, -706144, -789124, -406423, -107607, 75187, 295476, 207074, 213398, 13381, -501907, -673314, -885750, -1359598, -1464760, -1169392, -664367, -84466, -217550, -534519, -547349, -218324, 222411, 804961, 969605, 439434, -269245, -201626, 387107, 702322, 518847, 135902, -502084, -874671, -667249, -757892, -1076315, -1197579, -1015304, -866190, -517533, 8724, 119732, -233653, -211398, 224255, 371704, 343169, 412693, 334455, 34621, -242531, -241814, 108614, 299170, 56377, -42701, 90657, 761586, 1106512, 1003886, 818340, 561066, -7100, -498211, -413731, -517856, -1180175, -1579137, -1729214, -1704790, -1484913, -1530616, -1775827, -1683551, -1402360, -1496972, -1250286, -816672, -555953, -684339]
10096f84339O5362L51830j36038k26783R26K8138K11395J24840Q9545P0415o4281
10085a68990p8378k45793k82240p9198L00290N05693k74110m44772k00351J99327
10075g68522N08365L86105J56562j60150l24920k61201O6743J65080J85855K75182
10065B29099M07856J56074j23874L1016K88015k12047P975p1461m83409n00149
10055b70905j32552O15716O70965n1522m12615l33417j12068j29n2571j62383
10045b41481l685P9363K29974M7953K87758M55799j36038l85147m63047k68380
10035c96931K78564N31629N7336K787K01018k96176m94663l867n9303j8041J98474
10024H27K95954P0295M1641j12786k7063r2738m85639j25913Q8817k56689K35049
$$ y = [-684339, -618977, -267147, -403185, -629968, -629042, -600904, -389509, -264669, -175124, -104709, -168990, -247368, -493161, -775401, -854599, -554309, -48616, -322726, -767498, -967849, -768522, -260157, 125948, 282510, 122360, -202560, -463761, -397018, -231938, -46083, 229099, 636955, 793029, 669155, 700171, 988186, 776139, 784114, 712653, 229244, -270905, -403457, 212259, 883224, 831702, 419087, 85670, -26398, -26527, -79098, -241481, -245166, -165803, 64171, 112124, 399882, 855681, 719643, 334496, -128551, -396931, -118367, 413262, 470598, 473385, 674403, 378227, -116436, -120303, -179606, -197647, 827, 296781, 367076, 408717, 295931, 268868, 176130, -309509, -435422, -346605, -603294, -368245]
10013c68245L45215J599K1987K23715J64253j94620k97703l59053j72791L8352
10003e97291J20410l582J98858K71215j79925j04398M32327K16114K77139L31902
9993I62769j1678j82546n32499m77595j18465J3843j41838o1305R3427M34357
9983b1530J49175l86518k2644p5598n79414j10930M27294K13426R5366k9018j7627
9972c58018J73842k81536l66L07655J55362L67048M2851j73834K57484K17470
9962G07958l249K233N05952L18452j11395p5498K49613l77270q23140k59472R6380
9951B30564j16104n77235j72703K65579L11515J73786K21853P1230K64690k18557
9941D54618l81693K05671J17855m67481j67512Q586j87350j13951M09596K14865
$$ y = [-368245, -23030, -21431, 556, 224271, 388524, 193904, -103799, -462852, -635643, -597291, -476881, -480463, -281605, -10390, -190315, -294713, 137614, 353728, 630867, 962769, 951091, 768545, 236046, -241549, -360014, -346171, -488009, -549314, -455887, -21530, 127645, -258873, -281517, -357115, -936529, -1047459, -620165, -406739, -311373, -340391, -358018, -184176, -465712, -466078, -158423, -3061, 363987, 406838, 233004, 490488, 707958, 704709, 706942, 1212894, 1531346, 1419951, 1344453, 1594066, 1216796, 393656, 134184, 230564, 114460, -462775, -635478, -369899, -58384, 115402, 337255, 408485, 673175, 454618, 72925, 278596, 396451, -71030, -238542, -229956, -417306, -531257, -121661, 93204]
9931I3204n0430j80371J309L79486N4769o1569O8305M65562M99925l90032r49805
$$ y = [93204, 42774, -137597, -136288, 243198, 297967, 236398, 304703, 770265, 1270190, 880158, -69647]
$$ [...]
##END NTUPLES=NMR SPECTRUM
##END=
