##TITLE=C13_Pr 4996
 CDCl3, 5400 sc

 28.12.2020
##JCAMPDX= 6.0         $$ Bruker NMR JCAMP-DX V2.0
##DATA TYPE= NMR SPECTRUM
##DATA CLASS= NTUPLES
##ORIGIN= UXNMR, Bruker Analytische Messtechnik GmbH
##OWNER= root
$$ XWIN-NMR		Version 3.5
$$ Mon Dec 28 17:21:57 2020 Russian Standard Time (UT+4h)  she@DPX200
##.OBSERVE FREQUENCY= 50.327896
##.OBSERVE NUCLEUS= ^13C
##.ACQUISITION MODE= SIMULTANEOUS
##.ACQUISITION SCHEME= undefined
##.AVERAGES= 5400
##.DIGITISER RES= 17
##SPECTROMETER/DATA SYSTEM= spect
##.PULSE SEQUENCE= zgpg30
##.SOLVENT NAME= CDCl3
##.SHIFT REFERENCE= (INTERNAL, CDCl3, 0, 222.646)
##AUDIT TRAIL= $$ (NUMBER, WHEN, WHO, WHERE, WHAT)
$$ ##TITLE= Audit trail, XWIN-NMR		Version 3.5
$$ ##JCAMPDX= 5.01
$$ ##ORIGIN= Bruker BioSpin GmbH
$$ ##OWNER= she
$$ F:/spectra/data/she/nmr/c13/1/pdata/1/auditp.txt
$$ ##AUDIT TRAIL=  $$ (NUMBER, WHEN, WHO, WHERE, WHAT)
(   1,<2020-12-28 17:19:34.92 +0400>,<she>,<DPX200>,
      <created by zg, POWCHK disabled, PULCHK disabled
       terminated by command 'halt'
       configuration hash MD5:
       00 E9 B6 7A A2 85 ED C7 34 08 36 98 17 FE 4E 26
       data hash MD5: 32K
       61 5E 2A CC D4 97 B5 56 AC AB 27 37 B0 3C F8 7B>)
(   2,<2020-12-28 17:20:39.70 +0400>,<she>,<DPX200>,
      <Start of raw data processing
       efp BC_mod = 2 LB = 1 FT_mod = 6 PKNL = 1 PHC0 = -261.2599 PHC1 = 23.96242 SI = 32K 
       data hash MD5: 32K
       E6 FA 54 4F 52 74 30 97 0F E2 5E 93 21 28 EF 5F>)
(   3,<2020-12-28 17:20:42.45 +0400>,<she>,<DPX200>,
      <abs ABSG = 5 
       data hash MD5: 32K
       DB 67 3D C5 BB 05 0F E8 D2 90 AE EA B4 A7 A1 16>)
(   4,<2020-12-28 17:21:18.00 +0400>,<she>,<DPX200>,
      <pk PHC0 = -0.9036549 PHC1 = -0.4000012 
       data hash MD5: 32K
       6E FC CA 03 13 81 08 5C A1 82 B0 AF A8 70 A6 95>)
(   5,<2020-12-28 17:21:22.14 +0400>,<she>,<DPX200>,
      <abs ABSG = 5 
       data hash MD5: 32K
       03 B2 5F BF 4F C1 B3 94 61 14 5F AE 51 81 74 8F>)
(   6,<2020-12-28 17:21:30.87 +0400>,<she>,<DPX200>,
      <abs ABSG = 5 
       data hash MD5: 32K
       55 CB E9 88 55 FC 74 5C F0 A0 05 F2 6D 99 59 3B>)
$$ ##END=
$$ 
$$ hash MD5
$$ E5 07 7B C7 E6 2C 0B 24 84 92 B7 14 E2 CC E5 85
##$RELAX= 
##$RELAX= 
##$RELAX= 
##$RELAX= 
##$RELAX= 
##$RELAX= 
##$RELAX= 
##$RELAX= 
$$ Bruker specific parameters
$$ --------------------------
##$DU= <F:/spectra>
##$EXPNO= 1
##$NAME= <c13>
##$PROCNO= 1
##$TYPE= <nmr>
##$USER= <she>
##$AMP= (0..31)
100 100 100 100 100 100 100 100 100 100 100 100 100 100 100 100 100 100 
100 100 100 100 100 100 100 100 100 100 100 100 100 100 
##$AQSEQ= 0
##$AQ_mod= 1
##$AUNM= <au_zg>
##$AUTOPOS= <>
##$BF1= 50.322709
##$BF2= 200.13
##$BF3= 50.322709
##$BF4= 500.13
##$BF5= 500.13
##$BF6= 500.13
##$BF7= 500.13
##$BF8= 500.13
##$BYTORDA= 1
##$CFDGTYP= 0
##$CFRGTYP= 5
##$CHEMSTR= <none>
##$CNST= (0..31)
1 1 145 1 1 1 1 1 1 1 1 1 1 1 1 1 1 1 1 1 1 1 1 1 1 1 1 1 1 1 1 1 
##$CPDPRG= <waltz16>
##$CPDPRG1= <>
##$CPDPRG2= <waltz16>
##$CPDPRG3= <>
##$CPDPRG4= <mlev>
$$ [...]
##$SUBNAM4= <"">
##$SUBNAM5= <"">
##$SUBNAM6= <"">
##$SUBNAM7= <"">
##$SUBNAM8= <"">
##$SUBNAM9= <"">
##$SW= 239.972175391363
##$SWIBOX= (0..15)
0 1 3 0 0 0 0 0 0 0 0 0 0 0 0 0 
##$SW_h= 12077.2946859903
##$TD= 32768
##$TD0= 1
##$TE= 0
##$TE2= 300
##$TE3= 300
##$TEG= 300
##$TL= (0..7)
120 120 120 120 120 120 120 120 
##$TP= (0..7)
150 150 150 150 150 150 150 150 
##$TP07= 0
##$TPNAME0= <>
##$TPNAME1= <>
##$TPNAME2= <>
##$TPNAME3= <>
##$TPNAME4= <>
##$TPNAME5= <>
##$TPNAME6= <>
##$TPNAME7= <>
##$TPOAL= (0..7)
0.5 0.5 0.5 0.5 0.5 0.5 0.5 0.5 
##$TPOFFS= (0..7)
0 0 0 0 0 0 0 0 
##$TUNHIN= 0
##$TUNHOUT= 0
##$TUNXOUT= 0
##$USERA1= <user>
##$USERA2= <user>
##$USERA3= <user>
##$USERA4= <user>
##$USERA5= <user>
##$V9= 5
##$VALIST= <valist>
##$VCLIST= <CCCCCCCCCCCCCCC>
##$VD= 0
##$VDLIST= <DDDDDDDDDDDDDDD>
##$VPLIST= <PPPPPPPPPPPPPPP>
##$VTLIST= <TTTTTTTTTTTTTTT>
##$WBST= 1024
##$WBSW= 4
##$XGAIN= (0..3)
0 0 0 0 
##$XL= 0
##$YL= 0
##$YMAX_a= 33017971
##$YMIN_a= -29282858
##$ZGOPTNS= <>
##$ZL1= 120
##$ZL2= 120
##$ZL3= 120
##$ZL4= 120
##$ABSF1= 222.646
##$ABSF2= -17.35081
##$ABSG= 5
##$ABSL= 3
##$ALPHA= 0
##$AQORDER= 0
##$ASSFAC= 0
##$ASSFACI= 0
##$ASSFACX= 0
##$ASSWID= 0
##$AUNMP= <proc_1d>
##$AZFE= 0.1
##$AZFW= 0.5
##$BCFW= 0
##$BC_mod= 2
##$BYTORDP= 0
##$COROFFS= 0
##$CY= -3
##$DATMOD= 1
##$DC= 0
##$DFILT= <>
##$DTYPP= 0
##$F1P= 0
##$F2P= 0
##$FCOR= 0.5
##$FTSIZE= 32768
##$FT_mod= 6
##$GAMMA= 0
##$GB= 0
##$INTBC= 1
##$INTSCL= 4.134877e-10
##$ISEN= 128
##$LB= 1
##$LEV0= 0
##$LPBIN= 0
##$MAXI= 10000
##$MC2= 0
##$MEAN= 0
##$ME_mod= 0
##$MI= 0.1934396
##$NCOEF= 0
##$NC_proc= 0
##$NLEV= 6
##$NOISF1= 120.0001
##$NOISF2= 80.00006
##$NSP= 0
##$NTH_PI= 0
##$NZP= 0
##$OFFSET= 222.646
##$PC= 1.4
##$PHC0= -262.1635
##$PHC1= 23.56242
##$PH_mod= 1
##$PKNL= yes
##$PPARMOD= 0
##$PSCAL= 0
##$PSIGN= 0
##$REVERSE= no
##$SF= 50.3227304947849
##$SI= 32768
##$SIGF1= 140
##$SIGF2= 120
##$SINO= 11.81781
##$SIOLD= 32768
##$SREGLST= <13C.CDCl3>
##$SSB= 0
##$STSI= 32768
##$STSR= 0
##$SW_p= 12077.2946859903
##$SYMM= 0
##$S_DEV= 0
##$TDeff= 32768
##$TDoff= 0
##$TI= <>
##$TILT= no
##$TM1= 0
##$TM2= 0
##$TOPLEV= 0
##$USERP1= <user>
##$USERP2= <user>
##$USERP3= <user>
##$USERP4= <user>
##$USERP5= <user>
##$WDW= 1
##$XDIM= 32768
##$YMAX_p= 490888388
##$YMIN_p= -4359634
$$ End of Bruker specific parameters
$$ ---------------------------------
##NTUPLES= NMR SPECTRUM
##VAR_NAME=  FREQUENCY,     SPECTRUM/REAL,   SPECTRUM/IMAG
##SYMBOL=    X,             R,               I
##VAR_TYPE=  INDEPENDENT,   DEPENDENT,       DEPENDENT
##VAR_FORM=  AFFN,          ASDF,            ASDF
##VAR_DIM=   32768,         32768,           32768
##UNITS=     HZ,            ARBITRARY UNITS, ARBITRARY UNITS
##FACTOR=    0.368581032318806, 1,           1
##FIRST=     11204.1544571687, 0,            0
##LAST=      -873.140228821589, 0,           0
##MIN=       -873.140228821589, -4359634,    0
##MAX=       11204.1544571687, 490888388,    0
$$ Real data points
##PAGE= N=1
##DATA TABLE= (X++(R..R)), XYDATA
$$ [...]
15719i1848L07098P82092k27684r67531o59816K41867M11716q35527j159962M04919
15709a794676J668696J097179l60838q60684l62990j73314J45667j80858l56797
15700a178615l10878j79946L93360J067221L24483M8721M95807o69245j253200
15691a262292m46845K10557m22466m85571M10975O64560K53833K22954j2864p02261
15681a569420m58765j19140p874N46620J505515K83618j316870r34012M95922
15672a574406M37428L70704P7356p31087j98517R3914K5129K40040M58101m2776
15662h44114k73927K15577K65166R40410R41327M88728J77762p86634r79136o56119
15652e10960n68308j58607P01701P85028L52142k54886m4687l9640J85854K21465
$$ plain form
15719 -91848 215250 997342 769658 -197873 -857689 -615822 -204106 -1039633 -2199595 -1794676
15709 -1794676 -125980 971199 610361 -250323 -613313 -786627 -640960 -821818 -1178615
15700 -1178615 -1489493 -1669439 -1276079 -208858 115625 164346 660153 -9092 -1262292
15691 -1262292 -1709137 -1498580 -1921046 -2406617 -1995642 -1331082 -1077249 -854295 -867159 -1569420
15681 -1569420 -2028185 -2147325 -2155199 -1608579 -103064 180554 -1136316 -2070328 -1574406
15672 -1574406 -1136978 -766274 -688918 -1420005 -1618522 -1524608 -1499479 -1259439 -801338 -844114
15662 -844114 -1118041 -902464 -637298 303112 1244439 1733167 1910929 1124295 145159 -510960
15652 -510960 -1079268 -1237875 -536174 248854 600996 346110 301423 261783 447637 669102
15642F69102k85981j76078L9426J28728K37086k31602l75596K48751o79817M67276
15632D1295R65852K50043k64750j95845m83582j075074l52632o8435K32896O60869
15622b89363k20260m14102n1101J051471J197681O41875M38264N37798J95643
15613C087906o6317J05986j62259R4582q6599L49084j03568o09125j002882o96641
15603I10167j028803j277062j34366R93201K15893j88408K60319k07414o15194
15594a071667p98813j95992P2687q484k4807m05696k66946L90986M48954L3165
15584a826613N73797R79740P00358N05243J84717k80896m33133n74387p44369
15575i15543k20634L71792P33297L27807N76019M34335l29740l35062m67921j51559
$$ plain form
15642 669102 383121 207043 246469 375197 612283 380681 5085 253836 -425981 41295
15632 41295 1007147 1257190 992440 796595 313013 -762061 -1114693 -1183128 -950232 -289363
15622 -289363 -509623 -923725 -974826 76645 1274326 1916201 2354465 2892263 3087906
15613 3087906 3021589 3127575 2965316 3059898 2973299 3322383 3218815 2609690 1606808 910167
15603 910167 -118636 -1395698 -1530064 -536863 -320970 -509378 -249059 -456473 -1071667
15594 -1071667 -1870480 -2066472 -1993785 -2002269 -2027076 -2432772 -2699718 -2308732 -1859778 -1826613
15584 -1826613 -1252816 -273076 427282 932525 1117242 836346 403213 -171174 -915543
15575 -915543 -1136177 -764385 -31088 296719 872738 1307073 977333 642271 174350 22791
15565B2791q30481r39502j345752k85954J492820J110577O90303K33112r5875
15556E2039n32391j280167M29761R27239O99833M439m16138k04943k75350l60529
15546i56207k00488M53165O73157P34590Q16527J12862k67946J01864K42779k45502
15536A464801r80084j050516o24563j55761j86395m9057N06406Q17635L65011
15527A07477J28753r6205o99675l51096o22597m1095M96596L94082K2409N56266
15517a05085N91072L4764j143331j599270q79353J45937O62007O65106N45226
15508a082927Q70145R62509J78218o8362K01949O0093p55139n97275J73557M3717
15498a3515o26351q56912n64020P32787M57378n53718L82555J064652l85966r13816
$$ plain form
15565 22791 -807690 -1747192 -3092944 -3378898 -1886078 -775501 -85198 147914 52039
15556 52039 -480352 -1760519 -1330758 -403519 296314 300753 -115385 -320328 -595678 -956207
15546 -956207 -1156695 -703530 -30373 704217 1520744 1633606 1365660 1467524 1710303 1464801
15536 1464801 484717 -565799 -1190362 -1346123 -1532518 -1581575 -1075169 -257534 107477
15527 107477 236230 140025 -559650 -910746 -1533343 -1574438 -1077842 -683760 -661351 -105085
15517 -105085 485987 520751 -622580 -2221850 -3101203 -2955266 -2293259 -1628153 -1082927
15508 -1082927 -212782 749727 927945 859583 1061532 1121625 366486 -230789 -57232 -13515
15498 -13515 -639866 -1496778 -2060798 -1328011 -870633 -1424351 -1041796 22856 -363110 -1276926
15488a276926n08050Q55673Q58521M09503N12358K24117J87040J48470O393m9361
15478A367738m73504M1699L81367o01377o83493k99969n92152m11746k86071N2263
15468a505245m28733k7741J179678J381623N74730m38665n57969k00308j029930
15459a052560j186713K73031O15058M09204l63192m14125Q102N5920L41454m28493
15449a742314j58828J453326J259688L01411j20304k77596l97258j015198j7126
15440g14199J107189M57706l63844p61914j396700p04460M11540L26437k25642
15431a863887q52217q69262M95441R48975Q72228J139580O82450m39340o23503
15422e09535L67510K74812m36764P26468R92323M24156o3318o1706l12289J17033
$$ plain form
15488 -1276926 -1784976 -929303 -70782 338721 851079 1075196 1262236 1410706 1417099 1367738
15478 1367738 894234 935933 1317300 715923 32430 -267539 -859691 -1271437 -1557508 -1505245
15468 -1505245 -1933978 -1961719 -782041 599582 1174312 735647 177678 -22630 -1052560
15459 -1052560 -2239273 -1966242 -1351184 -941980 -1305172 -1719297 -1711195 -1655275 -1313821 -1742314
15449 -1742314 -1901142 -447816 811872 1113283 992979 715383 318125 -697073 -714199
15440 -714199 392990 850696 486852 -275062 -1671762 -2376222 -1964682 -1638245 -1863887
15431 -1863887 -2716104 -3585366 -3089925 -2140950 -1268722 -129142 553308 113968 -509535
15422 -509535 -142025 132787 -303977 422491 1414814 1838970 1775652 1713946 1401657 1518690
15412A518690Q4769j306834m93162M43926O44907J47555j75488k43705K350j18115
15402E04893l99990j50476o8075P55921J31582j322856m02206K10930l66270m68660
15392a575207j92605N02023K50011K84784n031m1361l65305p86266j96893p4689
15382b200539M55084M82566K33621r894k68612P5323L04580N00512m20757q94468
15372a742584j97598Q83953O59200j99576k00595q8229j33868Q9Q38382r5373
15362b76199r51450Q7480j8032p29715K19618P96761N07148Q50483P58245O47812
15352A892151J50978n85877n78519n96808j39533o04371l152J018266O33315R2970
15342A279420m39227r12255j88266O30558L93528K12094m73725k53413l16937
$$ plain form
15412 1518690 1603459 296625 -196537 247389 892296 1039851 864363 620658 623008 504893
15402 504893 104903 -45573 -113648 642273 773855 -549001 -951207 -740277 -1106547 -1575207
15392 -1575207 -1767812 -1265789 -1015778 -730994 -736025 -777386 -1142691 -1928957 -2125850 -2200539
15382 -2200539 -1745455 -1262889 -1029268 -1039162 -1307774 -1232451 -927871 -427359 -848116 -1742584
15372 -1742584 -1940182 -1056229 -397029 -596605 -797200 -885429 -1019297 -1019208 -180826 -276199
15362 -276199 -1227649 -1140169 -1158201 -1887916 -1668298 -871537 -364389 486094 1244339 1892151
15352 1892151 2043129 1457252 878733 281925 142392 -461979 -465131 553135 1186450 1279420
15342 1279420 840193 -72062 -260328 370230 763758 975852 502127 248714 -68223
15333f8223n99356n38960J13657q4956j506311r87810L51641J680771J397655
15324b41892L10318L43624k11215n85287p30293p01414o28853p07122k71230R86984
15314b436380J340861P84307J58117o14105p37176K96155P43188O5062r709L11438
15304i8242K04505L54903k30778q85024n27993L05614K9377m80472l17585l6447
15294a682142K84172o81085o56575k29142P46201J90807Q7852M55306m9410O1203
15284a472813k31172j77779j78887J20081J118614J621849J007845K34296J20939
15275B162973r40359r13520o70100j634421l15750J550184Q94712m92191n52936
15266i11408o84831m60529p395P91880J346267L09397k20523m80199l86925l08022
$$ plain form
15333 -68223 -667579 -1206539 -1092882 -1177838 -2684149 -3671959 -3320318 -1639547 -241892
15324 -241892 68426 412050 200835 -384452 -1114745 -1816159 -2445012 -3152134 -3423364 -2436380
15314 -2436380 -1095519 -311212 -153095 -767200 -1504376 -1208221 -465033 -399971 -409680 -98242
15304 -98242 106263 461166 230388 -654636 -1182629 -877015 -847638 -1328110 -1645695 -1682142
15294 -1682142 -1397970 -2079055 -2735630 -2964772 -2218571 -2027764 -1939912 -1484606 -1534016 -1472813
15284 -1472813 -1703985 -1881764 -2060651 -1940570 -821956 799893 1807738 2042034 2162973
15275 2162973 1222614 309094 -361006 -1995427 -2311177 -760993 133719 -358472 -911408
15266 -911408 -1596239 -2056768 -2064163 -1272283 73984 383381 162858 -317341 -704266 -1012288
15256a012288K21296n7322L3813Q053m44274k73536R0786L25911O17701K85938
15246b03922K79173K80969N3591M35463o3874L88960K38293m83680o94445r84882
15236g54354j4281J108271O41831m16201n53614M58754L33483q04850n20273Q53480
15226C32246J000429L05088p68390j383749n71197N40538O61765N30036Q85p12115
15216f4464m11478M50924O81513L23323k48028K08229j73580J01104J48885n03243
15206E13185n55513O4766j09418j127258l41203L69936M05068n72345p23571K98706
15196a777647J678378P45400m55752k28525j68224k19734N75470J040951L56193
15187A546510J75711l59958r03526q01408j048261m99183k58275L84486J51359
$$ plain form
15256 -1012288 -790992 -848314 -814501 -806448 -1250722 -1524258 -1433472 -1107561 -489860 -203922
15246 -203922 75251 356220 409811 845274 781400 1170360 1408653 924973 230528 -754354
15236 -754354 -768635 339636 981467 565266 11652 470406 803889 -961 -521234 332246
15226 332246 1332675 1637763 869373 -514376 -1085573 -545035 116730 646766 647651 -64464
15216 -64464 -475942 -25018 656495 979818 731790 940019 766439 867543 1016428 513185
15206 513185 -42328 22438 -86980 -1214238 -1555441 -1185505 -780437 -1352782 -2076353 -1777647
15196 -1777647 -99269 646131 190379 -38146 -206370 -426104 149366 1190317 1546510
15187 1546510 1722221 1362263 458737 -342671 -1390932 -1890115 -2148390 -1763904 -1612545
15178a612545L6588M6791l07252k70784O10527K51048j44694m62781q26597J71760
15168b507939O95980R05975N92301L29421J02042p57643q70236k34995L93290
15159a351804k67095P0750K4530M80965J194819J118864J79977o49266q72809
15150g1069j09020j66868K32644N12340n21946q77464O00566J115057L78666k29938
15140H62968o25473o59122K25066P50146o28008j274287j12719P46893K13546
15131e00990J11423M84429L77825K69688K33790n01231j569710j256179J19989
15122b230966N37118l25157o07557n1937L05201Q96167P18184M06329L10702J19260
15112G7344p6004k43244m31862n38711o27742O72632J326291Q30424M6787n93131
$$ plain form
15178 -1612545 -1575957 -1529166 -1836418 -2107202 -1496675 -1245627 -1390321 -1853102 -2679699 -2507939
15168 -2507939 -1811959 -905984 -313683 15738 117780 -639863 -1510099 -1745094 -1351804
15159 -1351804 -1618899 -1548149 -1523619 -1042654 152165 1271029 1451006 801740 -71069
15150 -71069 -180089 -346957 -114313 398027 -123919 -1001383 -400817 714240 1092906 862968
15140 862968 237495 -421627 -196561 553585 -74423 -1348710 -1461429 -714536 -500990
15131 -500990 -389567 94862 472687 742375 976165 474934 -1094776 -2350955 -2230966
15122 -2230966 -1693848 -2019005 -2626562 -2678499 -2373298 -1477131 -758947 -352618 -41916 77344
15112 77344 1340 -241904 -673766 -1212477 -1840219 -1167587 158704 989128 1035915 442784
15102D42784r02272j85035K65832n30228p56134q3529Q51419M04634n04075K90672
15092g05932Q87063O79106Q1023q4208J1579J65772N81987L16713p61157j061601
15082A10345o55499K0213k48836N1037J2530l29371M10714N87160N96112J07841
15072F62246n64583n21357K79633R86820Q41696N7995p34072q33355r29759r02556
15062a657292l21626L59253J287946Q17230l02398j4023p2424m9798j83519M660
15052a31991K4641M89058K75126l62711j012500J6211M58134j23849k79458p35402
15042a382741j916476m28010J067675O55123O59313M66527j051121r98816k7049
15033b955575J464094K132070J096647j34562j026934j295779m93126J92470r2885
$$ plain form
15102 442784 -459488 -644523 -378691 -908919 -1665053 -1748582 -897163 -492529 -996604 -705932
15092 -705932 181131 860237 941260 857052 868631 1034403 1616390 1933103 1171946 110345
15082 110345 -545154 -524941 -773777 -722740 -710210 -1039581 -628867 -41707 554405 662246
15072 662246 97663 -423694 -144061 842759 1684455 1742450 1008378 175023 -754736 -1657292
15062 -1657292 -1978918 -1619665 -331719 485511 183113 169090 96666 46868 -136651 -131991
15052 -131991 -107350 381708 656834 294123 -718377 -702166 -244032 -367881 -647339 -1382741
15042 -1382741 -3299217 -3727227 -2659552 -2004429 -1345116 -878589 -1929710 -2928526 -2955575
15033 -2955575 -1491481 640589 1737236 1602674 575740 -720039 -1213165 -1020695 -1113580
15024a113580j7771J6584K56128O6613m71392J48378N63682n39316o57619K80211
15014a468082M05743M7822L74671L64738j39180M11072J343944J296428L00561
15005B937717r99527k35439m81593q47447j05816L57989j18456o51145J30958
14996a2759K32760L73055m74039j22517N10583L35741K68336O13360N84575K65358
14986B574453L16308K15078n59443j271279o24716K45563L5523o37367j046241
14977g52121l18454Q16381R78105J18837K75352k5068r12788m37617j07326K94911
14967f9788P69512L80742k62132o02860o13948p21401N4669m26068o32759K71288
14957a852745O04377l79035p43549k73791N18668O51937J95795J48101O63059
$$ plain form
15024 -1113580 -1131351 -1114767 -858639 -792026 -1263418 -1115040 -551358 -1090674 -1748293 -1468082
15014 -1468082 -1062339 -1014517 -639846 -275108 -414288 -3216 1340728 2637156 2937717
15005 2937717 1938190 1702751 1221158 373711 267895 625884 507428 -143717 -12759
14996 -12759 220001 593056 119017 -3500 507083 842824 1111160 1724520 2309095 2574453
14986 2574453 2890761 3105839 2546396 1275117 650401 895964 931487 294120 -752121
14977 -752121 -1070575 -254194 723911 842748 1118100 1093032 180244 -257373 -364699 -69788
14967 -69788 699724 1080466 818334 215474 -398474 -1119875 -1065206 -1491274 -2124033 -1852745
14957 -1852745 -1248368 -1627403 -2370952 -2644743 -2126075 -1474138 -1278343 -1130242 -467183
14948d67183M40805P7937N96166M11830L24406J29879m12190q02854o42082n85695
14938i28981L19181K68200K42602N16599O09645N25741p6919q30473j010441j073909
14928a438755J75203L05744l33245m79361L01060j92363l29843K99719O2804L81889
14918a247148J281409N98634k2363j35993k40535n16163m65021k23440o43379
14909a613999L4908M87925l50311p4470R23833L53420n42552j217727j19277J084896
14899a033354K23052o16747o05936P7050M19097M29680M64788l59902k91852N39025
14889g55099L3432m90708j04876M42778O09654P09399N80346n18585m44306N17700
14879E79735J091823O46855o29581q04948M753K00489K25781L56096o26203r95433
$$ plain form
14948 -467183 -26378 51559 647725 1059555 1383961 1513840 1101650 298796 -343286 -928981
14938 -928981 -609800 -341600 -98998 417601 1027246 1552987 1476068 645595 -364846 -1438755
14928 -1438755 -1263552 -957808 -1291053 -1770414 -1469354 -1661717 -1991560 -1691841 -1629037 -1247148
14918 -1247148 34261 632895 610532 474539 234004 -282159 -747180 -970620 -1613999
14909 -1613999 -1579091 -1091166 -1441477 -1515947 -592114 -238694 -781246 -1998973 -2118250 -1033354
14899 -1033354 -810302 -1427049 -2032985 -1955935 -1536838 -1107158 -642370 -1002272 -1294124 -755099
14889 -755099 -721667 -1212375 -1317251 -874473 -264819 444580 1024926 506341 62035 579735
14879 579735 1671558 2318413 1688832 883884 888637 1089126 1314907 1671003 1044800 49367
14869D9367l89216m89314l9003P1680m63070J65351Q03139O29638O62065J88194
14859A188831o69017j110319j065054j15600K81099J14540j47950n5514K28520
14850a350464J25166j04875l79318j27918N98245n9789o21537k52657O9661l62507
14840b465993m76288O20176J445847K82877q78703K60877k27832o31968l5671
14831b106678p62373N26624J343424M96968q7192N79629L13580q1948J35843k41143
14821A16734k40641k70076l96770K39478O75392m29098o46847m39832m3444N77265
14811h57839R54663Q03508K49869m72326q17306o32186r15507M4951K38668o03934
14801b007439l15096K24600q5949j95432M61902J54302K94658J019705J317441
$$ plain form
14869 49367 -339849 -829163 -868166 -796486 -1259556 -1094205 -291066 338572 1000637 1188831
14859 1188831 519814 -590505 -1655559 -1771159 -1490060 -1375520 -1523470 -1578984 -1350464
14850 -1350464 -1225298 -1330173 -1709491 -1837409 -1239164 -1298953 -1920490 -2173147 -2103486 -2465993
14840 -2465993 -2942281 -2322105 -876258 -593381 -1472084 -1211207 -1439039 -2071007 -2106678
14831 -2106678 -2869051 -2342427 -999003 -502035 -589227 -9598 303982 222034 357877 116734
14821 116734 -123907 -393983 -790753 -551275 124117 -304981 -951828 -1391660 -1435104 -857839
14811 -857839 96824 900332 1150201 677875 -139431 -771617 -1687124 -1642173 -1403505 -2007439
14801 -2007439 -2322535 -2097935 -2183884 -2379316 -1917414 -1763112 -1468454 -448749 868692
14792H68692L87758L10973O36910j83890k63537K59072k14064l25141M1417m20532
14782A097658J41832L17284K25040m71146j114504p85374k16941r364m920n07210
14772a327645j035806o05987o1622n790N04481K56965L53469m7310N6749Q41006
14762a071490Q51861P02843O01247P66532Q77020q7614j123481p11378l60014
14753D45526m97330L0688j94356l6256O45768M86535L8533l31241j4875M18675
14743I91667p5858l49115J53314L42770J25316l01995q27671O1072j78262m04331
14733d63093Q93187J520721L46090k87984j306791j574546p71623k36364l08722
14724b189125M63153J176308R53459n9698j175009l04634L38113L71878m64625
$$ plain form
14792 868692 1256450 1567423 2204333 2020443 1756906 2015978 1801914 1476773 1518190 1097658
14782 1097658 1239490 1556774 1781814 1310668 196164 -589210 -806151 -815515 -820435 -1327645
14772 -1327645 -2363451 -2969438 -3031060 -3036850 -2532369 -2275404 -1921935 -1969245 -1912496 -1071490
14762 -1071490 -219629 483214 1084461 1850993 2728013 2640399 1516918 805540 445526
14753 445526 -51804 -21116 -215472 -251728 394040 880575 919108 587867 572992 991667
14743 991667 915809 566694 720008 1062778 1188094 886099 58428 119500 -58762 -463093
14733 -463093 430094 1950815 2296905 2008921 702130 -872416 -1644039 -1880403 -2189125
14724 -2189125 -1725972 -549664 403795 344097 -830912 -1135546 -797433 -425555 -890180
14715h90180k82907j87042K58911O26652K35006L97023J78460k93278l05836l79871
14705f43062J27757N362R1005l92736O3666M43951L90568N39388M03429L21734
14695A351062L3163o61750k38841J46282J4824l66144m00985N40871N99961O3206
14685A081649j04309K14111P48069l78415j050455j318090o22444M70114P58421
14676b01349M49328o6079k43982o1723l22054r99518l01593L00429R10721R10316
14666C74496K88249M61336J75012j26497K40339M1581o48219m32429p914k70751
14656I5203p30234n70359k88002j17601j21888l26248P66721J013697O04974O12205
14646I38468J008651n17381j525886m93980j47746Q11397J460899R21019K43294
$$ plain form
14715 -890180 -1173087 -1360129 -1101218 -474566 -239560 157463 335923 42645 -263191 -643062
14705 -643062 -515305 -509943 -418938 -811674 -748008 -304057 86511 625899 1029328 1351062
14695 1351062 1384225 722475 483634 629916 644740 278596 -122389 418482 1018443 1081649
14685 1081649 977340 1191451 1939520 1561105 510650 -807440 -1429884 -959770 -201349
14676 -201349 247979 181900 -62082 -123805 -445859 -1445377 -1746970 -1446541 -535820 374496
14666 374496 662745 1124081 1299093 1172596 1412935 1454516 806297 373868 365954 95203
14656 95203 -635031 -1205390 -1493392 -1610993 -1732881 -2059129 -1292408 -278711 326263 938468
14646 938468 1947119 1429738 -96148 -590128 -737874 73523 1534422 2455441 2698735
14637B698735l70630j076564j040518q51986n69037O50834R83495P58123n53971
14628F28481j040665J98005Q03609o25469j173402l15942O4720l8248k37778K0499
14618a716190O55293Q5085r7945R8397O7808Q87387j25153o53302M650O81791
14608a12179Q3642p29758p20085K63680K39045k8586n96801o85413N23838M16322
14598a346295K66831N55171j76349l91905L78680P4034L23770l65632p87731o68344
14588b137770K79542M77048l00421L59628L95667J007488P72892j084907j274122
14579a504955K5743N00050L07976O27392Q78605N90378K02842L84918k35684n15463
14569A261802j81782r35002j273555p60779l86445j99627O14219K86811l66379
$$ plain form
14637 2698735 2328105 1251541 211023 -640963 -1210000 -559166 424329 1182452 628481
14628 628481 -412184 -214179 589430 -36039 -1209441 -1525383 -1460663 -1498911 -1736689 -1716190
14618 -1716190 -1060897 -975812 -1073757 -975360 -907552 -20165 -145318 -798620 -793970 -112179
14608 -112179 -28537 -758295 -1478380 -1214700 -975655 -1004241 -1601042 -2286455 -1762617 -1346295
14598 -1346295 -1079464 -524293 -700642 -1092547 -713867 -639833 -316063 -681695 -1469426 -2137770
14588 -2137770 -1858228 -1381180 -1681601 -1321973 -926306 81182 854074 -230833 -1504955
14579 -1504955 -1479212 -979162 -671186 -43794 834811 1425189 1628031 2012949 1777265 1261802
14569 1261802 1080020 145018 -1128537 -1889316 -2275761 -2475388 -1861169 -1574358 -1940737
14560a940737l21518K38169N88849J93939O90895J26741m90191O1687K8210k44299
14550a068255M4756K25461L79683O5324l73066L2164R58873P81752j44292p23265
14540A79135K2371J058598L37597J12238K71549l9645o40327k44104p52081n11019
14530b05688k29267J80276O12975N01904J38478N5751l77323n41402m00256k7798
14520b92350L86421k76468p92757j091158n64576L69089N02250J20080l73279
14511b012748l14307O65804R33440l98744k16540O50160L33088k30914j94430
14502g85191K59533K56298l58171k58362l65198k74313l78774L43686L30762j87429
14492a417159k15295j96901k58023R78260R47376J49662k73027o23326p69332
$$ plain form
14560 -1940737 -2262255 -2024086 -1435237 -1241298 -550403 -423662 -913853 -852166 -823956 -1068255
14550 -1068255 -1023499 -798038 -418355 -353031 -726097 -693933 264940 1046692 902400 179135
14540 179135 201506 1260104 1597701 1709939 1981488 1941843 1301516 1057412 305331 -205688
14530 -205688 -434955 -254679 358296 860200 998678 1054429 677106 135704 -264552 -292350
14520 -292350 94071 -182397 -975154 -2066312 -2630888 -2261799 -1759549 -1639469 -2012748
14511 -2012748 -2327055 -1661251 -727811 -1126555 -1343095 -692935 -359847 -590761 -785191
14502 -785191 -525658 -269360 -627531 -885893 -1251091 -1525404 -1904178 -1560492 -1229730 -1417159
14492 -1417159 -1632454 -1829355 -2087378 -1109118 -161742 -12080 -285107 -908433 -1677765
14483a677765o39692K32625N38817K66437K05901j37940k7186j11366o73253m12144
14473b435566M69497J467564J120012M34831P5409n71540p74854j04920l0943
14464c50510l45190J06304J36894n8765L19210M90910K94789J11541p6770j401319
14454g72906q87403M31032J501298M68120K4329P78530N03220j7834n63454K46021
14444A710953L02559k25075j58264M54923n85510j206001o99918n91320k25774
14435a223427M66791O10588R5256l85267k26082P34822Q70074j2359n97647J57017
14425D89766Q15307r2633q91696k33382L58701J384641O74581k04515q14893j541520
14415e5643l09547M51820J61277O5693j57766K15615L33979j44784l35480l88666
$$ plain form
14483 -1677765 -2317457 -2084832 -1546015 -1279578 -1073677 -1211617 -1238803 -1350169 -2023422 -2435566
14473 -2435566 -1966069 -498505 621507 1056338 1131747 560207 -214647 -319567 -350510
14464 -350510 -695700 -589396 -452502 -511267 -192057 298853 593642 705183 628413 -772906
14454 -772906 -1660309 -1229277 272021 740141 764470 1543000 2046220 2028386 1464932 1710953
14444 1710953 2013512 1788437 1630173 2085096 1499586 293585 -406333 -997653 -1223427
14435 -1223427 -756636 -146048 -50792 -436059 -662141 72681 942755 930396 332749 489766
14425 489766 1305073 1212440 320744 87362 446063 1830704 2505285 2300770 1485877 -55643
14415 -55643 -365190 86630 247907 313600 155834 371449 705428 560644 225164 -163502
14405a63502n69839O84313M03496j04264P42671M38266q99975o37947j29586j42797
14395c79164j15256M9669L81838J174695M30168j67227m15351o08972q04255m58280
14385i12135m4561O8627M7765M35081P56477Q0344o44210p75018o02991Q50677
14375g39944J119081Q3382m79038o52459L03628Q18223L04173l86181q10983M37309
14365b809N81702k62211N78306K00775j2311R0916m50062n54733n67466q93075
14355a290968p42109q2383R9849Q80637K55298k64451N19065L02591n06767k59915
14345a089153N81152O28698J316189Q41075k82688q35914l43590j205898j239996
14336a630125K63215R63685O97741m1298n92092r19229J21513J492818J299214
$$ plain form
14405 -163502 -733341 -49028 354468 250204 992875 1431141 531166 -106781 -236367 -379164
14395 -379164 -494420 -444751 -62913 1111782 1541950 1374723 959372 350400 -453855 -912135
14385 -912135 -956696 -888069 -840304 -405223 351254 431598 -212612 -987630 -1590621 -739944
14375 -739944 379137 462519 -16519 -668978 -365350 452873 757046 370865 -440118 -2809
14365 -2809 578893 316682 894988 1095763 1083452 1174368 724306 169573 -397893 -1290968
14355 -1290968 -2033077 -2115460 -2015611 -1134974 -879676 -1144127 -625062 -322471 -829238 -1089153
14345 -1089153 -508001 120697 1436886 2277961 1995273 1159359 815769 -390129 -1630125
14336 -1630125 -1366910 -403225 294516 253218 -338874 -1258103 -1136590 356228 1655442
14327A655442M86709L853k83356q46754r72847p30513m21364k37039J92875N89347
14317e63647M69031k05465o36613K32165O2928k00751m25944m0046j12068l73034
14307a793444k45592K66271L10442N55538J17773o27519J38379K23834k47092
14298a301410R9291M95179K31881o60527l21674N19692P78846M59209N8735L76849
14288G36071O05716k08068n80551j01549K69798l32056p28591O71264M37146o33066
14278A36114n35906j91361M30402l39443n19433M20482R40831J613600j6365j320460
14268F18461n53769m25951p25624p41000n08874m63510M27981L16880K28530L16050
14258a510826l66310k80791n12871M17711P08043K84982j10920n78196O08814
$$ plain form
14327 1655442 2142151 2146004 1862648 1015894 43047 -687466 -1108830 -1345869 -1152994 -563647
14317 -563647 -94616 -300081 -936694 -704529 -641601 -842352 -1268296 -1308342 -1420410 -1793444
14307 -1793444 -2039036 -1772765 -1462323 -906785 -789012 -1416531 -1278152 -1054318 -1301410
14298 -1301410 -1202119 -706940 -475059 -1135586 -1457260 -937568 -158722 300487 359222 736071
14288 736071 1341787 1133719 553168 451619 721417 389361 -339230 332034 769180 136114
14278 136114 -399792 -591153 -160751 -500194 -1019627 -599145 341686 1955286 1938921 618461
14268 618461 64692 -361259 -1086883 -1827883 -2336757 -2800267 -2372286 -2055406 -1826876 -1510826
14258 -1510826 -1877136 -2157927 -2670798 -2253087 -1545044 -1260062 -1370982 -1949178 -1340364
14249a340364J335393P94383J42643o67541o39378l50834j05237k25824m07997
14240a464756K43824M43002M1295n20449k81229k3073n11846j4865N25697J357456
14230b04944O56339p94657n44030j40799j45625p43524J73238Q61290Q52402J289078
14220A258768M33371q47638q35674M23M13370K41517O82893O19068p29417j153120
14210H3561m02044j28093l25796j7776L80215K28801j62354n28131j4704O09332
14200b76989l22154r3535m58125n8742P40499L08976l52623p1746l33632k82833
14190a200904K18598O76545R99743J133718L27055j49477j2250J32788n42061
14181A583755m55447r51245n87187l07617o18150L03977q1528o06372P097M89012
$$ plain form
14249 -1340364 -4971 789412 932055 264514 -374864 -725698 -830935 -1056759 -1464756
14240 -1464756 -1220932 -777930 -736635 -1257084 -1538313 -1561386 -2073232 -2088097 -1562400 -204944
14230 -204944 451395 -343262 -887292 -1028091 -1173716 -1917240 -1744002 -882712 -30310 1258768
14220 1258768 1692139 844501 8827 9250 422620 664137 1347030 1966098 1236681 83561
14210 83561 -318483 -446576 -772372 -790148 -409933 -181132 -343486 -871617 -886321 -276989
14200 -276989 -599143 -692678 -1150803 -1209545 -469046 -160070 -512693 -584439 -918071 -1200904
14190 -1200904 -982306 -305761 693982 1827700 2154755 2005278 1993028 2125816 1583755
14181 1583755 1128308 177063 -410124 -717741 -1335891 -1031914 -1113442 -1719814 -1712717 -1223705
14171a223705P24167N82348q2494K00176l06389m42449K81536J46886l80551k55257
14161g55732l16282l11697R95003N36574o79206o10581l0580L45299Q4040o44502
14151a387664P58199J345670l77222q10163O12110J205205l3617l39463l49001
14142F24054n31598O45468N61959J59006j53897n54887L16671K81036j59203M7954
14132A236563j35421l73284K68161J9880q06095k76512j17432k94913l7895n5667
14122e72615K5821l00778k01374J87822L41630P69179K92816k00488J81591j24409
14112C99195l92376p09388K87979K15255k98705l98135l21190O11803M52778K56686
14102A03902Q49712L99263k59758j003391o21353n6814l22639n30381l17328L57040
$$ plain form
14171 -1223705 -499538 82810 316 200492 -105897 -548346 -266810 -119924 -500475 -755732
14161 -755732 -1072014 -1383711 -388708 147866 -531340 -1141921 -1172501 -827202 -743162 -1387664
14151 -1387664 -629465 716205 338983 -471180 140930 1346135 1312518 973055 624054
14142 624054 92456 737924 1299883 1458889 1304992 750105 1066776 1347812 1188609 1236563
14132 1236563 1101142 727858 996019 1015899 209804 -66708 -184140 -479053 -516948 -572615
14122 -572615 -546794 -847572 -1048946 -861124 -519494 249685 542501 342013 523604 399195
14112 399195 6819 -702569 -414590 -199335 -498040 -896175 -1217365 -605562 -152784 103902
14102 103902 953614 1352877 1093119 89728 -531625 -588439 -911078 -1441459 -1758787 -1401747
14092a401747M39584J55751l97162l18722o5029M59645L72023O50157L73952L42110
14082F10562M41462j91372o48336p29545j56072k66537l00234K55039R80411O27445
14072F22823j797k21395k05932l31502m94066L17000Q23670m72497m39877M89230
14062H5657J63668J41710J09736p24257j68611K39833m3335n24546l85456K92968
14052h12633M61960K76939N07712j85405j79100j02083j7151R3251j75449J47071
14042A5112L84444K82129J73976j88050m2535J48194j18915n51940p46228j75590
14032h19403Q7794L54545m88991j90487Q897N50336L18885q6167L3402j76713
14022d07902K90831N79092K45650q31354j19220K70326L2793K67810j17582m28524
$$ plain form
14092 -1401747 -962163 -806412 -1203574 -1522296 -1587325 -1127680 -755657 -105500 268452 610562
14082 610562 1052024 860652 212316 -517229 -673301 -939838 -1240072 -985033 -4622 622823
14072 622823 621026 399631 193699 -137803 -631869 -314869 508801 36304 -403573 85657
14062 85657 249325 391035 500771 -223486 -392097 -152264 -195599 -720145 -1105601 -812633
14052 -812633 -350673 -73734 433978 248573 69473 -32610 -49761 43490 -131959 15112
14042 15112 399556 681685 855661 667611 625076 773270 654355 102415 -643813 -819403
14032 -819403 -731609 -377064 -866055 -1056542 -1047645 -497309 -178424 -264591 -231189 -407902
14022 -407902 -117071 462021 707671 -123683 -242903 27423 60216 328026 210444 -218080
14012b18080q05784o11783O22427O41711l12040r08247o34796j77015L48086N40900
14002a514621M13299k18560o195L18099M22025l90144p04609K05137R68139L83190
13992a24240l65704o70342p8439J204512L94550L84257K26538L2648J15043k07257
13982I11566q80936j430543o31803P04883J460515O42488N5720l63630j091292
13973f23032r39082L52574J027096O26057O31886n98878p72708k3819K27024j20583
13963b13465k49613O5859K72056O67327J37121j301285j574797m99676J088279
13954a608194J015053J96640n7904l11852p4595M5426L01917J048156r257r12549
13944c67159j53963N67781J071813N15899K8049j4128p3202m73074l87110j08183
$$ plain form
14012 -218080 -1023864 -1635647 -1013220 -371509 -683549 -1591796 -2226592 -2403607 -2055521 -1514621
14002 -1514621 -1101322 -1319882 -1326077 -1007978 -585953 -976097 -1680706 -1475569 -507430 -124240
13992 -124240 -489944 -1160286 -1238725 -34213 360337 744594 971132 1003780 1118823 911566
13982 911566 30630 -1399913 -2031716 -1326833 133682 776170 831890 468260 -623032
13973 -623032 -1562114 -1209540 -182444 443613 1075499 476621 -296087 -319906 -92882 -213465
13963 -213465 -463078 -397219 -125163 542164 679285 -622000 -2196797 -2696473 -1608194
13954 -1608194 -593141 -396501 -454405 -766257 -840852 -795426 -493509 554647 545390 -367159
13944 -367159 -521122 46659 1118472 1634371 1662420 1648292 1575090 1102016 714906 606723
13934F06723q8158J50427l14232m0971R61964L31624l39442p4927M39437q2088
13924A550357p53167o53896k35488L05178J61283L14884j01964k59852K99811
13915F27146j44864M95585M23912n37679n49068k64568L3167N2541L6163K0003
13905A92338P7766r03763m32008M41453k07306l61411j38119N20270J020679J043866
13895A253765L29014q67544p47065J10597n90012r61464l99840O16250R02617
13886c53682O24726J012403L74885k28295n70845o48389o13349n58826l10475
13877a271847M1749K41535L68312p38034k32318Q61014J177878P11733M10261
13868A570283n68724o82784m2156k27407l07552j96245p413l46588n0394N57351
$$ plain form
13934 606723 518565 668992 354760 313789 1275753 1607377 1267935 1193008 1632445 1550357
13924 1550357 797190 143294 -92194 212984 374267 689151 587187 327335 627146
13915 627146 482282 977867 1401779 864100 315032 50464 83631 136172 172335 192338
13905 192338 270104 -633659 -1065667 -624214 -831520 -1192931 -1331050 -810780 209899 1253765
13895 1253765 1582779 715235 -31830 78767 -511245 -1472709 -1872549 -1256299 -353682
13886 -353682 271044 1283447 1658332 1430037 859192 210803 -402546 -961372 -1271847
13877 -1271847 -1230098 -988563 -620251 -1358285 -1590603 -729589 448289 1160022 1570283
13868 1570283 1001559 318775 276619 49212 -258340 -454585 -461998 -808586 -858980 -301629
13858c01629O93258K15151j05977K7295L50282m16513q17253p17151j94802N54508
13848g12831J356768K05905m12923p28759j75663j090547j374420M52951J348802
13839a130717J453775P67168k05210l91930J30210m89763j119950k64687Q1757
13830a169347K09609N16382L29668j50123J49854J85992L81628j0249j688590
13821a245176r49331o31043p28592j7670L08450M92456J782580N50642n81145
13812a018829P21653J312013N22520K7085n54925k26613L50184P05834L21846
13803B160768k45529m81544q00841J28330P94950o7723r57961q64979r06893O7477
13793a173945L41660J110714J140463n1960q62897j299053m43033q2870r1561
$$ plain form
13858 -301629 391629 606780 500803 528098 878380 461867 -355386 -1072537 -1267339 -712831
13848 -712831 643937 849842 436919 -291840 -467503 -1558050 -2932470 -2479519 -1130717
13839 -1130717 323058 1090226 885016 493086 623296 133533 -986417 -1251104 -1169347
13830 -1169347 -959738 -443356 -113688 -263811 -113957 72035 453663 443414 -1245176
13821 -1245176 -2194507 -2825550 -3554142 -3571812 -3263362 -2770906 -988326 -437684 -1018829
13812 -1018829 -297176 1014837 1537357 1564442 1009517 782904 1133088 1838922 2160768
13803 2160768 1915239 1433695 632854 761184 1556134 1488411 530450 -334529 -1241422 -1173945
13793 -1173945 -832285 278429 1418892 1366932 504035 -795018 -1238051 -1320921 -1412482
13784a412482O98921L59357j98847l36143R1956K49321k32562l70107J80162K64218
13774g06206K28496r7759l17337J25988j5904N51778k0006R8578J1608L77284
13764B36520J160942L91699N84046N9502k82421M08608m12987k17889m20762q08797
13754F98461M40952O02178n92452r69222n30038M27951Q74761j05974m66430l83726
13744c539Q14079L47793l25709N48296K44707o82722j132664r16892l84807K02035
13734a289423Q38673K00219n35587m36203j61608L92680M33341J06861R29141
13725D78094L89427p00545k85397l09875P7819N95586J287381P97444m40659k41406
13715A647869L52600J50614m65102j156455o68178K63220N31084l22439P7815
$$ plain form
13784 -1412482 -713561 -354204 -553051 -889194 -797238 -547917 -780479 -1150586 -970424 -706206
13774 -706206 -477710 -575469 -892806 -766818 -782722 -230944 -250950 -152372 -140764 236520
13764 236520 1397462 1789161 2373207 2432709 2150288 2558896 2145909 1928020 1507258 698461
13754 698461 1139413 1741591 1149139 179917 -350121 77830 952591 846617 380187 -3539
13744 -3539 810540 1158333 832624 1380920 1625627 942905 -189759 -1106651 -1491458 -1289423
13734 -1289423 -450750 -250531 -786118 -1222321 -1383929 -991249 -557908 -451047 478094
13725 478094 867521 166976 -118421 -428296 -350477 245109 1532490 2329934 1889275 1647869
13715 1647869 2000469 2151083 1685981 529526 -138652 124568 655652 333213 411028
13706D11028J25194n08068n67615L66383M05767J84749j06146p54165q32946J3414
13696a262405Q0812J17623L1364j66198k02541M24616P83806K36539J55952j16281
13686H3287q3767j108140j400133k82460R46082P17963J89454L1297N0085J83927
13676f72405j46376m07334j44089J95818L6328j0669n55343l11255J256080J605433
13666H46188l4722m68638j66322k86415j82846N95104P04104k80401k35642j65526
13656C24884O17884N87679l9169m15302q12580l99630m40219o2410R8788q1247
13646f21322J152293M92909l61747p26332j025880k94181O31736P23508R32543
13637I03527O23402L93277R4528n20379k49635m67946j56794N13779j99782m24065
$$ plain form
13706 411028 536222 28154 -539461 -173078 232689 417438 311292 -442873 -1275819 -1262405
13696 -1262405 -1181593 -1063970 -1032606 -1198804 -1401345 -976729 -192923 43616 199568 83287
13686 83287 -480 -1108620 -2508753 -2791213 -1845131 -1127168 -937714 -906417 -856332 -672405
13676 -672405 -818781 -1226115 -1370204 -1174386 -1138058 -1148727 -1704070 -2015325 -759245 846188
13666 846188 811466 342828 176506 -109909 -292755 302349 1006453 726052 490410 324884
13656 324884 942768 1530447 1491278 1075976 263396 -136234 -576453 -638863 -540075 -621322
13646 -621322 530971 1023880 662133 -64199 -1090079 -1384260 -752524 -29016 903527
13637 903527 1526929 1920206 2014734 1494355 1244720 776774 619980 1133759 933977 509912
13627E09912l02078K75307K48842L05780J84749j16326j16871j086122r07974
13618a004781q0443m59447K92460J626423J152075K37275K86532K41597r88540
13609A303151j977711j077559j29417O15266L76059n8735m64981J13353M04292
13600h96282J90520O84145P32065J42773r29238k80120P30448k31353m23659j92564
13590d73265M1078M00878J94961q50590j526347n45565J37842O29928O16413K73933
13580a100734R32380J201183R3690j67846K59540J21879n34667r65715K66353
13571A06063L01628o47947q69284k38360K22525j24766K65684O01719q9878n3101
13561e25717n15081k81137J56707n92259m18022q5026L50692k1645r5817R3488
$$ plain form
13627 509912 207834 483141 731983 1037763 1222512 1106186 989315 -96807 -1004781
13618 -1004781 -1085224 -1544671 -1252211 374212 1526287 1763562 2050094 2291691 1303151
13609 1303151 -674560 -1752119 -1881536 -1266270 -890211 -948946 -1413927 -1300574 -896282
13600 -896282 -705762 -21617 710448 853221 -76017 -356137 374311 142958 -280701 -473265
13590 -473265 -432187 -31309 163652 -686938 -2213285 -2758850 -2621008 -1991080 -1374667 -1100734
13580 -1100734 -168354 1032829 1126519 958673 1218213 1340092 805425 -160290 106063
13571 106063 407691 -240256 -1109540 -1347900 -1125375 -1250141 -984457 -382738 -472616 -525717
13561 -525717 -1040798 -1321935 -1165228 -1757487 -2175509 -2260535 -1909843 -1931488 -2027305 -1933817
13551a933817J99024K00890M38999L32537J61921l5680k35440n8425R7541L44991
13541d87459k67668j51886O48095p17470q54198K40074N28789N06125L11178O484
13531b37936K56075Q3405P1435R95624Q84674n44256m60798m90677p83973o03144
13521h29571o04847l51300J09487O49911O65260k72512M06844O47247K11393J47977
13511G79889L77329J35940n01764o29155l74483J50699O13357L86789O8070k29883
13501G76788p39504q14554n33100Q34814J092289L37368K72062k95307n33754
13492C97102l63535k18497P95770L2311n47106m02856J28393J47973J99246N45997
13482G14798L88498K91355k30206q51522o94394k5286p93425p04786N9368N83463
$$ plain form
13551 -1933817 -1734793 -1533903 -1094904 -762367 -600446 -636126 -871566 -929991 -832450 -487459
13541 -487459 -755127 -907013 -258918 -976388 -1830586 -1590512 -1061723 -555598 -244420 -237936
13531 -237936 18139 101544 172979 1168603 2053277 1509021 1048223 557546 -226427 -829571
13521 -829571 -1434418 -1785718 -1676231 -1026320 -361060 -633572 -226728 420519 631912 779889
13511 779889 1157218 1293158 791394 162239 -212244 -61545 551812 938601 1006671 776788
13501 776788 37284 -777270 -1310370 -475556 616733 954101 1226163 930856 397102
13492 397102 33567 -184930 610840 643151 96045 -306811 -178418 -30445 168801 714798
13482 714798 1103296 1394651 1164445 312923 -381471 -406757 -1200182 -1904968 -1845600 -1262137
13472a262137M47570L31575L0254o16724m83167J76727L38531L34073R40349J073473
13462A310524P88968L31111m72242q59734p82193j121734l17543P21642Q10377
13453D09176J62695m5839R1258J0173j09656q60310q74127K17524P3847l24552
13443a249811J46514K84023j00816p20799K94755J034855M32068J78752m55463
13434a55922j62312P33057R19321q1304m78781j53998k00747n04086m27703m36201
13424i48676M06812J204091J076468K11552n64999j95062n70556j062875n5056
13415d98301l57850q82937m14256L91398J072865P07644P5412J43504J01246K93129
13405F31854n6794p92908n90224L48488N6507q662O36514O7336o49785l57083
$$ plain form
13472 -1262137 -814567 -482992 -452738 -1069462 -1552629 -1375902 -1037371 -703298 237051 1310524
13462 1310524 2099492 2430603 1958361 1098627 316434 -805300 -1122843 -401201 409176
13453 409176 571871 526032 617290 627463 517807 -342503 -1216630 -999106 -925259 -1249811
13443 -1249811 -1103297 -819274 -920090 -1640889 -1346134 -311279 120789 299541 -155922
13434 -155922 -318234 414823 1334144 1252840 774059 620061 419314 -84772 -512475 -948676
13424 -948676 -541864 662227 1738695 1950247 1385248 1190186 619630 -443245 -498301
13415 -498301 -856151 -1739088 -2153344 -1761946 -689081 18563 93975 237479 338725 631854
13405 631854 575060 -217848 -808072 -459584 -403077 -411739 224775 292111 -357674 -714757
13395g14757k72989j49492O62874m5391K94599N4400r56558j112519j71046J43666
13385b267213P24920O56362P7323l08820k5818O53733M92772P02597Q00473N90957
13375B097286p2546r54783m16765r1209j44870j60076l49979M6400J11059j298628
13365a234111m52199O47717N16563J76291m16435p28065K25575P48669L58739
13356a57256K48056j362696j117703Q83703R99546M33956O75227L56456L19122
13347A278411J46471m11038n88718p32204k19138Q53654M59265o35526K38936
13338C90113R92209o48991p71525m24012k75671J082545J467706J08503k82226
13329A638651p16786j419298j269838k31524N16077L47446Q34354J60217k05329
$$ plain form
13395 -714757 -987746 -1137238 -474364 -519755 -225156 -170756 -1127314 -2239833 -2410879 -2267213
13385 -2267213 -1542293 -885931 -808608 -1117428 -1143246 -489513 3259 705856 1506329 2097286
13375 2097286 2024740 1069957 653192 561983 417113 257037 -92942 -46542 64517 -1234111
13365 -1234111 -1686310 -1038593 -522030 -345739 -762174 -1490239 -1264664 -515995 -157256
13356 -157256 90800 -1271896 -2389599 -1505896 -506350 -72394 602833 959289 1278411
13347 1278411 1424882 1013844 425126 -307078 -526216 327438 786703 151177 390113
13338 390113 1382322 733331 -38194 -462206 -737877 344668 1812374 1920877 1638651
13329 1638651 921865 -497433 -1767271 -1998795 -1482718 -1135272 -300918 -140701 -346030
13320c46030M08767p6552k88730J17210M59640R02672o27402r39799K16272J002990
13310H29038P81719R2150K31847J10791j494101o24508L53942k96828J70618m91516
13300c36848o43943j24673j06045J98028J007459M70672r32026n43835N30541
13291d80670Q00788k30942n32928L67202M48279p1876J70541L46478m15014q55996
13281d54138p7670P45380P37822r2408o03870n59465m95452O24562J283381L51832
13271A459974j39174n70668j047195n25294O79286J044614M41787j29455l26801
13262H87074p01234o13398P27592N52780J47464L4116j73046m10021L04946L72310
13252A128583n07743j224012n72926k31152k33171P67667L52306l1697K71966
$$ plain form
13320 -346030 62737 -13815 -302545 -185335 274305 1176977 549575 -390224 -173952 829038
13310 829038 1610757 1702907 1934754 2045545 551444 -73064 280878 -15950 154668 -336848
13300 -336848 -980791 -1105464 -1211509 -1013481 -6022 464650 -467376 -1011211 -480670
13291 -480670 320118 89176 -443752 -76550 371729 299853 470394 816872 401858 -454138
13281 -454138 -531808 213572 951394 858986 255116 -304349 -799801 -175239 1108142 1459974
13271 1459974 1320800 750132 -297063 -822357 -143071 901543 1343330 1213875 887074
13262 887074 185840 -427558 300034 852814 1000278 1034394 861348 451327 756273 1128583
13252 1128583 620840 -603172 -1176098 -1407250 -1640421 -872754 -520448 -552145 -280179
13243b80179J12316k76754j79787N45509Q12557R3683j99856N9326K31002j17061
13233H00756N05773O63195M1187l19581o95754r49607l82454P63106N1775j067738
13223e89342o57202K41012P43106N95087m05931Q19405M98104n60690k15845M18283
13213H85987K22396m5756j61759l01433q81461o81838l07268j22509n79667p82214
13203b755522M46542J383592N28761k43114N94213J66966m06415k61390M94558
13194e1809J532229Q42353k45885j26095p20486r00504k40280J25997Q48118J153784
13184B217422K35459l31826o51438n00996K52588l50228r23275n22116m19719
13175i94129P75219J57388p43782K6700O42884L6293j49706N2137l03202J79748
$$ plain form
13243 -280179 -167863 -444617 -624404 -78895 733662 827345 627489 686815 917817 800756
13233 800756 1306529 1969724 2010911 1691330 995576 45969 -336485 426621 478396 -589342
13223 -589342 -1246544 -1005532 -262426 332661 -73270 746135 1244239 683549 467704 885987
13213 885987 1108383 1062627 900868 599435 -282026 -963864 -1271132 -1393641 -1973308 -2755522
13203 -2755522 -2308980 -925388 -396627 -639741 -45528 121438 -284977 -546367 -51809
13194 -51809 1480420 2322773 2076888 1950793 1230307 329803 89523 215520 1063638 2217422
13184 2217422 2452881 2121055 1469617 968621 1221209 870981 -52294 -574410 -994129
13175 -994129 -218910 -61522 -805304 -778604 -135720 -99427 -249133 -196996 -500198 -320450
13165c20450j68544j49599K2059N16673Q58940J59418m18574L54675J441036J61323
13155B456957q53067m35778K51012l10444o88744k55843M02665R17405J64792
13146A648955n23799l15534o31649p71011k91534m07158k2020M32456o7403r3404
13136a042101J51280M36108O61998l38799j89091P8761K97461Q3228N04591O68344
13126A311780k94802m31226j28134k53010p90462p56435L48143R31712J117216
13117A054782L75160o38789k85163o66880l18125R44443M21467l89921M3194r8714
13107D41454M16453P43046J49391j30614N9157k13934M64958P24743j2164j64999
13097B477491J77562o18901j042211L4719O85289N37862j61983j58844J14119
$$ plain form
13165 -320450 -488994 -638593 -616534 -99861 759079 918497 499923 854598 2295634 2456957
13155 2456957 1603890 1168112 1419124 1108680 419936 164093 566758 1484163 1648955
13146 1648955 1125156 809622 177973 -593038 -884572 -1291730 -1313750 -881294 -948697 -1042101
13136 -1042101 -890821 -454713 207285 -131514 -320605 -241844 55617 138845 643436 1311780
13126 1311780 1016978 585752 457618 204608 -585854 -1342289 -994146 -62434 1054782
13117 1054782 1429942 791153 505990 -160890 -479015 465428 886895 496974 540168 441454
13107 441454 857907 1600953 1750344 1619730 1678887 1464953 1929911 2654654 2642490 2477491
13097 2477491 2655053 2036152 993941 1028660 1713949 2251811 2089828 1930984 2045103
13088B045103O55760O17411L97852j75309j279169n05311Q06565M12058L5314
13079C010274m54150l06288J97888m3513K2417r3202Q97325J273059M1177o91869
13069C853118o4650L91936J51190J31819O19537O35279j89568k13834n29466r25559
13059C859802q28310l69310N5818L19228O63595P07999N64280j68725n79259k02593
13049D022525r3839K37686J6859O13997P39404M43689K93305M69390m33372m51861
13039E857783N85187J62946k89473m48042j70705l73234j29273Q86110P23875
13030F805174l81995k78013j41506M10039Q89825M94155n17822L36658J334430
13021H950945M10248M68670M80059l3028j73806J439529J181385O30313R24644
$$ plain form
13088 2045103 2700863 3318274 3716126 3540817 2261648 1756337 2562902 2974960 3010274
13079 3010274 2556124 2249836 2447724 2404211 2426628 2333426 3230751 4503810 4544987 3853118
13069 3853118 3788468 4180404 4331594 4463413 5082950 5718229 5528661 5314827 4785361 3859802
13059 3859802 3031492 2662182 2718000 3037228 3700823 4408822 4973102 4804377 4225118 4022525
13049 4022525 3928686 4166372 4183231 4797228 5536632 5980321 6273626 6743016 6309644 5857783
13039 5857783 6442970 6605916 6316443 5868401 5697696 5324462 5195189 6081299 6805174
13030 6805174 6423179 6145166 6003660 6413699 7303524 7797679 7279857 7616515 8950945
13021 8950945 9361193 9829863 10309922 10276894 10103088 11542617 12724002 13354315 14278959
13012A4278959K51243J108033J254980M63936J395801K296824K879611K690849
13004B6620236L053398M944615N354919N586094P482576R883566J1117278J2452614
12996H6495296J4882490J9790845K6413610L3194335M4294906N8720553P0972392
12989C54764427P3224000M5662938j3850314o5121358p8599010o8370266n2474132
12982A95236285l9100374k9456968k1934292j6971724j3076366r747213p615151
12975E7334197o613514n144008m347557m249700m049744m115845l101363k334707
12967B3377759j862115j498255j317088r47795q4061k40105j504145r90409j67223
12958A4766563m87813m06461m06684p85508k85495m73343r54865n36937j93034
$$ plain form
13012 14278959 14530202 15638235 16893215 17357151 18752952 21049776 23929387 26620236
13004 26620236 29673634 34618249 39973168 45559262 53041838 62925404 74042682 86495296
12996 86495296 101377786 121168631 147582241 180776576 225071482 283792035 354764427
12989 354764427 427988427 473651365 459801051 394679693 316080683 247710417 195236285
12982 195236285 156135911 126678943 104744651 87772927 74696561 64949348 57334197
12975 57334197 50720683 45576675 41229118 36979418 32929674 28813829 25712466 23377759
12967 23377759 21515644 20017389 18700301 17752506 17668445 17428340 15924195 14933786 14766563
12958 14766563 14278750 13872289 13465605 12680097 12394602 11921259 10966394 10429457 10236423
12949A0236423J43595k23350j72097O6245P73218R42888k4019l85073o31895J12491
12939A0838426R78068R14318O61872N79087O48977L51485O74358J720373K074977
12930A9441941K032771K409192J370460J14415p51289r14342q62485L24797J421715
12921B4587175Q49917O92636J327946J789775L052038M485668N486215P308093
12913D9579463Q200586Q759597J0507442J2921122J6967169K0756778K6522407
12906A54214564L5002171M6383185O0526438P5048108P6917593M2796329k3900889
12899D66987499p4941810q3558249o8945797n1511725l6637184k6719188k0893600
12892A03779946j6261158j3314690j0725671q085603o309414n683442n248869
$$ plain form
12949 10236423 10380018 10156668 9984571 10050816 10824034 11766922 11742903 11357830 10725935 10838426
12939 10838426 11816494 12730812 13392684 13971771 14620748 14972233 15646591 17366964 19441941
12930 19441941 21474712 23883904 25254364 25368779 24617490 23703148 22840663 23165460 24587175
12921 24587175 25437092 26129728 27457674 29247449 32299487 36785155 42271370 49579463
12913 49579463 57780049 66539646 77047088 89968210 106935379 127692157 154214564
12906 154214564 189216735 235599920 296126358 371174466 448092059 490888388 466987499
12899 466987499 392045689 308487440 239541643 188029918 151392734 124673546 103779946
12892 103779946 87518788 74204098 63478427 55392824 49083410 43399968 38151099
12885C8151099l528024k389082j894998j357795k065661l043420l029720j885168
12877A8957231j355175j165994j774819j369534j29170k62334m54072q1212Q20837
12868A3185758K68742j204100j144386j139572o41240J6066k58933K95475R33964
12859A0311774M83002l61330o31856k71295J94060j46984n42492K04754L71868
12850I611501Q37470J055516L44302N0714P60553M17514J45713K54762k98896
12841A3179149J53896P56139J085414J212672R71046N6707P89492K563239J983815
12832B2751569K080689L745981M815486M840493N214279N873653P363667R859935
12824F6545752J0695958J3182236J6904398K1030897K7666794L6852655M7166175
$$ plain form
12885 38151099 34623075 32233993 30338995 28981200 26915539 23872119 20842399 18957231
12877 18957231 17602056 16436062 14661243 13291709 13162539 12900205 12446133 12364921 13185758
12868 13185758 13454500 12250400 11106014 9966442 9325202 9341268 9082335 9377810 10311774
12859 10311774 10794776 10433446 9801590 9530295 9724355 9577371 9034879 9239633 9611501
12850 9611501 10448971 11504487 11848789 11899503 12660056 13077570 13223283 13478045 13179149
12841 13179149 13333045 14089184 15174598 16387270 17358316 17415023 18204515 20767754 22751569
12832 22751569 24832258 28578239 33393725 38234218 43448497 49322150 56685817 66545752
12824 66545752 77241710 90423946 107328344 128359241 156026035 192878690 240044865
12817B40044865O0687309P3818455P0821110L3047269l0286891p3309059p8657042
12810B96166016o5172813m9193156l6146852k6871355k0517783j5533914j2252142
12803G0478001j0293203q565828o543065m942667m240280l844989l380799k493557
12795B6173613l104300l482315k564026j364019l25892J21749m53386q27945j527966
12786A2645513p63435m6956o33893j127072j346372j327438n48173K38652O4928
12777G155754n55963j43174k1332m84049n90037l45159j40438j02514p1055k54061
12767D447972l7460j38271n17979K7422O39520Q12816N31586K26036M6881j90114
12757E848409r02659n34398j30977k65954m07755n98455k36334o62731j90629
$$ plain form
12817 240044865 300732174 374550629 445371739 478419008 448132117 374823058 296166016
12810 296166016 230993203 181800047 145653195 118781840 98264057 82730143 70478001
12803 70478001 60184798 51618970 45075905 40133238 35892958 32047969 28667170 26173613
12795 26173613 23069313 19586998 17022972 15658953 15333061 15454810 15001424 14173479 12645513
12786 12645513 11882078 11835122 11201229 10074157 8727785 7400347 6852174 7090826 7155754
12777 7155754 6599791 6456617 6435285 5951236 5361199 5016040 4875602 4773088 4702033 4447972
12767 4447972 4410512 4272241 3754262 3781684 4421204 5234020 5765606 5991642 6038523 5848409
12757 5848409 4945750 4411352 4280375 4014421 3606666 3008211 2771877 2109146 1918517
12748A918517P9425m5414l86595o27190j058557r57089O00452J192117J674671
12739B390337O56453j00166m53452j239011q34739N09336M68408j37198k58190
12730A001778J18554M52181N5423q84412j821698j062019K68596J391489R02827
12721D22719N25123N52702Q2796j91214P33m26927N2341m86430r42893k07196
12711f18246K27726Q72741J189144P92188k19781j210161j470834P680J14798
12702c14745k08167L01057O28166Q48441j14612o75445q74187J30763J372929
12693A094200O64165Q16L79515K19467j57490n84819o69986q82102n03107R70809
12683E31468J140654L21043m39268o89485M3653N01774O57578N72289J01112k37266
$$ plain form
12748 1918517 1997942 1952528 1565933 938743 -119814 -1076903 -476451 715666 2390337
12739 2390337 3046790 2946624 2493172 1254161 419422 928758 1397166 1259968 1001778
12730 1001778 1120332 1572513 1627936 743524 -1078174 -2140193 -1871597 -480108 422719
12721 422719 947842 1500544 1583340 1392126 1392859 965932 1018273 531843 -411050 -618246
12711 -618246 -390520 482221 1671365 2463553 2243772 1033611 -437223 -429543 -314745
12702 -314745 -522912 -221855 406311 1254752 1140140 464695 -409492 -278729 1094200
12693 1094200 1758365 1759181 2138696 2358163 2200673 1615854 945868 63766 -439341 531468
12683 531468 1672122 1993165 1553897 864412 908065 1409839 2067417 2639706 2740818 2503552
12673B503552m05486l61715p72916p84176k20503O82150N68533l20326m51107
12664D38006j20918O82514O80396k97197k86916j51950q26590m24605j06052o86158
12654a099470m79824L14927J354225J795766N04133j205669r84113J53532L18485
12645F71992R1038L06863N9638p92061o77038j15815J84297L44634K53033J44483
12635D71064K48416P51815P69147J38268L491n05140j156947j87644K38652N22228
12625A293350M85357k80485q34537n40020m94514L90026Q84471P42915N20573
12616B167136L24694o58293j361222q68058J04718N27180Q0109m46073N08631
12607C78822O77419m79826k84206M96004J155703L19753j034361l33112l54523
$$ plain form
12673 2503552 2098066 1736351 963435 179259 -41244 640906 1209439 889113 438006
12664 438006 317088 999602 1679998 1382801 1095885 943935 117345 -307260 -413312 -1099470
12654 -1099470 -1579294 -1264367 89858 1885624 2389757 1184088 199975 353507 671992
12645 671992 763030 1069893 1129531 337470 -339568 -455383 -271086 73548 326581 471064
12635 471064 719480 1471295 2240442 2378710 2382201 1877061 720114 532470 771122 1293350
12625 1293350 1778707 1498222 663685 123665 -370849 19177 903648 1646563 2167136
12616 2167136 2491830 1833537 472315 -395743 -291025 236155 316264 -129809 378822
12607 378822 1056241 576415 292209 788213 1943916 2263669 1229308 896196 541673
12598E41673j40418O45343J04506o30567n84595R4216m07657j089979j89426K48903
12588a408001Q37134L77876m84826m30356L44059J130034N3849K201J00636p16240
12578a93634m27869J34249N56972R82736M16910Q89054k7768j027292k04118K60829
12568A360069p99422r36965K98247k87494n87520M14184M87194N93029N4076j41709
12558D53689J33225n26455o04563j47135N44805K77277m0190n91320j117975L0985
12548a587657J52466M49469Q317p3873P49813K77905m79644J34021P9536K01636
12538h8011N53077O72826K76307l37523j99182r11390q50345P03703K47173K11184
12528B77819P59664P99166Q30591N54800R1032l12058L83121M31713o32902m90541
$$ plain form
12598 541673 401255 1046598 1151104 520537 -64058 30158 -377499 -1467478 -1656904 -1408001
12588 -1408001 -570867 -192991 -677817 -1108173 -764114 365920 419769 421970 522606 -193634
12578 -193634 -621503 -487254 69718 1052454 1469364 2358418 2330650 1303358 1099240 1360069
12568 1360069 560647 -376318 -78071 -365565 -953085 -538901 -51707 541322 595398 453689
12558 453689 586914 60459 -544104 -691239 -146434 130843 90653 -500667 -1618642 -1587657
12548 -1587657 -1435191 -985722 -977405 -1051278 -301465 -23560 -503204 -369183 -289647 -88011
12538 -88011 465066 1137892 1414199 1076676 877494 -33896 -884241 -180538 66635 277819
12528 277819 1037483 1836649 2667240 3222040 3313072 3001014 3384135 3815848 3182946 2692405
12518B692405n56002j58471l24634r54573j107125p07919O97913J94907M813J27351
12508i1335m67879J78768J014297L42822J79520k98139j097982M53055J090936
12499A304063N67014O5705j84449n14234p71613j88967J33019k15891p40028j325916
12489a871297k97514O67086K21220j73593K33245Q13055R24576L97934M12160
12480A326872L33695J5157p50818j010481p48638L27765J053189K29808l46985
12471D29564L09663N11576K74546Q5480J42994O06269k62308r54828j138926j080998
12461a076968J1411R38192P50565Q53861j23991j546648j421984o69456l96511
12452b681529M35166J541271Q70328K25311m72525n61102Q80398J082548L20259
$$ plain form
12518 2692405 2136403 1977932 1653298 698725 -408400 -1116319 -418406 -223499 -218686 -91335
12508 -91335 -559214 -380446 633851 976673 1156193 858054 -239928 213127 1304063
12499 1304063 1871077 1936782 1752333 1238099 466486 277519 410538 194647 -545381 -1871297
12489 -1871297 -2168811 -1501725 -1280505 -1454098 -1220853 -407798 516778 914712 1326872
12480 1326872 1660567 1675724 924906 -85575 -834213 -506448 546741 776549 429564
12471 429564 739227 1250803 1525349 1610829 1753823 2360092 2097784 1142956 4030 -1076968
12461 -1076968 -1065557 -127365 623200 1477061 1353070 -193578 -1615562 -2285018 -2681529
12452 -2681529 -2246363 -705092 165236 390547 -81978 -643080 237318 1319866 1640125
12443A640125r41098j275506p50217L12013P03080J14384n94448k35525R20793
12434a06399M81237l24942j095654p94768J467997P93605n79919n7103J79407
12425c6539m70193q28784j32301K68940P44018O41847J93196q66715o29716J34161
12415i82086J1851P82165M95828l53408m37791m48416r1607R60994Q27654K4962
12405G90146R8372m6854L85280Q23260n09761j079642n15700R6649L38066L3986
12395D13802N68192j46442q97174m02507O05013Q00644j54715r91709j236402
12386a441298k03284M39767M10912L30469k99288k05822J291757R87507k42172
12377A068548k78114j99839o95909j219195n85558N70668Q84488N60773n15786
$$ plain form
12443 1640125 699027 -576479 -1326696 -1014683 -311603 -197219 -791667 -1027192 -106399
12434 -106399 374838 49896 -1045758 -1840526 -372529 421076 -158843 -215946 -36539
12425 -36539 -506732 -1335516 -1467817 -1198877 -454859 186988 380184 -486531 -1116247 -982086
12415 -982086 -970235 -188070 307758 -45650 -483441 -931857 -1023464 -62470 765184 790146
12405 790146 888518 841664 1226944 2050204 1540443 460801 -54899 41750 379816 413802
12395 413802 981994 835552 -61622 -464129 140884 941528 786813 -204896 -1441298
12386 -1441298 -1644582 -1204815 -793903 -463434 -762722 -968544 323213 1310720 1068548
12377 1068548 790434 590595 -105314 -1324509 -1910067 -1339399 -454911 105862 -409924
12368d09924j63565m0314m61209j90523O88540j59713n87226l16019L11592J360130
12358C1769Q72115Q9362k01527k47487o56862q11397j037363k50610N47726P45961
12348i18313R66407Q96429Q56742J0009r3812n30977q99487j41463L46986n42781
12338e0260O0159M59277o80752l21243M50139K33138k39947J76998M86176j75684
12328C98001k40542M44594O07435k265Q1910O34853j18534j029290m07878M29241
12318G97525k81545o17223N57449O96481j76128k00063R13138L48035J22128K29931
12308B389728L75049l41952j107706o04719n11243L32285Q65132J026215R0779
12299B513568m73120n76500r34069j926763j193213J16846M38404M73008J50097
$$ plain form
12368 -409924 -573489 -613803 -1075012 -1265535 -576995 -736708 -1323934 -1639953 -1328361 31769
12358 31769 903884 993246 791719 544232 -112630 -924027 -1961390 -2212000 -1664274 -918313
12348 -918313 48094 944523 1801265 1811274 1717462 1186485 286998 145535 492521 -50260
12338 -50260 9899 469176 -211576 -532819 -82680 150458 -89489 87509 573685 398001
12328 398001 157459 602053 1209488 1207223 1289133 1923986 1805452 776162 368284 797525
12318 797525 515980 -101243 456206 1152687 976559 776496 1689634 2037669 2159797 2389728
12308 2389728 2764777 2422825 1315119 710400 199157 531442 1396574 2422789 2513568
12299 2513568 2040448 1463948 529879 -1396884 -2590097 -2473251 -2034847 -1561839 -1411742
12290a411742K80113J040577Q24133l5778o1726j79420j05804m8830J05636K42963
12280F50122K53037P13152N50950N15762O2916m60232r85417j230384j009753
12271i39847m68765K23490Q07207r9029l64647L50364l4363o25825j99340J209313
12261a41442O70189l90607j28308M45295R4625n23871l94418j88091R5459L31169
12251a30000q22715j719829n37911L64611M50923R4662M30696N86571J14433M33206
12241g35353M77331j8808M0836M62403O14760N69573K35583q29646j267089m78277
12231i28687O34926M00282j63498j41698J5741J25310O2199l85156K53898L88701
12221B62018K36832L28757N14468O97031l31446j947446j730211k1234O23803
$$ plain form
12290 -1411742 -1131629 -91052 733081 697303 635577 456157 350353 301523 407159 650122
12280 650122 903159 1616311 2167261 2683023 2745939 2285707 1300290 69906 -939847
12271 -939847 -1408612 -1185122 -377915 -476944 -841591 -491227 -525590 -1151415 -1350755 -141442
12261 -141442 528747 138140 9832 455127 549752 25881 -368537 -556628 -461169 -130000
12251 -130000 -952715 -2672544 -3210455 -2845844 -2394921 -2300259 -1869563 -1282992 -1168559 -735353
12241 -735353 -258022 -276830 -235994 226409 841169 1410742 1646325 816679 -450410 -928687
12231 -928687 -293761 106521 -56977 -198675 -182934 -57624 4575 -380581 -126683 262018
12221 262018 498850 827607 1342075 2039106 1707660 -239786 -1969997 -1991231 -1367428
12212a367428N18566j91104l4099N65618Q76935J28708q87531j107881q0442O16734
12202i61924N14867k55329r21795j88822K62215J27924p9558K31888R7599N60304
12192f12631Q43602n49748j55669k2345p56928k26171k5617K42116Q8123p007
12182a182275O47524J37415q55631j57518M06669M70546M74192P04068L67277
12173A012267l04632p76313K65252Q13291m69676l31888K74587L14198q03933
12164f847l58842O09480L01798K50040M34366l5276m72007p20517p95962k57731
12154a051498P14967J458409N30463o59929o36988p0302q750O70550M82187q06073
12144F23036p20537l29804J63170J52634J91197m45366j258602l79681Q06569
$$ plain form
12212 -1367428 -848862 -1039966 -1074065 -508447 368488 497196 -390335 -1498216 -1578658 -961924
12202 -961924 -447057 -702386 -1624181 -1813003 -1550788 -1422864 -1502422 -1270534 -1172935 -612631
12192 -612631 230971 -318777 -474446 -496791 -1253719 -1479890 -1505507 -1263391 -1175268 -1182275
12182 -1182275 -534751 -397336 -1252967 -1410485 -1003816 -533270 -59078 644990 1012267
12173 1012267 707635 -68678 196574 1009865 540189 208301 482888 797086 -6847
12164 -6847 -365689 243791 545589 795629 1229995 1194719 722712 2195 -793767 -1051498
12154 -1051498 -336531 1121878 1652341 992412 355424 285122 276372 946922 1429109 623036
12144 623036 -97501 -427305 -264135 -111501 79696 -365670 -1624272 -2003953 -1197384
12135a197384M88241M17797J81152l29180L66282J38140l96961p9410L0444r72048
12125a352927p71991k59638M9637Q97512J308588Q99396p31069n11485p00234
12116a172211p50691M04397J019919L60230j45823n41794N6367P98292L9601k16581
12106a48294J04972K3784O01962M98181J09559k48329m87320m10758K31178M76998
12096G51933K22827J80141m69620l97327J81538p1881k9882m1092N51447J89238
12086A067322o72356o12712j35431K97380M17153j92878N62369O23470L38160
12077A692477J32284k67344m45827k8611J71330n83038n11816J2324k30353l21007
12067c79581r1859l4573Q62591J437201L31747k8957p41808n74879L6502n22604
$$ plain form
12135 -1197384 -709143 -291346 -110194 -439374 -73092 65048 -331913 -411323 -380879 -1352927
12125 -1352927 -2124918 -2384556 -2334919 -1437407 -128819 770577 39508 -471977 -1172211
12116 -1172211 -1922902 -1518505 -498586 -138356 -284179 -825973 -769606 28686 68287 -148294
12106 -148294 -43322 -19538 582424 1080605 1190164 941835 454515 43757 274935 751933
12096 751933 974760 1154901 685281 287954 469492 397611 367729 326637 878084 1067322
12086 1067322 394966 -217746 -353177 -55797 361356 168478 730847 1354317 1692477
12077 1692477 1824761 1557417 1111590 1082979 1254309 671271 159455 171779 -58574 -379581
12067 -379581 -471440 -506013 356578 1793779 2125526 2096569 1354761 779882 816384 293780
12057B93780k27458Q2673R1603l79275m08067p74152l80190j50090O6693K44386
12047a540097M09149J012422L23835m73954k99272o96320o50267j14969N23022
12038a506451J19223M73109J465611J183596L09491o30290j026814l76871J30862
12029A41466Q75916J125683r7488l50709J11871L87731J11124l27756J03074O935
12019B087847p67613j533729q97773m54828j19507O19586O69271J70774P2440
12010a53532n91978m20138j57603J39574M3112j18874m73533m62055j70551O66873
12000a698705O93000m21790r59619Q3273R78574N97092M09662L4008j01645R34605
11990E48455P09450J77842r68507j633592k90536J067027L33358j53694M4818
$$ plain form
12057 293780 66322 148995 240598 -138677 -546744 -1320896 -1701086 -1851176 -1784483 -1540097
12047 -1540097 -1130948 -118526 205309 -268645 -567917 -1264237 -1914504 -2029473 -1506451
12038 -1506451 -1387228 -914119 551492 1735088 2044579 1414289 387475 10604 141466
12029 141466 1017382 2143065 2045577 1694868 1806739 2194470 2305594 1977838 2080912 2087847
12019 2087847 1320234 -213495 -1111268 -1566096 -1685603 -1066017 -396746 -225972 -153532
12010 -153532 -745510 -1165648 -1323251 -1183677 -1140565 -1259439 -1732972 -2195027 -2365578 -1698705
12000 -1698705 -1005705 -1427495 -2387114 -2303841 -1325267 -728175 -318513 -284505 -386150 548455
11990 548455 1257905 1435747 467240 -1166352 -1456888 -389861 -56503 -210197 -165379
11981a65379K12780k42053m61021k92307q2468O47479J007046q5435o35243n0192
11971a46793K13499K0071j94516k389O8104K61529l06035q65892o57848K08898
11961a401372P89070O66900Q8668m1207O53083J20037k69987J7892j29901P6573
11951E69756K3368k77752K51803J5090j081530j19509Q60998O94716N39214N80401
11941B056555K90858J19819j47215q0518l17144r06956j592809n72079R6578N2492
11931a000419O7209M26522R58267N27776k954p22998q78133j76363J116976Q56016
11921A171899K31646k25300q28370r53948q60681l06857Q65626Q83541J01502
11912G9058k94572p9139K07545k31086m45725j81341K0266K32400j7529M98926
$$ plain form
11981 -165379 47401 -194652 -655673 -947980 -1030448 -382969 624077 538642 -96601 -146793
11971 -146793 66706 86777 -107739 -110128 -42024 219505 -86530 -952422 -1610270 -1401372
11961 -1401372 -612302 54598 143266 102059 755142 875179 605192 623084 493183 569756
11951 569756 593124 315372 567175 582265 -499265 -618774 242224 936940 1476154 2056555
11941 2056555 2347413 2467232 2320017 2239499 1922355 1015399 -577410 -1149489 -1052911 -1000419
11931 -1000419 -933210 -506688 451579 979355 976401 253403 -624730 -801093 315883 1171899
11921 1171899 1403545 1178245 349875 -604073 -1464754 -1771611 -905985 -22444 79058
11912 79058 -215514 -294653 -87108 -318194 -763919 -945260 -924994 -692594 -710123 -211197
11902b11197O01299n68459p82346k24968p8548o97411L86042R39728M00452L08902
11892G3494O67242Q88047L59865r15951j236701r26273o76341M26895M10221L2147
11882h97355k78918l38583k97149M21706P55860k37110n38343L36667P71629R3952
11872b07644O1691N25210P55052O79646O0257k74052m62020m65475J3123M5027
11862G30815K77092M65277o42095j263206j71456Q39930N33909k09543l68504
11853A92219L92267P51232M45285K59773j23041n80076l19641m35091M6682J004238
11843A633847N37798n59887q21354p34485L564n44585j069502J77745O29435P00992
11833d6432J014420M92517m09564k39624l48876o15375n72532J53960K19076L16214
$$ plain form
11902 -211197 390102 -178357 -960703 -1185671 -1264219 -1961630 -1575588 -635860 -235408 73494
11892 73494 740736 1628783 1988648 1072697 -164004 -1090277 -1766618 -1339723 -929502 -897355
11882 -897355 -1176273 -1514856 -1812005 -1390299 -634439 -871549 -1409892 -1073225 -301596 -207644
11872 -207644 -145953 379257 1134309 1813955 1874212 1600160 1138140 672665 685788 730815
11862 730815 1007907 1473184 831089 -432117 -603573 236357 770266 560723 192219
11853 192219 584486 1335718 1781003 2040776 1917735 1337659 1018018 582927 629609 1633847
11843 1633847 2171645 1611758 790404 55919 59483 -485102 -1554604 -1376859 -747424 -46432
11833 -46432 967988 1460505 1050941 811317 462441 -152934 -725466 -571506 -352430 -36216
11823c6216N97760r822k8435J38118K49342m31169j140962l21317K26670L62628
11813c93403K70556N49592M78751L44278m39465O8111p6069n79821l93311L71268
11803B00487J462018Q23530j186677j203970J7346O01415M33849J2231q26393
11794C33836j438560q46936q6488N60116j38927l3642o86108j086122N22205Q85181
11784b015445J80389P90700N46276J31746J34671Q1499Q9961l28448l04731n92734
11774a286116l54789j31443l3044K14555J462694M89900m67611m39325j83170
11765g28349m05402k63025M41704j47067r05042n09796L35689L86419M12457L98800
11755i83612l98560n52812P922O3144j32148P73643J097132P49663k76881p05605
$$ plain form
11823 -36216 561544 551722 523287 661405 910747 479578 -661384 -982701 -756031 -393403
11813 -393403 -122847 426745 905496 1249774 810309 878420 802351 222530 -170781 200487
11803 200487 1662505 2486035 1299358 95388 112734 714149 1147998 1160229 333836
11794 333836 -1104724 -1951660 -2038148 -1478032 -1616959 -1650601 -2336709 -3422831 -2900626 -2015445
11784 -2015445 -1835056 -1044356 -498080 -366334 -231663 -150164 -60203 -388651 -693382 -1286116
11774 -1286116 -1640905 -1772348 -1805392 -1590837 -128143 361757 -105854 -545179 -728349
11765 -728349 -1133751 -1396776 -955072 -1102139 -2007181 -2516977 -2181288 -1794869 -1382412 -983612
11755 -983612 -1382172 -1934984 -1927062 -1863918 -1996066 -1222423 -125291 624372 347491 -358114
11745c58114J76797J96264o37548o67771M7940J05076J2069P08201J063047P75569
11735A421530j78352m38329k01402k62988M5713R0748p9522l59659n33403O7419
11725d28245J702417P95745j203641n44735l75877m13163L85555j40056q2774
11716c04774K5457K62596K58958j54100K88989J09691l55404o75051o06392o90285
11706a840315K95778J361711O6090p05604m70423m06547K85121M85173K33135
11697f95881J036363J381410K71584l55948p46759N7478N04256k74924j739612
11688e62033j357036K31159M26173m0270n67853j93976M64269P42159m3854O6195
11678h35067J141828J395997M34390n5455M07916J88648p29589m87016k31115
$$ plain form
11745 -358114 -181317 14947 -622601 -1290372 -1242432 -1137356 -1125287 -417086 645961 1421530
11735 1421530 1243178 804849 603447 340459 386172 476920 397398 37739 -495664 -428245
11725 -428245 1274172 2069917 866276 321541 -54336 -467499 -81944 -222000 -304774
11716 -304774 -279317 -16721 242237 88137 377126 486817 131413 -543638 -1150030 -1840315
11706 -1840315 -1544537 -182826 -116736 -822340 -1292763 -1699310 -1414189 -929016 -695881
11697 -695881 340482 1721892 1993476 1637528 890769 948247 1452503 1177579 -562033
11688 -562033 -1919069 -1687910 -1261737 -1302007 -1869860 -2063836 -1599567 -857408 -901262 -835067
11678 -835067 306761 1702758 2137148 2081693 2489609 2678257 1948668 1461652 1230537
11669A230537k02412p56931m29748K68709L33233m43747L01433J457960M95776
11660B254810K0159l25814n70630r27600j460617o01934r4466J94112L97426J18201
11650i96353m51871N60297J389947L09777q88776n56072k93537l53562J77821
11641a102329N13021L10828j49429k6389k92799L40504J767005L75627n58381
11632A177658j96583N8738L90556L13075K48310n10431q41450l81313n83995m14468
11622g39903k64329J2175N40366l53736o92658p44957j43188O06622Q85628L59945
11612e34035j94886M99419N29986Q32069j60970q04149l70093n84357l24282p7426
11602a188724Q5128O7901j2532M42796K74277k73517j74471k64570M72792N32527
$$ plain form
11669 1230537 1028125 271194 -158554 110155 443388 -359 301074 1759034 2254810
11660 2254810 2274969 1949155 1378525 450925 -1009692 -1611626 -1706092 -1511980 -1114554 -996353
11650 -996353 -1448224 -887927 502020 811797 -76979 -633051 -926588 -1280150 -1102329
11641 -1102329 -589308 -278480 -427909 -454298 -747097 -406593 1360412 1736039 1177658
11632 1177658 981075 1039813 1430369 1743444 1991754 1481323 639873 258560 -325435 -739903
11622 -739903 -1004232 -992057 -451691 -805427 -1498085 -2243042 -2386230 -1779608 -893980 -534035
11612 -534035 -728921 -229502 300484 1132553 971583 167434 -202659 -787016 -1111298 -1188724
11602 -1188724 -1103596 -1035695 -1048227 -605431 -331154 -604671 -779142 -1043712 -570920 -38393
11592c8393p0775l45651n71362K27567M28006O59704K5078p58214m43411R1276
11582g96175Q5043L57403l38956n53805k44348n99932L78241N6648j35050l4166
11572a825097O50398K22956p61543j69120P41967O38033K9993N73006N31705m92599
11562A39699n31667K45968j50399R1892O55591M45170N9924n10998r43976q73002
11552a371798n58870j33788L90050P47010J055138J82255l65041k92460J77374
11543a70130O69992k48007m7787M38642j88056l15643N41686L90852n98295j191986
11533g18732j272033o5620Q72710Q62036P08635M92927l67591l96083J09603m1546
11523A84306n8473l29004q1785l35999k003N01315Q88083M50295r55036n98094
$$ plain form
11592 -38393 -109168 -454819 -1026181 -798614 -370608 289096 314174 -444040 -887451 -796175
11582 -796175 -711132 -353729 -692685 -1246490 -1490838 -2090770 -1712529 -1655881 -1790931 -1825097
11572 -1825097 -1174699 -951743 -1713286 -1882406 -1140439 -502406 -472413 100593 632298 139699
11562 139699 -391968 -146000 -296399 -204507 451084 896254 956178 445180 -498796 -1371798
11552 -1371798 -1930668 -2064456 -1674406 -927396 127742 309997 -55044 -347504 -170130
11543 -170130 499862 251855 204068 642710 454654 139011 680697 1071549 473254 -718732
11533 -718732 -1990765 -2056385 -1183675 -321639 386996 879923 512332 116249 225852 184306
11523 184306 125833 -203171 -284956 -620955 -622958 -121643 766440 1216735 261699 -336395
11513c36395k45156m41313K27638P84854P42471n50798q63752J76463O74907O03457
11503G72376M96354p2348m32757m47816m88637q19263l72480Q70700Q09957K09109
11493E25195K59502p31335m15566R8490K00687N84988J3431q16042k56314J12187
11483d24777j82406L67861J99881l584j84513m52924j95173N90402M72060l26486
11473a39659n79626K08981N87995o08687j696401j144996l02428K35501N94596
11464b844724J391483R35988N07898j91460k92277N48064N53483j37114m70339
11455A002k63576m91474K0819J080421R94764l85833n82480J91376j05997l77947
11445H1075J19164j5084p66075p7626M34103j15229m35912M7900O21970m21517
$$ plain form
11513 -336395 -581551 -1022864 -795226 -10372 732099 181301 -682451 -505988 168919 772376
11503 772376 1268730 1196382 763625 315809 -172828 -992091 -1364571 -493871 316086 525195
11493 525195 784697 53362 -362204 -263714 -63027 521961 535392 -280650 -536964 -424777
11483 -424777 -607183 -239322 -39441 -43025 -227538 -680462 -875635 -285233 186827 -139659
11473 -139659 -719285 -510304 77691 -530996 -2227397 -3372393 -3674821 -3439320 -2844724
11464 -2844724 -1453241 -517253 -9355 -200815 -493092 54972 608455 471341 1002
11455 1002 -262574 -754048 -733229 347192 1341956 956123 373643 565019 459022 81075
11445 81075 200239 185155 -580920 -658546 -224443 -339672 -775584 -727684 -105714 -527231
11435e27231m16082R00786K4648l12531k32198r3524l06134l96508P9435P04254
11425e75085O39382L12260K46762J24125k9486j03936q5112P15377Q97031l29253
11415A812065j901347k778064p56350Q23875O61497N99030R13842K90969J31402
11406b03081L52499J81526m19454o33088M0467P93017M01029j11183n73095q62420
11396a033783j36521Q04268N31679L05057O33363J19547r45231j390210o82539
11387a794370n42532L72720J101251K67817K58486k0986k24396M64997K07367
11378I0354m70784J92689J43790l68629n25199O12147J518632j52944n82268L92059
11368H49847k1296j95786K74337n5920l0278M69548j10740k45310J06630N41025
$$ plain form
11435 -527231 -943313 -42527 -17879 -330410 -562608 -656132 -962266 -1358774 -1279339 -575085
11425 -575085 64297 376557 623319 747444 717958 614022 528910 1244287 2141318 1812065
11415 1812065 -89282 -2867346 -3623696 -2799821 -2138324 -1539294 -625452 -334483 -203081
11406 -203081 149418 330944 -88510 -721598 -681131 111886 512915 401732 -171363 -1033783
11396 -1033783 -1170304 -366036 165643 470700 1104063 1223610 278379 -1111831 -1794370
11387 -1794370 -2336902 -1964182 -862931 -595114 -336628 -357614 -582010 -117013 90354
11378 90354 -380430 -187741 -43951 -412580 -937779 -325632 1193000 1040056 457788 849847
11368 849847 828551 632765 907102 851182 820904 1290452 1179712 934402 1041032 1582057
11358A582057O08825m28349N44790Q62365m47454j038502j167739j527970n85365
11349a597342K67372P32495Q34483M73629l20820o46239J29146P61736l45733
11340B88727j022763p8056M62696M91287P94348J40130m53862j98927k72569p80369
11330f29358k77736P13226J28073M14700L83886r12526n07402O51500N47726O54956
11320A167045N85896L3928R72089O56973o70652j339998r78141n21391j15314
11311b09565j39679j39434j5776m72198o62467N17601k5133k43098M02668K51409
11301g35672k21965k8908K74742j8628m53489K72085R58135k1606r29507j239971
11291b144784O8679R53718N14628k22633J67340J26268L81300Q2252o57631m29023
$$ plain form
11358 1582057 2190882 1762533 2307323 3169688 2722234 1683732 515993 -1011977 -1597342
11349 -1597342 -1329970 -597475 237008 710637 389817 -256422 -127276 634460 288727
11340 288727 -734036 -812092 -349396 141891 936239 1076369 622507 423580 151011 -629358
11330 -629358 -907094 -193868 -65795 348905 732791 -179735 -687137 -35637 512089 1167045
11320 1167045 1752941 1786869 2758958 3415931 2745279 1405281 427140 -94251 -209565
11311 -209565 -349244 -488678 -504454 -976652 -1639119 -1121518 -1146651 -1389749 -987081 -735672
11301 -735672 -957637 -986545 -711803 -730431 -1183920 -911835 46300 24694 -904813 -2144784
11291 -2144784 -2076105 -1122387 -607759 -830392 -663052 -536784 -155484 -73232 -730863 -1159886
11281a159886O61019J244384Q49715l15850j357099n37206M6210j79104m72473
11272a220290l89839m4539m33143n627L63094K04523M23696L45273J32276J215219
11262E90643R01667L34738P11554J43492K0022k37794p05439q31083j30647M0118
11252H37271k30844m93612k2216K83501p42431o36882P6474L89658J53965l06638
11242f91754L6536L25069K17348J23043M28512j32315k34321j82744L79229J169195
11232A437798P00859k17140j300530j226486l93139J200675J499835R69680M68946
11223C140498m95362j200868j065522j171528m93301K74223J16307j015186q36977
11214b747716O5746L84118L71530M57613M80889L92151M92842M93661P29495k6039
$$ plain form
11281 -1159886 -498867 745517 1595232 1279382 -77717 -614923 -568713 -747817 -1220290
11272 -1220290 -1610129 -1654668 -2087811 -2093438 -1730344 -1525821 -1102125 -756852 -624576 590643
11262 590643 1492310 1827048 2538602 2682094 2702116 2464322 1758883 927800 797153 837271
11252 837271 606427 112815 90599 374100 -368331 -1005213 -928739 -539081 -385116 -691754
11242 -691754 -655218 -330149 -112801 10242 438754 306439 72118 -110626 268603 1437798
11232 1437798 2138657 1921517 620987 -605499 -998638 202037 1701872 2671552 3140498
11223 3140498 2645136 1444268 378746 -792782 -1286083 -1011860 -895553 -1910739 -2747716
11214 -2747716 -2681970 -2297852 -1926322 -1468709 -987820 -595669 -102827 390834 1120329 1094290
11204A094290k88243K15593K17984j22330k32883J95780L93817j45329j75612
11195A153067L12949J007778L18019p3770P28580J44206l29377l92111n14900
11186B354441l02228K73145J2553n11917j039352q62243K76594N75338K55025
11177A031356J88483p23836k24418r7572k51111m46312r19269r69182p43878j53068
11167c308807J37959K46636P82783J76819m40207k45888M98203J059504J776578
11158F83580J748679N19476M01111K39749m81760o59490r06749p57730j216390
11149d29524j040806K67106J2442m88770r1015J89209j68849m95001K7673Q04873
11139a412662R98026M67527n06730p6548K56288O67336L74290l46859o79823j4736
$$ plain form
11204 1094290 806047 1021640 1239624 1117294 884411 1080191 1474008 1328679 1153067
11195 1153067 1466016 2473794 2791813 2718043 3446623 3590829 3261452 2869341 2354441
11186 2354441 2052213 2325358 2337911 1825994 786642 -75601 200993 776331 1031356
11177 1031356 1219839 496003 271585 174013 -77098 -523410 -1442679 -2411861 -3155739 -3308807
11167 -3308807 -3170848 -2924212 -2141429 -1964610 -2404817 -2650705 -2152502 -1092998 683580
11158 683580 2432259 2951735 3352846 3592595 3110835 2451345 1544596 786866 -429524
11149 -429524 -1470330 -1203224 -1190782 -1679552 -1770567 -1581358 -1750207 -2245208 -2217535 -1412662
11139 -1412662 -414636 52891 -453839 -530387 -274099 393237 767527 420668 -259155 -273891
11129b73891j04226k5628n5994j30021J91866m1676N04504J099156L05598p64468
11119G05220p18990N3962L30708L71471j04052m21640o1271l14954k19698k80147
11109f59391j64239J08438k30968n69728k32998O18555L95356O98902P96457p30061
11099C0323o13536J106312R83710l13817j37363Q8926m9767k08159o80498r63699
11089g57568o65399l40818p96098k86085K9001Q87717M59488m38744l82925J140018
11079a151413R16603O10696R68140J19311r08205k56221O04122j42118j02006
11070F58909k84297J59727j2679j061763r06258J69873J065444Q34773m7672l50372
11060B25685o35120n71928l90259K76000L82207K34049K78126N4856k29141l86447
$$ plain form
11129 -273891 -378117 -403745 -459739 -589760 -397894 -439570 64934 1164090 1469688 705220
11119 705220 -13770 40192 370900 742371 638319 216679 155408 -159546 -379244 -659391
11109 -659391 -823630 -715192 -946160 -1515888 -1748886 -1130331 -734975 -36073 760384 30323
11099 30323 -583213 523099 1506809 1192992 1055629 1144555 1094788 886629 206131 -757568
11089 -757568 -1422967 -1763785 -2559883 -2845968 -2816967 -1929250 -1469762 -1908506 -2291431 -1151413
11079 -1151413 -234810 375886 1344026 1463337 555132 298911 903033 760915 658909
11070 658909 374612 534339 521660 -540103 -1446361 -1276488 -211044 623729 576057 225685
11060 225685 -409435 -981363 -1371622 -1095622 -713415 -479366 -201240 -146384 -375525 -761972
11050g61972l65504k41425l37109j63242J79589P13874M54681M07960m24310p44907
11040a282365k54222O2488J25215q8216M84299P90818P48201M16905N57191M26735
11030A987049j35389r04504j127744l12098l52182p94830p25178K96801M34648
11021a633427J53868Q1360O4469J84386m9471j45355k88095q86988r87843M92504
11011c014592J171457J084999Q98501J86372J04870L47114n8241M92026M94218
11002A706724m9443n2557p46049o55425l0191M19014j44386J59155k308p5184
10992E29350L07798O41854O16778l75524k00962l08826j169052q77989n35894
10983a372467m98717R76162J165527L70047K32251K74724N77185n34160j044240
$$ plain form
11050 -761972 -1127476 -1368901 -1706010 -1869252 -1689663 -975789 -521108 -113148 -537458 -1282365
11040 -1282365 -1536587 -1474099 -1348884 -1437100 -952801 -161983 586218 1003123 1560314 1987049
11030 1987049 1851660 947156 -180588 -492686 -844868 -1639698 -2364876 -2068075 -1633427
11021 -1633427 -1479559 -1398199 -1333730 -1149344 -1198815 -1344170 -1632265 -2519253 -3507096 -3014592
11011 -3014592 -1843135 -758136 140365 326737 431607 778721 720480 1212506 1706724
11002 1706724 1657281 1604724 858675 203250 173059 592073 447687 606842 604534 529350
10992 529350 837148 1479002 2095780 1720256 1519294 1210468 41416 -836573 -1372467
10983 -1372467 -1871184 -895022 270505 640552 872803 1147527 1724712 1190552 146312
10974A46312L87868M56750k40202j72966l4800J50417K72745O17884P88187L10510
10964B682705r25917q88608l80784l00185J47050N87731O72309k23467j351512
10955A9322r89076N34306L78529o35087M84446O00112J05725Q71052P50967M64816
10945B585112k31760m1142n41393o89356n00136l97394N76822J069204Q63806
10936B693763J004924J036239P69533K0739l48226k62220l56979K99749J011169
10927E868691J328667J268503Q00531J526274K045754J583449J682326K601967
10919A8706162L191246L859612N019792O454441P732441Q859293J0382323J4267161
10911G8472471K0119973K7353295L2226053K5230334j588364k8861349l4586290
$$ plain form
10974 146312 534180 990930 750728 577762 542962 693379 966124 1584008 2372195 2682705
10964 2682705 1756788 868180 487396 187211 334261 921992 1594301 1370834 19322
10955 19322 -969754 -435448 -56919 -692006 -207560 392552 498277 1369329 2120296 2585112
10945 2585112 2353352 2312210 1770817 1081461 581325 183931 760753 1829957 2693763
10936 2693763 3698687 4734926 5504459 5525198 5176972 4914752 4557773 4857522 5868691
10927 5868691 7197358 8465861 9266392 10792666 12838420 14421869 16104195 18706162
10919 18706162 21897408 25757020 30776812 37231253 44963694 53822987 64205310 78472471
10911 78472471 98592444 125945739 158171792 183402126 181813762 152952413 118366123
10904A18366123k7968750j9994377j3851130j0102056q385633o637910m722934
10897B6703333l732685l706098k552325j649722j568489o19055j486919r50923
10889A0437117r33110j917867l75760M80652L3400l88875r25732j92512l49051
10880E868262j338012r49999k67223j00144r31489j104154j03610P30580P52237
10871B556448O21326J65436Q9018L71148M03606p8837p3556n9699l01371L61231
10861D054750Q70764k23939r18115j235878j078906p83168J29132J116522K31911
10852B163073M03534J36615o22387m77359r07485o23540K21815K04251j98049
10843C00468P53189O89285M24218l30622j172326n55998P72417J252750K03899
$$ plain form
10904 118366123 90397373 70402996 56551866 46449810 38064177 31426267 26703333
10897 26703333 22970648 19264550 16712225 15062503 13494014 12874959 11388040 10437117
10889 10437117 9504007 7586140 7210380 7691032 7724432 7335557 6409825 6217313 5868262
10880 5868262 4530250 3580251 3313028 3212884 2281395 1177241 1073631 1804211 2556448
10871 2556448 3177774 3343210 3432228 3803376 4206982 4128145 4054589 3994890 3693519 4054750
10861 4054750 4925514 4701575 3783460 2547582 1468676 685508 814640 1931162 2163073
10852 2163073 2566607 2703222 2080835 1603476 695991 72451 294266 498517 300468
10843 300468 1053657 1742942 2167160 1836538 664212 108214 880631 2133381 2337280
10834B337280k63350L24897L09915j31895J31309n50924m17262N00353K65411
10825B505734J18998j99624m08338L50951O90060J537082J179733O63125J129522
10816G567243M00879l48035l23110Q35703J603514M65133L81026J891989K328577
10807A4802919J533373K688902M495250M779449N169422O099428Q423003J1105652
10799E9097398J3846694J8458227K4507408K8535825K5282230O268724j9400397
10792A56596109l1057546k7938237k0915056j5589372j1906237r223737o687638
10785C3278286m739619l909853l598537k543680k392588k239455j829725k068375
10777I956454k070577j279334m4766l38935o70834l75179o16038j269021j004771
$$ plain form
10834 2337280 2073930 2398827 2708742 2576847 2708156 2157232 1739970 2240323 2505734
10825 2505734 2624732 2425108 2016770 2367721 3057781 4594863 5774596 6437721 7567243
10816 7567243 7968122 7620087 7296977 8132680 9736194 10201327 10582353 12474342 14802919
10807 14802919 16336292 19025194 23520444 28299893 33469315 39568743 47991746 59097398
10799 59097398 72944092 91402319 115909727 144445552 169727782 175996506 156596109
10792 156596109 125538563 97600326 76685270 61095898 49189661 39965924 33278286
10785 33278286 28538667 24628814 21030277 18486597 16094009 13854554 12024829 9956454
10777 9956454 7885877 6606543 6561777 6222842 5552008 5176829 4560791 3291770 2286999
10768B286999k03461l20109m9536P62996j49522j164257p72620q7119M02953M70691
10758A177015L25250M47874l363m00861j83068J06308k8119L37560R80049N27267
10748C285912n20316n44191n05079k15218J79022Q58030m75292j695012l38736
10739B9120N48283L13159q9852l59822l49931l19661l52894J22049Q4176L5803
10729c39570o76402k25434Q45271Q65989P5702n02881l51263p04461n81493j59308
10719a753850P32964R62863J16736k06641K56611J82613m40326q27664J4446j48404
10709a110652p60162P0408R19126J005117L63208n85733p34266Q68238P86770
10700H22054K98786p4694p06438o24734l94923o37143r43947l65258O23261R29880
$$ plain form
10768 2286999 2083538 1763429 1713893 2476889 2327367 1163110 390490 303371 706324 1177015
10758 1177015 1502265 1950139 1946776 1545915 1362847 1469155 1441036 1778596 2758645 3285912
10748 3285912 2765596 2221405 1716326 1501108 1680130 2538160 2062868 367856 29120
10739 29120 577403 890562 800710 440888 90957 -228704 -581598 -459549 -375373 -339570
10729 -339570 -1015972 -1241406 -396135 469854 545556 42675 -308588 -1013049 -1594542 -1753850
10719 -1753850 -1020886 -58023 58713 -147928 108683 291296 -149030 -976694 -962248 -1110652
10709 -1110652 -1870814 -1800406 -881280 123837 487045 -98688 -832954 35284 822054
10700 822054 1120840 1046146 339708 -285026 -679949 -1317092 -2261039 -2626297 -2003036 -1073156
10690a073156P13073J045983Q88410J59209M1238k72606p98398r06248j77639
10681c80134K69466J050453R48722n40709j417084j453684m80569L23826m01049
10672b080762J31087N82154R59136O90688J71932k52401J83130R54356K10006
10663A549326m37529j274459j591525q27884j16230M54659R28641J044690M31733
10654A61422m2304J63670P41840Q21997q2565q74833o10819L79320N53397n84896
10644F26229n98394J80584o36620p22367N12504L85810P0907m94242j518631p53798
10634b948018j72158P80474P18683J08050J2237j48056L75162J376652J089503
10625A192529l36226o09185Q78391N11534j12263K89197k02281m34491l03140
$$ plain form
10690 -1073156 -360083 685900 1574310 1733519 1774757 1502151 703753 -202495 -380134
10681 -380134 -110668 939785 1888507 1347798 -69286 -1522970 -2003539 -1679713 -2080762
10672 -2080762 -1949675 -1367521 -408385 282303 454235 201834 384964 1339320 1549326
10663 1549326 1111797 -162662 -1754187 -2582071 -2698301 -2243642 -1315001 -270311 161422
10654 161422 119118 282788 1024628 1846625 1764060 889227 278408 657728 1211125 626229
10644 626229 27835 208419 -428201 -1150568 -638064 -252254 -181347 -675589 -2194220 -2948018
10634 -2948018 -3120176 -2339702 -1621019 -1512969 -1500732 -1648788 -1273626 103026 1192529
10625 1192529 856303 247118 1125509 1637043 1524780 1813977 1611696 1177205 874065
10616H74065k41215J42329J372590J258944J75307j30116k55577Q8603q07449
10607B477481j209608j88478m13666n02010j05128k80058K47134J082107J029057
10598B136831n9873j265906n38000j12575j10375P8188P6958K62765k04557J22345
10588C85801j62976q43080q8673J0993J81979K07613n07938k19155J75766J58452
10578g01218l94971n02378K50963M46825l67396l08578K491j14978J05432M95302
10568a088506K77449K84684M7482L29168r2797j411879q59113r2668j47203J079895
10558a673488O60844J32922K29246j05799k46701j26274M47026J117680O67297
10549A102753l62868o18738l94190k89174K56269N64982K81831O7872l56630m90268
$$ plain form
10616 874065 632850 775179 2147769 3406713 3582020 3451904 3196327 3284930 2477481
10607 2477481 1267873 1079395 665729 163719 58591 -221467 25667 1107774 2136831
10598 2136831 2076958 811052 273052 160477 50102 128290 205248 468013 263456 385801
10588 385801 222825 -620255 -708928 -697935 -515956 -308343 -816281 -1035436 -859670 -701218
10578 -701218 -1096189 -1598567 -1347604 -900779 -1268175 -1576753 -1574262 -1689240 -1583808 -1088506
10568 -1088506 -811057 -526373 -478891 -149723 -242520 -1654399 -2513512 -2606180 -2753383 -1673488
10558 -1673488 -1012644 -879722 -650476 -756275 -1002976 -1129250 -682224 435456 1102753
10549 1102753 739885 121147 -273043 -562217 -305948 259034 540865 608737 252107 -238161
10539b38161n79960q21838n35777J44064k9766O43860O44069J98097K9135M13196
10529a33081M71237k39016m33165L01809P75392p2581j448900k71772P57610M80733
10519A88266K53265j31921l25209k75706j40636O70443M59920J08869n95696j63156
10509D8439J035048J67213p51583j189519l74727K98861R11152J407845J59121
10500A711850l99605J49680P31772k08086q49336n98321p8814J37795j125260
10491e28325q37126N73261Q43510L08038J08628j07477j10057l70317K2836M47716
10481C50687p42690j123820M00282M5833q67963l57097J082805Q47068K26989
10472a37906n54821n69604l45074p44641K86132O43753Q6567l32543N34868K70673
$$ plain form
10539 -238161 -818121 -1639959 -2175736 -2031672 -2061438 -1417578 -773509 -575412 -546277 -133081
10529 -133081 338156 99140 -334025 -32216 743176 670595 -778305 -1050077 -292467 188266
10519 188266 441531 309610 -15599 -291305 -431941 238502 698422 807291 211595 48439
10509 48439 1083487 1250700 499117 -690402 -1065129 -766268 144884 1552729 1711850
10500 1711850 1312245 1461925 2193697 1985611 1136275 537954 459140 596935 -528325
10491 -528325 -1365451 -792190 51320 359358 467986 360509 250452 -119865 -97029 350687
10481 350687 -392003 -1515823 -1115541 -1069708 -1937671 -2294768 -1211963 -364895 -137906
10472 -137906 -692727 -1262331 -1607405 -2352046 -2065914 -1422161 -1335594 -1668137 -1133269 -862596
10462h62596j34620K60925K50578N37904K09530o4285J95543L36624l95414j185166
10452h50977n23962l46015j18693R11941Q23270P17649L41633K41882L25927L44790
10442A867445k60140p90455o00899N74692O17659o53947j64807Q57323K46609
10433A693480p80427l44184L5719N34285o3116j13060k21442L45424J051417J95509
10423B333605k65139n4489n25230r26090o95691O8875L48237j032j009214q74619
10413a600787L6651K12808L64958J025615J289745l03537j150584o46358k69634
10404a041123P3503N22628O94051m428p56054m92325K5403Q23108J182408J864136
10394B891307L66069p47524n26158m81399K88538K18869o9499n47694o38876l07907
$$ plain form
10462 -862596 -997216 -736291 -485713 52191 261721 197436 392979 729603 334189 -850977
10452 -850977 -1374939 -1720954 -1839647 -927706 -104436 613213 954846 1196728 1522655 1867445
10442 1867445 1607305 816850 215951 790643 1408302 754355 589548 1446871 1693480
10433 1693480 913053 568869 604588 1138873 1075757 962697 741255 1086679 2138096 2333605
10423 2333605 2068466 2013977 1488747 562657 -133034 -64159 284078 283046 -726168 -1600787
10413 -1600787 -1564136 -1351328 -986370 39245 1328990 1025453 -125131 -771489 -1041123
10404 -1041123 -967620 -444992 249059 244631 -511423 -1003748 -978345 -155237 1027171 2891307
10394 2891307 3257376 2509852 1983694 1502295 1790833 2009702 1940203 1392509 753633 445726
10384D45726r2290Q57522R12562J25129k41010r36010n72992o42707j09668R62293
10374G08555L46962l45374n21199J23737M37262k75761l2780L77431M3362L4846
10364H97041K79096k91219p27172q18847j247692q2921M36366p26953j423988
10355c706289j48451J243428J162807J87359q7667r241K34746O00877O00725J032511
10345A110805L28599K38686j21301k38565k4448M11651l62185l12178l68865K46010
10335I08209J156234J90570o04422r66226j647623k29793J005212Q68893r5541
10326E85513Q4740K68731L03585l88112p43709m10173J2393R0527J67102L16252
10316B86849j66722n29145q9123K20569m04844k84504n20798k5402m6901r5753
$$ plain form
10384 445726 353436 1210958 2123520 2248649 2007639 1071629 498637 -144070 -253738 708555
10374 708555 1055517 710143 188944 312681 749943 474182 441402 818833 862195 897041
10364 897041 1176137 884918 157746 -661101 -1908793 -1991714 -1555348 -2282301 -3706289
10355 -3706289 -3854740 -2611312 -1448505 -1261146 -1348813 -1358054 -1123308 -522431 78294 1110805
10345 1110805 1439404 1678090 1556789 1318224 1293776 1705427 1343242 1031064 662199 908209
10335 908209 2064443 2255013 1650591 684365 -963258 -1193051 -187839 681054 585513
10326 585513 670253 938984 1242569 854457 110748 -299425 -287032 -196505 -29403 286849
10316 286849 120127 -409018 -498141 -277572 -682416 -966920 -1487718 -1513120 -1560021 -1655774
10306a655774L37213k17330j23566L81233P51971J017209J151190j8017k18439
10297A405690K63711j057144r46477l33859K174J24781M4492R991J07664l90610
10287g69587j76175K61594L40215j75815k1328L27126J77721N31179K43426l49523
10277C88833M10097R32521j89614j205397p00385q73948q0959J043352J066382
10268G90882O9541p03808k68496L90779J68575l00256j110407k83912N72406O6387
10258f08309m94158k31484M57426Q80276O09930J55554J70785L53135j14058k71101
10248I07996k44224l09402K60874k15937p29879m46354j17015L78238k42778l5597
10238g94078M5179L48407J374266K12067o04795L76692M92923p05915j58869J561283
$$ plain form
10306 -1655774 -1318561 -1535891 -1659457 -1278224 -526253 490956 1642146 1624129 1405690
10297 1405690 1669401 612257 -334220 -668079 -665905 -541124 -496632 -486641 -378977 -769587
10287 -769587 -945762 -684168 -343953 -519768 -541096 -213970 -36249 494930 738356 388833
10277 388833 798930 1731451 1541837 336440 -363945 -1237893 -1318852 -275500 790882
10268 790882 860423 156615 -111881 278898 447473 147217 -963190 -1247102 -674696 -608309
10258 -608309 -1102467 -1333951 -876525 3751 613681 769235 940020 1293155 1179097 907996
10248 907996 663772 354370 615244 399307 -330572 -776926 -893941 -515703 -758481 -794078
10238 -794078 -748899 -400492 973774 1185841 581046 957738 1450661 744746 585877 2147160
10228B147160J237925J34007m00002n94000o57203o56837j446714j037042K03368
10219a069338Q41367M97778j02244j085736j61918L91682J74792K74057k95173
10210e34733j38130K75519J5402p37902o46926O13178P40950L83032Q48027P97588
10200A616005l6298q09084n30780o2291q81827o26884N64705R1965m02996N040
10190a072445J171246N25636L16764j27467J50562K4527q21892m22325j67538
10181d22932M98002O26917m65805k02089J8080m40541j61587M44249P71645O08457
10171A274396r225n22462l57669k06622J0275j160982k33995J315004P35807J22502
10161I67029j58874M43433Q30091k29606k36894J76922L04454N51663R06591j45039
$$ plain form
10228 2147160 3385085 3519092 3119090 2525090 1867887 1211050 -235664 -1272706 -1069338
10219 -1069338 -227971 269807 167563 -918173 -1080091 -688409 -513617 -239560 -534733
10210 -534733 -672863 -397344 -381942 -1119844 -1766770 -1153592 -412642 -29610 818417 1616005
10200 1616005 1579707 770623 239843 177552 -704275 -1331159 -766454 -674489 -1077485 -1072445
10190 -1072445 98801 624437 941201 813734 964296 988823 166931 -255394 -422932
10181 -422932 75070 701987 236182 34093 52173 -388368 -549955 -105706 665939 1274396
10171 1274396 1265171 742709 385040 178418 188693 -972289 -1206284 108720 844527 967029
10161 967029 808155 1251588 2081679 1852073 1615179 1792101 2096555 2648218 3554809 3409770
10151C409770j305150q55693o59107o85632L4333k7838m37922k05191j94877n83833
10141a511140r84289K2398R06504R03005L58954j44935l34040L30040O11159L01699
10131D59355j47020o31819P6906P60900Q19415N71226m42868r31441j084497p30527
10121a280370L23390L22500J09948K73291J0789O0007Q12080J798449Q78497j39010
10111C169571o95704j624479j125589l77424L19011L89764o328L53596p2687j387717
$$ plain form
10151 3409770 2104620 1248927 589820 -95812 -61479 -89317 -527239 -732430 -927307 -1511140
10141 -1511140 -2495429 -2473031 -1566527 -663522 -304568 -449503 -783543 -453503 157656 459355
10131 459355 312335 -319484 -242578 518322 1337737 1908963 1466095 534654 -549843 -1280370
10121 -1280370 -956980 -634480 -524532 -251241 -240452 -180445 631635 2430084 3308581 3169571
10111 3169571 2473867 849388 -276201 -653625 -334614 55150 48822 402418 329731 -1057986
$$ [...]
##END NTUPLES=NMR SPECTRUM
##END=
