##TITLE=C13_Pr 4974
 CDCl3, 23100 sc

 29.12.2020
##JCAMPDX= 6.0         $$ Bruker NMR JCAMP-DX V2.0
##DATA TYPE= NMR SPECTRUM
##DATA CLASS= NTUPLES
##ORIGIN= UXNMR, Bruker Analytische Messtechnik GmbH
##OWNER= root
$$ XWIN-NMR		Version 3.5
$$ Wed Dec 30 10:14:34 2020 Russian Standard Time (UT+4h)  she@DPX200
##.OBSERVE FREQUENCY= 50.327896
##.OBSERVE NUCLEUS= ^13C
##.ACQUISITION MODE= SIMULTANEOUS
##.ACQUISITION SCHEME= undefined
##.AVERAGES= 23100
##.DIGITISER RES= 17
##SPECTROMETER/DATA SYSTEM= spect
##.PULSE SEQUENCE= zgpg30
##.SOLVENT NAME= CDCl3
##.SHIFT REFERENCE= (INTERNAL, CDCl3, 0, 222.653)
##AUDIT TRAIL= $$ (NUMBER, WHEN, WHO, WHERE, WHAT)
$$ ##TITLE= Audit trail, XWIN-NMR		Version 3.5
$$ ##JCAMPDX= 5.01
$$ ##ORIGIN= Bruker BioSpin GmbH
$$ ##OWNER= she
$$ F:/spectra/data/she/nmr/c13/1/pdata/1/auditp.txt
$$ ##AUDIT TRAIL=  $$ (NUMBER, WHEN, WHO, WHERE, WHAT)
(   1,<2020-12-30 10:13:15.20 +0400>,<she>,<DPX200>,
      <created by zg, POWCHK disabled, PULCHK disabled
       terminated by command 'halt'
       configuration hash MD5:
       00 E9 B6 7A A2 85 ED C7 34 08 36 98 17 FE 4E 26
       data hash MD5: 32K
       1F 9B C2 3B 88 AA B1 01 C3 5F 91 73 61 87 94 72>)
(   2,<2020-12-30 10:13:17.42 +0400>,<she>,<DPX200>,
      <Start of raw data processing
       efp BC_mod = 2 LB = 1 FT_mod = 6 PKNL = 1 PHC0 = -259.6119 PHC1 = 13.56242 SI = 32K 
       data hash MD5: 32K
       BE 90 CD 26 96 49 4F FC 77 01 CB D6 96 9B 99 67>)
(   3,<2020-12-30 10:13:20.81 +0400>,<she>,<DPX200>,
      <abs ABSG = 5 
       data hash MD5: 32K
       DB 2A 78 CF 5A A5 26 A7 06 6F CA D4 0E BD BF A0>)
(   4,<2020-12-30 10:14:06.48 +0400>,<she>,<DPX200>,
      <pk PHC0 = -8.957726 PHC1 = 13.4 
       data hash MD5: 32K
       A8 80 D1 C2 EB D8 65 6A 99 76 E8 B1 1A A9 9A 55>)
(   5,<2020-12-30 10:14:09.89 +0400>,<she>,<DPX200>,
      <abs ABSG = 5 
       data hash MD5: 32K
       23 5B BC 9B 6B F3 D4 B2 9E 67 E4 A4 4A F4 6C 35>)
$$ ##END=
$$ 
$$ hash MD5
$$ B8 58 4F E2 E5 27 6B 1C 38 26 19 33 69 E7 5C C3
##$RELAX= 
##$RELAX= 
##$RELAX= 
##$RELAX= 
##$RELAX= 
##$RELAX= 
##$RELAX= 
##$RELAX= 
$$ Bruker specific parameters
$$ --------------------------
##$DU= <F:/spectra>
##$EXPNO= 1
##$NAME= <c13>
##$PROCNO= 1
##$TYPE= <nmr>
##$USER= <she>
##$AMP= (0..31)
100 100 100 100 100 100 100 100 100 100 100 100 100 100 100 100 100 100 
100 100 100 100 100 100 100 100 100 100 100 100 100 100 
##$AQSEQ= 0
##$AQ_mod= 1
##$AUNM= <au_zg>
##$AUTOPOS= <>
##$BF1= 50.322709
##$BF2= 200.13
##$BF3= 50.322709
##$BF4= 500.13
##$BF5= 500.13
##$BF6= 500.13
##$BF7= 500.13
##$BF8= 500.13
##$BYTORDA= 1
##$CFDGTYP= 0
##$CFRGTYP= 5
##$CHEMSTR= <none>
##$CNST= (0..31)
1 1 145 1 1 1 1 1 1 1 1 1 1 1 1 1 1 1 1 1 1 1 1 1 1 1 1 1 1 1 1 1 
##$CPDPRG= <waltz16>
##$CPDPRG1= <>
##$CPDPRG2= <waltz16>
##$CPDPRG3= <>
##$CPDPRG4= <mlev>
##$CPDPRG5= <mlev>
##$CPDPRG6= <mlev>
##$CPDPRG7= <mlev>
##$CPDPRG8= <mlev>
##$CPDPRGB= <>
##$CPDPRGT= <>
##$D= (0..31)
$$ [...]
##$SUBNAM4= <"">
##$SUBNAM5= <"">
##$SUBNAM6= <"">
##$SUBNAM7= <"">
##$SUBNAM8= <"">
##$SUBNAM9= <"">
##$SW= 239.972175391363
##$SWIBOX= (0..15)
0 1 3 0 0 0 0 0 0 0 0 0 0 0 0 0 
##$SW_h= 12077.2946859903
##$TD= 32768
##$TD0= 1
##$TE= 0
##$TE2= 300
##$TE3= 300
##$TEG= 300
##$TL= (0..7)
120 120 120 120 120 120 120 120 
##$TP= (0..7)
150 150 150 150 150 150 150 150 
##$TP07= 0
##$TPNAME0= <>
##$TPNAME1= <>
##$TPNAME2= <>
##$TPNAME3= <>
##$TPNAME4= <>
##$TPNAME5= <>
##$TPNAME6= <>
##$TPNAME7= <>
##$TPOAL= (0..7)
0.5 0.5 0.5 0.5 0.5 0.5 0.5 0.5 
##$TPOFFS= (0..7)
0 0 0 0 0 0 0 0 
##$TUNHIN= 0
##$TUNHOUT= 0
##$TUNXOUT= 0
##$USERA1= <user>
##$USERA2= <user>
##$USERA3= <user>
##$USERA4= <user>
##$USERA5= <user>
##$V9= 5
##$VALIST= <valist>
##$VCLIST= <CCCCCCCCCCCCCCC>
##$VD= 0
##$VDLIST= <DDDDDDDDDDDDDDD>
##$VPLIST= <PPPPPPPPPPPPPPP>
##$VTLIST= <TTTTTTTTTTTTTTT>
##$WBST= 1024
##$WBSW= 4
##$XGAIN= (0..3)
0 0 0 0 
##$XL= 0
##$YL= 0
##$YMAX_a= 138704667
##$YMIN_a= -90156969
##$ZGOPTNS= <>
##$ZL1= 120
##$ZL2= 120
##$ZL3= 120
##$ZL4= 120
##$ABSF1= 222.6533
##$ABSF2= -17.34351
##$ABSG= 5
##$ABSL= 3
##$ALPHA= 0
##$AQORDER= 0
##$ASSFAC= 0
##$ASSFACI= 0
##$ASSFACX= 0
##$ASSWID= 0
##$AUNMP= <proc_1d>
##$AZFE= 0.1
##$AZFW= 0.5
##$BCFW= 0
##$BC_mod= 2
##$BYTORDP= 0
##$COROFFS= 0
##$CY= -3
##$DATMOD= 1
##$DC= 0
##$DFILT= <>
##$DTYPP= 0
##$F1P= 0
##$F2P= 0
##$FCOR= 0.5
##$FTSIZE= 32768
##$FT_mod= 6
##$GAMMA= 0
##$GB= 0
##$INTBC= 1
##$INTSCL= 4.134877e-10
##$ISEN= 128
##$LB= 1
##$LEV0= 0
##$LPBIN= 0
##$MAXI= 10000
##$MC2= 0
##$MEAN= 0
##$ME_mod= 0
##$MI= 0.1934396
##$NCOEF= 0
##$NC_proc= 2
##$NLEV= 6
##$NOISF1= 120.0001
##$NOISF2= 80.00006
##$NSP= 0
##$NTH_PI= 0
##$NZP= 0
##$OFFSET= 222.6533
##$PC= 1.4
##$PHC0= -268.5696
##$PHC1= 26.96242
##$PH_mod= 1
##$PKNL= yes
##$PPARMOD= 0
##$PSCAL= 0
##$PSIGN= 0
##$REVERSE= no
##$SF= 50.3227301278049
##$SI= 32768
##$SIGF1= 140
##$SIGF2= 120
##$SINO= 11.81781
##$SIOLD= 32768
##$SREGLST= <13C.CDCl3>
##$SSB= 0
##$STSI= 32768
##$STSR= 0
##$SW_p= 12077.2946859903
##$SYMM= 0
##$S_DEV= 0
##$TDeff= 32768
##$TDoff= 0
##$TI= <>
##$TILT= no
##$TM1= 0
##$TM2= 0
##$TOPLEV= 0
##$USERP1= <user>
##$USERP2= <user>
##$USERP3= <user>
##$USERP4= <user>
##$USERP5= <user>
##$WDW= 1
##$XDIM= 32768
##$YMAX_p= 487196090
##$YMIN_p= -12100664
$$ End of Bruker specific parameters
$$ ---------------------------------
##NTUPLES= NMR SPECTRUM
##VAR_NAME=  FREQUENCY,     SPECTRUM/REAL,   SPECTRUM/IMAG
##SYMBOL=    X,             R,               I
##VAR_TYPE=  INDEPENDENT,   DEPENDENT,       DEPENDENT
##VAR_FORM=  AFFN,          ASDF,            ASDF
##VAR_DIM=   32768,         32768,           32768
##UNITS=     HZ,            ARBITRARY UNITS, ARBITRARY UNITS
##FACTOR=    0.368581032318806, 1,           1
##FIRST=     11204.5221822817, 0,            0
##LAST=      -872.772503708586, 0,           0
##MIN=       -872.772503708586, -12100664,   0
##MAX=       11204.5221822817, 487196090,    0
$$ Real data points
##PAGE= N=1
##DATA TABLE= (X++(R..R)), XYDATA
$$ [...]
18255 -294744 -313407 -408044 -220742 354698 596958 542168 293963 125274 -31638 -452765
18245 -452765 -406505 -88602 -21935 75584 392538 352899 17038 -381259 -516069 -476422
18235 -476422 -320392 -4948 -134801 -328208 -317810 -177150 51636 -234644 -767407 -1197567
18225 -1197567 -1047216 -405322 254404 648869 943979 897968 524553 140747 -227430 -315047
18215 -315047 -2107 -44054 -473255 -345937 -278032 -562361 -791787 -716771 -460979 -44259
18205 -44259 253524 683172 1072179 1124120 802725 550664 519193 445129 149334 -61762
18195 -61762 -116012 25046 472609 618671 384108 252277 12200 -284420 -280054 47672
18185 47672 272744 387644 381134 372223 427079 624762 192617 -366330 -503579 -186867 103365
18174 103365 -12139 -419152 -453102 -116979 118110 168313 -440539 -1182241 -983419 -466519
18164 -466519 -147439 277861 957644 1568239 1615980 1342930 1088194 943501 688080 -200476
18154 -200476 -980342 -668979 -313917 -246592 -125786 233669 209298 128821 188353 77648
18144 77648 335120 982896 1157337 1044527 471850 189505 226141 251417 264309 -7184
18134 -7184 93075 89697 -246278 -502181 -733530 -995559 -1126998 -758310 -624197 -730636
18124 -730636 -1023940 -1134950 -846092 -470754 -321366 24427 -270105 -605213 -92237 469602
18114 469602 477676 230245 391132 717884 907021 921150 943375 1021542 1000334 872406 568620
18103 568620 428418 607942 836636 1031507 1255311 1129664 704453 600032 191720 -457568
18093 -457568 -496829 -628662 -1102858 -995059 -434357 -235324 -313023 -315731 -411286 -544338
18083 -544338 -276128 -328408 -458205 -204112 212897 518918 498370 462364 676951 878589
18073 878589 988546 799128 856538 765178 241134 -5248 155943 390825 456593 530691
18063 530691 708716 713745 119478 -411050 -99304 550012 713424 815848 688996 266617
18053 266617 -348840 -883050 -840086 -76373 500200 892559 810954 710294 900346 1158881
18043 1158881 838539 253747 -115689 -153579 -499163 -747083 -724533 -431156 -227053 -219273
18033 -219273 78354 517540 900536 1232058 1210306 526629 -162920 -382316 -349811 -174593
18023 -174593 130378 426500 573190 437393 412767 594245 684539 287179 -184220 -573518
18013 -573518 -579980 -50807 594127 283466 -276733 -136852 382355 761279 604057 449414
18003 449414 364704 462278 401372 -153236 -397273 -350203 -24657 736581 1488346 1649996
17993 1649996 1417766 1099052 732612 671268 846184 1072546 921688 830287 1063564 1448568
17983 1448568 1694800 1333882 767339 107223 -158277 185360 275574 316363 435206 406393
17973 406393 420971 209212 -42137 -97606 203986 739642 944506 621207 76564 268605
17963 268605 653795 602090 309842 -176310 -397790 -287410 -79913 109550 166352 744428
17953 744428 1508588 1727390 1138831 636329 730438 954820 859446 624189 495305 799427
17943 799427 1219818 1181122 668382 -137374 -531852 -243683 268836 422091 413219 1143964
17933 1143964 2121378 2552089 2538502 2437329 2344008 2556157 2596556 2195312 1712707 1328218
17923 1328218 987666 676815 1002005 1493163 2151650 2787731 3685033 4780187 5549270
17914 5549270 5955850 6798078 7948554 9406585 11925761 15697353 20694806 27784099
17906 27784099 37686723 48033793 49032032 39261027 28599482 20867669 15847169 12699890
17898 12699890 10058500 8212070 7351890 6786849 6072802 5358500 4810585 4318423 3637107
17889 3637107 2840532 2261292 2099415 1898138 1843438 1524705 1146177 1142294 1152941 1576570
17879 1576570 1871490 1957157 1674152 1232321 1068995 890896 737816 602390 508624 491016
17869 491016 344967 54664 -217001 -142141 125500 702081 1142665 1053089 927663 905599
17859 905599 786651 737099 842949 1138352 1122330 703101 178318 -38250 299215 659428
17849 659428 638667 371729 68476 320185 540611 539831 522860 611548 646001 396009 309442
17838 309442 419924 497124 301929 -54412 -37168 219105 482809 495791 508519 534932
17828 534932 584006 478521 474799 722150 610120 356431 616704 1012673 1007681 1152957
17818 1152957 1141003 1136811 1087025 765899 425406 -182740 -453696 -839606 -844510 -563197
17808 -563197 -544710 -643500 -551708 -855968 -706367 -531387 -568385 -768917 -1023106 -1046822
17798 -1046822 -1252111 -1226260 -401128 520194 664154 653273 675637 558919 183581 -104081
17788 -104081 -807 199774 328718 432967 593249 989893 967560 549776 89960 -68333
17778 -68333 75148 203708 -325532 -1085145 -1314804 -853691 -164219 442811 641807 835172
17768 835172 868506 878981 1106886 1450231 1346428 1063531 712796 204091 -65950 -212087
17758 -212087 -260976 242014 491385 605714 514178 444520 469415 590771 762223 639068
17748 639068 650281 1196457 1475655 1501414 1443984 1568492 1646053 1748902 1829029 1471717
17738 1471717 629829 283798 73285 -56410 -86587 -348174 -567870 -515334 -161465 -234464
17728 -234464 -532265 -525125 -256607 -3928 36826 186680 265450 450295 855556 693709
17718 693709 480766 274002 -85074 -364781 -747100 -1216001 -1571759 -1599449 -1270841 -496255
17708 -496255 448341 856449 984990 865636 285443 43202 -383049 -593432 -495317 -666452
17698 -666452 -866517 -837939 -906392 -1340201 -1260842 -544857 35149 523496 957539 997714
17688 997714 976881 1036961 1052104 940398 752770 509910 323256 30016 -119007 67853
17678 67853 175444 204556 75484 -258342 -296115 -178528 110956 298620 9817 -418144
17668 -418144 -600911 -408231 -102898 -41528 -164563 -137790 129045 111193 148246 78363
17658 78363 -242380 -332474 -201702 263334 324157 -135732 -261840 -636908 -652226 -218823
17648 -218823 153030 373118 565732 498167 419588 264881 -263680 -123560 190388 -15943
17638 -15943 -69235 278340 349084 350919 327798 293070 454101 483010 359214 594352 963512
17627 963512 894700 479485 123301 187562 30150 -192504 39209 435944 451883 501648
17617 501648 988389 1402471 1358377 1263576 964258 758635 692946 629942 685652 532256
17607 532256 235084 56742 105068 625328 830725 661693 775093 342901 -132530 -67737
17597 -67737 -159189 -532510 -580213 -18289 101785 10697 -76526 -51235 735320 1207341 1194755
17586 1194755 1016429 825204 754966 823205 941307 976264 828610 602237 663290 744284
17576 744284 618534 658429 540693 543759 850523 1218287 1599848 1720590 1991910 2241462
17566 2241462 2400184 1952251 1113656 849711 552995 484577 643306 670995 821481 890256
17556 890256 880352 758482 1060796 1273102 1447417 1234813 634779 190332 -9899 -223916
17546 -223916 -343327 95869 599564 885959 968079 1264038 1392974 1013441 657602 428816
17536 428816 535189 553070 174839 -110809 -118861 -70123 106234 360332 330154 -198679
17526 -198679 -491110 -564442 -432201 299718 783300 859400 602894 -71016 -380010 -644530
17516 -644530 -387066 -6534 -69467 -86545 -11162 22599 -80800 -183397 -45419 -110085
17506 -110085 -49883 -211665 -639216 -611677 -460974 -543052 -524109 -950238 -1264029 -1005773
17496 -1005773 -969566 -1018523 -892589 -400771 -4916 80253 332153 813363 979160 1046745
17486 1046745 261774 -519616 -545463 -488522 -587762 -593032 -893977 -955279 -667242 -451357
17476 -451357 -626227 -732402 -938618 -755044 -509254 -627425 -921414 -1132100 -670442 -64035
17466 -64035 -64706 -139545 272249 264544 192226 315632 626897 807380 768801 421608 458777
17455 458777 861553 765312 603932 823459 778837 290062 126352 85966 109601 66411
17445 66411 -83312 -136897 -381337 -398364 174897 681412 594417 327109 -137011 -548129
17435 -548129 -978621 -1150473 -836884 -849931 -759066 -227407 93233 -81733 -266404 -5784
17425 -5784 367473 221583 -146169 -340855 -310392 109585 639716 883241 540356 111612
17415 111612 -69172 -248503 -322801 -677922 -476098 211020 874909 1054972 933242 829154
17405 829154 426699 88617 52261 -256749 -452939 -279966 -102056 -157887 -366685 -505374
17395 -505374 -591419 -171996 531443 837365 585256 -50135 -337735 -259045 -376362 -257377
17385 -257377 -97742 -19562 -351003 -690330 -550681 -348954 16831 -22176 -362758 -508507
17375 -508507 -283873 -96177 -61273 -84797 -98774 -212256 -600818 -415200 150755 759979
17365 759979 827744 204771 -624008 -1227685 -1216552 -1008918 -647551 -394465 -463555 -554581
17355 -554581 -132786 728916 1190991 959291 772540 748156 778564 522564 64489 -137625
17345 -137625 -559032 -520215 -222772 21929 177623 142158 65990 238567 622558 885468
17335 885468 638923 -458061 -1502917 -1598297 -1146295 -942196 -948491 -871031 -928543 -996706
17325 -996706 -939043 -820061 -616924 -549342 -372347 -370859 -494701 -591615 -532703 49559 740629
17314 740629 1069584 852021 329770 -422716 -1083670 -1290717 -1058356 -350571 262407 218618
17304 218618 108024 370698 399408 -44941 -489848 -370335 -95870 -63365 115166 -27715
17294 -27715 -187920 -55154 460617 548193 276202 173479 -15440 204393 543437 561234
17284 561234 284312 -332626 -519588 -181147 -66523 -104887 -114655 -69734 21024 53269 268588
17273 268588 142060 -36105 -202843 -539476 -545921 -685213 -741359 -413260 -609559 -968097
17263 -968097 -663814 -757553 -971442 -931731 -811395 -675337 -482462 -205635 -90889 83395
17253 83395 154266 -7492 -353543 -788611 -776903 -317550 -108549 -261700 89147 399869
17243 399869 346811 280481 318397 413573 265909 -4569 -364615 -403526 -134570 -30821
17233 -30821 321991 431659 524888 570049 810534 904730 673891 432921 531931 656738
17223 656738 458966 107006 -529898 -649437 -688667 -800045 -669209 -759492 -790560 -550762
17213 -550762 -129229 163472 7907 -179835 -371058 -437926 -495841 -403152 -293269 -442201
17203 -442201 -435364 -325439 -376943 -501331 -497175 -436597 -399976 -614369 -847036 -269106 515449
17192 515449 616975 -31278 -681130 -1085668 -1182126 -1129020 -966844 -266400 287963 839671
17182 839671 636803 194803 87994 -171924 186353 483884 179980 -225192 36437 493193
17172 493193 365732 236936 501545 513205 207245 105113 -2767 -220991 -205022 -146776
17162 -146776 -235877 -559110 -798068 -772491 -739205 -506956 141319 419798 26059 -288685
17152 -288685 -197267 83677 55923 267619 843228 1211393 1089699 941101 997843 1180873
17142 1180873 1174006 1364784 1472251 1285327 1354139 1631158 1663882 1423800 1310360 1048329
17132 1048329 637437 348230 121739 -96634 -324135 -308906 -394764 -309354 -329401 -362474
17122 -362474 -172112 -82127 -329474 -591568 -715067 -812772 -821496 -693556 -554819 -1024375
17112 -1024375 -1553601 -1461621 -1420529 -1226789 -886775 -791372 -717684 -622972 -250362 -30538
17102 -30538 -403025 -528602 -671220 -771065 -437554 33823 331377 248831 -179421 -505842
17092 -505842 -204010 -76894 -237207 -299718 -325612 -511020 -575961 -507029 -139717 91010
17082 91010 74241 -94865 -418392 -702797 -899362 -908254 -1103473 -1258530 -1035223 -910500
17072 -910500 -566155 -258773 -58952 87970 262375 138443 211940 69733 196220 225834
17062 225834 -378211 -665866 -278915 -183947 -25847 250829 553809 322595 -105641 -71524
17052 -71524 6662 76300 -115150 -151337 -318836 -583832 -494025 -492364 -615088 -939592 -941290
17041 -941290 -509854 -157825 16658 104637 192334 -65944 99686 977149 1332249 1000717
17031 1000717 905841 848241 435911 73187 -131422 -215523 -468834 -498014 -254756 -254245 -518358
17020 -518358 -799564 -513630 -261398 189074 819197 542189 -163991 -358908 44361 271705
17010 271705 344631 464776 -187116 -643502 -603798 -360832 -188332 -199522 24998 197504
17000 197504 282953 670333 728130 79825 -626397 -1051132 -1159888 -932216 -623369 -543005
16990 -543005 -215199 -51022 -408926 -898469 -1223588 -1169433 -729303 -249407 -166404 47784
16980 47784 214336 172355 8579 -1871 260978 569784 732528 771041 986325 1046512
16970 1046512 671309 832503 1183202 1086765 793419 434931 162693 -60458 298178 806701
16960 806701 837121 1053081 942609 380245 365496 362364 506105 667885 715431 858244
16950 858244 902298 715606 381889 258151 507448 298776 -66728 -7432 276376 75419
16940 75419 -22742 -479243 -1324418 -1454784 -1253584 -851154 -593971 -315018 188506 524697
16930 524697 540304 -133174 -782921 -702558 -425367 -344854 -389720 -525797 -1034579 -1030277 -250846
16919 -250846 432077 763879 967257 865008 709318 407680 -39781 -330732 -342459 -112217
16909 -112217 -140000 -399683 -664345 -1078600 -1314483 -1241411 -905249 -706331 -543142 -562586
16899 -562586 -722914 -625171 -451487 -410242 -516356 -602251 -284339 -309 -452321 -944430
16889 -944430 -1387708 -1101345 -309160 -335536 -522789 -295185 -329839 -490606 -186800 303657
16879 303657 408947 383530 -58938 -685847 -861996 -700198 -424599 122085 122744 -363920
16869 -363920 -574535 -314450 314578 761186 1238220 1115770 1165138 1414454 1425644 983464
16859 983464 518559 174261 263035 507972 346287 50490 41246 -96695 -113690 235313
16849 235313 484699 447602 504666 355471 -15113 -41459 406446 444932 209111 -124710
16839 -124710 -287347 -189291 -200718 -273083 22786 644680 909136 1049159 1407014 1684004
16829 1684004 1648464 1619541 1168775 277672 159211 535381 490766 141493 186196 -278084
16819 -278084 -1132798 -1384767 -1345106 -979268 -872322 -603419 -420199 -101936 438008 807085
16809 807085 828655 654891 566282 423638 339171 414258 250497 -313217 -446364 -550476
16799 -550476 -766538 -765155 -560635 70169 491538 331678 22423 103972 410316 788842
16789 788842 456424 21057 -157347 191086 549211 96884 -343851 -228059 -126529 -318531
16779 -318531 -491964 -1082926 -1597091 -1403506 -1210049 -1440563 -1694586 -1586185 -1290206 -1192037
16769 -1192037 -989054 -1160382 -1038344 -412054 28824 326066 482178 312713 -13399
16760 -13399 -128583 -271441 81521 481331 648981 621142 526837 597701 674775 424623
16750 424623 301657 786458 968449 519746 125845 -264006 -485344 -316949 -435778 -619580
16740 -619580 -659514 -487253 -279503 -432066 -766705 -870539 -816231 -665210 -487338 -246805
16730 -246805 -395304 -555552 -455055 -360730 -386598 -186933 120484 65065 129482 -77046
16720 -77046 -74754 257337 612046 766077 821480 910242 1023266 957310 856001 645264 318333
16709 318333 149598 -23150 -214298 -462311 -635347 -383034 61666 536857 1262595 1483503
16699 1483503 896998 194679 51849 -45473 -323885 -561640 -275527 -338021 -302601 -251876
16689 -251876 -247885 -303678 -127380 104606 259513 481020 423755 33593 -96693 10099
16679 10099 58736 388052 431130 209373 -5241 743 -91015 -275402 -304496 -234383 -315926
16668 -315926 -592832 -592326 -291215 -204452 -171881 -136606 -100746 31379 -427655 -728917 -898079
16657 -898079 -642772 -355431 -518333 -521638 -678672 -897352 -872037 -575430 -558477 -760517
16647 -760517 -598630 -518792 -689210 -927642 -1221267 -1356553 -945163 -88337 438910 608148
16637 608148 951062 1044864 776055 573255 404397 117138 -298295 -374751 -286998 -83826
16627 -83826 -115929 -467774 -824633 -557641 -471426 -482629 -504999 -286224 14323 -5890 -318545
16616 -318545 -705698 -980610 -1115919 -980575 -275737 391355 586824 566950 720763 886078
16606 886078 831170 667137 548654 298605 -131478 -350288 -551494 -795442 -874371 -766482
16596 -766482 -538943 -639352 -584450 -182171 273886 441953 403233 622069 1063993 686817
16586 686817 101733 97979 437075 548179 488578 27270 -319342 -428146 -915692 -1105768
16576 -1105768 -1098278 -905552 -859277 -1000733 -875382 -187711 213901 -57471 -222708 27183
16566 27183 351646 223570 171929 427541 582457 103301 -27002 518002 862266 534629
16556 534629 -32023 -229529 -146575 -199161 -138746 17521 -111700 -327327 -487163 -341694
16546 -341694 309670 572457 587961 857172 643147 207447 -216283 -673286 -1200596 -1239553
16536 -1239553 -858955 -188229 165200 321063 307212 -119599 -166183 -199985 -547032 -742474
16526 -742474 -648258 -201427 17800 -10683 -127260 -573593 -777012 -494791 -105508 214077
16516 214077 135423 -36541 172855 148482 -427667 -677478 -431254 8330 75423 41215
16506 41215 110899 -269859 -465389 -553084 -594004 -694791 -845484 -971551 -719508 46653
16496 46653 390084 508823 634822 489707 233114 147401 313804 -97315 -848000 -1284891
16486 -1284891 -1197033 -684860 -405168 -551367 -304419 -96787 -58755 251005 411665 280488
16476 280488 -88715 -543765 -1145843 -1162584 -792154 -336788 -66602 -210787 -144790 354051
16466 354051 136093 -72535 294506 148621 -339032 -335266 -117135 -282049 -246630 -70336
16456 -70336 -71983 -273397 -179027 302124 377009 358986 871535 979411 550669 380812 352821
16445 352821 217211 -166927 -508466 -668092 -810115 -592914 -270567 369794 1174992 1429004
16435 1429004 1466149 1428555 1376213 1000651 625311 457422 236950 260871 399861 837798
16425 837798 1122402 758298 337149 482568 756624 688518 569330 849386 1266135 981050
16415 981050 665598 353285 250115 406016 426592 591858 670786 705158 682298 377948
16405 377948 -197990 -647563 -532900 -515414 -779883 -889854 -840081 -549656 166033 723960
16395 723960 922974 1249550 1429581 1138710 403556 -309758 -259862 -248445 -328689 -2521
16385 -2521 220780 -68243 -246563 -117044 -119103 -285873 -683302 -1134332 -1113866 -686763
16375 -686763 -305176 -232374 -325828 -777145 -1229858 -1444262 -1393106 -1038873 -709809 -613758
16365 -613758 -387444 -224832 -177898 -123977 -434869 -533177 -179866 -156858 -595589 -1255580
16355 -1255580 -1638796 -1548467 -1275087 -862717 -522507 -440435 -489842 -775595 -809374 -416120
16345 -416120 142188 556580 543653 166796 -194288 -422502 -445123 -576331 -383946 62349
16335 62349 -213199 -574638 -744991 -777837 -909774 -815218 -437903 -239227 -119023 137234
16325 137234 275609 430999 732495 1012561 1075815 624777 431894 576969 756482 798106
16315 798106 878726 960139 616155 256441 147213 29899 -96003 -299453 -426634 -534613
16305 -534613 -467551 -464981 -92724 70890 -537067 -930015 -663974 -402725 -418461 -456082
16295 -456082 -497104 -420279 -134122 396270 713771 656735 484949 61485 -97809 -113315
16285 -113315 -423512 -442839 -540196 -562883 -562496 -723019 -610846 -589165 -230023 54194 -130310
16274 -130310 -361608 -739444 -1361663 -1877658 -1377112 -393452 252837 294448 362700 745094
16264 745094 975777 831297 660617 439597 552553 348599 217132 357727 584081 357025
16254 357025 -37420 -322882 -690960 -658510 -215998 -34009 -516566 -995432 -876139 -219719
16244 -219719 118136 205676 230376 108263 150600 283456 245515 -149411 -608638 -458564
16234 -458564 -215452 -222759 -151743 -299703 -343242 70463 38680 -382425 -287344 279385 591096
16223 591096 613274 396749 130671 202813 399625 346665 71407 114156 473228 904842
16213 904842 1001663 838733 909290 972055 598516 277046 261739 385554 294462 114445
16203 114445 237541 295757 288054 -119364 -410863 -307350 -141344 -418428 -968483 -1027273
16193 -1027273 -786464 -638658 -709888 -270379 463844 1143698 1405240 1509641 1023161 491947
16183 491947 871460 834970 371755 56784 -63904 -252518 -844433 -1386728 -1190487 -740628
16173 -740628 -475925 -71481 -72248 -120868 -154654 -263014 -250877 -224961 -715763 -1369995 -1281865
16162 -1281865 -1050103 -836960 -408726 -397235 -660672 -917167 -1088597 -944274 -781238 -686293
16152 -686293 -396286 -267971 -220270 -311183 -808077 -1431323 -1485575 -948904 -196820 215053
16142 215053 30668 -219032 -292250 217285 234419 -467378 -911615 -764424 -467019 1470
16132 1470 -191093 -721078 -1074584 -1328869 -1068334 -534315 406525 1115403 1269022 983731
16122 983731 641348 114440 -606669 -755030 -619999 -207629 354136 759288 887804 541081
16112 541081 -45168 -83442 347238 650055 603672 356132 93277 313974 581036 437333
16102 437333 386267 156293 -363683 -843668 -762732 -343366 -41311 -22531 -60529 -35542
16092 -35542 -221237 -226767 129131 26695 1969 59780 -234649 -207004 145878 303412 364930
16081 364930 487739 547453 541074 229559 -53226 -85533 -39453 -139328 -300190 -222087 -35043
16070 -35043 246209 239454 157544 398578 752301 776799 130401 -427080 -293126 267122
16060 267122 554264 618625 447593 155556 261762 -83460 -348123 -246640 -362617 -379909
16050 -379909 -47705 -136347 -514719 -729521 -507705 -124305 -53626 30395 202218 410991
16040 410991 99232 -181943 -16417 75632 287085 698232 449856 92160 168567 548510
16030 548510 1153072 1115050 900618 763045 276624 -223808 -634756 -519553 11332 228071
16020 228071 195925 -199587 -409767 -291008 -104249 -105025 -315916 -687510 -1068041 -1635343
16010 -1635343 -1950289 -2379374 -2392993 -1694966 -776368 -109684 -99040 -237570 -338830 -448407
16000 -448407 -111375 286281 184955 167784 471796 727979 861839 1166724 1308938 1076501
15990 1076501 641616 627530 709310 732034 874137 722495 220568 -479512 -858567 -529784
15980 -529784 -73930 80919 -57872 -104605 -110191 -70459 19195 175619 330110 207597
15970 207597 -225458 -477983 -405549 -188484 7763 101789 -288748 -347943 -223195 -145445
15960 -145445 -81814 -138132 -256251 -703015 -1382919 -1428607 -1286823 -910845 -445294 -363142
15950 -363142 -454335 -225956 96837 -13074 -357751 -482696 -170256 44654 -311192 -627132
15940 -627132 -968682 -1406474 -1702612 -1760342 -1168994 -533323 -403263 -561714 -666813 -398900
15930 -398900 4168 23739 83769 385662 461239 -97785 -438214 -373236 -204704 212885
15920 212885 285378 16693 -163944 -500020 -1066241 -1218378 -923911 -201935 471842 466967
15910 466967 546366 744624 736254 784288 418984 -138680 -317364 -670412 -716750 -663874 -564814
15899 -564814 -601044 -700940 -499039 -75073 254681 208890 92913 -49567 -369768 -556412
15889 -556412 -618404 -899769 -974440 -674523 -574189 -455828 -63035 386047 893719 822503
15879 822503 636865 459181 369138 114602 -534132 -907709 -1105924 -1147534 -1024174 -1053194
15869 -1053194 -997917 -534449 -112810 210529 143075 -160331 -544661 -870815 -675266 -228633
15859 -228633 -282242 -135261 151177 -14773 -340635 -150711 160514 590613 947958 996833
15849 996833 1244030 1177388 1099378 1147808 742452 322244 -154625 -355931 -51487 242191
15839 242191 846409 1141532 624450 262531 671871 981751 1054609 793680 582394 304371
15829 304371 -79375 -327979 -632223 -1193566 -1433473 -1328332 -1386369 -1789613 -1766046 -1405453
15819 -1405453 -1050776 -541685 -79045 -136841 -628644 -370644 382517 604705 603757 891361
15809 891361 744824 90279 -430208 -359435 -313984 -915769 -988854 -558955 6999 632679
15799 632679 698854 423849 381230 92515 -259420 -247893 111175 269731 -294656 -926038
15789 -926038 -885112 -1053165 -1343844 -1025242 -772751 -707783 -449544 -217851 -144144 -472281
15779 -472281 -776068 -852526 -854316 -717704 -608778 -445137 -864184 -1171764 -873726 -342972
15769 -342972 -123042 -279636 -544790 -667803 -541519 -149779 -4866 -230631 -602046 -682691
15759 -682691 -518523 -361982 188890 488648 323680 309489 505737 599433 269158 -252062
15749 -252062 -569840 -566052 -387527 -187957 -189768 -369972 -381831 -479452 -789050 -731447 -581695
15738 -581695 -189284 193105 415683 193762 -67146 126096 160782 -58256 48150 53500
15728 53500 -228024 -425821 -23082 386929 332652 256160 -210851 -380279 -225167 -414073
15718 -414073 -692007 -885675 -737221 -241265 -223609 -794072 -1186559 -996923 -805721 -1036733
15708 -1036733 -1285994 -1118403 -848326 -893136 -1049717 -1332525 -1400897 -954729 -561006 -720996
15698 -720996 -1160178 -1522013 -1726736 -1716972 -2024761 -1800261 -1267743 -665444 -210970 -182278
15688 -182278 -309823 -38670 348819 500444 232513 -178192 -192518 -276877 -526051 -595327
15678 -595327 -916224 -898756 -714967 -788510 -800511 -718656 -685799 -947312 -937179 -585613 -380773
15667 -380773 -309849 -223802 -20197 -213800 -482941 -378834 62248 143699 -156441 -342971
15657 -342971 78147 -62989 -488200 -413066 115617 651884 821678 730913 178300 45964
15647 45964 99067 62953 177898 329750 202389 -32987 -338449 -539268 -806844 -543867
15637 -543867 91607 697852 1014408 973109 733542 260466 -179507 -186718 -125458 217442
15627 217442 653286 605912 217606 363498 458908 699917 507168 17428 56032 651518
15617 651518 608835 215551 21302 -27117 -314607 -653184 -843114 -625046 -361493 -99346
15607 -99346 19624 -272417 -510489 -585422 -860353 -804874 -314231 -121270 -269710 -277151
15597 -277151 -304346 -496318 -702238 -919997 -998508 -993586 -766872 -370817 -21549 -123493
15587 -123493 -294137 -140680 -61105 -20631 -158529 -998787 -1783594 -1679723 -1278618 -996194
15577 -996194 -661085 -745459 -937824 -920355 -1010176 -823906 -662823 -279141 185561 92603
15567 92603 -310086 -472165 -269229 -551433 -1194235 -1232204 -1044112 -827097 -529826 -612760
15557 -612760 -766978 -906648 -1237199 -1617534 -1347446 -963698 -601728 -355842 -334665 -222150
15547 -222150 -310675 -391052 -588161 -684485 -285451 -299577 -242280 162339 132730 -69041 -262852
15536 -262852 -708806 -931369 -886261 -616586 -384125 -61529 163042 -101764 -497431 -854502
15526 -854502 -1234573 -814402 -58189 320967 300847 146239 -192245 -307316 -332399 -246269
15516 -246269 -226124 -403199 -546346 -331756 -21034 552824 766621 633502 265968 -346506
15506 -346506 -518501 -548725 -870698 -1055377 -701234 -242314 165117 545065 794683 797572
15496 797572 734069 698848 765997 609196 69944 5874 442940 895114 991818 800563
15486 800563 469285 327380 506005 546954 756729 567757 13574 70159 392711 514686
15476 514686 580191 220601 -123324 -83306 59899 90385 -102659 -233072 -348183 -408132
15466 -408132 -483567 -438144 -403974 -110999 163405 237863 12719 -381187 -791623 -850801
15456 -850801 -467835 -409207 -710951 -564423 -28054 412013 782754 886666 643683 513427
15446 513427 615400 442398 615555 971037 1070295 1038815 684343 410090 382959 151085
15436 151085 -348126 -349648 -73325 -74962 -52973 -16371 32549 5430 213493 484607 527604
15425 527604 453606 141298 -132856 -520864 -846626 -877705 -737435 -140414 344783 440132
15415 440132 315550 96572 127162 258586 275733 585143 761256 425803 42954 -66756
15405 -66756 -634279 -972315 -435099 119739 661147 1292603 1321810 1222385 998728 620791
15395 620791 366570 92234 -276403 -354762 -597362 -457780 -206391 -177277 -270776 -522176
15385 -522176 -217716 139437 227867 403284 256826 -109595 -82281 205768 307639 497747
15375 497747 731291 769714 730806 354323 -59289 -48149 110789 130274 -53535 116538
15365 116538 400871 188046 -433373 -681252 -86112 330887 498970 1038872 1284869 926628
15355 926628 519833 303943 -237110 -485875 -146574 -14431 442353 822392 914897 843001
15345 843001 591917 401387 275406 306300 458429 478614 612797 612015 90146 -465418
15335 -465418 -551133 -458964 -259826 -306698 -480925 -497440 -421336 -354935 -599700 -834707 -764437
15324 -764437 -392132 -519467 -906247 -608799 103643 511716 620041 555604 373897 144506
15314 144506 -257035 -442377 -672841 -702152 -458733 -575806 -1048133 -1052921 -730125 -519437
15304 -519437 -207642 -226036 -563898 -322246 152172 375637 592673 553476 742571 1180144
15294 1180144 1294978 1282650 1341435 1593725 1223249 437447 64067 -333664 -989295 -1248524
15284 -1248524 -1038028 -572608 -61400 -145499 -624255 -660676 -459818 -160973 176339 418871
15274 418871 543874 282293 47572 -68266 -33995 126222 3036 -312007 -573078 -789980
15264 -789980 -827304 -456404 -299336 -135594 299278 554773 332461 196714 -161711 -452580
15254 -452580 -273063 -48004 98590 123200 -133677 -748571 -796983 -728592 -905788 -1157078
15244 -1157078 -1443990 -1267758 -518127 -217231 -204006 547 -152356 -535373 -462290 -152217
15234 -152217 51552 199776 411698 416565 226820 125093 -305937 -366820 -6610 390144
15224 390144 604612 428663 308050 84965 -296022 -499557 -239866 112002 152751 367227
15214 367227 455448 158685 -65369 -322449 -404468 -307078 -309412 -55919 254160 380903
15204 380903 725619 909480 562640 401172 493234 596822 605209 578918 726797 354106
15194 354106 161300 271625 589165 1030076 726152 510651 700580 863283 624494 268411
15184 268411 125907 111232 -151850 -692012 -843624 -695264 -476393 -554634 -492794 -269915
15174 -269915 -40656 159294 304875 487596 598107 621772 255449 -282667 -683391 -833428
15164 -833428 -804896 -639004 -24266 520598 845678 1202395 1319812 817951 302438 -17059
15154 -17059 -328357 -223109 -117474 -542010 -1126427 -1321617 -1460901 -1433784 -1016839 -507460
15144 -507460 -370133 -642294 -821361 -838580 -1132900 -1253594 -1170745 -1120422 -963169 -500885
15134 -500885 -374823 -621769 -688230 -921210 -917486 -896304 -518554 225972 447849 365576
15124 365576 107341 251431 555817 618451 283585 207114 314343 91744 -70517 -229467
15114 -229467 -311676 -307532 -419738 -479720 -1059868 -1368862 -1020798 -430773 -24635 172971
15104 172971 372503 283365 183203 191899 350497 180748 -84655 -7418 182525 221042
15094 221042 91795 -57451 -104341 -254640 -595008 -856777 -504738 -54559 363660 669295
15084 669295 888329 950649 910812 689361 357687 -58237 -776466 -919116 -356242 83026
15074 83026 86208 -100041 -127632 -331402 -111550 -28910 -583431 -1046703 -1261218 -1112540
15064 -1112540 -992864 -999562 -954349 -517636 -46503 269402 270144 -167413 -256812 168198 329378
15053 329378 282317 191265 276514 271113 427029 350291 154173 123996 -156225 44371 503329
15042 503329 713830 369852 -283985 -961091 -1307326 -1242415 -453349 250747 243917 342227
15032 342227 62647 -532947 -961980 -968397 -939166 -727343 -207021 131082 292606 643377
15022 643377 541740 -127005 -277143 -59396 -359884 -1015235 -1261512 -1002060 -765341 -581176
15012 -581176 -236905 -139345 -139027 -146752 -75942 -189857 -358297 -366660 -317698 -338509 -340652 -41954
15000 -41954 317943 4485 -370464 -375719 -383138 -312725 -140345 213698 -53918 -672870 -604896
14989 -604896 -306581 -192753 -237461 -285097 -432162 -385086 -363752 -150247 117711 197146
14979 197146 -66637 -216635 -178360 -263602 -110887 219879 519463 340564 -209591 -543016
14969 -543016 -710621 -823312 -1098812 -1219581 -930700 -593154 -450823 -224623 -35493 188633
14959 188633 231393 611719 796992 457707 378308 466130 118409 -324549 -341877 -155638
14949 -155638 -249891 -595103 -1034653 -1073616 -792374 -243825 280609 326342 136614 3948
14939 3948 -141345 -292741 -588415 -859396 -879155 -707240 -436771 -384745 -404514 -483794 -213371
14928 -213371 168183 421329 596387 788028 824005 816336 672550 469783 578578 736219
14918 736219 587642 481509 691029 644161 501360 595286 975508 1066770 815709 402940
14908 402940 385505 351083 61716 -29801 39010 35328 -162514 -280476 -267696 -388149 -373017
14897 -373017 -354345 -732509 -445644 -76022 78517 -34881 -41172 154843 223157 -72939
14887 -72939 -668781 -759794 -447314 -15627 -163255 -326196 -141438 -305782 -57879 292805
14877 292805 564415 535173 387572 409655 622529 806376 534733 -50490 -130376 390708
14867 390708 953346 807702 563099 679744 714054 -48919 -661684 -553001 -284452 -326221
14857 -326221 -524734 -948743 -973871 -308090 -17398 -432926 -845564 -851450 -791740 -1148471
14847 -1148471 -1646189 -1667246 -1526510 -1267103 -812733 -649480 -670534 -695017 -552586 -612878
14837 -612878 -1134035 -1276390 -1027826 -770235 -278191 110135 81265 166709 279801 668055
14827 668055 865932 411444 143156 2433 -361431 -783277 -993307 -850530 -699338 -473296
14817 -473296 -33970 522600 690825 638181 608386 663225 654344 737872 625086 176457 49749
14806 49749 152581 164718 -35893 35041 133072 69662 -4953 -266860 -250794 -21164 468007
14795 468007 511194 326197 101628 46290 154603 255493 280796 201359 202030 -9728 208415
14784 208415 436796 418035 421188 635886 537958 579873 529842 564494 435520 269119 15213
14773 15213 100429 264541 425613 423645 297299 -52440 -203115 97167 746489 1295018
14763 1295018 965920 328969 333518 281823 -251339 -463832 -556889 -806378 -1116971 -1096488
14753 -1096488 -578499 -500719 -853479 -1090867 -1058485 -814321 -675153 -1027273 -1412975 -1310304
14743 -1310304 -551942 -228163 -196119 191608 220494 29630 -29110 -3732 38170 -4024
14733 -4024 -426195 -819382 -725915 -623760 -634825 -556502 -508066 -219538 -224034 -112072 491549
14722 491549 814635 702151 353162 -528404 -828057 -835292 -594195 -327581 -156848 67393
14712 67393 356363 582664 450294 524204 303229 -15875 -374310 61563 742861 661999
14702 661999 760147 946555 1185348 859807 247877 -99319 -5024 276336 78135 -178280
14692 -178280 167529 320135 153310 -232616 -396320 -306783 -386498 -376230 -443004 -145885
14682 -145885 614469 1301677 1643105 1484816 1058108 639156 455535 21713 -329739 -118177
14672 -118177 315394 342822 621594 1131855 1317572 1323932 1229207 940671 545280 248980
14662 248980 140601 507118 495384 -124625 -564644 -931304 -1038641 -735205 -363347 -205091
14652 -205091 -154059 -18858 66119 1838 112254 156768 120231 608 -4845 254404 447736
14641 447736 880467 1072330 834358 232383 -514823 -750933 -803359 -1093119 -1309357 -1012075
14631 -1012075 -829097 -726640 -680782 -410999 -99211 -2281 95238 -138643 -337866 -273806
14621 -273806 -139581 -272996 -392130 -181061 -192819 -292510 -254293 -210366 -489215 -674318
14611 -674318 -603350 -454231 -674200 -685030 -324775 22087 -51858 -499919 -366194 -52987
14601 -52987 -255604 -713698 -525928 -127547 97417 270435 -56082 -512707 -876387 -879406
14591 -879406 -305801 246751 69998 -161192 -165861 -215274 -424043 -1021612 -1347112 -1331953
14581 -1331953 -1266984 -965620 -899374 -928050 -693978 -573014 -207146 -147573 -193128 110350
14571 110350 444985 340818 -231020 -508130 -533677 -579676 -443257 -21773 -106957 -488304
14561 -488304 -592478 -441679 8672 364968 391380 564423 663025 826664 711776 320007
14551 320007 112665 -149542 -424428 -361263 -205408 -35462 134390 371524 464435 427435
14541 427435 515004 1005866 1028873 655919 570552 449455 112933 -328546 -612340 -655535
14531 -655535 -514860 -808764 -619600 230578 467687 -76817 -331745 -184640 -329394 -725831
14521 -725831 -1000807 -1275246 -1494754 -1482728 -1216089 -1157883 -1174507 -730390 -376343 -345094
14511 -345094 -514625 -766467 -1143156 -1539635 -1601143 -1016034 -596231 -485257 9090 487564
14501 487564 565101 708640 922416 1099147 1051692 823471 529929 319589 188589 184757
14491 184757 200220 68371 313008 795685 1150276 931114 317119 -52817 -124164 -138284
14481 -138284 -108133 -241723 -311585 68335 614188 766887 537522 220469 60115 -429937
14471 -429937 -771735 -872458 -971341 -761180 -26910 212792 1636 167065 148868 86716
14461 86716 -386122 -1052578 -1045867 -834621 -695196 -778950 -696112 -310269 32990 336075
14451 336075 255644 111636 264518 559472 728386 214833 -523007 -1046335 -1444012 -1695646
14441 -1695646 -1451068 -1087360 -658578 -280950 -214360 -113848 151247 290699 190282 -331915
14431 -331915 -661642 -337900 3745 53226 -399403 -730666 -369500 -163378 -432213 -1094528
14421 -1094528 -1341798 -1503777 -1367076 -722252 280940 867905 697749 798379 561091
14412 561091 -143085 -351682 -431794 -478034 -1037322 -1461554 -1368237 -1155979 -1051100 -521461
14402 -521461 36471 7428 -37143 68272 -166324 -548284 -858133 -397768 283262 522361
14392 522361 890245 1004899 879569 850957 726278 101164 -162180 869 408608 613911
14382 613911 767414 838688 470169 234217 284630 610373 781544 706302 706724 1095092 1443209
14371 1443209 1126944 622431 26901 -193527 -365173 -828748 -785031 -275255 -14132 -42943
14361 -42943 -278652 -178905 312909 401958 24964 41254 468828 1149572 1556050 1493025
14351 1493025 1195944 867869 553053 326012 156222 -40770 -654590 -1439261 -1775782
14342 -1775782 -1286794 -734801 -416921 -170244 30388 212759 -369033 -1074245 -1135078 -904006
14332 -904006 -765048 -500267 94551 673938 461307 -16478 -206863 -286894 -331194 -193330
14322 -193330 -149779 11107 361957 886986 850455 354095 -30718 -368965 -410808 -773094
14312 -773094 -1403155 -1506634 -1339945 -966676 -560753 -313291 -27807 386653 758418 999681
14302 999681 679615 309015 109710 -399893 -936662 -807204 -373981 -443595 -338444 -246365
14292 -246365 -109502 -38245 -119939 94885 481573 588483 216897 -116855 -241713 -461974
14282 -461974 -403116 -438796 -701901 -814352 -595238 -369808 -533604 -929333 -905890 -921541
14272 -921541 -990536 -779358 -291168 575840 827737 401724 -14441 -64571 206669 103551
14262 103551 17427 -11258 -438603 -564280 -62559 122211 233919 267323 82108 15089
14252 15089 79789 189903 270196 45772 -351579 -520314 -442542 -655868 -648304 -502432 -33585
14241 -33585 345630 293558 110909 -362277 -838704 -1060608 -927525 -711866 -223684 -34241
14231 -34241 -174108 -25273 327860 137461 35103 266986 709569 1058901 997232 412301
14221 412301 -128000 -297106 -206348 -72023 28078 -46333 -639099 -1244115 -1463258 -1296423
14211 -1296423 -680001 -179182 -211865 -318812 -293721 -178751 -216252 -34856 284820 515996
14201 515996 725635 448998 -171211 -155058 399954 396660 152628 170927 487599 613377
14191 613377 553131 440652 217845 -183350 -244849 -22494 109957 61148 326182 639798
14181 639798 723249 690338 661471 632061 863747 1019504 747707 517512 401441 103444
14171 103444 155821 204254 -54839 -146424 -187233 28 135175 66093 241213 430385
14161 430385 319452 56699 -297985 -435892 -322344 -474513 -849522 -1149160 -1200125 -1244873
14151 -1244873 -1467920 -1400651 -1002864 -740537 -682086 -815736 -910512 -419357 -9401 -143332
14141 -143332 -41884 44579 -347155 -541143 -878759 -1258742 -1119680 -581310 -939952 -866274
14131 -866274 -410454 -455546 -533232 -475003 -158948 417559 513950 457983 30279 -832714
14121 -832714 -1217683 -1133255 -847205 -543328 -221102 -109443 -406069 -592020 -540170 -262592
14111 -262592 7535 169982 -55138 -136221 177771 680429 770635 492526 130630 -402231
14101 -402231 -661013 -351504 311146 1048977 1285137 976791 255105 -268612 -422033 -648548
14091 -648548 -745310 -430842 -307061 -268961 -142730 -314341 -329847 -171055 -537337 -650155
14081 -650155 -623968 -671327 -301523 -138071 -466591 -568577 -593616 -1122201 -1378334 -1134225
14071 -1134225 -618172 -381015 -33458 12536 89050 -44673 -458688 -391584 -436296 -324806
14061 -324806 -248529 -170193 362769 586667 673597 668607 836403 1078958 972152 615669
14051 615669 -50040 -601436 -553706 -505094 -404830 -464181 -328504 -241486 -374774 -554010
14041 -554010 -608141 -575074 -803589 -923557 -683751 -650660 -506476 -385337 -896095 -1014549
14031 -1014549 -750246 -310919 41748 298205 440193 345127 122898 -318434 -694352 -762552
14021 -762552 -860083 -814883 -523081 -632793 -1017925 -1022515 -962768 -842523 -282596 -29704
14011 -29704 -128557 -327715 -636804 -516636 -582529 -856807 -1036763 -1028668 -926039 -701858
14001 -701858 -376687 -373444 -995955 -1290861 -953977 -487008 -389594 -637284 -765893 -538205
13991 -538205 -57186 31453 -150478 -87768 522092 856118 803691 678664 492284 285861
13981 285861 -250461 -485415 -471049 -446140 -519930 -366862 -140879 178027 531399 705521
13971 705521 972049 802152 259080 -304015 -486389 -514932 -980782 -1164398 -803736 -570751
13961 -570751 -409005 39460 238167 26492 112067 640812 1029079 575213 -327503 -744657
13951 -744657 -447401 -76890 -40004 -538559 -898335 -1006845 -831088 -672922 -631148 -271114
13941 -271114 -46645 -542991 -612494 -163070 330686 464820 380176 237474 -136943 -375898
13931 -375898 -336950 -206869 -226087 -369022 -266114 -214847 -431651 -544068 -390043 -250557
13921 -250557 -323558 -804939 -1058527 -762877 -830985 -531190 -421601 -327324 -164233 -464047
13911 -464047 -588633 -802935 -745790 -487455 -576914 -293785 338674 346227 431882 661809
13901 661809 624950 226408 -436211 -583097 -546571 -367472 -72602 -151637 -172030 28746
13891 28746 -92113 -374425 -275174 -325301 -502626 -671553 -966535 -999974 -707384 -20252
13881 -20252 678924 765158 464284 224261 55272 69552 123449 -75492 -134364 -36372 173080
13870 173080 66146 -262070 -369987 -479587 -367925 -95914 461967 484965 -140509 -147814
13860 -147814 199529 188310 185235 205658 -170849 -566780 -576751 -715115 -870192 -979271 -1031186
13849 -1031186 -1361757 -1440704 -1316567 -1049656 -590101 -253572 -123702 -331119 -253339 -249043
13839 -249043 -543791 -780854 -587810 -176436 -54743 24904 238636 126301 -217956 -626442
13829 -626442 -536218 -430433 -566249 -677726 -489701 -463050 -367951 16241 102432 -33824
13819 -33824 -251443 -196524 94330 102868 24982 -178857 26126 152088 193123 151839 -105460
13808 -105460 -368377 -431285 -698244 -969949 -1058340 -1031873 -566664 -95516 165613 86354
13798 86354 -194867 -165534 -201575 -201399 49476 256229 234339 -23351 -151660 -435212 -536752
13787 -536752 -355598 -380831 -221621 51776 16598 -275139 -423535 -521186 -352675 39880
13777 39880 -227382 -632730 -848133 -505388 -11038 -89118 -521804 -551705 -51913 166997
13767 166997 36595 -186035 -325844 -592215 -907954 -813914 -240848 412101 792866 761594
13757 761594 389201 272057 601497 1020637 893124 390735 557236 674758 637195 390539
13747 390539 415111 318776 383461 533714 364632 538769 402035 70946 -152107 -540224
13737 -540224 -1338688 -1399482 -535435 -109042 241899 121663 -285098 -375871 -352326 -223385
13727 -223385 -289242 -772293 -1218545 -1104983 -899470 -964583 -1248111 -1061412 -832611 -1066234
13717 -1066234 -1076317 -753262 -262673 142777 104337 -132885 -152904 -151165 -701064 -1149712
13707 -1149712 -1179275 -953355 -886760 -818448 -568005 -800197 -992947 -695010 -392152 -540124
13697 -540124 -771438 -491228 137712 494732 215673 -126670 -330004 -128814 14681 -78856
13687 -78856 -517397 -1015660 -1286228 -1046168 -597250 -486433 -639457 -651858 -364952 114894
13677 114894 -183188 -835590 -856700 -757103 -1195654 -1661325 -1557623 -1049836 -736865 -631827
13667 -631827 -765999 -660106 -203184 414413 631418 391394 119325 422493 842300 702983
13657 702983 -44638 -380480 -240781 -119675 -54336 92795 -61697 -222032 -131524 240179
13647 240179 456529 637134 515584 117846 60539 382936 482726 385864 556282 727699
13637 727699 628650 749763 1129760 1211932 838791 259869 204227 444064 471150 439262
13627 439262 121335 -306839 -566811 -866727 -705023 -576898 -622643 -869463 -649592 -163846
13617 -163846 202352 332840 321753 260727 551246 541761 73826 -274434 -298469 -169675
13607 -169675 16408 346229 246000 103656 9732 655873 986067 542078 369522 682823
13597 682823 582785 318626 213506 210673 41720 -218096 185274 746680 422897 -472316
13587 -472316 -1107040 -1115224 -816163 -94605 548597 344099 -222324 -429834 -594179 -1178876
13577 -1178876 -1491132 -1679130 -1930830 -1572246 -872666 -57337 115301 -104085 -159440 -75152
13567 -75152 -74224 153999 958241 1091519 124278 -764234 -1017374 -1054516 -1135398 -1087873 -895351
13556 -895351 -898162 -913177 -481088 16869 -110088 -234570 -388072 -314895 -174126 -175192 197597
13545 197597 999199 1205165 1095993 587157 -22990 -225417 -295266 -102164 506319 1161118
13535 1161118 1039527 20633 -672180 -537514 -242303 -54235 -231274 -470209 -239639
13526 -239639 17776 232187 411601 320479 90881 -27206 384592 885455 767462 467665
13516 467665 128707 455993 831535 700528 484805 108768 -16069 190910 128131 339411
13506 339411 462356 672348 1027348 1198477 931240 615410 232054 -87337 146203 692723
13496 692723 808183 505768 321343 500459 731788 590510 481079 601043 462441 263381
13486 263381 218284 610184 920952 1039098 931310 328225 -293046 -633190 -458511 39408
13476 39408 -23116 -54995 -239668 -815568 -862637 -404514 -396547 -364153 -324395 -448361 -465996
13465 -465996 -487920 -539197 -674782 -660010 -511672 -165047 -196928 31871 471595 639113
13455 639113 419933 109077 -360505 -753588 -922095 -1010926 -1067081 -944957 -747054 -506859
13445 -506859 -440095 -49777 111879 -106457 -298605 -486304 -561759 -657794 -977272 -1224693
13435 -1224693 -1269451 -1058454 -1308346 -1608950 -1418372 -1012722 -356059 4430 -15470 -538057
13425 -538057 -870330 -578610 -117697 111502 -73192 -324357 -250863 -195474 -651740 -825104
13415 -825104 -544678 -343183 -275775 -455421 -412728 -281312 -551555 -789471 -516361 -573901
13405 -573901 -773373 -670179 -708382 -974389 -1358385 -1524406 -1262114 -976132 -744494 -412002
13395 -412002 13930 322177 445529 -133746 -820362 -962232 -516237 -389381 -374744 -12370
13385 -12370 -137463 -91893 4283 41625 290329 614609 705466 534169 316623 357860 523302
13374 523302 677027 795621 1197810 1675493 1664527 1029477 100517 -380006 -79378 635526
13364 635526 896278 1163523 780207 498081 567335 771196 551974 456549 931913 1033277
13354 1033277 722176 735014 730399 395456 -66976 -546676 -316082 512320 983622 958616
13344 958616 877976 953615 1175183 633598 447768 498897 573845 601883 528767 374999 -95291
13333 -95291 -203891 171438 252021 -4779 -293473 -495587 -324873 202702 627230 686651
13323 686651 601789 641069 548741 129004 -180357 -66610 441940 1057983 1136540 539553
13313 539553 323836 821698 1033747 1216103 1388030 935424 445253 467306 519208 165273
13303 165273 165922 184490 419907 762391 875112 835968 769479 851823 955514 1068542 1198544
13292 1198544 765658 535851 834523 1300373 1180077 1253799 1236077 987300 994861 1088826
13282 1088826 1216479 1113517 744073 -28712 -491436 -64477 884115 1213730 1255723 1375655
13272 1375655 1181683 1065403 885863 627714 808917 602976 206555 -302713 -646654
13263 -646654 -754818 -727639 -461380 -295355 -520710 -370716 -117671 252731 381047 33604
13253 33604 -75969 90222 361822 501845 196008 -171515 -393837 -491631 -315682 -40126
13243 -40126 276559 321157 -21283 -551327 -290272 597609 1178283 1175307 677258 547668
13233 547668 562886 107773 -477222 -532472 -252145 -17489 -167107 -301564 192767 671091
13223 671091 733344 854166 1067279 1041043 1089882 1292342 1267755 1226258 1326745 1551879
13213 1551879 1131810 622866 349375 127081 442087 564474 347479 249381 367123 566686
13203 566686 515897 636515 833355 1162877 1169609 1213734 1310573 1408378 1477736 1312815 1315985
13192 1315985 1349779 1471562 1463093 864007 -97111 -602307 -15767 741161 1282043 1693661
13182 1693661 1674215 1458279 1255475 1156306 1035348 821653 980347 1101997 1090760 1127913
13172 1127913 1243006 1135599 991757 868454 753494 930709 1062435 773982 793877 1223901
13162 1223901 1108060 985064 1285006 1533133 1546942 1306681 934058 766073 754873 774256
13152 774256 1109537 1362402 1282396 1077616 841509 1187258 1527052 1420692 1381479 1101257
13142 1101257 929215 1040686 1344158 1712594 1828603 1837362 1407777 1071386 1124055 1333015
13132 1333015 841663 584673 793969 1030951 1404577 1837118 2674536 3063814 2412682
13123 2412682 1916590 1929309 1681043 1293757 874862 948930 1192859 1523631 1414338 1117212
13113 1117212 1005014 1056878 1186834 1163995 1184085 1264524 1365516 1287205 1093027 1315048
13103 1315048 1777369 1841104 1475126 965089 830217 1278878 1745242 2030560 2324489 2202615
13093 2202615 2051239 2215609 2568110 3022906 3087764 2859731 2135972 1997574 2288215 2289418
13083 2289418 2654996 3079647 3227888 2834577 2494107 2281212 1795289 1285209 1188565 1698700
13073 1698700 2186330 2089278 1967925 2114920 2427047 2499912 2578954 2738878 3027739 3208446
13063 3208446 3376772 3163488 2945719 3019660 2938610 2764226 2796653 2626701 2688365 3069794
13053 3069794 3322633 3509250 3448185 3451984 3605387 3520122 3280489 3344532 3697650 3615834
13043 3615834 3348029 3199034 3132312 2852567 2747590 3251630 3766428 4040591 4016351 3926115
13033 3926115 3625958 3410945 3561005 3869145 3907303 4114506 4317353 4575039 4556521 4441980
13023 4441980 4470343 4831074 5256183 5574160 5577387 5317672 5469245 5814858 6159495 6252285
13013 6252285 6744431 7501732 8193774 8227974 8003590 8035416 8196733 8522956 9056324 9728005
13003 9728005 10296252 10810299 11343464 12155722 12909211 13462428 14103095 14948230 15628357
12994 15628357 16959664 18867659 20427491 22331772 24886702 27770093 31229145 35406158
12986 35406158 40203430 46371702 53993495 62804641 73408093 87101105 104713802 127098115
12978 127098115 155715368 193227145 242654390 306598073 382044951 451254559 481031394
12971 481031394 451892283 382949461 307772156 244007438 194594786 157773730 130099537
12964 130099537 108681262 92026846 79223129 68951551 60444589 53337928 47397797
12957 47397797 42398870 37816523 33952110 30619985 28052474 26043771 24061728 22208478
12949 22208478 20835489 19466871 18277203 16862014 15736994 15013623 14470955 13714904
12941 13714904 13406966 13320681 13171715 13267171 13208497 12860649 12644677 12389185 11925877 11543637
12931 11543637 11421122 11633776 12008078 12044901 11844655 11626282 11306287 11445737 12245893
12922 12245893 13083345 13605665 13949031 14893007 16339766 17923930 20255588 23149432 25640482
12913 25640482 26900795 26732546 25641314 24236499 23140354 22653876 22524670 23285964 24761097
12904 24761097 26469972 28553535 31260552 34331162 38004658 42783988 49148624 56655945
12896 56655945 66014229 77767632 91950326 109915133 133460355 164422537 205402324
12889 205402324 259851647 329171402 408133647 473233639 487196090 440595854 363590897
12882 363590897 288291703 227670124 182138373 148031245 122291470 102461391 86942554
12875 86942554 74873488 65440625 57312731 50201496 44806346 40515604 36582756 33109789
12867 33109789 29765165 26741341 23952826 22112748 20868805 19762831 18947680 18171612
12859 18171612 17348662 16334267 15684519 15091898 14347560 14016556 13633489 12998738 12338016
12850 12338016 11776087 11381420 10746843 10462175 10590387 10570186 10372043 10276658 10209000 10103077
12840 10103077 10440025 10852741 10901314 10478164 10263631 10416911 10569861 10542916 10587821 10870027
12830 10870027 11410805 12049639 12480669 13176779 14328930 15271483 15924517 16947625 17986398
12821 17986398 18589053 19514900 20993822 22713276 24796462 27123507 30069247 33960697
12813 33960697 38485703 43765054 50543932 59388892 70352553 83302225 98427874 117860013
12805 117860013 143534836 176678428 220171613 277620914 349310625 424534416 475045931
12798 475045931 469802397 412677825 336903888 267850107 212830710 170923087 139233822
12791 139233822 115422602 96935284 82201413 70763126 61504902 53399393 46649545
12784 46649545 41177620 36491065 32760345 29500529 26626501 24166213 21899634 19862373
12776 19862373 18156068 16547176 14870660 13607102 12869652 12136766 11640137 11296345 10810494
12767 10810494 10139568 9884069 9457038 8320364 6871248 5931111 5280617 5130392 5387100
12758 5387100 5799051 5982651 5764990 5427436 4732222 3867995 3287235 3148576 2854343
12749 2854343 2596527 2771542 2854189 2593066 2348565 2188820 1948866 2055734 2477421 2637430
12739 2637430 2572621 2574545 2753241 2812034 3082824 3366443 3665888 3544327 2932608 2270836
12729 2270836 1752028 1887469 2192065 2209184 2033710 1993764 2063748 1787896 1188799 1162218
12719 1162218 1156580 1079025 1084288 1444287 1899224 2488607 2593489 2522631 2001782 1446784
12709 1446784 1515565 1764702 2228353 2568726 2426576 2280649 2219838 1925778 1820661 1753469
12699 1753469 1355489 988794 766252 525727 548919 771338 594573 491879 564313 784040
12689 784040 1136812 1115111 740459 727086 928370 895676 840027 960681 1099525 1095115 1023695
12678 1023695 882046 791533 750957 871018 782068 751222 1201326 1595278 2001964 2144219
12668 2144219 1849523 1523350 1242025 1200011 1083714 892293 904879 1047603 752166 -23788
12658 -23788 -306932 263295 681684 814347 963917 909131 661150 989005 1056705 634948
12648 634948 695821 668510 244989 208573 306730 448772 709362 627830 343430 52120
12638 52120 -290329 -542643 -124372 728610 1146887 1008260 841272 947843 746629 414944
12628 414944 54980 -278833 -469640 -482198 -225608 72718 419087 471054 384477 14178
12618 14178 -368307 -353219 243812 794988 757030 637605 570966 582938 676444 821798 478255
12607 478255 147392 4429 -213138 -347079 -426701 -228769 349973 721083 527550 531287
12597 531287 556469 371749 426676 654356 986388 1241136 1366985 925956 658891 690891
12587 690891 787806 841824 1247539 1677287 1874251 1666140 1384520 871482 45399 -314914
12577 -314914 -105585 -293111 -297948 544613 1049640 771503 220281 212 104928 61967
12567 61967 287796 288335 -63559 -25949 -32523 -340314 -698486 -659166 -411903 -582636 -719878
12556 -719878 -802785 -660133 -343790 -275631 -384225 -261832 -106338 -200375 -394468 -474940
12546 -474940 -407516 -524118 -771964 -862240 -869635 -624002 -471282 -292340 -326730 -280430 12922
12535 12922 88739 -343726 -940416 -898755 -348690 79131 325544 408847 244450 -105001
12525 -105001 -315021 896 243015 540419 704211 843736 499647 229976 144465 294335
12515 294335 714001 907346 735782 343552 92648 173843 490690 466571 294397 -49709
12505 -49709 -418581 -747559 -651724 -319257 -334402 -937709 -1341783 -1339330 -1120589 -485916
12495 -485916 -177385 -230217 -381357 -580987 -386529 -275529 -629387 -837132 -518216 -190551
12485 -190551 -663244 -1199129 -1301397 -1111379 -841801 -555489 -463307 -629190 -924090 -876934
12475 -876934 -683817 -273630 2115 47055 196589 354433 251021 62789 -176254 -322031
12465 -322031 -320898 -65699 -50293 -272339 -400296 -405796 -228364 82324 143718 311579 459573
12454 459573 72698 -283495 -389939 -272302 -336176 -379945 -623213 -843941 -714840 -303876
12444 -303876 108703 788577 852254 13427 -193478 -150911 -243436 -17179 -58810 -437448
12434 -437448 -459106 -249522 -176259 219804 633884 385099 376723 189495 -639662 -1231033
12424 -1231033 -770259 -201454 -234141 -424412 -419626 -8972 189204 170761 -175059 -611609
12414 -611609 -473483 -160931 43767 350278 290679 41769 158320 281610 127943 172129
12404 172129 315258 15223 -591787 -660330 -281774 -415140 -464024 -268841 -565903 -812126
12394 -812126 -685644 -675304 -370229 241070 313933 40382 -376711 -834541 -700893 -345237
12384 -345237 -80515 -47500 -542420 -742294 -312138 -230789 -503542 -431392 -118149 373119
12374 373119 634132 897711 820391 782119 1041099 636137 149322 206900 108417 -262975
12364 -262975 -191986 414743 962921 998016 1020174 759291 535890 502582 499839 437100 273665
12353 273665 17478 -187518 -371072 -77050 55185 32413 220881 -202798 -724326 -1332434
12343 -1332434 -1726563 -1347632 -961023 -567267 -687547 -961696 -985176 -872494 -674303 -182451
12333 -182451 231484 -282295 -517023 -268946 -116987 -108971 -481379 -119015 198897 170593
12323 170593 133460 -20978 -139629 -744307 -1141133 -1000580 -805052 -982238 -1040356 -771947
12313 -771947 -588221 -417268 -65974 222058 413087 306120 60465 -6794 -51084 -162609
12303 -162609 -142972 -171361 -310884 -286373 -220647 -358203 -961028 -1268082 -1121799 -991959
12293 -991959 -781064 -522242 -353545 -401106 -628378 -347215 -41439 428463 480934 69695
12283 69695 -39636 51921 52051 -448294 -655846 -163199 -229047 -820712 -508461 26993 -21660
12272 -21660 -283499 -174346 -246442 -648758 -756563 -308456 119623 109394 94042 -31163
12262 -31163 161035 43927 -211441 -106245 -250798 -565528 -498233 -173228 -17958 392763
12252 392763 597942 470787 303673 -148297 -658959 -568184 -271513 77639 -130833 -146365
12242 -146365 -160171 -579077 -496259 -321854 -163365 83729 159533 394974 781290 645789
12232 645789 318096 470860 790920 700368 207308 -166690 -232937 -127867 -443697 -973674
12222 -973674 -1395502 -1504556 -1662697 -1653049 -1273196 -1157935 -1020468 -931565 -845336 -670056
12212 -670056 -594333 -164854 133692 92916 -96672 52493 311813 309753 222814 -245353
12202 -245353 -609246 -674856 -312220 87935 439844 981130 1092889 603620 132439 -8996
12192 -8996 -278594 -750141 -1050154 -1172903 -1271866 -1234076 -1374822 -1723248 -1598364 -1091762
12182 -1091762 -1081173 -1383490 -1512965 -1334616 -886454 -312378 -205880 -308776 -286409 -80119
12172 -80119 -106118 -119973 -185757 -548951 -441960 -154076 -280648 -714346 -968044 -629195
12162 -629195 -238096 -78483 -106780 -334943 -309582 -310371 21901 268215 515768 638265
12152 638265 489495 357609 233689 -130200 -586315 -1117565 -1402271 -1307556 -1357361 -1427673
12142 -1427673 -1341378 -875827 -384558 -32436 125983 -251347 -583876 -596508 -484609 -186624
12132 -186624 -14853 -38340 -139966 36478 -159664 -782886 -1276659 -1547004 -1507056 -1758586
12122 -1758586 -2263082 -1978676 -823010 282130 419647 696858 1067474 1286618 1258911
12113 1258911 789454 425209 300877 80422 -565893 -1075956 -945353 -472903 196956
12104 196956 502446 345265 259987 211855 -52232 -27347 306284 617774 536467 450518
12094 450518 174830 64999 322624 333231 632527 753935 574705 676165 445409 440017
12084 440017 366233 117753 186992 496773 584174 221142 107962 164828 228449 -45552
12074 -45552 -207276 -260836 -389242 -466306 25010 251125 278021 14719 -189795 -8025
12064 -8025 -338568 -610120 -160545 279761 558416 840261 886029 666895 575617 455787
12054 455787 343944 598108 626700 561141 476499 576330 401677 141507 43679 -24833 453981
12043 453981 492120 -121440 -200348 142945 237637 120032 -258376 -234840 -176123 -814255
12033 -814255 -1456874 -1372047 -1412265 -1249645 -963938 -482392 27248 301369 378827 366889
12023 366889 293017 203039 280162 241243 194084 294425 -161965 -632296 -351046 433096
12013 433096 1210356 1685371 1611187 1068631 529109 115052 348485 669260 685626 210944
12003 210944 20701 118109 90627 52787 185442 494236 767341 1247602 1447965 1310321
11993 1310321 600138 173359 -363779 -843914 -1033116 -854581 -1083668 -1731539 -1664459 -974258
11983 -974258 -196770 147887 255786 464747 737757 802114 600265 318334 -61117 -458753
11973 -458753 -892789 -1047838 -630996 -219314 -144075 133373 249904 -8671 -231878 -778536
11963 -778536 -944496 -531445 181240 661705 716804 424508 376756 446402 656897 725014
11953 725014 692166 842100 899531 1009754 1102264 821607 181205 -111504 175727 278517
11943 278517 226171 519395 811881 818698 939920 1238737 1188287 996713 727596 457170
11933 457170 584447 1068279 1237265 710685 162412 -128462 -617931 -821535 -412955 -208576
11923 -208576 -37674 307198 24807 -403105 -352800 -120870 -18601 18851 36921 -187346
11913 -187346 -323956 121306 464336 705882 909963 862930 736398 645279 852473 1343996
11903 1343996 1596869 1333255 694700 287302 149560 -37174 -132214 -390663 16696 402075
11893 402075 340644 411614 720231 722059 202841 -242268 -309306 -290583 -242991 -590182 -775933
11882 -775933 -553087 -539213 -930923 -1051655 -583609 -503180 -802329 -1133253 -986663 -495491
11872 -495491 -219639 -95819 17661 -156275 -258865 -173252 -214175 -232872 -220316 -294984
11862 -294984 -463815 -499890 -277684 7833 339533 640399 527681 372339 311863 332781
11852 332781 519953 445092 545801 553849 302876 341099 61670 -147358 113858 507483
11842 507483 510781 152186 -154914 -373092 -494019 -299542 -165900 -348479 -719244 -695884
11832 -695884 -527163 -616111 -669852 -222053 151073 265894 363159 455168 545290 863971
11822 863971 474827 -14119 55821 417139 602411 584737 375761 -148206 -600648 -771711
11812 -771711 -572464 -509752 -778611 -941282 -860818 -628095 -360269 -132891 -48172 -175037
11802 -175037 -556025 -1141746 -1319975 -1574919 -1671902 -1376846 -731453 -459012 -660216 -531204
11792 -531204 -280384 -123009 48523 368635 585942 505710 475396 361677 -123062 -625902
11782 -625902 -732665 -890091 -740979 -118496 -98797 -328713 -164127 465948 1223328 1232787
11772 1232787 951387 1157774 1619120 1437417 739030 192028 -237958 -397100 130253
11763 130253 250617 -47175 -428843 -560075 -503602 -218604 -57417 -37858 -357250 -263981
11753 -263981 -105331 2592 -199628 -571585 -878966 -1069097 -794664 -504455 -106120 384620
11743 384620 735070 758978 673187 801543 800682 215694 -257700 -594364 -415966 -520929
11733 -520929 -705825 -378605 53922 -62911 -468947 -822558 -582597 -134360 -195306 -296736
11723 -296736 -539009 -577292 -280571 -10159 162473 131508 351189 528428 409016 -74933
11713 -74933 -444591 -160386 326236 320644 -47068 -21226 160707 539106 870160 1453211
11703 1453211 1598782 621490 5192 113804 463126 359423 37419 -320228 -520853
11694 -520853 -174697 56301 -64005 70336 517509 625062 219468 -164866 -449974 -780964
11684 -780964 -1073333 -1153097 -1098174 -962636 -919032 -1064343 -459974 388236 699215 1036442
11674 1036442 1025834 613013 252115 -160333 -619309 -1035004 -1029572 -816045 -905596 -1232979
11664 -1232979 -1646818 -1756940 -1747970 -1205097 -674662 -461459 -314942 -15463 285227 85654
11654 85654 -240017 -523589 -622698 -568926 -464872 -438935 -356480 -425365 -826867 -1182878 -1169466
11643 -1169466 -994197 -540014 -587603 -659216 -440469 -183110 140154 512265 426519 -343769
11633 -343769 -727024 -662660 -208886 261600 109894 -20050 -150311 -276989 -348075 -465523
11623 -465523 -542270 -737560 -849712 -1010792 -1426403 -1608276 -1486409 -1310263 -1214219 -1059214
11613 -1059214 -877659 -628275 -350934 -9233 243179 -199519 -918823 -974119 -718394 -239796
11603 -239796 124438 214100 245754 355533 252994 -170829 -118474 -149710 -420594 -295381
11593 -295381 -633485 -1219761 -1349507 -1128701 -933295 -1002898 -867078 -450343 128155 154285
11583 154285 40879 436437 640699 319037 -93192 -371994 -357138 -499542 -444537 -438368
11573 -438368 -309375 -56724 -46323 74669 527735 515277 495820 815379 609406 631971
11563 631971 895578 1002734 904098 395934 -90881 -335271 -452600 -280108 -37838 303342
11553 303342 403630 77450 116104 451596 540396 568142 316834 -201030 -746196 -1013422
11543 -1013422 -1007508 -954009 -639705 -365450 -408599 -763863 -1078802 -1259658 -972154 -565920
11533 -565920 -244593 -529339 -958954 -1134397 -1056873 -789503 -595357 -543132 -864969 -1038998
11523 -1038998 -877183 -818422 -923948 -1088406 -908288 -444509 -249069 -137956 -125420 -7891
11513 -7891 167375 -87785 -868517 -1522453 -1412577 -1200412 -1254714 -1024906 -959683 -1123529
11503 -1123529 -931078 -716702 -801537 -941727 -1074101 -1072069 -965858 -1002940 -963100 -729361
11493 -729361 -488220 -603153 -960243 -1191666 -1451459 -1133078 -457374 55282 604584 547262
11483 547262 2634 -436956 -111323 455951 675159 827181 743692 775393 776685 421028
11473 421028 -173430 -544258 -316711 276294 601268 682678 601672 574969 593782 344406
11463 344406 -1489 -240039 -303594 -478098 -504472 -768291 -1020328 -647889 -184962 85332
11453 85332 326974 199069 -204498 -309087 -300660 -149579 190993 633064 749943 477972
11443 477972 -76845 -206087 54978 403079 579369 69612 -587203 -710642 -925852 -1195565
11433 -1195565 -1065575 -543640 -354954 -172701 8509 325113 439793 418830 499129 577159
11423 577159 790580 844136 749839 672094 551791 541856 305148 -483920 -932435 -1180631
11413 -1180631 -1190979 -1132915 -905935 -490445 -174281 -114102 -334621 -435359 -591943 -548028
11403 -548028 -436621 -615342 -687325 -441186 403 159238 130036 -12043 -96152 -183495
11393 -183495 -474914 -750763 -739955 -1069435 -1735373 -1808338 -1242337 -674183 -498161 -705099
11383 -705099 -722476 -402616 -46176 327614 416782 269518 273667 584174 701634 401101
11373 401101 136129 112791 231208 484088 312762 100992 178127 110886 110445 -50083 -135382
11362 -135382 -36577 204641 352944 433116 260005 -154877 -390443 -479963 -406013 -111609
11352 -111609 -53709 -339768 -765814 -875121 -860553 -921220 -844063 -930615 -924056 -836123 -500943
11341 -500943 -273648 -129824 -9149 21319 -125950 -491682 -317240 136245 304050 11700
11331 11700 -252086 -24321 108474 -131038 -318678 -252970 315683 930099 896911 277740
11321 277740 -122314 7476 196484 230376 189886 287845 399889 419060 148023 267257
11311 267257 363045 242131 -263071 -786527 -736822 -143935 270514 886386 1741208 1534648
11301 1534648 968645 826945 672526 660765 829321 892626 845329 398215 -579191 -1416829
11291 -1416829 -1361063 -791387 -146822 -134150 -335017 -26329 114895 -168154 -518562 -591240
11281 -591240 -548569 -520486 231359 828675 1026313 901226 562935 186858 -147938 -282776
11271 -282776 -79410 -132894 -239110 -119324 -54045 -99482 -16202 165951 136890 108488 76006
11260 76006 255541 390911 493065 744353 1063801 1094223 893008 913748 539216 28070
11250 28070 -104886 -171789 39900 418049 378452 56150 -44350 -44373 90654 -67178 -454071
11239 -454071 -235017 -64693 -76658 316511 696531 894601 1011659 911128 463806 -22141
11229 -22141 -154816 -2017 -17519 -350288 -272323 -154850 218578 707421 738780 538414
11219 538414 190811 -147843 9794 172289 312644 582946 638601 461450 145615 -143571
11209 -143571 -288098 -579095 -974394 -805667 -176290 80875 -370263 -1209870 -1577833 -1422134
11199 -1422134 -1257431 -966673 -569348 -309993 -253323 -191150 -44791 -239955 -541072 -404098
11189 -404098 -151571 -63179 -123433 -435995 -787383 -1308712 -1488670 -1173828 -1269081 -1791659
11179 -1791659 -1907020 -1663253 -1138807 -581992 -106349 36127 147287 127715 -271443 177063
11169 177063 1030621 1331021 1261065 1043125 675753 422847 103965 -33672 57292 181388
11159 181388 332038 391296 520832 598684 40126 -157030 -94222 -196439 -108301 -203659
11149 -203659 -63382 190356 91451 209943 166205 -575968 -862640 -387897 -150043 -326242
11139 -326242 -180503 -376530 -1096585 -1131372 -600478 51796 529377 877731 544312 -54836
11129 -54836 -113456 -52610 -391109 -831751 -807308 -550761 -460412 -136619 220039 723679
11119 723679 968106 742712 378993 187719 295217 538305 279903 107551 172638 232118
11109 232118 38380 -144214 41641 -15612 -34453 517835 712257 717644 755618 813418 720142
11098 720142 528477 579543 373195 -51930 -409042 -552556 -64642 437386 402737 300015
11088 300015 -83089 -415239 -350734 -423187 -670133 -771286 -544339 -118218 83350 269973
11078 269973 350909 256831 423555 509817 298207 462626 731273 1080381 1400416 1174302
11068 1174302 1008619 854988 386707 149217 467477 755324 650326 442513 406615 284227
11058 284227 80720 27283 170965 309314 100800 46374 101513 -140876 -469051 -858104
11048 -858104 -930305 -904677 -959137 -554690 -267817 53473 577437 622091 261394 -96290
11038 -96290 -341078 -315562 -466964 -748449 -813581 -579745 -776221 -1098830 -677331 39759
11028 39759 435345 601336 759754 956927 737307 336276 247073 341132 84969 -185274
11018 -185274 -184929 -310034 -408531 -730147 -985811 -739536 -576508 -303526 -88387 4013
11008 4013 548602 629213 130732 223666 612186 1157242 1228384 814664 635152 611563 702147
10997 702147 864377 736761 551555 501022 333314 295205 292704 807805 944501 603635
10987 603635 526066 530888 858167 975177 720726 466835 204441 9962 -181008 26323
10977 26323 135624 -301884 -449363 -438845 -428886 -456180 -508130 -473107 -114809 284266 -25038
10966 -25038 -192490 -163325 -371733 -751078 -978555 -1059391 -755817 -78197 583976 714828
10956 714828 139773 -13776 -123206 -480740 -523928 -451101 -673489 -801729 -600058 -27803
10946 -27803 454216 740347 650622 473979 361873 67402 -106102 -76216 -79717 -45866 33950
10935 33950 -57945 -128313 -103328 -161325 -317514 -469283 -373777 -349750 -4062 372154 342302
10924 342302 -93877 -1006928 -1286215 -1103199 -941354 -778697 -682166 -334872 118913 432106
10914 432106 181938 -254354 -73503 -123355 -92047 64622 -146663 -530166 -971064 -1134901
10904 -1134901 -1065413 -977551 -641304 -314527 -82092 -72041 -418788 -949445 -1060358 -842877
10894 -842877 -411310 -299638 -599043 -456889 274693 720525 419028 -239748 -566956 -519075
10884 -519075 -344251 -645956 -971524 -1031279 -851370 -368319 -7647 177640 196445 -60007
10874 -60007 -788341 -915970 -503080 -138452 169231 595222 860016 519949 -96388 -104255
10864 -104255 152592 176358 26858 -88620 76743 356484 689951 578855 -62646 -22516
10854 -22516 39095 -81120 -172370 -11870 391729 648602 696234 552686 536030 370390
10844 370390 135422 -251472 -229500 286455 760602 977092 895539 658440 750756 1028309
10834 1028309 1170659 1066358 943308 632701 263586 518143 814516 1238125 1508474
10825 1508474 1590984 1640002 1692903 1896463 1928017 2247045 2825350 3934671 5290980 6627130
10815 6627130 8355957 10967093 14691245 18237308 19933534 18533564 15239499 12009379
10807 12009379 9268078 7654188 6806368 6123819 5648640 5091989 4620195 4557398 4467127
10798 4467127 4019487 3553362 2957173 2710817 2710665 2405030 2093683 1716856 1554418 1619246
10788 1619246 1724081 1937954 1888728 1535334 1155684 878898 388703 -70927 24301 308390
10778 308390 382783 343999 -2027 -50264 322308 217673 67534 206312 -112916 -791639
10768 -791639 -1242998 -1259846 -690742 324913 796678 732511 931855 1127732 974411 863634
10758 863634 937302 857951 1064190 1177265 1260066 1657482 1541357 1232578 940594 452268
10748 452268 348503 288840 47502 -51306 329314 778642 1086450 1150088 1058131 867430
10738 867430 421412 6226 -329685 -340888 -148722 -164804 -237808 -368170 -594455 -410537
10728 -410537 -167547 -364866 -307471 -466122 -516713 -341926 -605787 -1181438 -1509362 -1228796
10718 -1228796 -892383 -991958 -746692 -261522 -307530 -598754 -854392 -922946 -972341 -1105261
10708 -1105261 -775459 -220375 -183076 -631607 -993277 -1254781 -1055134 -568748 -63543 335411
10698 335411 -274630 -895421 -862770 -605851 -280004 284135 287586 -21053 22973 190594
10688 190594 253469 392771 243698 -59922 -296744 -225620 -26668 -40243 112857 234053
10678 234053 114390 136145 -206162 -695212 -511697 -10649 470443 655758 660964 386989
10668 386989 282476 622933 846419 1154580 1138898 506279 116961 -237502 -652729 -546084
10658 -546084 -135409 34545 52894 101371 157244 411339 203096 -252731 -834685 -1257861
10648 -1257861 -1769724 -1841240 -1660545 -1453468 -1531619 -1536768 -1163110 -977869 -921205 -1320101
10638 -1320101 -1323945 -1050051 -708432 -431017 -156368 17467 -24274 -209534 -50892 24148
10628 24148 -367321 -789691 -960588 -412130 264495 567858 676317 687797 757526 547863
10618 547863 287035 269701 196453 -79503 -325184 -664009 -876772 -979459 -1128673 -1390615
10608 -1390615 -1381044 -877570 -334528 -58182 -76857 100868 383369 428930 83791 -246094
10598 -246094 -362130 -709863 -1132875 -821929 -346988 -412888 -317955 -172508 -93725 94888
10588 94888 228217 86965 -259695 -912565 -1247585 -1487331 -1551557 -927655 -330667 -59199
10578 -59199 182750 433677 790255 1228820 1246274 885529 445299 322658 448141 744630
10568 744630 853585 468155 196791 156114 466005 577241 522480 658138 509892 115095
10558 115095 -445769 -765691 -369289 -58712 -149796 166489 511021 615651 534714 492628
10548 492628 415667 -56561 -465203 -372880 -533938 -703430 -730151 -623022 -226844 -32609
10538 -32609 281658 933821 1326528 939964 235452 -175068 71392 223983 143937 -100115
10528 -100115 -433877 -453725 -207338 -107338 -237620 -526269 -932068 -1306738 -1643503 -1312310
10518 -1312310 -915449 -722316 -284971 -82627 -26777 -199835 -355828 114260 247861 -9920
10508 -9920 -298241 -413289 -226352 -11903 -138659 -349689 -351580 -201206 59214 316144
10498 316144 239260 15178 -277023 17552 423348 334582 71697 -66431 -72757 -316529
10488 -316529 -249650 -306944 -850275 -1244637 -1373524 -1552589 -2016975 -2606724 -2526676 -2008261
10478 -2008261 -1907268 -2016241 -2011861 -1417771 -724540 -620127 -780758 -645405 -561898 -727723
10468 -727723 -629191 -474903 -220107 -97442 98257 42673 146970 493070 867627 1089551
10458 1089551 1001443 444853 -105004 -267444 -299894 -418011 -331784 -38394 -76991 -626987
10448 -626987 -765447 -655445 -482815 -233227 -68797 -303655 -271542 168123 432059 430739
10438 430739 78140 -254287 -614656 -676447 -420869 -601059 -1114988 -1216539 -943811 -230645
10428 -230645 140106 -216104 -592678 -801484 -697027 -856981 -1022124 -338098 60986 -33196
10418 -33196 -574095 -361746 285301 623868 263986 -438479 -265998 22929 -54610 -266318
10408 -266318 -688758 -1065545 -1005105 -460194 144666 350350 315839 256579 398586 414337
10398 414337 57895 -547854 -889351 -814600 -487341 -357093 -387501 -325706 -355297 -490179
10388 -490179 -406534 -120328 141582 262429 69070 -344010 -562710 -530926 -127990 -13483
10378 -13483 -275913 -331831 -289468 -276236 45991 177700 43256 -46489 -177448 -285791
10368 -285791 -266304 -52186 255660 404108 242162 501444 686169 1035283 1559580 1377458
10358 1377458 1172659 824458 364996 182266 184733 110376 -267225 -400634 -36409 236827
10348 236827 251802 355159 756758 1072571 1112656 1024430 712093 295365 -296453 -659537
10338 -659537 -799891 -896338 -638701 -231098 124442 -364108 -847516 -1133228 -1066340 -508674
10328 -508674 -99193 66439 231758 383061 412287 423245 83106 -468684 -801113 -673916
10318 -673916 -865001 -736865 -625713 -539417 163166 1023231 1105601 425257 55955 467364
10308 467364 545257 112285 -274117 -853477 -1361862 -1532950 -1341615 -1220824 -1289211 -1284798
10298 -1284798 -1483951 -1464041 -855370 -278860 17167 344453 23254 -466429 -557914 -532285
10288 -532285 -703058 -765108 -704471 -321501 -35848 -415762 -1046617 -1524749 -1551598 -1199255
10278 -1199255 -958970 -625631 -309192 -388 166282 9074 -273270 -244742 -216938 -296874
10268 -296874 -176161 6583 91841 364815 503127 555162 292900 -41883 162308 622169
10258 622169 613905 393395 385300 334727 23876 -191574 -348184 -715877 -714893 -542214 -948059
10247 -948059 -919447 -446572 -260261 -454516 -673935 -510560 -304036 277789 930626 1070951
10237 1070951 788006 611860 226161 31077 244801 -54019 -290611 -141950 -143638 -309142
10227 -309142 -154979 -53296 -137669 -423532 -483808 25804 391233 54259 -229156 -164371
10217 -164371 -21628 50167 -36802 -67620 -328717 -328030 -580866 -823889 -799260 -535099 -373291
10206 -373291 209144 256179 -42601 162137 235737 109437 200135 634963 578474 555449
10196 555449 764486 467735 -17805 -453413 -650721 -307275 512410 697266 698035 880001
10186 880001 872032 517022 -16369 275370 508974 445982 420319 4026 -317736 -459064
10176 -459064 -518978 -447532 -266733 -380308 -528633 -596447 -417555 -347522 -534484 -584315
10166 -584315 -251983 52250 303498 334149 214314 98252 -83076 -310891 -339562 -103503
10156 -103503 231474 402551 511751 364745 -27962 155873 361663 104850 154550 234977
10146 234977 -113833 -249213 -377081 -420062 -397510 -311871 -111184 -254399 -686574 -983490
10136 -983490 -790715 -798760 -971478 -670944 -93189 220478 135903 -5286 -24402 -297632
10126 -297632 -516577 -381032 -181412 -517874 -862495 -709173 -321162 195367 546697 584505
10116 584505 654513 1031392 1033805 1112553 1246000 1238083 926672 555036 657832 700271 442160
10105 442160 -156239 -91532 564538 999204 830168 341640 414511 265818 -188328 -433458
10095 -433458 -669532 -800035 -881681 -454984 2631 -37117 -728244 -1452650 -1528330 -1341281
10085 -1341281 -1028003 -476512 3393 117305 28855 92651 531444 509378 -136684 -557594
10075 -557594 -402357 93186 163018 -260448 -190753 346847 404431 370673 540146 363837
10065 363837 258709 159980 -159634 -565161 -1037207 -961500 -448806 6339 -255446 -688590
10055 -688590 -476314 314865 692761 456452 278709 279772 52240 -260341 -293412 -213779
10045 -213779 -94363 -211966 -277175 -63368 -12936 -152592 -122720 -296681 -581866 -383353
10035 -383353 87328 -205002 -738464 -587026 -233100 -254382 -170097 -462175 -941058 -1152788
10025 -1152788 -1081009 -983717 -1092270 -1202284 -1143903 -825666 -462581 -550148 -1151874 -1570167
10015 -1570167 -1576092 -1361821 -1175245 -889727 -572114 -780470 -794707 -534221 -444512 -260944
10005 -260944 -185584 -548066 -989682 -1633920 -1823571 -1514622 -882455 -509468 -485696 -592960
9995 -592960 -372991 216599 428935 463198 356839 248975 18750 -309493 -214097 533760
9985 533760 1179255 1134585 971534 971921 778988 729555 615789 440069 51202 -436761 -674271
9974 -674271 -560808 -85148 462872 648818 533546 235368 287154 425287 568786 716168
9964 716168 888656 799801 520116 755819 1057426 1104355 676142 313011 86674 200508
9954 200508 190656 35770 59456 433930 688513 661885 518833 591537 645130 413552 158464
9943 158464 -246378 -239162 40199 -80803 -246283 -405778 -593326 -962073 -720664 -231365
9933 -231365 -75838 356331 713941 482443 340791 513676 54512 -406353 -255066 -57765
9923 -57765 180228 137870 -346055 -543569 -526414 -541933 -389145 -331452 -226921 -249380 -122954
9912 -122954 -107822 -194285 -109662 136925 120521 -147619 -616127 -1055626 -1211975 -516228
9902 -516228 500635 774587 531267 238310 -52078 -408033 -572880 -388901 -265166 -152050
9892 -152050 -493638 -950805 -908028 -821346 -586841 -65841 -62065 -188597 6699 -22123 69438
9881 69438 -172434 -360529 -460022 -521399 -339173 -167108 -135379 -38524 -367708 -474384 -142112
9870 -142112 114850 -189289 -143651 -173443 -99096 386143 258089 -608725 -1366523 -1585449
9860 -1585449 -1342856 -1190278 -823996 -395911 -249533 -22923 460738 936935 1043278 1234243
9850 1234243 1377348 1268798 1036154 496155 45710 -326634 -564465 -319923 192462 670945
9840 670945 1004363 1170878 1349202 1836599 1937011 1528479 1022531 1043691 915235 385371
9830 385371 -244155 -557736 -480071 -148486 348613 799708 1104504 1216789 1591783 1341548
9820 1341548 246918 -160332 35089 155510 406750 608437 694614 591264 615025 383994
9810 383994 133071 207809 170677 186552 281474 341120 295521 5015 -463081 -617753 -641186
9799 -641186 -882180 -1118730 -938666 -756555 -542023 -273622 -601139 -775855 -645782 -522852
9789 -522852 -825331 -1175589 -878834 -453729 -279933 -333294 -628227 -647312 -591827 -496910
9779 -496910 -96609 230668 -3781 -396466 -295086 18250 395790 434943 459381 705333
9769 705333 649423 675324 614243 407421 477319 779721 1079409 1308972 1310996 531475 -105966
9758 -105966 -101072 296886 343050 123905 114518 347430 501579 190005 -213427 226133 1029620
9747 1029620 935660 810293 512390 24680 -253683 -150468 -295291 -616084 -655492 -211306
9737 -211306 108378 235680 147754 -80263 -582933 -826993 -623252 -522623 -376686 -216463
9727 -216463 -51134 -166902 -234993 -114992 -315037 -776658 -934232 -862727 -612075 -132519
9717 -132519 241263 208866 217406 608209 1505140 2280487 2333928 1731734 1402286 1427601 1379723
9706 1379723 1090901 879182 907181 634486 625608 368939 150010 32372 -260266 88882
9696 88882 868648 1349716 1886682 2569184 2573409 1884991 1668351 2227209 2626175 2520022
9686 2520022 1840751 1445911 1270631 963092 855867 944839 1000925 1079000 1440761 2109429
9676 2109429 2551465 2995192 3014201 3147200 3318062 3453031 3837068 4846479 6447251
9667 6447251 7441215 8363715 9727276 10989373 12467421 14958239 18812123 24442801 31443440
9658 31443440 38935413 43344940 40649837 33256612 25955909 20296250 16496530 13759789
9650 13759789 11067630 8646494 6703376 5397563 4666238 4100296 3523165 3117315 2842376
9641 2842376 2436838 1765648 1207858 1088692 1189208 1512404 1519275 1719156 1938802 1953725
9631 1953725 1589278 1119959 1034533 1126129 1501622 2008378 1783632 974698 593665 597544
9621 597544 566493 136767 80565 378951 290989 170280 572514 738142 410347 91902
9611 91902 68270 721705 1364095 1479281 1070755 415558 164781 -88913 -358921 -480706
9601 -480706 -312190 -152018 -233316 -607109 -849391 -613611 -358851 -466618 -424056 -22247
9591 -22247 162802 -126740 -316407 -357619 -281243 -185864 -205931 -339520 -556402 -212026 9952
9580 9952 186753 367068 380097 384869 493247 926527 1075478 1271504 1308117 965238 597937
9569 597937 110292 -337643 77471 794399 912380 511371 149582 42409 -133911 -377296
9559 -377296 -664490 -672303 -530101 -477630 -112443 187177 -34666 179898 237183 56311
9549 56311 -75507 9791 273600 290301 -90779 -581106 -466572 -146552 -81796 -50636 -80651
9538 -80651 -96283 55221 -101532 -118816 167142 376962 417863 144871 -361748 -522628
9528 -522628 -317196 14219 101191 -132050 -472335 -801976 -1088177 -1467531 -1433988 -901291
9518 -901291 -720584 -828717 -759884 -407738 74728 282146 344659 339215 451212 805614
9508 805614 605558 12521 9851 111702 93591 96349 39314 288321 240059 -277173 -605334
9497 -605334 -628214 -725208 -1177609 -1457560 -1599016 -1487703 -1047156 -572957 -100503 -132801
9487 -132801 -10260 197997 -37627 -214087 -213678 -545310 -485701 53488 548819 530970 -147633
9476 -147633 -588335 -869176 -714792 -576677 -600449 -644149 -453550 -16145 337409 304903
9466 304903 -18465 -118987 -305524 -559461 -698259 -737966 -699871 -415026 342400 877807
9456 877807 605190 44899 -339565 -656735 -782528 -766479 -913932 -1134813 -1091432 -665277
9446 -665277 -193153 -87469 -324339 -440675 -561983 -785457 -534157 -337971 -296264 -443591
9436 -443591 -87352 126902 214567 68257 -207203 77090 476908 475797 46256 -650301
9426 -650301 -1185582 -1200982 -1046875 -831298 -624968 -52606 164767 -9540 67344 329503
9416 329503 232999 341408 410059 133516 -169740 -325387 -358342 -353153 -790647 -1330451 -1393341
9405 -1393341 -790121 -365947 151782 422763 -53363 -617313 -781118 -910932 -1138048 -1300049
9395 -1300049 -1494461 -1808521 -1583253 -838199 -133119 208642 39429 -400877 -410068 335163
9385 335163 807714 643437 600812 568397 180855 47943 -91411 -257991 -393142 -835336
9375 -835336 -1268069 -1351424 -1287822 -1237166 -937208 -758718 -740694 -982882 -1180229 -854292
9365 -854292 -604809 -580913 -744777 -447919 -32729 -39953 -100523 350691 638326 685448 538630
9354 538630 283786 305754 219599 156385 367284 286890 264321 416257 340167 282118 213757
9343 213757 -150674 -251821 -220373 -425731 -548462 -357734 -72970 96897 -87528 -212470
9333 -212470 -256568 -291267 -774075 -1001577 -741959 -135235 468837 198351 -134976 169264
9323 169264 707009 581859 -61618 -431702 -104525 517317 649185 526018 331720 373422
9313 373422 769017 977625 541215 315328 -40295 -629767 -682327 -464460 -504261 -862794
9303 -862794 -938313 -582923 6915 423611 579036 799773 584078 422401 923448 843550
9293 843550 470893 175805 -55487 25787 457326 554591 18907 -26480 78760 -46938
9283 -46938 130837 209926 -63926 -154771 24765 -57243 -212350 -258689 -414162 -527033 -244533
9272 -244533 63598 -223189 -587392 -299909 144379 126988 -340134 -435716 -540697 -599144
9262 -599144 -399279 -206488 227184 0 -177097 -198233 -522602 -499767 77420 391116
9252 391116 390731 -55643 -278386 -382330 -672215 -597259 -430277 -21321 569797 1198589
9242 1198589 1655414 1582474 1112179 927030 649059 366669 564033 451575 104801 44369
9232 44369 297226 648611 706347 929637 1164469 1144248 1117788 463712 -606759 -800282
9222 -800282 -620288 -652064 -327735 171447 236669 156488 120423 294476 245074 308516 371231
9211 371231 426686 317404 194324 227407 450926 272887 -117049 -192752 -342227 -603830
9201 -603830 -700649 -958192 -1132820 -983336 -947418 -732217 -403929 -49288 27849 -103269
9191 -103269 239566 190874 -250012 -699744 -996465 -1027625 -1019912 -1347445 -1509879 -1102273
9181 -1102273 -674584 -676423 -1078419 -1301184 -1219229 -1046150 -900429 -543857 -469625 -529694
9171 -529694 -645516 -941898 -782804 -780688 -933858 -1157612 -1529960 -1530387 -912511 -335517 38165
9160 38165 166698 229565 176142 795035 1507175 1573165 1215987 637242 196763 -176353
9150 -176353 -374329 -52519 516250 313502 90143 -180500 -611105 -703737 -666828 -358617
9140 -358617 -156553 625711 1428624 1082142 530055 -99206 -368808 -612573 -849178 -511400
9130 -511400 121428 436140 748012 811674 919715 885380 646666 487925 125813 -47011
9120 -47011 -295377 -532567 -478130 -52085 383977 292243 -81703 -29651 117835 87430 -31174
9109 -31174 -47101 -228557 -608739 -653104 -752262 -990672 -951484 -884837 -1082508 -981826 -874653
9098 -874653 -804221 -424598 81489 282240 43543 -4934 81607 505564 391742 -213951
9088 -213951 -290767 140386 367625 300095 439308 305108 -362544 -681521 -378452 -33344
9078 -33344 263161 423405 644456 656315 624115 542701 267414 -233712 -246589 -26563 63401
9067 63401 18720 -343452 -560451 -666340 -787649 -494411 -40871 251284 108265 -200467
9057 -200467 -431118 -527973 -685959 -838030 -546250 -151754 65302 129982 112024 261537
9047 261537 273529 269665 -32089 -382588 -612284 -482751 -82425 -20607 -622925 -873265
9037 -873265 -928470 -610420 -120649 218529 239709 -202345 -589915 -575388 -514095 -645372
9027 -645372 -754058 -792385 -585081 -515168 -483325 -2453 268792 4744 -96040 -381076
9017 -381076 -739621 -224190 165900 32450 274199 425029 593332 451612 57768 -147160
9007 -147160 129173 184451 -227159 -64641 106404 239452 282136 389277 379286 -86682
8997 -86682 -689814 -596149 -263478 17546 -281546 -899579 -1029659 -927592 -892929 -343395
8987 -343395 138981 296751 466171 443623 876189 1068990 513510 283501 469108 646685
8977 646685 581168 741735 660699 266437 115540 37397 -244731 -239559 25543 269889 538763
8966 538763 496943 290501 -286560 -304499 -240891 -84502 56687 215507 568830 653633
8956 653633 445649 437145 785014 847824 753746 480520 -206576 -670310 -676909 -152132 17235
8945 17235 452392 347892 270760 239680 121174 245490 509464 820293 226585 -487062
8935 -487062 -454833 131655 511332 397419 146563 104249 86854 311174 694829 979585
8925 979585 1216487 1015384 936827 1154484 1287507 909126 396416 347648 575828 479927
8915 479927 562956 1014643 963126 422633 442695 539813 686614 1006711 1171433 1080182 767369
8904 767369 534566 711208 1021142 1290453 1658268 2345085 2894963 3420687 3540074 3443463
8894 3443463 3723711 4090230 4615535 5277757 6332080 7677832 9092670 11156024 14129424
8885 14129424 18430558 24018961 30469908 37576063 41731057 38933020 31992961 24802329
8877 24802329 18983424 14976788 11915505 9767570 7902925 6358400 5590736 5154665
8869 5154665 4818404 4333089 3145480 2192160 1441376 743179 410478 264497 774823
8860 774823 1520101 1607149 1110768 1101691 1026614 724687 586206 368227 287029 584261 862866
8849 862866 1246929 1576132 1425019 1461977 1580790 1633137 1488571 1423777 1320812 1259008
8839 1259008 1160868 945602 973798 898975 878263 886811 774512 676760 787763 571028 348047
8828 348047 554254 934070 1190227 1543001 1674335 1752910 1618068 1167254 988583 853773
8818 853773 797744 802996 472406 376498 717543 764989 898289 945132 752965 235229 -32554
8807 -32554 313913 529820 216874 -419372 -767274 -551076 -379588 -296257 -289506 -598581
8797 -598581 -515755 141118 656153 571485 400516 600690 908654 861961 723350 562425
8787 562425 292154 431974 717065 624494 246675 41068 275558 389243 -89176 -775737
8777 -775737 -1157992 -896644 -312982 -133180 -204145 -111808 116550 278027 123657 -29500
8767 -29500 -420021 -837624 -988082 -743245 -204370 8588 -30612 -170955 -204482 93956
8757 93956 64164 -216892 -676388 -804403 -539260 -13597 142494 58761 64907 277915 497837
8746 497837 596722 852555 978062 383739 41925 304961 196956 -90283 -139246 -269757
8736 -269757 -425908 -512221 -518779 -360652 -286768 -383547 23588 507710 687876 541512 355825
8725 355825 541726 729782 702115 1080328 1604898 1907061 1620684 942287 319406 20353
8715 20353 81409 204398 214611 172047 273560 654829 813480 736957 434035 483859 522211
8704 522211 387298 385559 476773 551575 711138 1150496 1865223 2120239 1754546 1405878
8694 1405878 1193836 1454067 1229708 1214876 1642488 1544381 1433229 1383009 1253856 1292528
8684 1292528 1246785 1416665 1610817 1248258 561290 -266339 -582443 75812 688098 566051
8674 566051 181821 722392 1322650 1388473 1238084 1108204 866340 669713 941485 904765
8664 904765 729365 667548 505666 231409 120667 97543 178314 186278 -162712 -300711 -594586
8653 -594586 -613341 66209 544358 355120 -293748 -667576 -610713 -24835 374150 314304
8643 314304 295524 138830 -68093 61620 136813 259038 355061 322570 291008 179115 391969
8632 391969 289423 -141709 -355881 -314587 3354 178385 106797 -48960 -230404 -378593
8622 -378593 -141117 327896 292991 -44055 -274105 -412090 -388935 152525 451251 448090
8612 448090 182304 -33648 -292466 -456819 -580719 -675721 -734840 -725667 -310075 70700
8602 70700 362324 457123 -159547 -542050 -284879 42453 126258 81836 310639 259019 -1415
8591 -1415 -191913 -235293 -269293 2881 -86354 -441496 -628286 -638238 -631002 -769742 -483836
8580 -483836 -393681 -448727 -384059 -138906 -129723 -180849 -296256 -436096 -442612 -335692 -313970
8569 -313970 -201880 -170922 -204095 88631 325043 298144 -92722 -549851 -593938 48727
8559 48727 513555 651523 479581 83668 -149300 -101490 -389105 -355734 -77331 113466
8549 113466 -192468 -562309 -1168887 -1585202 -1701410 -1563797 -1064113 -477986 222175 500450
8539 500450 153971 -268012 -29706 234329 147838 226009 255009 287722 576267 754062
8529 754062 560705 233041 4983 -224510 -158647 -118413 -160561 -24040 314351 424685
8519 424685 -42586 -479266 -472628 -662081 -555026 -425722 -308454 -378309 -514627 -208087
8509 -208087 469059 985133 1065506 561467 89867 -178995 -474806 -390083 -154757 -209140
8499 -209140 -57507 -47508 68973 258206 256868 219847 354951 357546 250885 28508 -114914
8488 -114914 -27356 -20430 -146359 -661848 -1349122 -1734090 -1866929 -1638911 -1119302 -1156504
8478 -1156504 -1201428 -522476 -40793 24416 -415675 -541508 -78722 8032 -132670 -262717
8468 -262717 -373598 -420176 -427483 -511860 -345090 -262969 -564926 -859212 -874918 -784531 -696339
8457 -696339 -908409 -1225114 -1177429 -1009111 -760641 -656828 -705653 -637160 -268551 -81777
8447 -81777 121092 25702 267179 571692 475698 362537 284534 137626 -309723 -520576
8437 -520576 -165218 126687 507364 636750 225546 -159295 -606238 -675389 -553312 -709137
8427 -709137 -1104507 -1168078 -951285 -863049 -369423 90073 263559 100629 -343006 -485422
8417 -485422 -308165 -208908 -126583 143099 240236 199685 258559 370938 411921 179254 -339671
8406 -339671 -394339 -284571 -222167 -277596 -742869 -1025762 -1053129 -966102 -1039651 -1086694 -917734
8395 -917734 -595929 -250256 97777 158977 -263681 -412945 -531135 -274795 228196 388314
8385 388314 374741 -297907 -313820 -37175 -421816 -422530 -240146 -422032 -554048 -320875 -159587
8374 -159587 -192070 -606413 -784281 -453615 -151945 -53805 -306686 -534001 -447616 26458
8364 26458 626833 736732 777514 748519 759707 503884 18768 -443686 -754403 -775404 -678225
8353 -678225 -464267 -284763 -96579 -19524 -55854 -312951 -311303 -64800 195750 97120 -203031
8342 -203031 -227420 -216004 -33746 -136207 -503820 -851393 -1111163 -1060389 -1074856 -965804
8332 -965804 -276934 -115598 -479277 -665568 -537859 -274041 51026 -233847 -528149 -552005
8322 -552005 -484503 -363744 -291870 -140289 236963 42611 -525726 -726410 -552482 -465817
8312 -465817 -349663 -315031 -130531 295403 441052 464997 770953 903559 889571 945900
8302 945900 1059511 891073 676153 520580 15435 -324758 -263334 -274991 -329915 -234838
8292 -234838 -38247 -104157 -67680 62119 308809 370126 343452 147359 98936 270931 290082
8281 290082 377750 88771 -227761 -560625 -812658 -923734 -784925 -862740 -1177011 -1313278
8271 -1313278 -1263033 -948040 -917489 -1046146 -1128835 -927792 -589571 -358951 -118223 329295
8261 329295 670355 394787 139114 13045 21975 264980 594059 699245 466823 151230
8251 151230 -127054 -296095 -269850 -82418 40705 58115 -183304 -39462 394618 167772
8241 167772 -348153 -276265 64200 315337 810841 1046954 883623 557332 336271 438095
8231 438095 338828 35312 -14891 -24073 -96130 -660891 -1455254 -1422537 -1061709 -772660 -686481
8220 -686481 -798346 -416539 -389488 -693033 -695343 -427422 8926 98093 -5454 -189851
8210 -189851 -314302 -348693 -251058 41784 -532933 -1234696 -1838152 -1830698 -1180717 -925939
8200 -925939 -771564 -593720 -136300 137802 111856 317401 184158 70085 142781 297785
8190 297785 357271 104138 157418 469417 243877 92081 284763 268301 219990 441757
8180 441757 838762 769678 56088 -334530 -175113 207398 571964 746675 701887 519839
8170 519839 -5043 -477615 -205776 364280 490921 550622 652293 508190 -66504 -571299
8160 -571299 -613485 -514233 -111109 -17301 287775 145851 -294036 -633980 -986095 -899881
8150 -899881 -824740 -959354 -974774 -778637 -621793 -506664 -166268 186347 113500 -152903
8140 -152903 -7180 -97628 -493803 -944192 -1238003 -953930 -217940 455382 702363 373895
8130 373895 -223274 -626375 -1191625 -1247934 -1222605 -1491956 -1382628 -1231552 -1036518 -834021
8120 -834021 -770693 -835312 -885967 -1064813 -1043632 -970005 -1102445 -784731 -635288 -701472 -369133
8109 -369133 -10615 -57754 -99687 -163056 -292077 -401570 -415585 -116645 85212 244009
8099 244009 270285 21771 -547515 -658879 -392257 66100 -73698 -317794 -237449 -40533
8089 -40533 78117 -114005 -160324 245131 417976 529642 721050 502807 86142 -63330
8079 -63330 328007 419010 220158 -138507 -252761 -138949 358643 392714 323724 414892 222902
8068 222902 -7495 -170850 -206803 116009 3445 -440988 -416385 -373980 -711649 -1044508
8058 -1044508 -951815 -697631 -427649 -265656 -604015 -1161441 -1309077 -591310 -226019 6794
8048 6794 -5408 -209560 -180530 -291614 -527613 -659367 -607250 -530740 -718600 -1044053 -1174650
8037 -1174650 -1062028 -1059090 -999294 -880574 -554044 -237593 -328064 -651768 -593771 -238194
8027 -238194 289641 755842 742483 656262 633546 470367 1007388 1396648 1047068 647266
8017 647266 139270 -23340 142845 46593 -333865 -192572 -18056 152745 93051 12248
8007 12248 75421 190901 499027 670766 557001 -13295 -514580 -622567 -105138 383005
7997 383005 438715 119904 15737 -100725 -576987 -583635 -373445 -455330 -683201 -543593
7987 -543593 -249989 -710777 -1066317 -797741 -187876 341835 487119 423719 274563 543881
7977 543881 1002135 1278153 1313555 874326 256512 102834 -69970 58735 -85489 -535550
7967 -535550 -328128 90436 305028 161442 -72667 149847 732426 694975 195892 54076
7957 54076 131533 171510 74066 -530217 -891833 -817578 -877577 -967876 -915300 -692757 -617123
7946 -617123 -339834 -135493 -91226 115438 6632 19252 184061 140424 -164711 93423
7936 93423 474195 426960 260397 355810 227042 68744 -29720 -277545 -246938 -336863 12745
7925 12745 297476 551940 1221610 1318266 1029565 941409 767831 762128 327147 -359055 -977728
7914 -977728 -1175760 -1058442 -1059353 -976710 -782624 -704865 -1066140 -1147676 -815330 -841996 -1179249
7903 -1179249 -1393591 -1454940 -1026445 -666823 -674488 -286516 -132982 -133285 -14328 231747 557490
7892 557490 737370 830372 699507 434738 -43984 -564217 -547955 -247729 110525 430466
7882 430466 607424 337017 277171 229578 131585 372480 666650 628499 593000 384441 122387
7871 122387 -201230 -720032 -1142583 -919668 -734639 -904060 -712772 -706149 -1119851 -844775
7861 -844775 -377368 -297796 -386208 -360832 -82767 155697 276085 175670 343809 227465
7851 227465 176843 291231 239891 587441 711075 465361 -153694 -555289 -793308 -853157
7841 -853157 -767548 -414474 -72898 24666 227120 470832 -43315 -427599 -58627 105220
7831 105220 92301 -172024 -147768 276362 11497 -352389 -252452 -41810 -185147 -715694
7821 -715694 -501782 54827 -27595 -559424 -611027 -409034 -11433 -45632 -363554 -477198
7811 -477198 -304466 15986 38322 176689 617497 989238 1007658 684424 583146 600412
7801 600412 86102 -171409 34013 183375 224216 475669 715760 667520 465929 141820
7791 141820 191263 441784 433559 368542 586582 583030 86807 -439500 -384106 176122 612518
7780 612518 1024998 1031352 441313 235253 157107 97399 -55329 -145869 -166740 -233734 -130534
7769 -130534 -210404 50276 550309 738862 507995 418003 568380 605465 781819 792080
7759 792080 549208 517264 506127 51676 -48097 141693 339758 639272 399583 -176213
7749 -176213 -507091 -681926 -848191 -861497 -837080 -881907 -788368 -602285 -480800 -334636
7739 -334636 -241924 -75585 55769 -84421 -260675 -340979 -382436 -453792 -709296 -617730 -370815
7728 -370815 -514949 -636998 -601501 -494780 -475476 -609324 -626568 -334041 153109 22060
7718 22060 -228673 142530 265320 63280 133120 42207 117964 127432 347431 843563 1037456
7707 1037456 879731 197510 -161878 -372848 -637941 -605273 -149668 319498 -661 25678
$$ [...]
##END NTUPLES=NMR SPECTRUM
##END=
