##TITLE=C13_Pr 4973
 CDCl3, 17600 sc

 28.12.2020
##JCAMPDX= 6.0         $$ Bruker NMR JCAMP-DX V2.0
##DATA TYPE= NMR SPECTRUM
##DATA CLASS= NTUPLES
##ORIGIN= UXNMR, Bruker Analytische Messtechnik GmbH
##OWNER= root
$$ XWIN-NMR		Version 3.5
$$ Tue Dec 29 10:16:23 2020 Russian Standard Time (UT+4h)  she@DPX200
##.OBSERVE FREQUENCY= 50.327896
##.OBSERVE NUCLEUS= ^13C
##.ACQUISITION MODE= SIMULTANEOUS
##.ACQUISITION SCHEME= undefined
##.AVERAGES= 17602
##.DIGITISER RES= 17
##SPECTROMETER/DATA SYSTEM= spect
##.PULSE SEQUENCE= zgpg30
##.SOLVENT NAME= CDCl3
##.SHIFT REFERENCE= (INTERNAL, CDCl3, 0, 222.646)
##AUDIT TRAIL= $$ (NUMBER, WHEN, WHO, WHERE, WHAT)
$$ ##TITLE= Audit trail, XWIN-NMR		Version 3.5
$$ ##JCAMPDX= 5.01
$$ ##ORIGIN= Bruker BioSpin GmbH
$$ ##OWNER= she
$$ F:/spectra/data/she/nmr/c13/1/pdata/1/auditp.txt
$$ ##AUDIT TRAIL=  $$ (NUMBER, WHEN, WHO, WHERE, WHAT)
(   1,<2020-12-29 10:14:55.81 +0400>,<she>,<DPX200>,
      <created by zg, POWCHK disabled, PULCHK disabled
       terminated by command 'halt'
       configuration hash MD5:
       00 E9 B6 7A A2 85 ED C7 34 08 36 98 17 FE 4E 26
       data hash MD5: 32K
       A4 E6 94 16 C5 5C DF 6C 4D A9 C8 45 F0 08 60 48>)
(   2,<2020-12-29 10:15:01.43 +0400>,<she>,<DPX200>,
      <Start of raw data processing
       efp BC_mod = 2 LB = 1 FT_mod = 6 PKNL = 1 PHC0 = -262.1635 PHC1 = 23.56242 SI = 32K 
       data hash MD5: 32K
       86 40 28 71 B7 69 7B CE CC 3D FC A6 13 90 45 F5>)
(   3,<2020-12-29 10:15:08.48 +0400>,<she>,<DPX200>,
      <abs ABSG = 5 
       data hash MD5: 32K
       16 09 92 CB 77 9E 12 65 08 13 6C 66 60 80 7E 82>)
(   4,<2020-12-29 10:15:46.48 +0400>,<she>,<DPX200>,
      <pk PHC0 = -1.155427 PHC1 = 0 
       data hash MD5: 32K
       23 7B 1D 9E 51 E3 31 7E F3 2D 1C 96 B8 E8 92 B2>)
(   5,<2020-12-29 10:15:56.67 +0400>,<she>,<DPX200>,
      <abs ABSG = 5 
       data hash MD5: 32K
       6D 27 AC 5B 28 AA F0 C4 4D 0A 1A 4B CE 2A 7C CC>)
$$ ##END=
$$ 
$$ hash MD5
$$ 83 A0 CD A8 6C 81 DD DE 31 C3 BF 61 2F 03 1D DC
##$RELAX= 
##$RELAX= 
##$RELAX= 
##$RELAX= 
##$RELAX= 
##$RELAX= 
##$RELAX= 
##$RELAX= 
$$ Bruker specific parameters
$$ --------------------------
##$DU= <F:/spectra>
##$EXPNO= 1
##$NAME= <c13>
##$PROCNO= 1
##$TYPE= <nmr>
##$USER= <she>
##$AMP= (0..31)
100 100 100 100 100 100 100 100 100 100 100 100 100 100 100 100 100 100 
100 100 100 100 100 100 100 100 100 100 100 100 100 100 
##$AQSEQ= 0
##$AQ_mod= 1
##$AUNM= <au_zg>
##$AUTOPOS= <>
##$BF1= 50.322709
##$BF2= 200.13
##$BF3= 50.322709
##$BF4= 500.13
##$BF5= 500.13
##$BF6= 500.13
##$BF7= 500.13
##$BF8= 500.13
##$BYTORDA= 1
##$CFDGTYP= 0
##$CFRGTYP= 5
##$CHEMSTR= <none>
##$CNST= (0..31)
1 1 145 1 1 1 1 1 1 1 1 1 1 1 1 1 1 1 1 1 1 1 1 1 1 1 1 1 1 1 1 1 
##$CPDPRG= <waltz16>
##$CPDPRG1= <>
##$CPDPRG2= <waltz16>
##$CPDPRG3= <>
##$CPDPRG4= <mlev>
##$CPDPRG5= <mlev>
##$CPDPRG6= <mlev>
##$CPDPRG7= <mlev>
##$CPDPRG8= <mlev>
##$CPDPRGB= <>
##$CPDPRGT= <>
##$D= (0..31)
$$ [...]
##$SUBNAM4= <"">
##$SUBNAM5= <"">
##$SUBNAM6= <"">
##$SUBNAM7= <"">
##$SUBNAM8= <"">
##$SUBNAM9= <"">
##$SW= 239.972175391363
##$SWIBOX= (0..15)
0 1 3 0 0 0 0 0 0 0 0 0 0 0 0 0 
##$SW_h= 12077.2946859903
##$TD= 32768
##$TD0= 1
##$TE= 0
##$TE2= 300
##$TE3= 300
##$TEG= 300
##$TL= (0..7)
120 120 120 120 120 120 120 120 
##$TP= (0..7)
150 150 150 150 150 150 150 150 
##$TP07= 0
##$TPNAME0= <>
##$TPNAME1= <>
##$TPNAME2= <>
##$TPNAME3= <>
##$TPNAME4= <>
##$TPNAME5= <>
##$TPNAME6= <>
##$TPNAME7= <>
##$TPOAL= (0..7)
0.5 0.5 0.5 0.5 0.5 0.5 0.5 0.5 
##$TPOFFS= (0..7)
0 0 0 0 0 0 0 0 
##$TUNHIN= 0
##$TUNHOUT= 0
##$TUNXOUT= 0
##$USERA1= <user>
##$USERA2= <user>
##$USERA3= <user>
##$USERA4= <user>
##$USERA5= <user>
##$V9= 5
##$VALIST= <valist>
##$VCLIST= <CCCCCCCCCCCCCCC>
##$VD= 0
##$VDLIST= <DDDDDDDDDDDDDDD>
##$VPLIST= <PPPPPPPPPPPPPPP>
##$VTLIST= <TTTTTTTTTTTTTTT>
##$WBST= 1024
##$WBSW= 4
##$XGAIN= (0..3)
0 0 0 0 
##$XL= 0
##$YL= 0
##$YMAX_a= 85194980
##$YMIN_a= -90171294
##$ZGOPTNS= <>
##$ZL1= 120
##$ZL2= 120
##$ZL3= 120
##$ZL4= 120
##$ABSF1= 222.646
##$ABSF2= -17.35081
##$ABSG= 5
##$ABSL= 3
##$ALPHA= 0
##$AQORDER= 0
##$ASSFAC= 0
##$ASSFACI= 0
##$ASSFACX= 0
##$ASSWID= 0
##$AUNMP= <proc_1d>
##$AZFE= 0.1
##$AZFW= 0.5
##$BCFW= 0
##$BC_mod= 2
##$BYTORDP= 0
##$COROFFS= 0
##$CY= -3
##$DATMOD= 1
##$DC= 0
##$DFILT= <>
##$DTYPP= 0
##$F1P= 0
##$F2P= 0
##$FCOR= 0.5
##$FTSIZE= 32768
##$FT_mod= 6
##$GAMMA= 0
##$GB= 0
##$INTBC= 1
##$INTSCL= 4.134877e-10
##$ISEN= 128
##$LB= 1
##$LEV0= 0
##$LPBIN= 0
##$MAXI= 10000
##$MC2= 0
##$MEAN= 0
##$ME_mod= 0
##$MI= 0.1934396
##$NCOEF= 0
##$NC_proc= 2
##$NLEV= 6
##$NOISF1= 120.0001
##$NOISF2= 80.00006
##$NSP= 0
##$NTH_PI= 0
##$NZP= 0
##$OFFSET= 222.646
##$PC= 1.4
##$PHC0= -263.3189
##$PHC1= 23.56242
##$PH_mod= 1
##$PKNL= yes
##$PPARMOD= 0
##$PSCAL= 0
##$PSIGN= 0
##$REVERSE= no
##$SF= 50.3227304947849
##$SI= 32768
##$SIGF1= 140
##$SIGF2= 120
##$SINO= 11.81781
##$SIOLD= 32768
##$SREGLST= <13C.CDCl3>
##$SSB= 0
##$STSI= 32768
##$STSR= 0
##$SW_p= 12077.2946859903
##$SYMM= 0
##$S_DEV= 0
##$TDeff= 32768
##$TDoff= 0
##$TI= <>
##$TILT= no
##$TM1= 0
##$TM2= 0
##$TOPLEV= 0
##$USERP1= <user>
##$USERP2= <user>
##$USERP3= <user>
##$USERP4= <user>
##$USERP5= <user>
##$WDW= 1
##$XDIM= 32768
##$YMAX_p= 345578447
##$YMIN_p= -4734125
$$ End of Bruker specific parameters
$$ ---------------------------------
##NTUPLES= NMR SPECTRUM
##VAR_NAME=  FREQUENCY,     SPECTRUM/REAL,   SPECTRUM/IMAG
##SYMBOL=    X,             R,               I
##VAR_TYPE=  INDEPENDENT,   DEPENDENT,       DEPENDENT
##VAR_FORM=  AFFN,          ASDF,            ASDF
##VAR_DIM=   32768,         32768,           32768
##UNITS=     HZ,            ARBITRARY UNITS, ARBITRARY UNITS
##FACTOR=    0.368581032318806, 1,           1
##FIRST=     11204.1544571687, 0,            0
##LAST=      -873.140228821589, 0,           0
##MIN=       -873.140228821589, -4734125,    0
##MAX=       11204.1544571687, 345578447,    0
$$ Real data points
##PAGE= N=1
##DATA TABLE= (X++(R..R)), XYDATA
$$ [...]
15969e58526L82554K34620K27860r5557j33279j05715J51430Q521j72085J11704
$$ -558526 -175972 58648 286508 190951 57672 -48043 103387 111908 -60177 51527
15959E1527J42207J04113o7962m25400p7854j71263n167N29098P8234n04557m03197
$$ 51527 193734 297847 229885 -195515 -273369 -444632 -449799 79299 157533 -347024 -750221
15948g50221j11082N0670r7315M3699o7012J53661O34655M69487M34977L22264
$$ -750221 -861303 -810633 -907948 -864249 -931261 -777600 -142945 326542 761519 1083783
15938A083783p1123j44920k83232l07364m1705K0436j28832r4820K5099m8604
$$ 1083783 1012660 867740 584508 277144 235439 255875 127043 32223 57322 8718
15928H718K15625K78492j57712l07612n62869j14809L40230K4047j65104J7692
$$ 8718 224343 502835 345123 37511 -525358 -640167 -299937 -275890 -440994 -423302
15918d23302L26030L06652P0093J519J35j30991l00405j1170L29093J03185L0446
$$ -423302 -97272 209380 279473 280992 281127 150136 -150269 -161439 167654 270839 301285
15907C01285J75052n4138k23902l25546k96298k13236j86167J69352M49617L49014
$$ 301285 476337 422199 198297 -127249 -423547 -636783 -822950 -653598 -203981 145033
15897A45033N51274J53853m32410k69146k19642J53718N25384L94321J36982r8714
$$ 145033 696307 850160 417750 148604 -71038 82680 608064 1002385 1139367 1040653
15887A040653j07192N9228m52024n42379M1610M35047p1080j29929Q5738k38327
$$ 1040653 933461 992689 540665 -1714 39896 474943 403863 273934 359672 121345
15877A21345m78175J87361L25574M68488L74784j86027J4454J28398j81636n27748
$$ 121345 -356830 -169469 156105 624593 999377 813350 827804 956202 774566 246818
15867B46818j55735O9465J79697l13860m25858l01257l80860n7313J35053J20467
$$ 246818 91083 160548 340245 26385 -399473 -700730 -1081590 -1138903 -1003850 -883383
15857h83383J68360j61030j48689j3205N4738l7444L04322L25746J80098N2782
$$ -883383 -715023 -876053 -1024742 -1037947 -983209 -1020653 -716331 -390585 -210487 -157705
15847a57705J41141r3972K15380M00549r7492J98224J17168j01133k76800o9181
$$ -157705 -16564 -110536 104844 505393 407901 606125 723293 622160 345360 276179
15837B76179j3984k35575m9621P3521L33024M28859J26761L4225k82350l87345
$$ 276179 262195 26620 -23001 50520 383544 812403 939164 973389 691039 303694
15827C03694k19896Q0457K23427L83711K6560p7629l96778n46895l80561p4414
$$ 303694 83798 164255 387682 771393 797953 720324 323546 -223349 -603910 -678324
15817f78324J84477L11983J61618Q4866K30598m5510j93186j9766L65396N21674
$$ -678324 -493847 -181864 -20246 64620 295218 249708 56522 36756 402152 923826
15807I23826O0531k30711l13581L9206J01669j42116k91747j66937l9166k66694
$$ 923826 984357 753646 440065 479271 580940 438824 147077 -19860 -59026 -325720
15797c25720l25212N801K28330p6265K67107N44491N41859K30032j31136j35391
$$ -325720 -650932 -645131 -416801 -493066 -225959 318532 860391 1090423 959287 823896
15787H23896J04130m7062l38589O1820L86291r5939l5040J32827l65988l39513
$$ 823896 928026 880964 542375 604195 990486 894547 859507 992334 626346 286833
15777B86833j90347q8854J15422q3896k56465J52519N7676m40591m45493k7525
$$ 286833 96486 7632 123054 39158 -217307 -64788 -7112 -447703 -893196 -920721
15767i20721Q0515J36343M70040K84964m1358j45010j16759K24439J5078m26097
$$ -920721 -840206 -703863 -233823 51141 9783 -135227 -251986 -27547 -12469 -438566
15757d38566j37341J49196J58593J73643Q627m7896J42492J48849P3207N30539
$$ -438566 -575907 -426711 -268118 -94475 -85848 -133744 8748 157597 230804 761343
15747G61343P6698m21222k89092J7114R9918P5736L26720K61069K08232k8863
$$ 761343 838041 416819 127727 144841 244759 320495 647215 908284 1116516 1087653
15737A087653j52022q3113o6669r4869m05078k82355j42884k7460L0228m8590
$$ 1087653 935631 852518 785849 690980 285902 3547 -139337 -166797 -136569 -185159
15727a85159Q9090j38007j54451p0934N0622K80168K27121j20517j37739j58713
$$ -185159 -96069 -234076 -388527 -459461 -408839 -128671 98450 -22067 -159806 -318519
15717c18519Q4319J98436K99928J30680j28824J84522N58324L16347m4864k1345
$$ -318519 -234200 -35764 264164 394844 266020 450542 1008866 1325213 1280349 1259004
15707A259004j32900m10148m47535k25124k67111k55492K5211m9412J96705N11900
$$ 1259004 1126104 715956 268421 43297 -223814 -479306 -454095 -503507 -306802 205098
15697B05098J73289k17262L8864L22189l8880k31177q8750O4375J8999r6389J65762
$$ 205098 378387 161125 199989 522178 483298 252121 163371 227746 246745 150356 316118
15686C16118k8774P3992K12492M8607K71556K4565k40875J8077j2391p6448j51302
$$ 316118 287344 361336 573828 622435 893991 918556 677681 695758 683367 606919 455617
15675D55617k47680k42897J46578L04165m8072j18792j62649j12123j97836k79528
$$ 455617 207937 -34960 111618 415783 367711 248919 86270 -25853 -223689 -503217
15665e03217l3737K00519N4048j93459p7303L04731L59478K07545L7025P6891
$$ -503217 -536954 -336435 -282387 -475846 -553149 -248418 111060 318605 355630 432521
15655D32521J36494k655j80592j71971R8070M03391J84722j1956k75679P2222
$$ 432521 569015 566360 385768 213797 311867 715258 899980 888024 612345 684567
15645F84567j22702l39977m6299k7167k96793J81953N21281J5885k60021k15186
$$ 684567 561865 221888 175589 148422 -148371 33582 554863 570748 310727 95541
15635I5541J88086P1653k7443n0228r3697P1442j52360l65643j24897J30695K51068
$$ 95541 283627 355280 327837 277609 183912 255354 102994 -262649 -387546 -256851 -5783
15624e783K05915L3646L9223L40251J53286l41827l57285M39m1560k50022k76444
$$ -5783 200132 233778 273001 613252 766538 424711 67426 67865 26305 -223717 -500161
15613e00161J02145L73074l15103j22250J32968J62695J00048m0624r2386l9797
$$ -500161 -398016 -24942 -340045 -462295 -329327 -166632 -66584 -107208 -199594 -239391
15603b39391L54760J81298r6173j64966J05913P2825j35383l40266j51678k5444
$$ -239391 115369 296667 200494 35528 141441 214266 78883 -261383 -413061 -438505
15593d38505K03719K26504k62206m84038j901R9828p2624J72000K36075k4330
$$ -438505 -234786 -8282 -270488 -754526 -756427 -656599 -729223 -557223 -321148 -345478
15583c45478r5307l1413j28062K98706O34769M322m59975l67213J48494K04645
$$ -345478 -440785 -472198 -600260 -301554 333215 337537 -122438 -489651 -341157 -136512
15573a36512M84249O04412O32005k9433l21254j77152j83902l57383m59514J89126
$$ -136512 347737 952149 1584154 1554721 1233467 1056315 872413 515030 55516 244642
15563B44642O6502j50639J73589M12194M52677M8509m9291n2742j65476J32998
$$ 244642 311144 160505 334094 746288 1198965 1247474 1198183 1145441 979965 1112963
15553A112963R5238j40327j45293K3266P9932j70555k72503j3467l4728j09744
$$ 1112963 1208201 1067874 922581 945847 1025779 855224 582721 569254 534526 424782
15543D24782k48805l80869j23940K47449M212n26606l88501R0726K21075Q2990
$$ 424782 175977 -204892 -328832 -81383 -77171 -603777 -992278 -901552 -680477 -597487
15533e97487j17696j41624j29393L16205K83009Q6842j91981J18174M34143L71004
$$ -597487 -715183 -856807 -986200 -669995 -386986 -300144 -492125 -373951 60192 431196
15523D31196K72001J02875j77171m5878j1942m54685l75143J10805M429k4422
$$ 431196 703197 806072 628901 583023 571081 116396 -258747 -147942 -143513 -167935
15513a67935J31134N6963j2484Q6696L02515L93790R6737o6165o5565l55912k45898
$$ -167935 -36801 20162 7678 94374 396889 790679 887416 821251 755686 399774 153876
15502A53876l44529j61018J9721P5898n953J22079J22866L5984j5583k14270O0209
$$ 153876 -190653 -351671 -331950 -256052 -262005 -139926 -17060 18924 3341 -210929 -150720
15491a50720L99587R7255k82015L3876n3522m3959K48748J43866l58427j45225
$$ -150720 248867 346122 64107 97983 44461 502 249250 393116 34689 -110536
15481a10536P2157K12329J90858j46434l99279m62134j23464O8256J33467j09516
$$ -110536 -38379 173950 364808 218374 -180905 -643039 -766503 -698247 -564780 -674296
15471f74296j26644J3568K86159J27111K32854K60062j179J58459q1099n5626
$$ -674296 -800940 -787372 -501213 -374102 -141248 118814 117635 276094 194995 139369
15461A39369P1983l10886j51366J20171j00340k50981r6297R3605Q764L1754K01789
$$ 139369 211352 -99534 -250900 -130729 -231069 -482050 -578347 -484742 -475978 -444224 -242435
15450b42435M54235J71486J16533N53945O75083M86038J12343n38652q19078n01503
$$ -242435 211800 383286 499819 1053764 1728847 2214885 2327228 1788576 969498 467995
15440D67995k12781m8547J93390j0913k0946Q3190n0881l35282k98607J6284j59979
$$ 467995 255214 206667 400057 389144 368198 451388 400507 65225 -233382 -217098 -377077
15429c77077P8720M42850K19487k3213J0561P1485R6881k12339l39600O3401L1085
$$ -377077 -298357 144493 363980 340767 351328 422813 519694 307355 -32245 31156 62241
15418F2241k66557j74032K40778J25682j14440Q8718M7667N7439J26408M11760
$$ 62241 -204316 -378348 -137570 -11888 -126328 -37610 10057 67496 193904 605664
15408F05664K4081j28912o49l25642k96881M84759M83748l61051l38563k37336
$$ 605664 629745 500833 500184 174542 -122339 362420 846168 485117 146554 -90782
15398i0782l41679J42164O14508J93185k34784j73612q9016M3454j16627k54037
$$ -90782 -432461 -290297 324211 517396 282612 109000 19984 63438 -53189 -307226
15388c07226m5712J7531J59821M2556k54892k96668J12054N76114N26570J2073
$$ -307226 -352938 -335407 -175586 -133030 -387922 -684590 -572536 3578 530148 542221
15378E42221j03842K6506j36822R5380J57083K15090J06622m19753j15717J45900
$$ 542221 438379 464885 328063 423443 580526 795616 902238 482485 366768 512668
15368E12668j90179m43233K4945K55283L41063Q3515l49204n9333l5516L6163
$$ 512668 322489 -120744 -95799 159484 500547 584062 234858 175525 140009 176172
15358A76172K08048K19639J12315O715j4447Q55l7370k98244j73879M7883k5578
$$ 176172 384220 603859 716174 722889 708442 709297 671927 373683 199804 247687 222109
15347B22109r4285k08963J25512M4833K80124J28967n84171l50021M19376M02199
$$ 222109 127824 -81139 44373 89206 369330 498297 -85874 -435895 -16519 385680
15337C85680l70504l43618J45526L68549K20561o9056l28352j91025J64797M02922
$$ 385680 15176 -328442 -182916 185633 406194 337138 8786 -182239 -17442 385480
15327C85480M72823N43738k16228n33451m53887j41733J1788k93708q685J38278
$$ 385480 858303 1402041 1185813 652362 198475 56742 68530 -225178 -233863 -95585
15317i5585M7187q3700Q7674N50048L66916k48622k89425K6957R3005l89327p3293
$$ -95585 -48398 -132098 -44424 505624 872540 623918 334493 361450 454455 65128 -8165
15306h165j15462j97007l54039m38287L77o2721M6487K84406J85123J04153K2833
$$ -8165 -123627 -320634 -674673 -1112960 -1112583 -1175304 -1128817 -844411 -659288 -555135 -532302
15295e32302K80190L7811k34532j74944j77617j92520K4014N1839m2029J69498
$$ -532302 -252112 -214301 -448833 -623777 -801394 -993914 -969900 -918061 -960090 -790592
15285g90592K08761L62793J28225j57723j70018m76177j10771L89739k06833m38126
$$ -790592 -581831 -219038 -90813 -248536 -418554 -894731 -1005502 -615763 -822596 -1260722
15275a260722J45706M20496J86129m45817p6548M50732K90644N05027M7953m35210
$$ -1260722 -1115016 -694520 -508391 -954208 -1030756 -580024 -289380 215647 263600 -171610
15265a71610L7166r439J84431K4336l93394k47934R6267L06317K00658N7164K60895
$$ -171610 -134444 -143883 40548 64884 -328510 -576444 -480177 -173860 26798 83962 344857
15254C44857K97597K38861q0391j01442J57896j44904l98268l54948k32118N6651
$$ 344857 642454 881315 800924 699482 857378 712474 314206 -40742 -272860 -216209
15244b16209L26390K67106K46882n1801l37129k72099J90111L25599j88224l40057
$$ -216209 110181 377287 624169 572368 235239 -36860 153251 478850 290626 -49431
15234d9431j10619j61966n27022m31989J80510M99550O0627k37234K00985M684
$$ -49431 -160050 -322016 -849038 -1281027 -1100517 -600967 -540340 -777574 -576589 -571905
15224e71905P5815K48625J95867m3122j65947j65701k15338Q3912O62725K99388
$$ -571905 -496090 -247465 -51598 -94720 -260667 -426368 -641706 -557794 104931 404319
15214D04319l63673k13136M23618K76589l1039J37298K6479J5926o3728k45779
$$ 404319 40646 -172490 251128 527717 496678 633976 660455 676381 612653 366874
15204C66874l24166n40254k36065K7097P484K05689J36858l4632j10628J27449
$$ 366874 42708 -497546 -733611 -706514 -699030 -493341 -356483 -391115 -501743 -374294
15194c74294L52999K51788j37666n71554k7012K17399O5535K07349J59524p8900
$$ -374294 -21295 230493 92827 -478727 -505739 -288340 -222805 -15456 144068 65168
15184F5168k22779l15650j70140L49273J76441j55257m13798l2154K26296R107
$$ 65168 -157611 -473261 -643401 -294128 -117687 -272944 -686742 -718896 -492600 -483493
15174d83493j07254N5419J14127J52438N70077L41138k95r7414j50407m58175
$$ -483493 -590747 -535328 -421201 -268763 301314 642452 642157 544743 394336 -63839
15164f3839n29740J42662J93753M6840M42083L03120k91699o12328j64536J36427
$$ -63839 -593579 -450917 -257164 -210324 231759 534879 243180 -369148 -533684 -397257
15154c97257L0643K3436m8155j43132n7221j60622K453J52504L06532L17125N06891
$$ -397257 -366614 -343178 -391333 -534465 -591686 -752308 -749855 -597351 -290819 26306 533197
15143E33197L23302k27875j95660k24271k12263k47966k35090O5277J64934L64570
$$ 533197 856499 628624 432964 208693 -3570 -251536 -486626 -421349 -256415 108155
15133A08155K27144j27090k40966j40495N10749M33860k01986k76216k56402j87639
$$ 108155 335299 208209 -32757 -173252 337497 771357 569371 293155 36753 -150886
15123a50886O9892Q3541n2373j06436k83534m44656m04714J4024J66331j7005
$$ -150886 -80994 2547 -49826 -156262 -439796 -884452 -1289166 -1275142 -1108811 -1125816
15113a125816M62287M98205K07649J96479M5044J51708n300k51776j23874r6129
$$ -1125816 -663529 -165324 42325 238804 283848 435556 430256 178480 54606 -41523
15103d1523k15894J4652M6904J32800N20397K05254l07518P1201L35658j26566
$$ -41523 -257417 -242765 -195861 -63061 457336 662590 355072 426273 761931 635365
15093F35365k86415k41448k8457N38875J18800k86545k61512j68405m0715K68421
$$ 635365 348950 107502 79045 617920 736720 450175 188663 20258 -20457 247964
15083B47964L35906j41720n64394l55813j35575K46560N96607L88926o1492k23264
$$ 247964 583870 442150 -122244 -478057 -613632 -367072 229535 618461 556969 333705
15073C33705Q586m9053k90471o33946k94325P1125m2787j32242O9024M93116J08644
$$ 333705 342291 293238 2767 -631179 -925504 -854379 -897166 -1029408 -960384 -467268 -358624
15062c58624k31307m8553L43493L66233J23379J62461K03960K74685J24295k64061
$$ -358624 -589931 -638484 -294991 71242 194621 357082 561042 835727 960022 695961
15052F95961l34734j40836j27650j27952k2978l27598m56056P2284K71176L6211
$$ 695961 361227 220391 92741 -35211 -58189 -385787 -841843 -769559 -498383 -462172
15042d62172k55739l19929J07150J44842K14903N02233M01906o9717l72936j57581
$$ -462172 -717911 -1037840 -930690 -785848 -570945 -68712 333194 263477 -109459 -267040
15032b67040Q6237K54105L14540j30669k83717p2059m11914n23538n1548L96931
$$ -267040 -180803 73302 387842 257173 -26544 -98603 -510517 -1034055 -1085603 -688672
15022f88672j22784n85690l86622j04619J93148O11511R6344P8692M44427N8445
$$ -688672 -811456 -1397146 -1783768 -1888387 -1695239 -1083728 -987384 -908692 -464265 -405820
15012d05820k92546J40231J95428j66677O6271K26395j98218l32451k95218k7610
$$ -405820 -698366 -558135 -362707 -529384 -463113 -236718 -434936 -767387 -1062605 -1090215
15002a090215k6584J76J23556L10704M2202M7795L01678K05117j91655P1193L52981
$$ -1090215 -1116799 -1116623 -993067 -682363 -640161 -592366 -290688 -85571 -277226 -206033 146948
14991A46948R8003R010j78839l68539n58845l33641k7724m693N0183K40029J44783
$$ 146948 244951 253961 75122 -293417 -852262 -1185903 -1213627 -1218320 -1168137 -928108 -783325
14980g83325j37575k42533l02584k1253L00440O07888M74123J30194Q2912P0139
$$ -783325 -920900 -1163433 -1466017 -1487270 -1186830 -578942 -104819 25375 108287 178426
14970A78426j62709j20316K9434k0334k62307j42689M02895N4113j36253K8234
$$ 178426 15717 -104599 -75165 -95499 -357806 -500495 -97600 -43487 -179740 -151506
14960a51506L70347P9311k77647l13236k33489j13072K99414M21911M3900l3356
$$ -151506 218841 298152 20505 -292731 -526220 -639292 -339878 82033 125933 92577
14950I2577K23859N9604j71293K1642K41993P9271l56132l14589j54649L02341
$$ 92577 316436 376040 204747 226389 468382 547653 191521 -123068 -277717 24624
14940B4624M63043J05544K10264J99780J07766J53676m83497m75251J63303M88458
$$ 24624 487667 593211 803475 1003255 1111021 1264697 781200 305949 469252 957710
14930I57710M59534l10674n53092k72269j82737j03403p4199J6983O4057j44645
$$ 957710 1417244 1106570 553478 281209 98472 -4931 -79130 -62147 1910 -142735
14920a42735r3107J62126K62361R6916Q0390J2372N08286M64076J1013O6275O1393
$$ -142735 -235842 -73716 188645 285561 365951 378323 886609 1350685 1361698 1427973 1489366
14909A489366K2769k95090n51208n59549k14141j32455J14024J56376J16215J11374
$$ 1489366 1512135 1217045 665837 106288 -107853 -240308 -126284 30092 146307 257681
14899B57681J46049J13336n9612o9636L5874Q3892o1221j92701J98288M60488
$$ 257681 403730 517066 457454 387818 423692 507584 446363 253662 451950 912438
14889I12438K07414O6684Q5125j35748o67542l61816K7857j94314m21799l17365
$$ 912438 1119852 1186536 1271661 1135913 468371 106555 134412 -59902 -481701 -799066
14879g99066L60365L40192L90935K21865o8096k32198m66140k54667O4937J23151
$$ -799066 -438701 -98509 292426 514291 446195 213997 -252143 -506810 -441873 -318722
14869c18722n7426k33306l8608j78767m0826J06292K47615O8370n7223J37969
$$ -318722 -376148 -609454 -648062 -826829 -867655 -761363 -513748 -445378 -502601 -364632
14859c64632J79645J74937p783J8297j69184J0092r954k67729k8328P1235j97172
$$ -364632 -184987 -10050 -17833 464 -168720 -158628 -168582 -436311 -464639 -393404 -590576
14848e90576k68254j18203O0159O9130m40407k77895K73011J62884J00627L93362
$$ -590576 -858830 -977033 -916874 -847744 -1288151 -1566046 -1293035 -1130151 -1029524 -636162
14838f36162K32898J08815K75916J61818J60953j40570n4178k96310n78171P020
$$ -636162 -403264 -294449 -18533 143285 304238 163668 109490 -186820 -764991 -757971
14828g57971O10399J71743l2925k1672O6816Q5101j19945j29208j41606k01187
$$ -757971 -147572 24171 -8754 -30426 36390 121491 1546 -127662 -269268 -470455
14818d70455j3548J90673M0123l23229l06396k9258J78981L4853J55112L23528
$$ -470455 -484003 -293330 -253207 -576436 -882832 -912090 -733109 -698256 -543144 -219616
14808b19616m0247j24395k37585j03271K30687L20818k02388j08105K36932K52650
$$ -219616 -259863 -384258 -621843 -725114 -494427 -173609 -375997 -484102 -247170 5480
14798E480L35771J44421R4571L6102j61126r1565J35392m3678j38549J2832O5560
$$ 5480 341251 485672 580243 616345 455219 363654 499046 455368 316819 329651 395211
14787C95211L7585q0508K5336J10453n0915k52866n7144j070j3175K9768K62769
$$ 395211 432796 352288 377624 488077 437162 184296 127152 126082 112907 142675 405444
14776D05444N85509M11782j77331k91899n71348q34060m73102J03973L95716j5934
$$ 405444 990953 1402735 1225404 933505 362157 -471903 -945005 -841032 -445316 -461250
14766d61250j84835p5369L26451L96765L25934n946J23573J98612j79182k50745
$$ -461250 -646085 -721454 -395003 1762 327696 321750 445323 643935 464753 214008
14756B14008k30779q0106k41300J30195K43304l5889L6383P4302J24348J54719
$$ 214008 -16771 -96877 -338177 -207982 35322 -567 35816 110118 234466 389185
14746C89185O1750J3131n3313l17126m95851n27327j3035J71102J31787K45247
$$ 389185 450935 464066 410753 93627 -402224 -929551 -942586 -771484 -639697 -394450
14736c94450M14034K67998K62946K28105q9794k41044m44011m17777n8373J31288
$$ -394450 19584 287582 550528 778633 688839 447795 3784 -413993 -472366 -341078
14726c41078J04362L56259J19924j32683j59286n4629J08166j47312l85852J60977
$$ -341078 -236716 119543 239467 106784 -52502 -107131 1035 -146277 -532129 -371152
14716c71152L93352l2986l7145J11861O3866m24833n03059p9064K97092o6473
$$ -371152 22200 -10786 -47931 63930 127796 -297037 -800096 -879160 -582068 -648541
14706f48541l29193m16150K32347M39607j08073J15552L38908m5653l39141l74048
$$ -648541 -977734 -1393884 -1161537 -721930 -830003 -714451 -375543 -421196 -760337 -1134385
14696a134385l25419Q8299L39334K22775J82026N20098N25652L16745j35389o55107
$$ -1134385 -1459804 -1371505 -1032171 -809396 -627370 -107272 418380 735125 599736 -55371
14686e5371l49072j45318j00620j07232K16617J72445J70392k68769k98399n361
$$ -55371 -404443 -549761 -650381 -757613 -540996 -368551 -198159 -466928 -765327 -770688
14676g70688o3135q471k2186K52904J62715M7086J78340L39823K34059j44551
$$ -770688 -833823 -842294 -864480 -611576 -448861 -401775 -223435 116388 350447 205896
14666B05896j66178Q4626j89490n1105L2904m57050j51376N49431N70565M8815
$$ 205896 39718 124344 -65146 -116251 -83347 -540397 -691773 -142342 428223 477038
14656D77038r9380k33354l32791J27223K07316j68433Q8841J36276J32440j3349
$$ 477038 377658 144304 -188487 -61264 146052 -22381 66460 202736 335176 321827
14646C21827n0204K17324J67115j19294k05905J43761R1259R5630J5092L2882
$$ 321827 271623 488947 656062 536768 330863 474624 565883 661513 676605 709487
14636G09487K01967r5544l61485j53331J40981r4617n2854o0636n8791M08866
$$ 709487 911454 815910 454425 301094 442075 347458 294604 233968 175177 584043
14626E84043O66557K36694j90981m90807l83964o4643M4587L8846j1241j59084
$$ 584043 1250600 1487294 1296313 805506 421542 356899 401486 440332 429091 270007
14616B70007j31422J27257K50724l884j40733J87327M08396K87215j69436m49074
$$ 270007 138585 265842 516566 512682 371949 559276 967672 1254887 1085451 636377
14606F36377j56270N725P8901m10673l04333K22472J55181Q1441n48829l57390
$$ 636377 480107 485832 564733 154060 -150273 72199 227380 308821 -240008 -597398
14596e97398m9135K27035J02850k0294Q0050K42036K4965M34674L25802j61141
$$ -597398 -646533 -419498 -316648 -336942 -256892 -14856 10109 444783 770585 609444
14586F09444j45124k88182l25148l38944l07082O2988K36214J49564K3027L8972
$$ 609444 464320 176138 -149010 -487954 -795036 -732048 -495834 -346270 -323243 -284271
14576b84271j20320k72205j28063K51271K16372J70246O0332M09625K466o08027
$$ -284271 -404591 -676796 -804859 -553588 -337216 -166970 -106638 302987 305453 -302574
14566c02574l10346J48552M74195O9508k10241j9909J1678n2537k2538j57474
$$ -302574 -612920 -464368 9827 79335 -130906 -150815 -139137 -191674 -214212 -371686
14556c71686j25422J59917r210k63136j05142J53621J50614K46027K08281j40229
$$ -371686 -497108 -337191 -346401 -609537 -714679 -561058 -410444 -164417 43864 -96365
14546i6365l65303l34430j2970r3629m2658J24959L16480L22185M74407N44157
$$ -96365 -461668 -796098 -809068 -902697 -945355 -820396 -503916 -181731 292676 836833
14536H36833M42617q8199r7277o0945k45055l78735j91335N2910l8701k42610
$$ 836833 1279450 1191251 1093974 1033029 787974 409239 217904 270814 232113 -10497
14526a0497o8655K00202K61377J76483k72663j39309j35067Q0929M5373m7832
$$ -10497 -79152 121050 382427 558910 286247 146938 11871 92800 138173 90341
14516I0341M32521L85731p1068k32403l94653n92868m05563k24638P1995M81000
$$ 90341 522862 908593 837525 605122 210469 -382399 -787962 -1012600 -940605 -459605
14506d59605R9197k58309k10242k55314K39947M31836p9646K4631M2455R8597
$$ -459605 -360408 -618717 -828959 -1084273 -844326 -412490 -492136 -467505 -425050 -326453
14496c26453J23570K75512K58044J85666R0930K99467K91311j10036k44148j78217
$$ -326453 -202883 72629 330673 516339 607269 906736 1198047 1088011 843863 665646
14486F65646l61104l97522r071R384J72101J28037J16387J92245K69321K1774
$$ 665646 304542 -92980 -102051 -92667 79434 207471 323858 516103 785424 807198
14476H07198j39563q6440j09770m97675m42606J04948L43159J39221k35527Q6486
$$ 807198 667635 581195 471425 -26250 -468856 -363908 -20749 118472 -117055 -30569
14466c0569N54053K61540j29235k02765j80839l2119K5868k42509j92121J81649
$$ -30569 523484 785024 655789 453024 272185 240066 265934 23425 -168696 12953
14456A2953m9932k27355N171K6042n5837n3469J61029L69675L89026l273r4524
$$ 12953 -36979 -264334 -259163 -233121 -288958 -342427 -181398 188277 577303 574030 479506
14445D79506m150k85748j20654J46296N5923m11910l44431k98958j63891O4029
$$ 479506 475356 189608 68954 215250 271173 -140737 -485168 -784126 -948017 -883988
14435h83988O4564K116j28600L9636R5349j33469K20803K71548J79689n8086J11020
$$ -883988 -819424 -817308 -945908 -906272 -810923 -944392 -723589 -452041 -272352 -330438 -219418
14424b19418j617k85399j07459j47437p1432K20523K60255J14033L47294J80558
$$ -219418 -221035 -506434 -613893 -761330 -832762 -612239 -351984 -237951 109343 289901
14414B89901J04042j51020q6043J73279J82225p146k13122k241Q7492O9892k45628
$$ 289901 393943 242923 156880 330159 512384 505238 292116 289875 377367 447259 201631
14403B01631k48053j6092J93265r080k17207J93038M9944J48500J83768k04785
$$ 201631 -46422 -62514 130751 121671 -95536 97502 147446 295946 479714 274929
14393B74929m26023k08939Q3761M38936L06054m36762k13992M34294K19627j43493
$$ 274929 -151094 -360033 -276272 162664 468718 31956 -182036 252258 471885 328392
14383C28392m85532l38752O8425J11425K09609N3932q7218j18146p9702L28473
$$ 328392 -157140 -495892 -427467 -316042 -106433 -52501 -139719 -257865 -337567 -9094
14373i094J59040q2129l1394j31217j25091p2698j1106l0691R0452N5217Q5858
$$ -9094 149946 67817 36423 -94794 -219885 -292583 -303689 -334380 -243928 -188711 -102853
14362a02853j0741K41428O8077j82809j9833N1226J12631J65753K63868j18515
$$ -102853 -113594 127834 195911 13102 -6731 44495 157126 322879 586747 468232
14352D68232m01605J33572N5670j40416J01516Q7099J4531L1351K73614j23437
$$ 468232 66627 200199 255869 115453 216969 304068 318599 349950 623564 500127
14342E00127l21990o05078l15710M2608K84941J66227k33594Q488J6496L1467
$$ 500127 178137 -426941 -742651 -700043 -415102 -248875 -482469 -473981 -457485 -426018
14332d26018P1895M3471l24845m17824j83689K36748Q5973l93143j57802K87647
$$ -426018 -354123 -310652 -635497 -1053321 -1237010 -1000262 -914289 -1307432 -1465234 -1177587
14322a177587Q3115J22987M01806L23592L47273K66014k6929k24830k334j33458
$$ -1177587 -1094472 -971485 -569679 -246087 101186 367200 340271 115441 113107 -20351
14312b0351J97671L35647j18759j22226P8536M8541o9101j78244l98294M9152
$$ -20351 177320 512967 394208 271982 350518 399059 329958 151714 -246580 -197428
14302a97428K70374j45687k29690k08332R262P8429L75824M31177j66555l74643
$$ -197428 72946 -72741 -302431 -510763 -501501 -423072 -47248 383929 217374 -157269
14292a57269k49757k52550K75052M29837p498j2872k36893p0982K06716l77015
$$ -157269 -407026 -659576 -384524 45313 37815 24943 -211950 -282932 -76216 -453231
14282d53231k74431l29771k13741K10070L17175p6847j38018L79445K88048P6265
$$ -453231 -727662 -1057433 -1271174 -1061104 -743929 -820776 -958794 -579349 -291301 -215036
14272b15036K67913J18973k83521m54838R8743J40744L9439K56286N1240Q0261
$$ -215036 52877 171850 -111671 -566509 -467766 -327022 -287583 -31297 19943 100204
14262A00204J62336K10415o9868j34801l4796k89881j51308j0643J71014Q2630
$$ 100204 262540 472955 403087 268286 233490 -56391 -207699 -218342 -47328 35302
14252C5302j58805Q0936L41730M97820N3569m34353N0856J31655k22298j81429
$$ 35302 -123503 -42567 299163 796983 850552 416199 467055 598710 376412 194983
14242A94983K0354l362k96158j40556J05371J24170j70546l21298j05339P8656
$$ 194983 215337 211975 -84183 -224739 -119368 4802 -165744 -487042 -592381 -513725
14232e13725K9992l9508j69587k01338R3094J72437L80771K63457l3390j9524
$$ -513725 -483733 -523241 -692828 -894166 -801072 -628635 -247864 15593 -17797 -37321
14222c7321J13152R8113l32360n10348l68703o6041J86114L04020l04488L7129
$$ -37321 75831 173944 -158416 -668764 -1037467 -1103508 -917394 -613374 -917862 -880733
14212h80733K81598R8416k09023k06922K89922K61186J9487r2873K48577N0198
$$ -880733 -599135 -500719 -709742 -916664 -626742 -365556 -346069 -438942 -190365 -140167
14202a40167M1451J51279L3146J76076M39489J60535j81153R0029m4285j33904
$$ -140167 -98716 52563 85709 261785 701274 861809 680656 770685 726400 592496
14192E92496l85142o07157k36969j02971K16253K06595Q6548K80786J36564Q8488
$$ 592496 207354 -399803 -636772 -739743 -523490 -316895 -230347 50439 187003 275491
14182B75491k3229k39366l3167o2803R0646L0776k76215j31548J33924J27896
$$ 275491 252262 12896 -20271 -83074 7572 38348 -237867 -369415 -235491 -107595
14172a07595q8055m59079l80353K38387K70701J19071J2014j5782J57986K94470
$$ -107595 -195650 -654729 -1035082 -796695 -525994 -406923 -394909 -410691 -252705 41765
14162D1765J10917n2016j68330j10084j7568j35076k44633k833K53755K70189
$$ 41765 152682 100666 -67664 -177748 -195316 -330392 -575025 -577858 -324103 -53914
14152e3914J05632k7082o6467j31735k68272l95797L042K56414q385r6584k6315
$$ -53914 51718 24636 -41831 -173566 -441838 -837635 -834593 -578179 -586564 -683148 -709463
14141g09463k06639l51364k24097K89799O81372M74104k2192l6359J30689K23061
$$ -709463 -916102 -1267466 -1491563 -1201764 -520392 -46288 -68480 -104839 25850 248911
14131B48911j47676j22813K33188q0318j12194M238l6697M8669l30056k56012
$$ 248911 101235 -21578 211610 131292 19098 23336 -13361 35308 -294748 -550760
14121e50760J18274K37105L81598J31862o9387j78754n8982J81550L04475R2371
$$ -550760 -432486 -195381 186217 318079 248692 69938 10956 192506 496981 589352
14111E89352k98818n06617k26291J05951m0855k78188j76800J05202K14175L15462
$$ 589352 290534 -216083 -442374 -336423 -377278 -655466 -832266 -727064 -512889 -197427
14101a97427J2900q4326n6935J86390N041k30188L75271K39032P1472Q9190r3105
$$ -197427 -184527 -268853 -325788 -139398 -134357 -364545 10726 249758 321230 410420 317315
14090C17315n53412l46578M0612L01267J82444J07425n8497j44595k52563k04746
$$ 317315 -236097 -582675 -542063 -240796 -58352 49073 -9424 -154019 -406582 -611328
14080f11328K6467J90394L04856P281j45592K4483M62673N80356L28019Q7944
$$ -611328 -584861 -394467 -89611 -82330 -227922 -203439 259234 839590 1167609 1255553
14070A255553k9809l8564m36704n50994l71498k9447K21839j43501k46799k43934
$$ 1255553 1225744 1187180 750476 199482 -172016 -201463 20376 -123125 -369924 -613858
14060f13858j18841K55090K9413Q922r0591P7587K84561K44955Q8172k8007j23633
$$ -613858 -732699 -477609 -448196 -439274 -529865 -452278 -167717 77238 165410 137403 13770
14049A3770k71735k27128j71678n1927J52255M5925p7279L03558K7722n9656k53999
$$ 13770 -257965 -485093 -656771 -708698 -556443 -510518 -587797 -284239 -256517 -316173 -570172
14038e70172j93152J53596L35388L48413P0792R3956j48742j76693j66467P1888
$$ -570172 -763324 -609728 -274340 74073 144865 238821 90079 -86614 -253081 -181193
14028a81193K28743k9593p532l24666j50835L44772M70581l83769k08681M43811
$$ -181193 47550 17957 10425 -314241 -465076 -120304 350277 -33492 -242173 201638
14018B01638M38250k9566l64127j72478J7293J2538k24562k42196k59568r225
$$ 201638 639888 610322 246195 73717 91010 103548 -121014 -363210 -622778 -632003
14008f32003K39228j83947j08300k50938j49072K85368N82615N38422K15389j50843
$$ -632003 -392775 -576722 -685022 -935960 -1085032 -799664 -217049 321373 536762 385919
13998C85919m29799j21203j47240n77692n3717M88204J76896k39217m8475K13663
$$ 385919 -43880 -165083 -312323 -890015 -943732 -455528 -278632 -517849 -566324 -352661
13988c52661j41974J84835L85008M9330n14250l63300R9300L52622M32062O2370
$$ -352661 -494635 -309800 75208 124538 -389712 -753012 -653712 -301090 130972 193342
13978A93342n63418j99485j38961j46968j2987j1887L37620K09920n0220j2667
$$ 193342 -370076 -569561 -708522 -855490 -868477 -880364 -542744 -332824 -383044 -395711
13968c95711k6740J37803L92395L44965j4835k18651k84803J4707k2383k32966
$$ -395711 -422451 -284648 107747 452712 437877 219226 -65577 -50870 -73253 -306219
13958c06219J12434K19695K49178L60129l1454l21715n74067m66372m2266J67483
$$ -306219 -193785 25910 275088 635217 603763 282048 -292019 -758391 -800657 -633174
13948f33174L56565N74894J35284k59420J04484J92273j01292K2369J34319j17948
$$ -633174 -276609 298285 433569 174149 278633 470906 369614 391983 526302 408354
13938D08354k8434Q3492l23333k81814k1120k86429l05340K24220J00763K48129
$$ 408354 379920 463412 140079 -141735 -162855 -449284 -754624 -530404 -429641 -181512
13928a81512L86587J66927K78854Q24619J69763n19733m45047k76435M5396K38948
$$ -181512 205075 372002 650856 1475475 1645238 1125505 680458 404023 449419 688367
13918F88367R5021n9143m03159m35604k85772j14958K82841K58263Q5215j94803
$$ 688367 783388 724245 321086 -114518 -400290 -515248 -232407 25856 111071 -83732
13908h3732j07098J73973k30101k12268J04018q777j04432P885N03150M75305
$$ -83732 -190830 -16857 -246958 -459226 -355208 -363985 -468417 -460532 42618 517923
13898E17923K96885j91725m50048k40335J93910P6817l31551j84242L8882J55839
$$ 517923 814808 623083 173035 -67300 126610 203427 -128124 -312366 -273484 -117645
13888a17645K64903J27114L07532j00439l05709n45275l47825j50868J80334K18800
$$ -117645 147258 274372 581904 481465 175756 -369519 -717344 -868212 -687878 -469078
13878d69078R2580N10164L95320k08210l85892m08723q3919K28714L69841J21742
$$ -469078 -376498 133666 528986 320776 -65116 -473839 -557758 -329044 40797 162539
13868A62539k44585N2669K41084N6484n9841q6539P5879J4327N5309K22795K88740
$$ 162539 -82046 -29377 211707 268191 208350 121811 197690 212017 267326 490121 778861
13857G78861J97018J00488P2281j67638k26142l89822l89053j61034K09750M49876
$$ 778861 975879 1076367 1148648 981010 754868 365046 -24007 -185041 24709 474585
13847D74585J13880J6598J97751L27302j9950k65059k49728r0046J06711l10886
$$ 474585 588465 605063 802814 1130116 1110166 845107 595379 505333 612044 301158
13837C01158n82137j4037L77772K16155k6636J43181J52142L00766M12871o5821
$$ 301158 -280979 -295016 82756 298911 272275 415456 567598 868364 1281235 1215414
13827A215414m06307m19215p5019J44035J11952q3781n65772o84087J05164N2962
$$ 1215414 809107 389892 314873 458908 570860 487079 -78693 -762780 -657616 -604654
13817f04654k39638K9086N8199M2504q5395j37079J63989K67416R0291L6452J61732
$$ -604654 -844292 -815206 -757007 -714503 -799898 -936977 -772988 -505572 -415281 -378829 -217097
13806b17097k49338k35204K56583L26053L2082j41822J79566J99504l1427j64318
$$ -217097 -466435 -701639 -445056 -119003 -86921 -228743 -49177 150327 118900 -45418
13796d5418M0628j56091k82582m58984j4856M43994K32052K94730j72606l74628
$$ -45418 -4790 -160881 -443463 -902447 -917303 -473309 -241257 53473 -119133 -493761
13786d93761K8789L47128L48285K42701l6615n5054o741J05660J45604m26363
$$ -493761 -464972 -117844 230441 473142 436527 381473 374732 480392 625996 199633
13776A99633j68108J54356j1259j32532K27037K23195r3167l50798l09631l01921
$$ 199633 31525 185881 174622 42090 269127 492322 399155 48357 -261274 -563195
13766e63195J51352N00017p5742m28728j88735J46042K06552j00089k74203K26922
$$ -563195 -411843 88174 12432 -416296 -605031 -458989 -252437 -352526 -626729 -399807
13756c99807L88588J69174j15463k24020p1097k61991m81775K38102K46085J91715
$$ -399807 -11219 157955 42492 -181528 -252625 -514616 -996391 -758289 -512204 -320489
13746c20489K18747j38697j08340K63644J15404j38441K00066P9440J18397L94239
$$ -320489 -101742 -240439 -348779 -85135 30269 -108172 91894 171334 289731 683970
13736F83970L80479k53979l81827R6768K84679j17177j09396k4438k33628J14334
$$ 683970 1064449 810470 428643 525411 810090 692913 583517 559079 325451 439785
13726D39785j04250m40126j42127L03290K56254J17436r4482k04029j6055k49600
$$ 439785 335535 -104591 -246718 56572 312826 430262 335780 131751 115696 -133904
13716a33904m03802P5175l1764n2749q8234j19556k3115j32247j11258j31561
$$ -133904 -537706 -462531 -494295 -547044 -635278 -754834 -777949 -910196 -1021454 -1153015
13706a153015l24036j42061Q422K47073O1876L54680O55589L96460Q3880j24473
$$ -1153015 -1477051 -1619112 -1610690 -1363617 -1301741 -947061 -291472 104988 188868 64395
13696F4395K0086J9148J31957O6733q4398m0943L6386K10032L73451L63397j64400
$$ 64395 84481 103629 235586 302319 217921 176978 213364 423396 796847 1160244 995844
13685I95844l55605o3258K35394j70702l2668J68458l79804l39490J41293J85323
$$ 995844 640239 576981 812375 641673 609005 777463 397659 58169 199462 384785
13675C84785K99596J66393k62452j95426L04046J91519l57915m42233l94921k55134
$$ 384785 684381 850774 588322 392896 696942 888461 530546 88313 -306608 -561742
13665e61742J78150L60710j1868M4781K24030j11522j29909L00729L11203K3978
$$ -561742 -383592 -22882 -34750 10031 234061 122539 -7370 293359 604562 628540
13655F28540k12653k33478M2353j65999p6340L93864L81349n643j25934n35767
$$ 628540 415887 182409 224762 58763 -17577 376287 757636 751993 626059 90292
13645I0292n45894j48635k26540k39581l8543m5410j70722J2136L79814J53449
$$ 90292 -455602 -604237 -830777 -1070358 -1108901 -1154311 -1325033 -1312897 -933083 -779634
13635g79634q7223j91305p7742k42735l6664N24999j43693n536M02004N43988
$$ -779634 -866857 -1058162 -1135904 -1378639 -1415303 -890304 -1033997 -1039533 -637529 -93541
13625i3541R2239J27425J10075Q3244K05614k2244P020J51490K76114K16149J21824
$$ -93541 -1302 126123 236198 319442 525056 502812 509832 661322 937436 1153585 1275409
13614A275409j17124n73274l28037N1658L0485n434J25625J88975J97470K18852
$$ 1275409 1158285 585011 256974 308632 339117 333683 459308 648283 845753 1064605
13604A064605o1458l15622j05206n82990n42353k74949M4915J38578L06560L47829
$$ 1064605 1003147 687525 582319 -671 -543024 -817973 -773058 -634480 -327920 19909
13594A9909Q7522O1828l28542o55410j81801N9838n21887l07442N19947K64268
$$ 19909 107431 169259 -159283 -814693 -996494 -936656 -1458543 -1765985 -1246038 -981770
13584i81770L1230M69554O90116L31055m0246o7509O17J38304j05069k15246m0566
$$ -981770 -950540 -480986 209130 540185 499939 432430 433047 571351 466282 251036 210470
13573B10470L17251O3136m07197O2651J3332j89182k16235l6839J26771J17026
$$ 210470 527721 590857 183660 246311 259643 70461 -145774 -182613 -55842 61184
13563F1184J54115k94170j34339K34410R492j58924r0764k233J04461J71772K61685
$$ 61184 215299 -78871 -213210 21200 30692 -128232 -218996 -221229 -116768 55004 316689
13552C16689j61665m20815o09859l17904K66787L04973L40370N64023M27544K10359
$$ 316689 155024 -265791 -875650 -1193554 -926767 -621794 -281424 282599 710143 920502
13542I20502j60765n42201m47171l67452q2837M81483M79896j5955k73249m33818
$$ 920502 759737 217536 -229635 -597087 -679924 -198441 281455 265500 -7749 -441567
13532d41567l36646k52113L26465N98894R4219k96385o76418k47181L82248M88494
$$ -441567 -778213 -1030326 -703861 -104967 -10748 -307133 -983551 -1230732 -848484 -359990
13522c59990M01643J31624k53333k08950m3923K95519M55616j45085n22049n24203
$$ -359990 41653 173277 -80056 -289006 -332929 -37410 418206 273121 -248928 -773131
13512g73131k67746r928J67212N57574P00564p8694l56715K01230J59567j00091
$$ -773131 -1040877 -1050805 -883593 -326019 374545 295851 -60864 140366 299933 199842
13502A99842j05770j34082J83487M90054l5285j52456j10668q3559j70198m34529
$$ 199842 94072 -40010 143477 633531 598246 445790 335122 251563 81365 -353164
13492c53164r6863K61137j21106j14187K04402K94545j03989m87349l75634n0838
$$ -353164 -450027 -188890 -309996 -424183 -219781 74764 -29225 -516574 -892208 -943046
13482i43046M2755L86558N00891M0969K8212J26716p573j06357R1853J69633l13825
$$ -943046 -900291 -513733 -12842 28127 56339 183055 175482 69125 160978 330611 16786
13471A6786l26745k88371j71474j53467k09251J64748J43024j21819r5462j6698
$$ 16786 -309959 -598330 -769804 -923271 -1132522 -967774 -824750 -946569 -1042031 -1058729
13461a058729j18445L79985N37490M30739K78519l4317l80158m33487q2832j8155
$$ -1058729 -1177174 -797189 -259699 171040 449559 415242 35084 -398403 -481235 -499390
13451d99390l75186k31415l3558J92556M87005O04445p2605n24509K9968j74294
$$ -499390 -874576 -1105991 -1139549 -946993 -459988 144457 71852 -452657 -422689 -596983
13441e96983k91481J55333P1744k49966p2111J53012K38317K81251K0169p4140
$$ -596983 -888464 -733131 -661387 -911353 -983464 -830452 -592135 -310884 -290715 -364855
13431c64855L5065J51035N17958N15391l3806k12758j62720j05470k07393N343
$$ -364855 -329790 -178755 339203 854594 820788 608030 445310 339840 132447 137790
13421A37790j21238j12324j10444j972L6651k88506J15636K30874L68225J18523
$$ 137790 16552 -95772 -206216 -208188 -171537 -460043 -344407 -113533 254692 373215
13411C73215m6983J33661q811k50863o1128P3210l34952k05170J33645L88503
$$ 373215 326232 459893 451082 200219 139091 212301 -122651 -327821 -194176 194327
13401A94327K45506J02369r7305l27639j97330j13166n8327M5149J64548J15577
$$ 194327 439833 542202 444897 117258 -80072 -193238 -251565 -206416 -41868 73709
13391G3709k39985k67392K60499L53135M0882l14547j17193J05563l77703m42451
$$ 73709 -166276 -433668 -173169 179966 220848 -93699 -210892 -105329 -483032 -925483
13381i25483k71196l37595j20938M64853P70094K96703o3003k85467m84162L2354
$$ -925483 -1196679 -1534274 -1655212 -1190359 -420265 -123562 -186565 -472032 -956194 -923840
13371i23840M34445L74770Q8395j85807l504Q0673K49995j83191l93171q7697
$$ -923840 -489395 -114625 -26230 -212037 -215541 -134868 115127 -68064 -461235 -548932
13361e48932O33699M82051K1953J70654O6990l48160k99383j64383k15604J57048
$$ -548932 84767 566818 588771 759425 826415 478255 178872 14489 -201115 -44067
13351d4067l9165j71694K46477j41775m65556k36729r7344N02678M00867j47333
$$ -44067 -83232 -254926 -8449 -150224 -615780 -852509 -949853 -447175 -46308 -193641
13341a93641k00771j03273j53568o1493K00423K92398K12793j66104l14751l8615
$$ -193641 -394412 -497685 -651253 -712746 -512323 -219925 -7132 -173236 -487987 -526602
13331e26602N2548n4890O073r2205j31786K18916M05632P5797p259J27765K97212
$$ -526602 -474054 -528944 -522871 -615076 -746862 -527946 -122314 -46517 -53776 73989 371201
13320C71201K65077j19229m11484n54589l60618L64241N95533J92667k93762k6648
$$ 371201 636278 517049 105565 -449024 -809642 -445401 150132 342799 49037 22389
13310B2389K96216m9305j83509q973K55473L81726K18253K97590k9521m64771
$$ 22389 318605 269300 85791 76818 332291 714017 932270 1229860 1200339 735568
13300G35568m25027k52921j82097m0055O0572l21926j06893K68194J55085K54641
$$ 735568 310541 57620 -124477 -164532 -103960 -425886 -532779 -264585 -109500 145141
13290A45141j9054m88636j75838k1991j18907O6818J00524k59949L7960J31766
$$ 145141 126087 -362549 -538387 -560378 -679285 -612467 -511943 -771892 -733932 -602166
13280f02166p8886K18605O71264N56458j77331m54508k19646J54667L07339M62987
$$ -602166 -681052 -462447 208817 765275 587944 133436 -86210 68457 375796 838783
13270H38783M99667q6546k88551k4446m1548J58304J24364k11318K06946K68484
$$ 838783 1338450 1251904 963353 938907 897359 1055663 1180027 968709 1175655 1444139
13260A444139J17774k33534l51333l30241j66608M7098J90566K4181l01048k15897
$$ 1444139 1561913 1328379 977046 646805 480197 527295 717861 742042 440994 225097
13250B25097k73951k43580K65066N11246l614m56737j95801K83263K71242L84600
$$ 225097 -48854 -292434 -27368 483878 480264 23527 -172274 110989 382231 766831
13240G66831J87955k03028k0389K00622J29242R6413k06559J361K28493k6936
$$ 766831 954786 751758 731369 931991 1061233 1157646 951087 952448 1180941 1154005
13230A154005k76140k84964J6433J15356J59882L3062j61224M455J95388L62476
$$ 1154005 877865 592901 609334 724690 884572 917634 756410 760865 956253 1318729
13220A318729J47491l44979j99600K2503L78759L93392M67m31773l66497k90831
$$ 1318729 1466220 1121241 921641 944144 1322903 1716295 1716762 1284989 918492 627661
13210F27661k96875n83432j18822O50813M87389O3081K45844M68295K34455k04493
$$ 627661 330786 -252646 -371468 279345 766734 829815 1075659 1543954 1778409 1573916
13200A573916l54934j11813L1087L06993r0244l79994k64033o651m9571l34136
$$ 1573916 1218982 1107169 1138256 1445249 1355005 975011 710978 704327 654756 320620
13190C20620K11568L76171K90563k08800l14339P4524Q3823J64880J46250m05533
$$ 320620 532188 908359 1198922 990122 675783 750307 834130 999010 1145260 739727
13180G39727q67889k30530M53363L04844k07505l69751J55689O39967P12711J65719
$$ 739727 -128162 -358692 94671 399515 192010 -177741 -22052 617915 1330626 1496345
13170A496345k80884k41910K77765K62994k15498K53031K37298j42511m55704
$$ 1496345 1215461 973551 1251316 1514310 1298812 1551843 1789141 1646630 1190926
13161A190926m03632k1672p642l61814l88254Q8808L56704J85965j55909k44600
$$ 1190926 787294 765622 757980 396166 7912 96720 453424 639389 483480 238880
13151B38880J4327J63114k647j16890j29910j51874J17139J96351M47182L13451
$$ 238880 253207 416321 413674 296784 166874 15000 132139 328490 775672 1089123
13141A089123K48097j83588j56701j09943j58456J34853j84798j58517J02750
$$ 1089123 1337220 1153632 996931 886988 728532 863385 678587 520070 622820
13132F22820K46267K85070p3154j87117j31767k17231j26189K85963L22984k0936
$$ 622820 869087 1154157 1081003 893886 762119 544888 418699 704662 1027646 1006710
13122A006710J3526K57454K72279k77519n21780l9509j5953j56159j04572k04002
$$ 1006710 1020236 1277690 1549969 1272450 750670 711161 695208 539049 434477 230475
13112B30475j02661R62k36249j48218O11147N65680l1853m8690J11768j58315
$$ 230475 127814 128776 -107473 -255691 355456 921136 889283 840593 952361 794046
13102G94046L926L37287j9636k96289m52919k03960M45162M64210K84088q268
$$ 794046 797972 1135259 1115623 819334 366415 162455 607617 1071827 1355915 1347647
13092A347647l53502j10226R8069L62377M65275J32661K94801K55479K00206K06598
$$ 1347647 994145 883919 981988 1344365 1809640 1942301 2237102 2492581 2692787 2899385
13082B899385J65795k13431l68606j03580K82828J59529k32212o02193l19124
$$ 2899385 3065180 2851749 2483143 2379563 2662391 2821920 2589708 1987515 1668391
13073A668391O2311j28209m597L02801L87655L7417j80814j94100o1014p8182
$$ 1668391 1730702 1602493 1597896 1900697 2288352 2325769 2144955 1950855 1889841 1811659
13063A811659Q0209K65992J0697K57642M33241L04194L33315j22215l98988l09150
$$ 1811659 1891868 2157860 2168557 2426199 2859440 3163634 3496949 3374734 2975746 2666596
13053B666596m77999k36973J78001M73975N18301J10920q6949J1615j33324n55902
$$ 2666596 2188597 1951624 2129625 2603600 3121901 3232821 3145872 3157487 3024163 2468261
13043B468261l56085L25734K94123j81858j65239p7572J33854M24329L53693J98258
$$ 2468261 2112176 2437910 2732033 2550175 2384936 2307364 2441218 2865547 3219240 3417498
13033C417498l80616n14680r3910l4919j51105J27026K64368N571J0280K67198
$$ 3417498 3036882 2522202 2428292 2393373 2242268 2369294 2633662 2639233 2649513 2916711
13023B916711n7262k13054L1440N56154O94046j9680l32402J63049L53188M86551
$$ 2916711 2859449 2646395 2677835 3233989 3928035 3908355 3575953 3739002 4092190 4578741
13013D578741M10309J77342N03741M81432q9053o6434K88527M07943K09748J445
$$ 4578741 4989050 5166392 5670133 6151565 6062512 5996078 6284605 6692548 6902296 6903741
13003F903741K8738K53850N99689O80195Q85173Q17826P08750R28667J343841
$$ 6903741 6932479 7186329 7786018 8466213 9351386 10169212 10877962 11806629 13150470
12994A3150470J066890J042258J487670J673487J985918K276435K232074K843845
$$ 13150470 14217360 15259618 16747288 18420775 20406693 22683128 24915202 27759047
12986B7759047L812349M761614N484131O440854P693200R776269J2261729J5104013
$$ 27759047 31571396 36333010 41817141 48257995 55951195 65727464 77989193 93093206
12978I3093206J9206566K5041017L1520501L9471529M7248050M8303815L1736267
$$ 93093206 112299772 137340789 168861290 208332819 255580869 303884684 335620951
12971C35620951m704353l9524383n3008749m8581984l8379667k9195811k2009014
$$ 335620951 330916598 291392215 238383466 189801482 151421815 122226004 100216990
12964A00216990j6704255j3262241j0106259p575384o307789n469637m360373
$$ 100216990 83512735 70250494 60144235 52568851 46261062 40791425 36431052
12957C6431052l799185l355260k511293k546809k247910j689442j539433j498562
$$ 36431052 32631867 29276607 26765314 24218505 21970595 20281153 18741720 17243158
12949A7243158j351549q87047n12002q13464q63169q91296r00859p89722k48847
$$ 17243158 15891609 15004562 14492560 13679096 12815927 11924631 11023772 10234050 9985203
12940I985203j57226k58212L0353K292R1570Q6578l16597m43543m33418l00566
$$ 9985203 9827977 9569765 9600118 9602410 9693980 9780558 9463961 9020418 8587000 8286434
12930H286434J55444O3862k17626j60628K01756N96784N45156L71184L74694P00950
$$ 8286434 8441878 8505740 8288114 8127486 8329242 8926026 9471182 9842366 10217060 10918010
12920A0918010Q70589K57366J86808P97665J227263J988921K220225J373336M36184
$$ 10918010 11788599 12045965 12232773 13030438 14257701 16246622 18466847 19840183 20276367
12911B0276367m42593n94474l09505K09674O38377P13868N18689O94424J274541
$$ 20276367 19833774 19239300 18929795 19139469 19777846 20491714 21010403 21704827 22979368
12902B2979368J904610K685111L349591L999190N100362N929324O993500Q303510
$$ 22979368 24883978 27569089 30918680 34917870 40018232 45947556 52941056 61244566
12894F1244566J0263953J2749015J5979112K0690101K6671175L4150699M2930153
$$ 61244566 71508519 84257534 100236646 120926747 147597922 181748621 224678774
12887B24678774N0196193M7661204K3042276j8191917m8584588n4505530m6772635
$$ 224678774 274874967 322536171 345578447 327386530 278801942 224296412 177523777
12880A77523777l6173990k6847772k0193588j5247754j1863585r641443p623654
$$ 177523777 141349787 114502015 94308427 79060673 67197088 57555645 49931991
12873D9931991n715314m574419m089023l296862k808571k864680k562898k129595
$$ 49931991 44216677 39642258 35553235 32256373 29447802 26583122 24020224 21890629
12865B1890629j852208j822870j395785q68856p02075p42540o55813o20669o87091
$$ 21890629 20038421 18215551 16819766 15950910 15248835 14506295 13850482 13229813 12542722
12856A2542722q61379o52127m34964m42514l49772n02630n67391p27349k57473
$$ 12542722 11681343 11029216 10594252 10151738 9801966 9299336 8731945 8004596 7747123
12847G747123L74998J58775J07665R8343j35560m3167P9952K97075J85600k43304
$$ 7747123 8122121 8280896 8388561 8486904 8351344 8308177 8388129 8685204 8870804 8627500
12837H627500k58965q3228J07944P34071N97604j31647l8966K05299M05454N28426
$$ 8627500 8368535 8285307 8393251 9127322 9724926 9593279 9554313 9759612 10165066 10693492
12827A0693492L54063K91399K58953N23466P50609P52866P90754R34930J273610
$$ 10693492 11047555 11338954 11597907 12121373 12871982 13624848 14415602 15350532 16624142
12818A6624142J795971J804060J991792K387585K870335L356423M637148N607096
$$ 16624142 18420113 20224173 22215965 24603550 27473885 30830308 35467456 41074552
12810D1074552O112085P365718Q975645J0990920J3858423J7533808K2047405
$$ 41074552 47186637 54552355 63528000 74518920 88377343 105911151 127958556
12803A27958556K8264434L6212471M4633623M9320159M0784555J0427293k8369476
$$ 127958556 156222990 192435461 237069084 286389243 327173798 337601091 309231615
12796C09231615n0665576n1579155m2722307l2946987k4506090j8376487j4100197
$$ 309231615 258566039 206986884 164264577 131317590 106811500 88435013 74334816
12789G4334816j1583734r184124o774092n420789m527916m211455l612150l047781
$$ 74334816 62751082 53566958 46792866 41372077 36844161 32632706 29020556 25972775
12781B5972775k650193k477965k200432j694211j148628j208501j018029p58740
$$ 25972775 23322582 20844617 18644185 16949974 15801346 14592845 13574816 12816076
12773A2816076q63622j004447q74740m22152l70502o60190r13957n70930p171
$$ 12816076 11952454 10948007 10073267 9651115 9280613 8620423 7706466 7135536 7128365
12764G128365k57537j40706l2090j03943k94491o59525n18439j36289M00472L51734
$$ 7128365 6870828 6730122 6698032 6594089 6299598 5640073 5121634 4985345 5385817 5737551
12754E737551n5420k82764l89948n20745p67601o73130n29704p502J95481j64405
$$ 5737551 5682131 5399367 5009419 4488674 3721073 3047943 2518239 2510737 2706218 2541813
12744B541813l35602J32972L76437L60238K38152P3786J67790J24084j21237n18334
$$ 2541813 2206211 2339183 2715620 3075858 3314010 3387796 3555586 3679670 3558433 3040099
12734C040099q04071l61667K20042K58086J41063j74675j94049l22955o99127
$$ 3040099 2236028 1874361 2094403 2352489 2493552 2318877 2124828 1801873 1102746
12725A102746m23286J7194L12989N80661N80224L3800r6390l6894m77818m34752
$$ 1102746 679460 696654 1009643 1590304 2170528 2204328 2107938 2071044 1593226 1158474
12715A158474l30311O6914K24711q6041j12939p3770j71216J4708K56436N8825
$$ 1158474 828163 895077 1119788 1033747 920808 847038 675822 690530 946966 1005791
12705A005791o3454L5752O9967J53465p8534N5305K48606p8127m64100l95479
$$ 1005791 942337 978089 1048056 1201521 1122987 1178292 1426898 1348771 884671 489192
12695D89192k56072J87805N42795Q8776O9194L09551L1475N3925Q1885J11276
$$ 489192 233120 420925 963720 1052496 1121690 1431241 1462716 1516641 1598526 1709802
12685A709802j26671m79444k70106L17789L11401K722j83533k78009j6840J4435
$$ 1709802 1583131 1103687 833581 1151370 1462771 1465493 1281960 1003951 987111 1001546
12675A001546k16822j40358k104r3680K04073N20588j912l60320k42292j08980
$$ 1001546 784724 644366 642262 548582 752655 1273243 1271331 911011 668719 559739
12665E59739R250m6588M6050l1544q3966j46321J30277K72023J85393K29972J83891
$$ 559739 568989 522401 568451 536907 452941 306620 436897 708920 894313 1124285 1308176
12654A308176J1045l37574j55907N9012Q4717j8569o5268R560K21524n6267o82886
$$ 1308176 1319221 981647 825740 884752 969469 950900 885632 895192 1116716 1060449 377563
12643C77563m83084L00175P14308J82773K75807M95538J89925j09507j54209j73314
$$ 377563 -105521 194654 908962 1091735 1367542 1863080 2053005 1943498 1789289 1615975
12633A615975o8430j09200k86278k23440k54414Q3270Q3354r3739k72354k20131
$$ 1615975 1547545 1438345 1152067 928627 674213 757483 840837 747098 474744 254613
12623B54613K11162N26944L04962J69786L64519m5488k32386J39803j11572l27463
$$ 254613 465775 992719 1297681 1467467 1831986 1786498 1554112 1693915 1582343 1254880
12613A254880k90409l96396k83016j85269J25229L74142M6909J78961L05417j20537
$$ 1254880 964471 568075 285059 99790 225019 599161 646070 825031 1130448 1009911
12603A009911k85107k76978l30615j09835K36401M05431J2320n1694J86581J43505
$$ 1009911 724804 447826 117211 7376 243777 649208 661528 609834 796415 939920
12593I39920j10694m41633K14329M62664r7319l19464l94074j57162k57869k60045
$$ 939920 829226 387593 601922 1064586 967267 647803 253729 96567 -161302 -421347
12583d21347j16012l35093J87820Q8253j55468R5380m9599j145J13639K6125J11761
$$ -421347 -537359 -872452 -684632 -596379 -751847 -656467 -706066 -707211 -593572 -567447 -455686
12572d55686K27162J45376M4123J37084M25963M38848j86844l29231J18286J79262
$$ -455686 -228524 -83148 -39025 98059 524022 962870 776026 446795 565081 744343
12562G44343j13954k14661k15087L03319K74620J09326R7082j2434l4611j76186
$$ 744343 630389 415728 200641 503960 778580 887906 984988 972554 937943 761757
12552G61757j28881q1438M9405J54515J37197J54985q5869P2873K36160K51025
$$ 761757 632876 551438 600843 755358 892555 1047540 961671 1034544 1270704 1521729
12542A521729J95441m24952q58898l95483L17466M82193L45621j40578m89531
$$ 1521729 1717170 1292218 433320 37837 355303 837496 1183117 1042539 553008
12533E53008k58715K4932J70466J55535p4062J00439J89167J36736L6911J24518
$$ 553008 294293 319225 489691 645226 571164 671603 860770 997506 1034417 1158935
12523A158935J34162l14951m33988l11495k06285O0876k31799k44720j18708L6052
$$ 1158935 1293097 978146 544158 232663 26378 87254 -144545 -389265 -507973 -471921
12513d71921O27283O22419M2044j93838j49769K97427L92839P7520O2191k01668
$$ -471921 155362 777781 819825 625987 476218 773645 1166484 1244004 1306195 1104527
12503A104527q12436l90065M4652N9671N2183k97718r5872J76316p1071k4756
$$ 1104527 292091 -97974 -53322 6349 58532 -239186 -335058 -158742 -229813 -254569
12493b54569k3477p1484K11518K64147K13767L6273m4154J97222K60878l76371
$$ -254569 -278046 -349530 -138012 126135 339902 376175 332021 529243 790121 413750
12483D13750n27567j67184J69729J03367K33203L61166p3738k82044p7451L9347
$$ 413750 -113817 -281001 -111272 -7905 225298 586464 512726 230682 153231 192578
12473A92578M64571J58072l22718k28584J58747L47556o8079j93858l68860n8634
$$ 192578 657149 815221 492503 263919 422666 770222 702143 508285 139425 80791
12463H0791L36313M84589L37912k34296m21904m82706j74232M7765K55672K53366
$$ 80791 417104 901693 1239605 1005309 583405 100699 -73533 -25768 229904 483270
12453D83270Q0987J14888K48471m4435P6352L5672j26673k45721l28076P7881
$$ 483270 564257 679145 927616 883181 959533 995205 868532 622811 294735 372616
12443C72616K9987P6909K24071j32544l72648J01568M74487k0494k62379m2336
$$ 372616 402603 479512 703583 571039 198391 299959 774446 753952 491573 449237
12433D49237O5754L3357k38820O0152n466K15152L54112q8809k79378k35384l04098
$$ 449237 514991 548348 309528 369680 364214 579366 933478 844669 565291 329907 25809
12422B5809k38203Q259J90216L82954J29509J34059q1082l74534l9082K16282
$$ 25809 -212394 -204135 -13919 369035 498544 632603 551521 176987 137905 354187
12412C54187J34342k05300O8728J4239J28595K67812J96481L36356O2892n93745
$$ 354187 488529 283229 351957 366196 494791 762603 959084 1295440 1358332 764587
12402G64587m53634K60262K381k55542o775K70266K00920l1309j29718j34180
$$ 764587 310953 571215 573596 318054 311279 581545 782465 751156 621438 487258
12392D87258j75421k68807j25084m8366l62548k84665K56080J91749m0374Q6733
$$ 487258 311837 43030 -82054 -130420 -492968 -777633 -521553 -329804 -370178 -283445
12382b83445L24863L05296k26531p58416j03157L10507R5093J16801O6805j10342
$$ -283445 41418 346714 120183 -638233 -741390 -430883 -335790 -218989 -152184 -262526
12372b62526o0284L06278N306q2217j30440L81471P48090K78959J1551l15980
$$ -262526 -322810 -16532 -11226 -93443 -223883 157588 905678 1184637 1196188 880208
12362H80208o63729l19262J89088p5060J9493L39012K3883r9278J5657n6602O3166
$$ 880208 216479 -102783 86305 11245 30738 369750 393633 294355 310012 253410 316576
12351C16576k9706r4584j76439m27410m37581J00030M83319o6852l4666K27068
$$ 316576 286870 192286 15847 -411563 -849144 -749114 -265795 -332647 -367313 -140245
12341a40245J28844L764K47824K04533n5399n0089Q3308M2564l08115n38548j44156
$$ -140245 -11401 -7637 240187 444720 389321 339232 422540 465104 156989 -381559 -525715
12330e25715K0794j44328K91471M59329K38492j21325j59868q4697o6892l35465
$$ -525715 -504921 -649249 -357778 101551 340043 218718 58850 -25847 -92739 -428204
12320d28204r809O5110q2601q6441K5458N14641M39063n9857n13351q42963k55288
$$ -428204 -438013 -372903 -455504 -541945 -516487 -1846 437217 377360 -135991 -978954 -1234242
12309a234242M82466L84075J84972l482K86464L16504r8717O7487J47205j32137
$$ -1234242 -751776 -367701 -182729 -186211 100253 416757 318040 385527 532732 400595
12299D00595k09484j9702K0838O1425O801m07864j75520L75017J17244k34354
$$ 400595 191111 171409 192247 253672 260473 -147391 -322911 52106 169350 -65004
12289f5004j50177L12982K43998r7728j20652J43136j01114j00121K06931Q3052
$$ -65004 -215181 97801 341799 244071 123419 266555 165441 65320 272251 355303
12279C55303J07144l70575Q681M66739L26143k48092l05743j06174k18978k21445
$$ 355303 462447 91872 100553 567292 893435 645343 339600 233426 14448 -206997
12269b06997J51044J44168k7919j4220K51061J41800k08169P6274L81787J12296
$$ -206997 -55953 88215 60296 46076 297137 438937 230768 307042 688829 801125
12259H01125k9173n0257n10849m25975J85054M59162J79338j91188m64776m7028
$$ 801125 771952 721695 210846 -215129 -30075 429087 608425 417237 -47539 -94567
12249i4567J80708J30180j67499k98155j89340k00322k86412K08436K06919J39723
$$ -94567 86141 216321 48822 -249333 -438673 -638995 -925407 -716971 -510052 -370329
12239c70329J70273K72345M53418J77450J29126P4570o3209n39528j10434L78076
$$ -370329 -200056 72289 525707 703157 832283 906853 843644 304116 193682 571758
12229E71758J53770m77788m58902P2703M50766N21283k16953l34043Q741J30943
$$ 571758 725528 247740 -211162 -138459 312307 833590 616637 282594 291335 422278
12219D22278Q9640K27291J85787j13431J69353J96087l50480k99134K4894j06372
$$ 422278 511918 739209 924996 811565 980918 1177005 826525 527391 552285 445913
12209D45913m97962m77345N8774K35705M13641J51683n08217j29384K42697J94055
$$ 445913 -52049 -529394 -470620 -234915 178726 330409 -177808 -307192 -64495 129560
12199A29560q3415j1512K38960j4365n32735k14176Q8289m6840m8836R9388n6937
$$ 129560 46145 34633 273593 259228 -273507 -487683 -399394 -446234 -495070 -395682 -452619
12188d52619j70914j7350P5606M8331p2891L3087M19342L61170J96200J80778
$$ -452619 -623533 -640883 -565277 -516946 -589837 -556750 -137408 223762 419962 600740
12178F00740J42542m9055m22042l68090p897P3649m6595K23679J6241j13301K76060
$$ 600740 743282 694227 272185 -95905 -103802 -30153 -76748 146931 163172 49871 325931
12167C25931n9634k46578j23328N2203j3735j46334j27890J66060L12277L72526
$$ 325931 266297 19719 -103609 -51406 -65141 -211475 -339365 -173305 138972 511498
12157E11498M05104j52526j98040K6894l50184m41776n22981n12412j66451O01322
$$ 511498 916602 764076 566036 592930 242746 -199030 -722011 -1234423 -1400874 -799552
12147g99552O50435K98283K32186j69060k22259j52472k49896l86019j25049M89931
$$ -799552 -149117 149166 381352 212292 -9967 -162439 -412335 -798354 -923403 -433472
12137d33472M97964L20436L06266J34808K81147k46230m40765m30829O9090L23637
$$ -433472 64492 384928 691194 826002 1107149 860919 420154 -10675 58415 382052
12127C82052K92031L97021p7217o10763k71833j0792K13210M50184K59833k47589
$$ 382052 674083 1071104 993887 383124 111291 100499 313709 763893 1023726 776137
12117G76137K14048M76082P3812k88526l53410n20570p42860k27066j87778j45763
$$ 776137 990185 1466267 1540079 1251553 898143 377573 -365287 -592353 -780131 -925894
12107i25894P8367J33929J78616J12075j36332m08080O3113N02837M35795K75659
$$ -925894 -847527 -713598 -534982 -422907 -559239 -967319 -904206 -401369 34426 310085
12097C10085j34709k91017k9946K3425R8680j31180j01280J21359j22429m15454
$$ 310085 175376 -115641 -145587 -122162 -23482 -154662 -255942 -134583 -257012 -672466
12087f72466r9149J93432M28337J24030j59495k77916l47215M2825J41112K4260
$$ -672466 -771615 -578183 -149846 -25816 -185311 -463227 -810442 -767617 -626505 -602245
12077f02245J18614J8049j46006j10730n7084K46225L44790P9326O1433k3830
$$ -602245 -483631 -465582 -611588 -722318 -779402 -533177 -188387 -109061 -47628 -71458
12067g1458j29489J24323K47624J3449o0551j17058k10174J00972J82878j41539
$$ -71458 -200947 -76624 171000 184449 123898 6840 -203334 -102362 80516 -61023
12057f1023R1209K23021j605j61637J35408J19365k77952n33115k25866J90536
$$ -61023 30186 253207 251602 89965 225373 344738 66786 -466329 -692195 -501659
12047e01659O2132l01751m30278K15719M46094M0918P0458K3610N4000M3872k86125
$$ -501659 -439527 -741278 -1171556 -955837 -509743 -468825 -398367 -374757 -320757 -276885 -563010
12036e63010q9053P7440L2924M84242M44633n6546l28854m40569j92644L6670
$$ -563010 -652063 -574623 -541699 -57457 387176 330630 1776 -438793 -631437 -594767
12026e94767J97371r6725j89114L16655P84870L05958l00848n99363o11980p4059
$$ -594767 -397396 -494121 -683235 -366580 418290 724248 423400 -175963 -787943 -862002
12016h62002N62857L08724m6712P2875l0797k11104K3358L08046J61734J73459
$$ -862002 -299145 9579 -37133 35742 4945 -206159 -182801 125245 286979 460438
12006D60438Q4332j34787L2697l6939k51323l72766M6202K07718L43034n1388
$$ 460438 544770 409983 442680 405741 154418 -218348 -172146 35572 378606 327218
11996C27218l78870k52389j65426J68903O80940M90440P1155j71192j6740l59340
$$ 327218 -51652 -304041 -469467 -300564 380376 870816 941971 770779 754039 394699
11986C94699m99126m5385M49574O4774l57660l5934r5774k92729j00060K19128
$$ 394699 -104427 -149812 299762 364536 6876 -29058 -124832 -417561 -517621 -298493
11976b98493L4658m48868n11564r609M43179J001074N97852j01773j84640j42611
$$ -298493 -263835 -712703 -1224267 -1233876 -790697 210377 808229 706456 521816 379205
11966C79205l1706m356o7266m5591j57545k31144K17530R3293j30064J30013J97275
$$ 379205 347499 343143 275877 230286 72741 -158403 59127 152420 22356 152369 349644
11955C49644K5353k9395j00834k76383k86546J18820K70786N8545j15365J5817
$$ 349644 374997 345602 244768 -31615 -318161 -199341 71445 129990 14625 30442
11945C0442K75776q8649j82332M14433J05005j97026R2754J85618l384j88451
$$ 30442 306218 217569 35237 449670 554675 357649 450403 636021 632637 444186
11935D44186l78478j68994O1663l95050k23903J76081K74073M63626K90575j02873
$$ 444186 65708 -103286 -41623 -436673 -660576 -484495 -210422 253204 543779 440906
11925D40906j26000j01175j72727p7147N5252J91276r4035k12180j17974j625
$$ 440906 314906 213731 41004 -36143 19109 210385 116350 -95830 -213804 -215429
11915b15429K46613p9792j3930l7625k25563L95289P69550J77990l13354j92025
$$ -215429 31184 -48608 -62538 -100163 -325726 69563 839113 1017103 703749 511724
11905E11724k08387k45484j60223R8168k22182l11095m7730L32607K56437k34150
$$ 511724 303337 57853 -102370 -4202 -226384 -537479 -585209 -252602 3835 -230315
11895b30315l37421j51835L52614L50501J65284O3979J88487L01088o7877m55668
$$ -230315 -567736 -719571 -366957 -16456 148828 212807 401294 702382 634505 178837
11885A78837l97636k24714k14215J27669K51032o2297k44024j9560K27056K21493
$$ 178837 -218799 -443513 -657728 -530059 -279027 -341324 -585348 -604908 -377852 -156359
11875a56359K47349J90364J88954Q6897q0326J94625J73126k61086k81308j55353
$$ -156359 90990 281354 470308 557205 476879 671504 844630 583544 302236 146883
11865A46883j18116n4380Q5491M5127k15145L4571L53410N7639k52734j90337
$$ 146883 28767 -25613 59878 105005 -110140 -75569 277841 335480 82746 -107591
11855a07591j19395K1649M55692L65542o6788n30898n78008Q9892K83750L00468
$$ -107591 -226986 -205337 250355 615897 549109 18211 -559797 -469905 -186155 114313
11845A14313M13835n6290j48755M6860K86840J80484k409j34733k91082m96409
$$ 114313 528148 471858 323103 369963 656803 837287 834878 700145 409063 -87346
11835h7346m55842j44233L92985K76703L35016R7119k8761O8098k758R7687L68895
$$ -87346 -543188 -687421 -294436 -17733 317283 414402 385641 453739 450981 548668 917563
11824I17563L39965J28160j87766n46113n20370m38489j57296J54177K28872J67119
$$ 917563 1257528 1385688 1197922 651809 131439 -307050 -464346 -310169 -81297 85822
11814H5822J11645o6982o4631k30263j91119M75688L05407j50049l21615l88620
$$ 85822 197467 130485 65854 -164409 -355528 120160 425567 275518 -46097 -434717
11804d34717J42383P9362l0219k3998K03487M24685M9524k43944m11060K1952
$$ -434717 -292334 -212972 -243191 -267189 -63702 360983 410507 166563 -244497 -222545
11794b22545K40050n1310J54146l4582m4054K9085o62317m18576L41115J55270
$$ -222545 17505 -33805 120341 85759 41705 70790 -591527 -1010103 -668988 -513718
11784e13718l02958j6089J60246q5045J54072p8213j14185N68285N84042K43456
$$ -513718 -816676 -832765 -672519 -757564 -603492 -681705 -795890 -227605 356437 599893
11774E99893j41505J78607l6818l88511m30161P3131L30940L4613L80905N72547
$$ 599893 458388 636995 600177 211666 -218495 -145364 185576 220189 601094 1173641
11764A173641l7719l19923n15090m33549k1225m4929q8233O663J49042R8011q9384
$$ 1173641 1135922 815999 300909 -132640 -153865 -198794 -287027 -280364 -131322 -33311 -122695
11753a22695l07538j23204K35784O01235K73345q8763n44966m05726j6052K63262
$$ -122695 -430233 -553437 -317653 283582 556927 468164 -76802 -482528 -498580 -235318
11743b35318K67411J06236j62727j57977J95028L47466L34070K64991N7358k47882
$$ -235318 32093 138329 -24398 -182375 12653 360119 694189 959180 1016538 768656
11733G68656p5663n7943k17439l17426o52788l47589J37534K89674J15972j67446
$$ 768656 692993 635050 417611 100185 -552603 -900192 -762658 -472984 -357012 -524458
11723e24458J43236L41227n2864j41797L46665J58362l85516k20686O6590K35178
$$ -524458 -381222 -39995 -92859 -234656 112009 270371 -115145 -335831 -269241 -34063
11713c4063J98198K00826j51805l62409j66492l73834k13485l83555j20403M4564
$$ -34063 164135 364961 213156 -149253 -315745 -689579 -903064 -1286619 -1407022 -1362458
11703a362458O74418O40822M8849R1584l1225j43283P9699J47765n6142p3072
$$ -1362458 -688040 -47218 1631 93215 61990 -81293 -1594 146171 90029 16957
11693A6957l01927j71171L67520J89715k44810j98941j44220K5616J73739j61679
$$ 16957 -284970 -456141 -88621 101094 -143716 -342657 -486877 -461261 -287522 -449201
11683d49201k02158K91734m9883L4964K62399j28828l14458j50043Q8727K97093
$$ -449201 -651359 -359625 -409508 -374544 -112145 -240973 -555431 -705474 -616747 -319654
11673c19654J50274J10723M4667k72341k5299Q7000J06131K84685j1628j52681
$$ -319654 -169380 -58657 -13990 -286331 -311630 -224630 -118499 166186 154558 1877
11663A877k25521j91921p9511K43109K83040K90715K07126k22429n47921j97125
$$ 1877 -223644 -415565 -495076 -251967 31073 321788 528914 306485 -241436 -438561
11653d38561J00333J99027K48903J57533M5236n9783p3383p7439q8432k65666
$$ -438561 -338228 -139201 109702 267235 312471 252688 179305 101866 13434 -252232
11643b52232J42129M6558k57946k25293K52424M34303K35193l9088L2229j05657
$$ -252232 -110103 -63545 -321491 -546784 -294360 139943 375136 336048 368277 262620
11633B62620m53237p1117N34529M19226j72535l58631k44486K81610L19787L5933
$$ 262620 -190617 -261734 272795 692021 519486 160855 -83631 197979 517766 553699
11623E53699j03899k84712K4114K13562l882l34529J8683K83891L76637L18951
$$ 553699 449800 165088 189202 402764 398882 64353 83036 366927 743564 1062515
11613A062515L4373j91967m70221l51894J22957o339l23993k3873J84326q8952
$$ 1062515 1096888 904921 434700 82806 205763 199424 -124569 -148442 35884 -53068
11603e3068N3959L33141o6456j34914j40325k36788j18976k22188k30276k38626
$$ -53068 891 334032 267576 132662 -7663 -244451 -363427 -585615 -815891 -1054517
11593a054517k85931J53773L48255M4786j55984O7053M32732q0188l63387q1930
$$ -1054517 -1340448 -1186675 -838420 -793634 -949618 -882565 -449833 -530021 -893408 -975338
11583i75338K89870l2289r4598K39900J70723j05962k04743R9973R0289M85154
$$ -975338 -685468 -717757 -812355 -572455 -401732 -507694 -712437 -612464 -522175 -37021
11573c7021O60044K15589l02298k40538j8861k52967k14354L48066J50259k99523
$$ -37021 623023 838612 536314 295776 276915 23948 -190406 157660 307919 8396
11563H396n35107k01428M17417K52340j08927L4842J04095J9360N7811J35225
$$ 8396 -526711 -728139 -310722 -58382 -167309 -132467 -28372 -9012 48799 184024
11553A84024K64480K26965j86585k16606j21082j56925k96501m28141m7603O2850
$$ 184024 448504 675469 488884 272278 151196 -5729 -302230 -730371 -777974 -715124
11543g15124l01799K6152L03625L76625K24310K04653L45986K0111k06158l71370
$$ -715124 -1016923 -990771 -687146 -310521 -86211 118442 464428 484539 278381 -92989
11533i2989l64506j17950J34964L45586l5348k54610k02656j67034j99360J71282
$$ -92989 -457495 -575445 -440481 -94895 -130243 -384853 -587509 -754543 -953903 -782621
11523g82621N38786L49949j13936l72499l27085R4771K45493l4105j95149j05820
$$ -782621 -243835 106114 -7822 -380321 -707406 -612635 -367142 -401247 -596396 -702216
11513g02216P6581N03697N66805q1211l24755k12634K119J85294J69269R2417
$$ -702216 -625635 -121938 444867 363656 38901 -173733 -171614 13680 182949 275366
11503B75366k66390l62882j37391J39469j58646n1506J17993J20118N21274M88259
$$ 275366 8976 -353906 -491297 -351828 -510474 -561980 -443987 -323869 197405 685664
11493F85664J04460J52458O4146j74395m79823m20194k3815L47402N87433J24402
$$ 685664 790124 942582 1006728 832333 352510 -67684 -91499 255903 843336 967738
11483I67738l58215j83979j67163l24401q6701J64881K51879J18939p9009q9179
$$ 967738 609523 425544 258381 -66020 -152721 12160 264039 382978 303969 214790
11473B14790J31201K68370J53899k57067j89128K28051K28118L4713k45543l68540
$$ 214790 345991 614361 768260 511193 322065 550116 778234 812947 567404 198864
11463A98864j96590k57405J5589J43920m8824j66209J0704K14302J14209n3257
$$ 198864 2274 -255131 -239542 -95622 -144446 -310655 -299951 -85649 28560 -24697
11453b4697n41969j97388L23887J94618N3586k38743J08419J90513k2374O2805
$$ -24697 -566666 -764054 -440167 -245549 -191963 -430706 -322287 -131774 -154148 -91343
11443i1343J05043K33688M0323K9887K77569K64821k16195l78652L9866M70527
$$ -91343 13700 247388 287711 317598 595167 859988 643793 265141 305007 775534
11433G75534L76980k70315m2948k29762n97798o39836p10342j73968M75964O51223
$$ 775534 1152514 882199 839251 609489 11691 -628145 -1338487 -1512455 -1036491 -385268
11423c85268L65587n9943k56514l50699k95635j00678J00515k3299M08101M01444
$$ -385268 -19681 -79624 -336138 -686837 -982472 -1083150 -982635 -1005934 -597833 -196389
11413a96389L13890L97638j65062k44450j90600j46839p722j46914J07313J75041
$$ -196389 117501 515139 350077 105627 -84973 -231812 -239534 -386448 -279135 -104094
11403a04094l75088l95255J54234K20920N2359L52783K09561j6119J42840j74989
$$ -104094 -479182 -874437 -720203 -499283 -446924 -94141 115420 99301 242141 67152
11393F7152o74592m56437m8180J82413M46181M69349q8164l8748j38173j80853
$$ 67152 -607440 -1063877 -1112057 -929644 -483463 -14114 -102278 -141026 -279199 -460052
11383d60052k92187k0732K10047J99090L41611L07744k68512k84498r7486p839
$$ -460052 -752239 -772971 -562924 -363834 -22223 285521 17009 -267489 -364975 -372814
11373c72814L04591M85322M76798j91795o13459m71659J8687J94813K57032M28882
$$ -372814 -68223 417099 893897 702102 88643 -383016 -364329 -169516 87516 516398
11363E16398K33761j62752l198L026O8031j76787J2587j07907k6534j40692m59692
$$ 516398 750159 587407 584209 587235 655266 478479 491066 383159 356625 215933 -243759
11352b43759n81934k63508n9769J37962M47948L97621R5711L40838L99473m07944
$$ -243759 -825693 -1089201 -1148970 -1011008 -563060 -165439 -69728 271110 670583 262639
11342B62639n45398j10513o8177K81493M66067K36071K08131P1698k98566K83515
$$ 262639 -282759 -393272 -461449 -179956 286111 522182 730313 802011 503445 786960
11332G86960M48588J55216M4960R9833l30435l65048k49963o34916k81956J48223
$$ 786960 1235548 1390764 1435724 1535557 1205122 840074 590111 -44805 -326761 -178538
11322a78538R7586P0077K35554K27507m80077n24116q8366J49320O095l9948N9274
$$ -178538 -80952 -10875 224679 452186 -27891 -552007 -640373 -491053 -484958 -524906 -465632
11311d65632M43420P31505J07371j05552j45284k9219j08681r487k37878k96110
$$ -465632 -22212 709293 816664 711112 565828 536609 427928 418441 180563 -115547
11301a15547L3155L9147j08980j12004j61865J23464J20359N2405K16153K74105
$$ -115547 -82392 -43245 -152225 -264229 -426094 -302630 -182271 -129866 86287 360392
11291C60392L67071K33107j29229k61672P1751L01219K0333l42016j47303M1788
$$ 360392 727463 960570 831341 569669 641420 942639 962972 620956 473653 515441
11281E15441j59624J14331j81476l17143j02489l54274l32630M0200N03174J47197
$$ 515441 355817 470148 288672 -28471 -130960 -485234 -817864 -777664 -274490 -127293
11271a27293j29355J70851L5567O8186J62620n9969j22312J70679N99931L01686
$$ -127293 -256648 -85797 -50230 17956 180576 120607 -1705 168974 768905 1070591
11261A070591j51424l18658k86908k74379k47371J40905K80107K9399m26417k01572
$$ 1070591 919167 600509 313601 39222 -208149 -67244 212863 242262 -184155 -385727
11251c85727N0605j12070p3944j92674k43315K98170N97213N06109j36467j22473
$$ -385727 -335122 -447192 -521136 -713810 -957125 -658955 -61742 444367 307900 185427
11241A85427K04145l19116j85846N2423L90309K20732J7614K01931L00467q9837
$$ 185427 389572 70456 -115390 -62967 327342 548074 565688 767619 1068086 978249
11231I78249j95949j70956n97993m02738m0755N73669M00300p87p8878k83516
$$ 978249 782300 611344 13351 -389387 -430142 143527 543827 543040 464162 180646
11221A80646m65744o92193k60240K91224K72637K26462l8128P7871L18803K02893
$$ 180646 -285098 -977291 -1237531 -946307 -673670 -447208 -485336 -407465 -88662 114231
11211A14231o3214l51442k01511L39713N11973L55404j47066j13756J48579J41680
$$ 114231 51017 -300425 -501936 -162223 349750 705154 558088 444332 592911 734591
11201G34591O8002R4045N5846j08292l87366m83208L6598M83493K15408j35392
$$ 734591 802593 896638 952484 844192 456826 -26382 10216 493709 709117 573725
11191E73725l53338k21850j20274j73712k03713j2105j31818l07866m42884J80669
$$ 573725 220387 -1463 -121737 -295449 -499162 -511267 -643085 -950951 -1393835 -1213166
11181a213166O10274K2617M11409O68934J22108J28692J21498k65082j32557j27704
$$ -1213166 -602892 -580275 -168866 500068 622176 750868 872366 607284 474727 347023
11171C47023j07100j1375L19734L36610p3022l28478j90569J03252K01670O7988
$$ 347023 239923 228548 548282 884892 811870 483392 292823 396075 597745 665733
11161F65733p2279l10327m34872j07651J38822N3761l60224j58937n029L88959
$$ 665733 593454 283127 -151745 -259396 -120574 -66813 -427037 -585974 -591003 -202044
11151b02044L57743J11413J4572j55892j02011j77454l22492k56669J42382P2785
$$ -202044 155699 267112 281684 125792 23781 -153673 -476165 -732834 -590452 -517667
11141e17667O0997o6978k74115J40334L94003K96748J75826m06849m94166O8617
$$ -517667 -456670 -523648 -797763 -657429 -263426 33322 209148 -197701 -691867 -623250
11131f23250K22793k7901l65562j6612J53257j00014p2993O404K15268L54618
$$ -623250 -400457 -428358 -793920 -810532 -657275 -757289 -830282 -823878 -608610 -253992
11121b53992L57319o5556o0718L2244q016K9031l77778m06419O0481K7751Q0914
$$ -253992 103327 37771 -22947 9297 1281 30312 -347466 -753885 -693404 -665653 -584739
11110e84739J90073L99189J88469k13983N8866L67451K36569k69608l53963j19451
$$ -584739 -394666 4523 192992 -20991 37875 405326 641895 372287 18324 -101127
11100a01127J56116R6021l2107O6650l0397k80946o4912M4639L0202J22643K22112
$$ -101127 54989 151010 118903 185553 155156 -125790 -190702 -146063 -115861 6782 228894
11089B28894q5853o0225K35907J72875R9715p2772L7173l20034l84418k96873
$$ 228894 143041 82816 318723 491598 591313 518541 555714 235680 -148738 -445611
11079d45611K05656J87308m5279N8100M27633R9278k16222K4389j08573J88031
$$ -445611 -239955 -52647 -97926 -39826 387807 487085 270863 295252 186679 374710
11069C74710L9695l45754j19023L19934K05009l25731j50139K6212j78450j469
$$ 374710 414405 68651 -50372 269562 474571 148840 -1299 24913 -153537 -155006
11059a55006l92452j89302m3475j43128K17951P45471N18331j76284m62854n57494
$$ -155006 -547458 -736760 -780235 -923363 -705412 40059 558390 382106 -80748 -638242
11049f38242m13255p5960O00J93724M09933M38456M7249K486L9131k90451o7130
$$ -638242 -1051497 -1127457 -1126857 -933133 -523200 -84744 -37495 -35009 4122 -286329 -353459
11038c53459o6056k47580J91807K55724p1494l85013j54978k57667j1020O95278
$$ -353459 -419515 -667095 -475288 -219564 -291058 -676071 -831049 -1088716 -1099736 -404458
11028d04458Q41370K34646j20921P6690l4270M1433n257k15429k70797j2762J00477
$$ -404458 436912 671558 550637 627327 593057 634490 629233 413804 143007 130245 230722
11017B30722M1610M7546q1587j39618J4258M58342M49976p5111l57955k55958
$$ 230722 272332 319878 238291 98673 112931 571273 1021249 946138 588183 332225
11007C32225l29043j43491k52144j74328Q8885q3779j2035L47683N07187L60229
$$ 332225 3182 -140309 -392453 -566781 -477896 -561675 -573710 -226027 281160 641389
10997F41389K47341J60084m7129n66109l72330l8645J62973m5151K49720M65496
$$ 641389 888730 1048814 1001685 435576 63246 24601 187574 142423 392143 857639
10987H57639J73004m4469n43943m16630K0251K93718L01595l04060l10429o8745
$$ 857639 1030643 986174 442231 25601 45852 339570 641165 337105 26676 -42069
10977d2069j28667j61036k0656o7903Q5505j49594k75170q7529j76183J7301K86200
$$ -42069 -170736 -331772 -352428 -420331 -334826 -484420 -759590 -847119 -1023302 -1006001 -719801
10966g19801N70177M58761j20405p4182K7572j21873j37130p1685Q6821R2976
$$ -719801 -149624 309137 188732 114550 142122 20249 -116881 -188566 -101745 -8769
10956h769j88517k41181L2721R4969L74455M73972m2403l6867l61911k94788J50432
$$ -8769 -197286 -438467 -405746 -310777 63678 537650 495247 458380 96469 -198319 -47887
10945d7887N1827k81614k14235j25108K86305M320l17835J6549K83694L5179n0296
$$ -47887 3940 -277674 -491909 -617017 -330712 -326392 -644227 -627678 -343984 -308805 -359101
10934c59101j3433j1195r1217P2026J66104J80872J0886l53548K2439K31536J47648
$$ -359101 -372534 -383729 -474946 -402920 -236816 -55944 -45058 -398606 -376167 -144631 3017
10923C017J11612M7951J13053O5243r3395P4176J89456L26827k1565j52663Q1367
$$ 3017 114629 162580 275633 340876 247481 321657 511113 837940 816375 663712 745079
10912G45079j10804l36957l12798k23797o2456K46267M85755J37972k99105j77102
$$ 745079 634275 297318 -15480 -239277 -301733 -55466 430289 568261 269156 92054
10902I2054j14246J27569K80641M46031K01147q6316m14979o91154l25925L90702
$$ 92054 -22192 105377 386018 832049 1033196 946880 531901 -159253 -485178 -94476
10892i4476L61545r3106j82378L3581j29610l43488Q1818L29039J53854j07783
$$ -94476 267069 173963 -8415 25166 -104444 -447932 -366114 -37075 116779 8996
10882H996M11715M37041L02595J31590k97199j9783j36199l93662l13128j40746
$$ 8996 420711 857752 1160347 1291937 994738 974955 838756 445094 131966 -8780
10872h780P191j657k94090p7753J92462m6101k66468l26134l60706j17305K62674
$$ -8780 -1589 -3246 -297336 -375089 -182627 -228728 -495196 -821330 -1182036 -1299341 -1036667
10861a036667K18572J85284n4636K4923j54475K3385K05044K96400j23030j15027
$$ -1036667 -818095 -632811 -687447 -662524 -816999 -793614 -588570 -292170 -415200 -530227
10851e30227J96704K69599K46389R2011k40k41613m00239j80525k4420j7724N3669
$$ -530227 -333523 -63924 182465 274476 274236 32623 -367616 -548141 -572561 -590285 -536616
10840e36616j37770J96093O64302L25300N6588K45008L74321J04400L94488M96494
$$ -536616 -674386 -478293 186009 511309 567897 812905 1187226 1291626 1686114 2182608
10830B182608M44423K57436N83597P87790P90815Q40332J360776K049233K635286
$$ 2182608 2627031 2884467 3468064 4255854 5046669 5887001 7247777 9297010 11932296
10821A1932296L106675K286003m61726k870250l030421k168700j758988j328909
$$ 11932296 15038971 17324974 16863248 13992998 10962577 8793877 7034889 5705980
10813E705980j015567r03096m16535l70623o05944n81329k28302l31142k89143
$$ 5705980 4690413 3787317 3370782 3000159 2394215 1812886 1584584 1253442 964299
10804I64299p3145q636j0120L14896O4968k94262o0017p3578k86337n70291q7635
$$ 964299 891154 882518 872398 1187294 1252262 958000 897983 824405 538068 -32223 -119858
10793a19858N16519N2292k26887k49807j87401K25067M38459P2793m55289j34748
$$ -119858 396661 448953 222066 -27741 -215142 9925 448384 521177 65888 -68860
10783f8860K17910K04767k57306k27628J33121K26926O9384l0246j28988J47015
$$ -68860 149050 353817 96511 -131117 2004 228930 298314 268068 139080 286095
10773B86095L34939j30645l07750p1025o5380k19614k59755R4961K24520L9706
$$ 286095 621034 490389 182639 111614 46234 -173380 -433135 -338174 -113654 -73948
10763g3948l1289Q6012L37118L74251K99459j57665m68863M5087J3286n0818k38013
$$ -73948 -105237 -19225 317893 692144 991603 833938 365075 410162 423448 372630 134617
10752A34617k26419n5485p8549J69507P1716l7276m28242j12604J02362r0633
$$ 134617 -91802 -147287 -225836 -56329 15387 -21889 -450131 -562735 -460373 -551006
10742e51006o4162J74658L80542Q0753n65824k03421K37988M78976L05516P880
$$ -551006 -615168 -440510 -59968 20785 -545039 -748460 -510472 -31496 274020 281900
10732B81900n4361o6849k46386m07130k49717K03539L32093P1742J13904r8900
$$ 281900 227539 160690 -85696 -492826 -742543 -539004 -206911 -135169 -21265 -120165
10722a20165p801N32996L44596l27303m80987n1555k07585o4812O6095j12435
$$ -120165 -127966 405030 749626 422323 -58664 -110219 -317804 -382616 -316521 -428956
10712d28956N5218j37108l71309M10785N58110L66277J4902m88170m47093j2117
$$ -428956 -373738 -510846 -882155 -471370 86740 453017 467919 -20251 -467344 -479461
10702d79461J29096k20151K5991J71139m4660N5914J53638k79924k52145L03759
$$ -479461 -350365 -570516 -544525 -373386 -418046 -362132 -208494 -488418 -740563 -436804
10692d36804L67233J40469M006j10485r0811J11888R5437k88996j99667J90543
$$ -436804 -69571 70898 74904 -35581 -126392 -14504 80933 -208063 -407730 -217187
10682b17187l1771k40527O9408M2057Q1446P7750k5525k16469k92957k22886j73953
$$ -217187 -248958 -489485 -420077 -378020 -296574 -218824 -244349 -460818 -753775 -976661 -1150614
10671a150614J10856K40622J77302l3518j42104J62247K22190J2304L75166L69479
$$ -1150614 -1039758 -799136 -621834 -655352 -797456 -635209 -413019 -400715 -25549 343930
10661C43930l14183l16339l05854L48681M34101K71234K81575J05547k50251k82728
$$ 343930 29747 -286592 -592446 -243765 190336 461570 743145 848692 598441 315713
10651C15713k62751k90548L4018R0899R4257O9881j60106l32476r9368L14903
$$ 315713 52962 -237586 -203568 -112669 -18412 51469 -108637 -441113 -540481 -225578
10641b25578J12289j86650o0370Q3365q9440L336K77985K67114k59844l54086
$$ -225578 -113289 -299939 -360309 -276944 -366384 -363048 -85063 182051 -77793 -431879
10631d31879p8715R8513J80114q6798k3843l85492p0672M07033N81231J42606
$$ -431879 -510594 -412081 -231967 -318765 -342608 -728100 -798772 -391739 189492 332098
10621C32098m38521k19548J12959J13911m2562p5587N39405O14883K79750N450
$$ 332098 -106423 -325971 -213012 -99101 -141663 -217250 322155 937038 1216788 1222238
10611A222238J88301k54541k54828L4813j81037l21805k23451q1528J03956l80305
$$ 1222238 1410539 1155998 901170 935983 754946 433141 209690 128162 232118 -148187
10601a48187m82720J08153L76887L51376L4971j51192R4928L88219K01946j20490
$$ -148187 -630907 -522754 -145867 205509 240480 89288 184216 572435 774381 653891
10591F53891J47395L21749o7182m63997m88522l76522j34509k8851k6757J98083
$$ 653891 801286 1123035 1055853 591856 103334 -273188 -407697 -436548 -463305 -265222
10581b65222M36728L11327o9300j28314j27719J91648J79181l51693n19900r5368
$$ -265222 171506 482833 413533 285219 157500 349148 528329 176636 -343264 -438632
10571d38632J06607K2123q5404r4149O4108J68467p2534K15858L39867N99802
$$ -438632 -332025 -309902 -395306 -489455 -425347 -256880 -329414 -113556 226311 826113
10561H26113J55535j26541k06131k3366k8321j86674j04108l97866r4238Q3681
$$ 826113 981648 855107 648976 625610 597289 410615 306507 -91359 -185597 -101916
10551a01916o1702m9511j26955k48113j60672q4387J40466J09992J40478J14850
$$ -101916 -163618 -213129 -340084 -588197 -748869 -833256 -692790 -582798 -442320 -327470
10541c27470m95352m21267K63362M64038L66238J05197J74185J07313q0042j49222
$$ -327470 -822822 -1244089 -980727 -516689 -150451 -45254 128931 236244 156202 6980
10531F980k0235J98859L92477Q9371m55655k18296j00097k37488q4243M8071L76251
$$ 6980 -13255 185604 578081 667452 211797 -6499 -106596 -344084 -428327 -380256 -4005
10520d005N3293m48612l93688K2279O04097Q81898L00996q5497j2769q6431n40097
$$ -4005 49288 -399324 -793012 -770733 -166636 715262 1016258 930761 917992 831561 291464
10509B91464n13345o795k9211p8233k76565j9753P65382N11832k2237L3887N4864
$$ 291464 -221881 -228676 -257887 -336120 -612685 -632438 132944 644776 622539 656426 711290
10498G11290j59515l26414l92298j43973K06199K03361K41564j7113k21307j91371
$$ 711290 551775 225361 -166937 -310910 -104711 98650 340214 323101 101794 -89577
10488h9577N5800R6754J43535K51636j53595R4844j07354m66070l7204J84518
$$ -89577 -33777 62977 206512 458148 304553 399397 292043 -174027 -211231 -26713
10478b6713J83328k64529j11057m0197q9340l8602q8778J44672L32743n2517k86693
$$ -26713 156615 -107914 -218971 -259168 -348508 -387110 -475888 -331216 1527 -50990 -337683
10467c37683k36125m4420J1319K70458J08431j86102q1719J95369P6000J94544
$$ -337683 -573808 -618228 -606909 -336451 -228020 -414122 -495841 -300472 -224472 -29928
10457b9928J20515j61612p3247r3290J39444K88905k47842l74040n6066L47507
$$ -29928 90587 -71025 -144272 -237562 -98118 190787 -57055 -431095 -487161 -139654
10447a39654L24867k36943k77568o1138K23968r1791o05658k92374K87710N57408
$$ -139654 185213 -51730 -329298 -390436 -166468 -258259 -863917 -1156291 -868581 -311173
10437c11173L44274k64193n5325J38995J12505J27603j20665R3475K04529J01378
$$ -311173 33101 -231092 -286417 -147422 -34917 92686 -27979 65496 270025 371403
10427C71403k76405k98999J51701J36454m8301j89164q0646K749L3165J23811
$$ 371403 94998 -204001 -52300 84154 35853 -153311 -233957 -231208 -198043 -74232
10417g4232q2078l29409k14028J5423K68995K53791k0212j78980J69837J23987
$$ -74232 -156310 -485719 -699747 -684324 -415329 -161538 -181750 -360730 -190893 -66906
10407f6906j67634l04735p52K76520J02904l28522k16359m7333m9739L62020L62471
$$ -66906 -234540 -539275 -540027 -263507 -160603 -489125 -705484 -752817 -802556 -440536 -78065
10396g8065O4581m3895K73027L87031r3587j05069J21165P9921P5290j47025m16204
$$ -78065 -13484 -57379 215648 602679 509092 404023 525188 605109 680399 533374 117170
10385A17170k05969L58792K80028m3146j01372k63337j67893n6829J04312J77294
$$ 117170 -88799 269993 550021 506875 405503 142166 -25727 -82556 21756 199050
10375A99050j09698j26604l03031j67279n9843K44091O41901L03651k27165k03971
$$ 199050 89352 -37252 -340283 -507562 -567405 -323314 318587 622238 395073 191102
10365A91102k50772M934P0766K6098K20148p7422p5248Q7806q0160J48186K55010
$$ 191102 -59670 -54736 16030 42128 262276 184854 109606 197412 117252 265438 520448
10354E20448J2948J00157L16599J39231p4284j52426n64638j09682L53543k64629
$$ 520448 533396 633553 950152 1089383 1015099 862673 298035 188353 541896 277267
10344B77267m26470l99798R4493K60427J91282K13452K00726n0526n12223k60242
$$ 277267 -149203 -549001 -454508 -194081 -2799 210653 411379 360853 -151370 -411612
10334d11612r5261q9402P9249J48681K67423K07241j68783K2837J03010J8923
$$ -411612 -506873 -596275 -517026 -368345 -100922 106319 -62464 -39627 63383 82306
10324H2306j01259n5240j17726N3290J51982J64283j64244j79230j5974k44832
$$ 82306 -18953 -74193 -191919 -138629 13353 177636 13392 -165838 -181812 -426644
10314d26644M5495J04803r355j32961J39945L65940J25192j60759l58824m66378
$$ -426644 -381149 -276346 -285701 -418662 -278717 87223 212415 51656 -307168 -773546
10304g73546k24807K93570N84769K39976Q6011l70050j57903M1341k81798K1669
$$ -773546 -998353 -704783 -120014 119962 205973 -164077 -321980 -280639 -562437 -540768
10294e40768M3613L58635M81981N5586l12278j93981j38196J28224K25132K40672
$$ -540768 -497155 -138520 343461 399047 86769 -107212 -245408 -117184 107948 348620
10284C48620Q6089j65670k53038k68268j06800O527J26856k5175q1062j35207
$$ 348620 434709 269039 16001 -252267 -359067 -352540 -225684 -250859 -331921 -467128
10274d67128k48597n8419k2561J40280K44951l9354Q6357M69320L76609K94113
$$ -467128 -715725 -774144 -796705 -656425 -411474 -450828 -364471 104849 481458 775571
10264G75571n3434J02904J67089j25964k74585j85907r8461k63369L2037O3514
$$ 775571 722137 825041 992130 866166 591581 405674 307213 43844 75881 139395
10254A39395j08406j17018m948K01731L21248J92600j6021K93005K22447n7985
$$ 139395 30989 -86029 -90977 110754 432002 624602 608581 901586 1124033 1066048
10244A066048r5741N1842J07099l72835o32770n10791j20962n0672l5687J39778
$$ 1066048 970307 1022149 1129248 756413 123643 -387148 -508110 -558782 -594469 -454691
10234d54691K79526L67266J01413K34733L97086j95661m4384N88813M75923M31672
$$ -454691 -175165 192101 293514 528247 925333 729672 685288 1274101 1750024 2181696
10224B181696k78279p75013k82449r050m50581l46382j50816l47142j88992L46169
$$ 2181696 1903417 1128404 845955 836905 386324 39942 -110874 -458016 -647008 -300839
10214c00839M61820P2593o0208k71935l55086K13243K33164J00596L2155O7057
$$ -300839 160981 233574 173366 -98569 -453655 -240412 -7248 93348 125503 192560
10204A92560j7937p5945Q9500o7024k66943k81895q4023K79479J66207n0006J22100
$$ 192560 174623 98678 188178 121154 -145789 -427684 -511707 -232228 -66021 -116027 6073
10193F073K23346R2018j95227j69329M3369K47724L28776J33713N3983K48634
$$ 6073 229419 321437 126210 -43119 250 247974 576750 710463 764446 1013080
10183A013080N7892r3161l82606l32522O9983J76914q7397m20692q25768n37276
$$ 1013080 1070972 977811 595205 262683 332666 509580 422183 1491 -824277 -1361553
10173a361553J05228O35328Q30799J86488k81365O8536J01991j3680K23410N0105
$$ -1361553 -1256325 -620997 209802 396290 114925 183461 285452 271772 495182 545287
10163E45287n7380j54021j09642K37123K46313J7065j63776j86711k11439k13208
$$ 545287 487907 333886 224244 461367 707680 724745 560969 374258 162819 -50389
10153e0389k33760k65311L8249M04240K40740J24769r3625m14232n42688l65844
$$ -50389 -284149 -549460 -511211 -106971 133769 258538 164913 -249319 -792007 -1157851
10143a157851j13992J17095J18873l21249j33486L57779K08938j79676p835K75797
$$ -1157851 -1271843 -1154748 -1035875 -1357124 -1490610 -1132831 -923893 -1103569 -1111404 -835607
10133h35607L25481N72111J95742k22784j08556K40170N11006K79910k21336J0850
$$ -835607 -510126 61985 257727 34943 -73613 166557 677563 957473 736137 746987
10123G46987J25803l94986m70469K0368K19418P4354J47492j64491k52480O4932
$$ 746987 872790 477804 7335 27703 247121 321475 468967 304476 51996 116928
10113A16928O4564J03412j45508l64748l44049M9997N51528L37264l7954p5003
$$ 116928 181492 284904 139396 -225352 -569401 -519404 32124 369388 331434 256431
10103B56431j80861n61387j75704J58667K53933K11418K63837J26150k65897k0379
$$ 256431 75570 -485817 -661521 -502854 -248921 -37503 226334 352484 86587 66208
10093F6208r2610o1935O7604J98231K10130l3355k31946l78716L0260K41663P0262
$$ 66208 -26402 -88337 -20733 177498 387628 354273 122327 -256389 -226129 15534 85796
10082H5796l4667j63733m7418N63O7540M5388J08327o1600j51201m845l4516n838
$$ 85796 51129 -112604 -160022 -159459 -91919 -46531 61796 196 -151005 -155850 -190366 -196204
10070a96204L59195L66210J45787K14128R5083J82345K30710j71770r147k62449
$$ -196204 162991 529201 674988 889116 984199 1166544 1397254 1225484 1216337 953888
10060I53888m18472l37119m04586j22523o6424k22432j06113o432N475P500N49701
$$ 953888 535416 198297 -206289 -328812 -395236 -617668 -723781 -730213 -724738 -717238 -167537
10049a67537L08828k24112K2508K69402K08117k3402k97642m8207K80515N9706
$$ -167537 141291 -82821 -60313 209089 417206 393804 96162 47955 328470 388176
10039C88176m33573l32299L1688O4884J74489K58696j31140k66507m962K85771
$$ 388176 -45397 -377696 -346008 -281124 -106635 152061 20921 -245586 -250548 35223
10029C5223N16915J55059J46652K07283j5759j9144M6758k15014n78150n97266
$$ 35223 552138 707197 853849 1061132 1045373 1026229 1072987 857973 279823 -317443
10019c17443O4900R9759j74504J94826M20338L8111O9774P4012J946q5515l8264
$$ -317443 -252543 -152784 -327288 -132462 287876 325987 395761 469773 471719 386204 347940
10008C47940p695p8036k36413l877O8858J08218j56962J55108L06465R984l10319
$$ 347940 340245 262209 25796 21919 90777 198995 42033 197141 503606 513590 203271
9997B03271q4747K01638j53824j67958N6479L0897j82122p9791J47527J98020
$$ 203271 118524 320162 166338 -1620 54859 85756 -96366 -176157 -28630 169390
$$ [...]
##END NTUPLES=NMR SPECTRUM
##END=
