##TITLE=C13_Pr 4968
 CDCl3, 18600 sc

 24.12.2020
##JCAMPDX= 6.0         $$ Bruker NMR JCAMP-DX V2.0
##DATA TYPE= NMR SPECTRUM
##DATA CLASS= NTUPLES
##ORIGIN= UXNMR, Bruker Analytische Messtechnik GmbH
##OWNER= root
$$ XWIN-NMR		Version 3.5
$$ Fri Dec 25 09:55:54 2020 Russian Standard Time (UT+4h)  she@DPX200
##.OBSERVE FREQUENCY= 50.327896
##.OBSERVE NUCLEUS= ^13C
##.ACQUISITION MODE= SIMULTANEOUS
##.ACQUISITION SCHEME= undefined
##.AVERAGES= 18600
##.DIGITISER RES= 17
##SPECTROMETER/DATA SYSTEM= spect
##.PULSE SEQUENCE= zgpg30
##.SOLVENT NAME= CDCl3
##.SHIFT REFERENCE= (INTERNAL, CDCl3, 0, 222.705)
##AUDIT TRAIL= $$ (NUMBER, WHEN, WHO, WHERE, WHAT)
$$ ##TITLE= Audit trail, XWIN-NMR		Version 3.5
$$ ##JCAMPDX= 5.01
$$ ##ORIGIN= Bruker BioSpin GmbH
$$ ##OWNER= she
$$ F:/spectra/data/she/nmr/c13/1/pdata/1/auditp.txt
$$ ##AUDIT TRAIL=  $$ (NUMBER, WHEN, WHO, WHERE, WHAT)
(   1,<2020-12-25 09:53:48.50 +0400>,<she>,<DPX200>,
      <created by zg, POWCHK disabled, PULCHK disabled
       terminated by command 'halt'
       configuration hash MD5:
       00 E9 B6 7A A2 85 ED C7 34 08 36 98 17 FE 4E 26
       data hash MD5: 32K
       B8 D2 E5 86 B3 75 99 79 70 80 74 65 FE 59 29 7C>)
(   2,<2020-12-25 09:53:55.31 +0400>,<she>,<DPX200>,
      <Start of raw data processing
       efp BC_mod = 2 LB = 1 FT_mod = 6 PKNL = 1 PHC0 = -273.1092 PHC1 = 38.36242 SI = 32K 
       data hash MD5: 32K
       64 44 7E 1A 90 F1 45 D7 42 62 FC DC 47 49 65 BC>)
(   3,<2020-12-25 09:54:02.37 +0400>,<she>,<DPX200>,
      <abs ABSG = 5 
       data hash MD5: 32K
       06 BA 9D 94 77 EC 24 FB 18 DF D8 1A 69 19 62 72>)
(   4,<2020-12-25 09:54:58.84 +0400>,<she>,<DPX200>,
      <pk PHC0 = 7.79153 PHC1 = -10.4 
       data hash MD5: 32K
       47 55 10 A7 AB 25 4B BB 77 27 3F 2A 75 CD AC 85>)
(   5,<2020-12-25 09:55:02.39 +0400>,<she>,<DPX200>,
      <abs ABSG = 5 
       data hash MD5: 32K
       83 36 88 2A CF 10 2E 05 12 E7 76 8E D9 F7 10 C6>)
$$ ##END=
$$ 
$$ hash MD5
$$ 06 1D C6 88 11 23 67 8D 2A 55 35 9A A9 D6 81 7A
##$RELAX= 
##$RELAX= 
##$RELAX= 
##$RELAX= 
##$RELAX= 
##$RELAX= 
##$RELAX= 
##$RELAX= 
$$ Bruker specific parameters
$$ --------------------------
##$DU= <F:/spectra>
##$EXPNO= 1
##$NAME= <c13>
##$PROCNO= 1
##$TYPE= <nmr>
##$USER= <she>
##$AMP= (0..31)
100 100 100 100 100 100 100 100 100 100 100 100 100 100 100 100 100 100 
100 100 100 100 100 100 100 100 100 100 100 100 100 100 
##$AQSEQ= 0
##$AQ_mod= 1
##$AUNM= <au_zg>
##$AUTOPOS= <>
##$BF1= 50.322709
##$BF2= 200.13
##$BF3= 50.322709
##$BF4= 500.13
##$BF5= 500.13
##$BF6= 500.13
##$BF7= 500.13
##$BF8= 500.13
##$BYTORDA= 1
##$CFDGTYP= 0
##$CFRGTYP= 5
##$CHEMSTR= <none>
##$CNST= (0..31)
1 1 145 1 1 1 1 1 1 1 1 1 1 1 1 1 1 1 1 1 1 1 1 1 1 1 1 1 1 1 1 1 
##$CPDPRG= <waltz16>
##$CPDPRG1= <>
##$CPDPRG2= <waltz16>
##$CPDPRG3= <>
##$CPDPRG4= <mlev>
##$CPDPRG5= <mlev>
##$CPDPRG6= <mlev>
##$CPDPRG7= <mlev>
##$CPDPRG8= <mlev>
##$CPDPRGB= <>
##$CPDPRGT= <>
##$D= (0..31)
$$ [...]
##$SUBNAM4= <"">
##$SUBNAM5= <"">
##$SUBNAM6= <"">
##$SUBNAM7= <"">
##$SUBNAM8= <"">
##$SUBNAM9= <"">
##$SW= 239.972175391363
##$SWIBOX= (0..15)
0 1 3 0 0 0 0 0 0 0 0 0 0 0 0 0 
##$SW_h= 12077.2946859903
##$TD= 32768
##$TD0= 1
##$TE= 0
##$TE2= 300
##$TE3= 300
##$TEG= 300
##$TL= (0..7)
120 120 120 120 120 120 120 120 
##$TP= (0..7)
150 150 150 150 150 150 150 150 
##$TP07= 0
##$TPNAME0= <>
##$TPNAME1= <>
##$TPNAME2= <>
##$TPNAME3= <>
##$TPNAME4= <>
##$TPNAME5= <>
##$TPNAME6= <>
##$TPNAME7= <>
##$TPOAL= (0..7)
0.5 0.5 0.5 0.5 0.5 0.5 0.5 0.5 
##$TPOFFS= (0..7)
0 0 0 0 0 0 0 0 
##$TUNHIN= 0
##$TUNHOUT= 0
##$TUNXOUT= 0
##$USERA1= <user>
##$USERA2= <user>
##$USERA3= <user>
##$USERA4= <user>
##$USERA5= <user>
##$V9= 5
##$VALIST= <valist>
##$VCLIST= <CCCCCCCCCCCCCCC>
##$VD= 0
##$VDLIST= <DDDDDDDDDDDDDDD>
##$VPLIST= <PPPPPPPPPPPPPPP>
##$VTLIST= <TTTTTTTTTTTTTTT>
##$WBST= 1024
##$WBSW= 4
##$XGAIN= (0..3)
0 0 0 0 
##$XL= 0
##$YL= 0
##$YMAX_a= 109529298
##$YMIN_a= -81551410
##$ZGOPTNS= <>
##$ZL1= 120
##$ZL2= 120
##$ZL3= 120
##$ZL4= 120
##$ABSF1= 222.6607
##$ABSF2= -17.33611
##$ABSG= 5
##$ABSL= 3
##$ALPHA= 0
##$AQORDER= 0
##$ASSFAC= 0
##$ASSFACI= 0
##$ASSFACX= 0
##$ASSWID= 0
##$AUNMP= <proc_1d>
##$AZFE= 0.1
##$AZFW= 0.5
##$BCFW= 0
##$BC_mod= 2
##$BYTORDP= 0
##$COROFFS= 0
##$CY= -3
##$DATMOD= 1
##$DC= 0
##$DFILT= <>
##$DTYPP= 0
##$F1P= 0
##$F2P= 0
##$FCOR= 0.5
##$FTSIZE= 32768
##$FT_mod= 6
##$GAMMA= 0
##$GB= 0
##$INTBC= 1
##$INTSCL= 4.134877e-10
##$ISEN= 128
##$LB= 1
##$LEV0= 0
##$LPBIN= 0
##$MAXI= 10000
##$MC2= 0
##$MEAN= 0
##$ME_mod= 0
##$MI= 0.1934396
##$NCOEF= 0
##$NC_proc= 2
##$NLEV= 6
##$NOISF1= 120.0001
##$NOISF2= 80.00006
##$NSP= 0
##$NTH_PI= 0
##$NZP= 0
##$OFFSET= 222.7046
##$PC= 1.4
##$PHC0= -265.3177
##$PHC1= 27.96242
##$PH_mod= 1
##$PKNL= yes
##$PPARMOD= 0
##$PSCAL= 0
##$PSIGN= 0
##$REVERSE= no
##$SF= 50.3227275485802
##$SI= 32768
##$SIGF1= 140
##$SIGF2= 120
##$SINO= 11.81781
##$SIOLD= 32768
##$SREGLST= <13C.CDCl3>
##$SSB= 0
##$STSI= 32768
##$STSR= 0
##$SW_p= 12077.2946859903
##$SYMM= 0
##$S_DEV= 0
##$TDeff= 32768
##$TDoff= 0
##$TI= <>
##$TILT= no
##$TM1= 0
##$TM2= 0
##$TOPLEV= 0
##$USERP1= <user>
##$USERP2= <user>
##$USERP3= <user>
##$USERP4= <user>
##$USERP5= <user>
##$WDW= 1
##$XDIM= 32768
##$YMAX_p= 455523573
##$YMIN_p= -2216360
$$ End of Bruker specific parameters
$$ ---------------------------------
##NTUPLES= NMR SPECTRUM
##VAR_NAME=  FREQUENCY,     SPECTRUM/REAL,   SPECTRUM/IMAG
##SYMBOL=    X,             R,               I
##VAR_TYPE=  INDEPENDENT,   DEPENDENT,       DEPENDENT
##VAR_FORM=  AFFN,          ASDF,            ASDF
##VAR_DIM=   32768,         32768,           32768
##UNITS=     HZ,            ARBITRARY UNITS, ARBITRARY UNITS
##FACTOR=    0.368581032318806, 1,           1
##FIRST=     11207.1031663892, 0,            0
##LAST=      -870.191519601083, 0,           0
##MIN=       -870.191519601083, -2216360,    0
##MAX=       11207.1031663892, 455523573,    0
$$ Real data points
##PAGE= N=1
##DATA TABLE= (X++(R..R)), XYDATA
$$ [...]
12592G9284k63911m32222l4143N62481L79906p0902l48381l11718O0841L46065
$$ 79284 -184627 -616849 -650992 -88511 291395 220493 -127888 -439606 -378765 -32700
12582c2700R2711j1900K63346Q2206K59769n2367m82640j7312L24345N31070L15884
$$ -32700 60011 48111 311457 393663 653432 601065 118425 101113 425458 956528 1272412
12571A272412o223p8039j30206O8898K40611o3356m52075n89789n10823l36505
$$ 1272412 1266189 1188150 1057944 1126842 1367453 1304097 852022 262233 -248590 -585095
12561e85095l46300l6747K10046J63994M32465M39696J41572J56674L05374j63006
$$ -585095 -931395 -968142 -758096 -594102 -161637 278059 419631 576305 881679 718673
12551G18673k71600l56354l13757O0177J4991J33331L98982K21044p3113k92140
$$ 718673 447073 90719 -223038 -162861 -147870 -14539 384443 605487 532374 240234
12541B40234o11K61217j6613j93428j09324o9530k99500j73749L04415L08565
$$ 240234 239623 500840 484227 290799 181475 111945 -187555 -361304 -56889 251676
12531B51676N3475K02367L56362L45052M0052K3763k04205n92844l05284J65104
$$ 251676 305151 507518 863880 1208932 1248984 1272747 1068542 475698 170414 335518
12521C35518J61175o0130O8214N0221J0346J17827o1653k04549k03120k56915
$$ 335518 496693 436563 504777 554998 565344 683171 621518 416969 213849 -43066
12511d3066j64452k12221k14812K02958M83455J47377p5757L5873k08655j00359
$$ -43066 -207518 -419739 -634551 -431593 51862 199239 123482 159355 -49300 -149659
12501a49659J80226k2649l8900o3041J42473J66082p546m4658k60145L4737K20262
$$ -149659 30567 7918 -30982 -94023 48450 214532 206986 162328 -97817 -63080 157182
12490A57182J32633j68962o26106l95131J82045M57499L17169L5384Q6286j02124
$$ 157182 289815 120853 -505253 -900384 -718339 -260840 56329 91713 177999 75875
12480G5875k39604k12717l4729k89188l04464M81293K65784l01971n84751j20587
$$ 75875 -163729 -376446 -411175 -700363 -1004827 -523534 -257750 -559721 -1144472 -1265059
12470a265059K63729K61133J55700j18758j80880P0130J36433J7018o4142m0215
$$ -1265059 -1001330 -740197 -584497 -703255 -884135 -814005 -677572 -660554 -724696 -764911
12460g64911R5646K30390L06169J99612J70206j63325m86765m245L55936m2727
$$ -764911 -669265 -438875 -132706 66906 237112 73787 -412978 -417223 -61287 -104014
12450a04014j3825O7168j44929L4625J27901L31890r5276n25910r4010K02200
$$ -104014 -117839 -50671 -195600 -160975 -33074 298816 203540 -322370 -416380 -214180
12440b14180R5373M06234R6466k38094J25120L87984J56705J97604J56556n34067
$$ -214180 -118807 287427 383893 145799 270919 658903 815608 1013212 1169768 635701
12430F35701n19631l45637j40938L07609J26642j00330K50539L30810J4096j48923
$$ 635701 116070 -229567 -370505 -62896 63746 -36584 213955 544765 558861 409938
12420D09938k52499m01350l39868n7808M0666R3044Q1964J51010l33440O6086
$$ 409938 157439 -243911 -583779 -641587 -600921 -507877 -425913 -274903 -608343 -542257
12410e42257O76121M35458M09398j66230l42853o682P3170k58503m63503k75139
$$ -542257 133864 569322 978720 812490 469637 462955 536125 277622 -185881 -461020
12400d61020k2044Q9085J54792q4823j38583j94877k70562j07442M05025N49629
$$ -461020 -483064 -393979 -239187 -324010 -462593 -657470 -928032 -1035474 -630449 -80820
12390h0820K210j67768K2689J09425j06734K06660L23028j43830o0727K18908
$$ -80820 -78610 -246378 -223689 -114264 -220998 -14338 308690 164860 104133 323041
12380C23041L477j23651j69067j37457k51871j66291R7150J94421J90201p6622
$$ 323041 326518 202867 33800 -103657 -355528 -521819 -424669 -230248 -40047 -116669
12370a16669m4599K19587q2462k6666K2134J54311r9136P235J89048p9621k40502
$$ -116669 -161268 58319 -24143 -50809 -28675 125636 26500 33735 222783 143162 -97340
12359i7340l7896L4395m90180l28829L1667j0541J20482K16559L11194L51984
$$ -97340 -135236 -100841 -591021 -919850 -888183 -898724 -778242 -561683 -250489 101495
12349A01495J75845l4288m18078j72608k41285j60129n1128J19039K82478M5597
$$ 101495 277340 243052 -175026 -347634 -588919 -749048 -800176 -681137 -398659 -353062
12339c53062p7560L0343p8727r0549l96732M6626L80743J32748R2464K81406K72484
$$ -353062 -430622 -400279 -479006 -569555 -966287 -919661 -538918 -406170 -313706 -32300 240184
12328B40184k13327k16945P8755o684J1353J59588M7434j23517l24411j71029
$$ 240184 26857 -190088 -111333 -118017 -106664 52924 100358 -23159 -347570 -518599
12318e18599o1368l21561k66434j02660k17283j85985L80282O70735L20938p0436
$$ -518599 -579967 -901528 -1167962 -1270622 -1487905 -1673890 -1293608 -622873 -301935 -372371
12308c72371k00489P5173M8758k0024j49752m5980P1074Q4082J55337M07840L42074
$$ -372371 -572860 -497687 -448929 -468953 -618705 -664685 -593611 -509529 -354192 53648 395722
12297C95722o8276k38037k63666j27856k0814K1630J54684j56024j57676K70616
$$ 395722 327446 89409 -174257 -302113 -322927 -301297 -146613 -302637 -460313 -189697
12287a89697J70740j50624p0739j03770Q5965K69842L90973j36393j60558J51200
$$ -189697 -18957 -169581 -240320 -344090 -258125 11717 402690 266297 105739 256939
12277B56939l12662n06495j25241O2928R2417L45769j19615o87061n23607P9310
$$ 256939 -55723 -562218 -687459 -624531 -532114 -186345 -305960 -993021 -1516628 -1437318
12267a437318K36347L83449J26007j18748K18249K43659m5059k52635j22863K01784
$$ -1437318 -1200971 -817522 -691515 -810263 -592014 -348355 -393414 -646049 -768912 -567128
12257e67128N96579J85860l42941j89060l26453k29739L56649L02468K30543p5375
$$ -567128 29451 215311 -127630 -316690 -643143 -872882 -516233 -213765 16778 -58597
12247e8597o71834q7004J62287j83167k75556j96421K70440L01355L9461L02334
$$ -58597 -730431 -817435 -655148 -838315 -1113871 -1310292 -1039852 -738497 -699036 -396702
12237c96702K26665k36963R5382L2970j98544o6142r1648M6383J29230M35214
$$ -396702 -170037 -407000 -311618 -278648 -477192 -543334 -634982 -588599 -459369 -24155
12227b4155r3133j77101L26680K25176m4482j05286k82671l09872j07784K9090
$$ -24155 -117288 -294389 32291 257467 212985 107699 -174972 -484844 -592628 -563538
12217e63538L22784r2875n34517j66487J03171K90370J36462j21776j59079N01946
$$ -563538 -240754 -333629 -868146 -1034633 -931462 -641092 -504630 -626406 -785485 -283539
12207b83539K73510j87270o0054q2704j65757n9184j45816q6778L31281K83088
$$ -283539 -10029 -197299 -257353 -340057 -505814 -564998 -710814 -797592 -466311 -183223
12197a83223Q3052L86727L76760M12956q8447n76880m35490k51603m82086k61901
$$ -183223 -100171 286556 663316 1076272 987825 410945 -24545 -276148 -758234 -1020135
12187a020135O2952q3083Q6621Q14673N04325j07384n73184k64476L18808j46703
$$ -1020135 -957183 -1040266 -953645 -138972 365353 257969 -315215 -579691 -260883 -407586
12177d07586j15147r7544j48548j80350K25183M38355L68163K38028K3322j94231
$$ -407586 -522733 -620277 -768825 -949175 -723992 -285637 82526 320554 343876 149645
12167A49645l39625k10939r1220j65381K5836K05145J33169K5862K44954L22207
$$ 149645 -189980 -400919 -492139 -657520 -631684 -426539 -293370 -267508 -22554 299653
12157B99653J24593L21527J60325k61494k23844k57399j44253j12552j42044j15197
$$ 299653 424246 745773 906098 644604 420760 163361 19108 -93444 -235488 -350685
12147c50685R0916K10364K55304K40782K75122o8613j28520K46393J56924l21989
$$ -350685 -259769 -49405 205899 446681 721803 653190 524670 771063 927987 605998
12137F05998l95980O5883R3894j55114j10615Q6602J30017K58603j13638l41353
$$ 605998 210018 275901 369795 214681 104066 190668 320685 579288 465650 124297
12127A24297o07509m13548J74740P69929L07898k82005l62593k89973N5031L28066
$$ 124297 -483212 -896760 -722020 47909 355807 73802 -288791 -578764 -523733 -195667
12117a95667N62348O9620j36885j8515J88820K99921J68339m19118o25361k94803
$$ -195667 366681 436301 299416 280901 469721 769642 937981 518863 -106498 -401301
12107d01301j12986l57426m59382l6034N08901O10123K60081n4035j35207k79164
$$ -401301 -514287 -871713 -1331095 -1367129 -858228 -248105 11976 -42059 -177266 -456430
12097d56430m2376L31783J8059j07157J08921k78583j10674K24190n5566J97080
$$ -456430 -498806 -167023 -148964 -256121 -147200 -425783 -536457 -312267 -367833 -170753
12087a70753J47562k06297m148J56700M60105J24810q75817j051908Q3655R38846
$$ -170753 -23191 -229488 -233636 -76936 383169 507979 -367838 -1419746 -1336091 -397245
12077c97245N91054O0573O0039J68102k25098j89325J67676J74817K56576J82270
$$ -397245 193809 254382 314421 482523 257425 68100 235776 410593 667169 849439
12067H49439O4728k71256k91315j2412l4933K53749K98675M1430k91399o87240
$$ 849439 914167 642911 351596 339184 304251 558000 856675 898105 606706 -80534
12057h0534l44509j86052k34667J38220M02827Q1707k08716R1653J00967o5374
$$ -80534 -425043 -611095 -845762 -707542 -304715 -223008 -431724 -340071 -239104 -304478
12047c04478j54103L0020m3069M25126J24228j56960l52893k90123J18136M58353
$$ -304478 -458581 -428561 -471630 -46504 77724 -79236 -432129 -722252 -604116 -145763
12037a45763J04800k91448J13758L02208J79089L85245K84025j3058j20782k88659
$$ -145763 -40963 -332411 -218653 83555 262644 647889 931914 918856 798074 509415
12027E09415j63747l3397M77609K19940p365l4515j15345k20901j50111k32036
$$ 509415 345668 312271 789880 1009820 1002455 967940 852595 631694 481583 249547
12017B49547k4584K85212j2308j88924J89650j08877k84406J89496L59616Q1327
$$ 249547 224963 510175 497867 308943 498593 389716 105310 294806 654422 735749
12007G35749l77990n20251n7915m85330o5001K42370K25666L40346Q0361j06232
$$ 735749 357759 -162492 -220407 -705737 -770738 -528368 -302702 37644 118005 11773
11997A1773k01517k02793J92018L68405J00431J01150j07111k11181j20822l1303
$$ 11773 -189744 -392537 -200519 167886 268317 369467 262356 51175 -69647 -100950
11987a00950k63412J47273J46144j92586J01751J61153j70946N5952K7010l63738
$$ -100950 -364362 -217089 -70945 -263531 -161780 -627 -171573 -115621 -88611 -452349
11977d52349j0589K59086M56059J91516o3782k84986m63781j31846P457m55000
$$ -452349 -462938 -203852 252207 443723 379941 94955 -368826 -500672 -493215 -948215
11967i48215l49323K18409L79738J05943J63330P2525L4186J32170p9709L2464
$$ -948215 -1297538 -1079129 -699391 -593448 -430118 -357593 -323407 -191237 -270946 -238482
11957b38482K4521l31786l74387J17924J48573O6089J65451j41072k53656M6005
$$ -238482 -213961 -545747 -920134 -802210 -653637 -587548 -422097 -563169 -816825 -770820
11947g70820L79920j65917p4010m8100k68487L54807L92868n6837k09754q9240
$$ -770820 -390900 -556817 -630827 -678927 -947414 -592607 -199739 -256576 -466330 -555570
11937e55570R8948J16576p4941n05920k13751j99137q2957L33666M03904K25583
$$ -555570 -456622 -340046 -414987 -920907 -1134658 -1333795 -1416752 -1083086 -679182 -453599
11927d53599J28134k33854j88732K19982J98689J20515Q2929j06594j85060L31078
$$ -453599 -325465 -559319 -748051 -528069 -329380 -208865 -125936 -232530 -417590 -86512
11917h6512L75677O6469q6822l21288M1321M01223J7211k71067k89940P9722K5501
$$ -86512 289165 355634 268812 -52476 -11155 390068 407279 136212 -153728 -74006 -48505
11906d8505r2827N935q2997j94561J2403K16768O7864J25797J68578m45495n37371
$$ -48505 -141332 -135397 -218394 -412955 -400552 -183784 -115920 9877 178455 -267040 -804411
11895h04411l39733o3598J38382M4810L04463O47050N37916L48715p0117m12824
$$ -804411 -1144144 -1207742 -1069360 -1024550 -720087 -73037 464879 813594 743477 330653
11885C30653o610J1854m14273m63372k34870L45101M98303J14050r9749j17078
$$ 330653 324043 335897 -78376 -541748 -776618 -431517 66786 180836 81087 -35991
11875c5991j50995M1845Q1001q6881k21810K25636K72926k15619n43469l28893
$$ -35991 -186986 -145141 -64140 -151021 -372831 -147195 125731 -89888 -633357 -962250
11865i62250j27092J83429J72861J19130N54025K34677k1665M15737k9484l79349
$$ -962250 -1089342 -905913 -733052 -613922 -59897 174780 153115 568852 539368 160019
11855A60019q5198j8422k1299K36040P3627J85040M80696M19158J51571j71021
$$ 160019 74821 56399 35100 271140 344767 529807 1010503 1429661 1581232 1410211
11845A410211l40627o3550n9581j64164n0976l5759r4981l51770J84257N26572
$$ 1410211 1069584 1006034 946453 782289 731313 695554 600573 248803 433060 959632
11835I59632k52408n01687n76526j90006l6132j01141r9299M943j99853j55670
$$ 959632 707224 205537 -370989 -560995 -597127 -698268 -797567 -792624 -992477 -1148147
11825a148147J54107L31120K81897N5336Q9779L31076M13885J61208j03716j94449
$$ -1148147 -994040 -662920 -381023 -325687 -235908 95168 509053 670261 566545 372096
11815C72096l74762j16133o581m17687n56398j06424K91557J01535k75651k09639
$$ 372096 -2666 -118799 -125380 -543067 -1099465 -1205889 -914332 -812797 -1088448 -1298087
11805a298087K659J48178J9454L11908J43680M2087O2442L5035J55594k49733
$$ -1298087 -1295428 -1147250 -1127796 -815888 -672208 -630121 -567679 -532644 -377050 -626783
11795f26783j69993q7954J1227M5739K74620L4323j79415n9830O7601K33352M06469
$$ -626783 -796776 -884730 -873503 -827764 -553144 -518821 -698236 -758066 -690465 -457113 -50644
11784e0644K76209K59116R6995n7071K24391n334l03767n08353k24674K89012
$$ -50644 225565 484681 581676 524605 748996 743662 439895 -68458 -293132 -4120
11774d120L72861O12713P26838L95048l23582l19289l39693N3318J60608m16228
$$ -4120 368741 981454 1708292 2103340 1779758 1460469 1120776 1174094 1334702 918474
11764I18474m12989N5220K43762j0731m73459l30734l4619K52964L87067P0857
$$ 918474 505485 560705 804467 793736 320277 -10457 -45076 207888 594955 665812
11754F65812K0894j40765j93803l39035l73576j62199J10228j23699k23142R5982
$$ 665812 686706 545941 352138 13103 -360473 -522672 -412444 -536143 -759285 -663303
11744f63303K3233l03843k09318l287j69666K26298L81166J5112o5137l54923
$$ -663303 -640070 -943913 -1153231 -1156518 -1326184 -1099886 -718720 -703608 -768745 -1123668
11734a123668J754P96818J096935R86355m20834j096048o65495j93501J14147
$$ -1123668 -1121914 -325096 771839 1758194 1337360 241312 -424183 -617684 -503537
11725e03537J91967k32211j48288L53762L21525J750j04370J59273K45439k29592
$$ -503537 -311570 -543781 -692069 -338307 -16782 -15032 -119402 39871 285310 55718
11715E5718k63076J26861L29064L72314o8740q9947m6293n875r3544o52370j99640
$$ 55718 -207358 -80497 248567 620881 552141 462194 415901 410026 316482 -335888 -535528
11704e35528J39012L22629K22885q7j1770k36335K3267L30339l17503m80196k9803
$$ -535528 -396516 -73887 148998 148911 137141 -99194 -75927 254412 -63091 -543287 -573090
11693e73090k14516k46384k09771n7141J27594J62008L07519O15365M73782K50592
$$ -573090 -787606 -1033990 -1243761 -1300902 -1173308 -1011300 -703781 -88416 385366 635958
11683F35958j32960o17405l25777L40606M02645k65622r4134M06951M20961m21342
$$ 635958 502998 -114407 -440184 -99578 303067 37445 -56689 350262 771223 349881
11673C49881j025039l55204j63151r11J80485K01362p3701P883K88538K27654
$$ 349881 -675158 -1030362 -1193513 -1194424 -1013939 -812577 -886278 -878395 -589857 -362203
11663c62203P4361k62362q2566R8100J09362P872p8368N78942O05645K13699J5408
$$ -362203 -287842 -550204 -632770 -534670 -425308 -417436 -495804 83138 688783 902482 917890
11652I17890l7511j84084K5219r67n75668j4004L82463J83032K68538q0255o38597
$$ 917890 880379 696295 721514 720547 144879 130875 513338 696370 964908 884653 246056
11641B46056l99561k86601l2175j1174l13287k58669l744M39401L89668J65032
$$ 246056 -153505 -440106 -472281 -483455 -796742 -1055411 -1059155 -619754 -230086 -65054
11631f5054j5932l08749j53150L16767J94453J4258Q0391j7969k38294k14427
$$ -65054 -80986 -389735 -542885 -226118 -31665 -17407 62984 45015 -193279 -407706
11621d07706J30096J35033L72363M06491J41688J23470K59257l10813n92183n09113
$$ -407706 -277610 -142577 229786 636277 777965 901435 1160692 849879 257696 -251417
11611b51417j45133K71214J60053J79133r2780j01899j46464j0206j07761q3660
$$ -251417 -396550 -125336 34717 213850 121070 19171 -127293 -137499 -245260 -328920
11601c28920o9691k46022k78971k63349K33065N13283L42355L74219K43085J12786
$$ -328920 -398611 -644633 -923604 -1186953 -953888 -440605 -98250 275969 519054 631840
11591F31840j49300n96051l09545M28881M25215L59216M28413k50145q30497m79352
$$ 631840 482540 -113511 -423056 5825 431040 790256 1218669 968524 138027 -341325
11581c41325j02826K7847J66857M26288j41490k84882L36361l5811k82031m84998
$$ -341325 -444151 -416304 -249447 176841 35351 -249531 86830 51019 -231012 -716010
11571g16010n22836m29547k50054N76084Q37028L02810N1779m33899k00020J79501
$$ -716010 -1238846 -1668393 -1918447 -1342363 -505335 -202525 -150746 -584645 -784665 -605164
11561f05164N9232k06048L17116L97568O9884j70064n2960j96559M9420L33003
$$ -605164 -545932 -751980 -434864 -37296 32588 -137476 -190436 -386995 -337575 -4572
11551d572K41659J53457J07565j08104j49192j03262j87594l62606r2740K75753
$$ -4572 237087 390544 498109 390005 240813 137551 -50043 -412649 -505389 -229636
11541b29636J03763j8807l4653J01495j63333n62037r1089M27987K48873Q4037
$$ -229636 -125873 -144680 -179333 -77838 -241171 -803208 -894297 -466310 -217437 -133400
11531a33400L0768K17428L67512K486o10934r58393l67772N1680K06438N45462
$$ -133400 -102632 114796 482308 484794 -126140 -1084533 -1452305 -1400625 -1194187 -648725
11521f48725M80344L35011K64545j08049p1922q9908j08623p9671n0667M54369
$$ -648725 -168381 166630 431175 323126 251204 161296 52673 -26998 -77665 376704
11511C76704L11786J5980P0866k50502m25336p86349o31457M34279P89939M73551
$$ 376704 688490 704470 775336 524834 99498 -686851 -1318308 -884029 -94090 379461
11501C79461j29848j52495k9183k2478P2862J24699K49164K76080k93044m33985
$$ 379461 249613 97118 67935 45457 118319 243018 492182 768262 475218 41233
11491D1233k02833J98884K04291K65293K23301K1600l40985l88614l78166R8914
$$ 41233 -161600 37284 241575 506868 730169 751769 410784 22170 -355996 -257082
11481b57082L41025L11669j15774n45332O0908K18269o4879k22191j33567J97785
$$ -257082 83943 395612 279838 -265494 -204586 13683 -51196 -273387 -406954 -209169
11471b09169J74976k78429J09010K78879k05452k36717m2529J77044J71391k3196
$$ -209169 -34193 -312622 -203612 75267 -130185 -366902 -409431 -232387 -60996 -84192
11461h4192j76540N0511M3838K1369Q6438J17395J10758j30595l27294l73869
$$ -84192 -260732 -210221 -166383 -145014 -58576 58819 169577 38982 -288312 -662181
11451f62181j47654M03280N70937M39501J12080O1371J9094j23818n62036k17963
$$ -662181 -809835 -406555 164382 603883 715963 777334 796428 672610 110574 -107389
11441a07389J85189q0892Q1449M91958L85819J28038o5659k27933j227766o49364
$$ -107389 77800 -3092 78357 570315 956134 1084172 1018513 790580 -437186 -1086550
11431a086550O91260q6965R4799M91207j29348n46027j26321K21109K62116q7166
$$ -1086550 -395290 -482255 -387456 103751 -25597 -571624 -697945 -476836 -214720 -301886
11421c01886j49256O47905O22151j71308m33677m67890k31992m0159J03148K79360
$$ -301886 -451142 196763 818914 647606 213929 -253961 -485953 -526112 -422964 -143604
11411a43604l427q3236j03430K95579K48843j1038r7528k01317j31163R843m25545
$$ -143604 -147031 -230267 -333697 -38118 210725 199687 102159 -99158 -230321 -220478 -646023
11400f46023m13184k2477n8807J73016N63264L81665l3963k3756R5364j11290
$$ -646023 -1059207 -1081684 -1140491 -967475 -404211 -22546 -56509 -80265 15099 -96191
11390i6191j62397j92769j78592r0885K45329K4729M05413L15002j78521l30952
$$ -96191 -258588 -451357 -629949 -720834 -475505 -450776 -45363 269639 91118 -239834
11380b39834j96988m4455K74216L54640J25805J21523J21684K37711K31746k5925
$$ -239834 -436822 -481277 -207061 147579 273384 394907 516591 754302 986048 960123
11370I60123m53738l25227n0949K06840j63933n99401q50850k75549M58610N51309
$$ 960123 506385 181158 130209 337049 173116 -426285 -1277135 -1552684 -1094074 -542765
11360e42765L25984K59896L52737L10505k1116o31499k15846J2009K32701L28359
$$ -542765 -216781 43115 395852 706357 685241 53742 -162104 -150095 82606 410965
11350D10965K16716M44706k1086n05319m03351m31584l26030j96344J77937P6713
$$ 410965 627681 1072387 1051301 545982 142631 -288953 -614983 -811327 -633390 -556677
11340e56677j09728J7706Q2404j84411k83688K97795K09053M1198m6619o9506
$$ -556677 -666405 -648699 -566295 -750706 -1034394 -736599 -527546 -486348 -532967 -602473
11330f02473n5029J52320J09711O3519m2614K60895L95468J04222m25615l63825
$$ -602473 -657502 -505182 -395471 -331952 -374566 -113671 281797 386019 -39596 -403421
11320d03421J38357L12308J12732K12280N5884K44600K72111j69396N3843n956
$$ -403421 -265064 47244 159976 372256 428140 672740 944851 775455 829298 823342
11310H23342k60435j15416k21075k94759k35967L21303L30918m7030Q1285N60509
$$ 823342 562907 447491 226416 -68343 -304310 16993 347911 300881 382166 942675
11300I42675K18264o8824r8775j6423M31412J36595m24713k55896J86453k2385
$$ 942675 1160939 1092115 993340 976917 1408329 1544924 1120211 864315 1050768 1028383
11290A028383k18095o4779q9428k01126k29821k99117k23026K2372q2425j19269
$$ 1028383 810288 745509 656081 454955 225134 -73983 -297009 -274637 -357062 -476331
11280d76331j98104O9471N34356K53100p2310K16284m659l24124k65983j60771
$$ -476331 -674435 -604964 -70608 182492 110182 326466 321807 -2317 -268300 -429071
11270d29071J80363L42416L32454k79m19855k00158J80277Q2228l47392J55217
$$ -429071 -248708 93708 426162 425883 6028 -194130 -13853 68375 -279017 -123800
11260a23800M40037M56858R2458m32214n27330j71510J3040J71063J54254j44018
$$ -123800 316237 773095 865553 433339 -93991 -265501 -252461 -81398 72856 -71162
11250g1162L7350K28827l08618k79741N49479O58087L93781J18610m08085m34428
$$ -71162 -33812 195015 -113603 -393344 156135 814222 1208003 1326613 918528 484100
11240D84100k85221o0039l8761j03662M07926K32077l7166M1586J58240j8418
$$ 484100 198879 138840 100079 -3583 404343 636420 599254 640840 799080 780662
11230G80662k22228j84893K105K39835L8714r6360p0172J51592J90408j95096
$$ 780662 558434 373541 375646 615481 654195 557835 487663 639255 829663 634567
11220F34567n51978j54984K62561Q3505K43062K6571j55824m70832l99259J67621
$$ 634567 82589 -72395 190166 273671 516733 543304 387480 -83352 -482611 -314990
11210c14990K30305O8445l57263k54193l51076j00410M58720L17456o1166j76398
$$ -314990 -84685 -16240 -373503 -627696 -978772 -1079182 -620462 -303006 -364172 -540570
11200e40570P9701K78041K81878L11598N84294Q3222o03649l7322J20983P8966
$$ -540570 -460869 -182828 99050 410648 994942 1078164 474515 437193 558176 637142
11190F37142J71456J19781J11641j7508J85791j49242o50482j53228K19491J15130
$$ 637142 808598 928379 1040020 1022512 1208303 1059061 408579 255351 474842 589972
11180E89972n2527n35900k84639K69133J45169m1018R2302K65089N21829J40856
$$ 589972 537445 1545 -283094 -13961 131208 90190 182492 447581 969410 1110266
11170A110266k13189P0475P898k32074k56266n55256j80561M2923l77100k5791
$$ 1110266 897077 967552 975450 743376 487110 -68146 -248707 -205784 -582884 -608675
11160f08675L47936J93057j73708J77338N21776K41136j10717m21409k26892J31679
$$ -608675 -260739 -67682 -241390 -64052 457724 698860 588143 166734 -60158 71521
11150G1521K11143M0734k54956J54378L32534j36351L15264N03767J01601m73958
$$ 71521 282664 323398 68442 222820 555354 419003 734267 1238034 1339635 865677
11140H65677o33428k68236O0231l0359j87295j47822J95087J43859J6953p0922
$$ 865677 232249 -35987 24244 -6115 -193410 -341232 -146145 -2286 14667 -56255
11130e6255k19472J42958K15186m0158p2384j18594j52069j69187k08119L11483
$$ -56255 -275727 -132769 82417 42259 -30125 -148719 -300788 -469975 -678094 -366611
11120c66611Q07830M55013q6666k33678k58803J34278K30060N2465n8985j6335
$$ -366611 441219 896232 809566 575888 317085 451363 681423 733888 674903 658568
11110F58568k65975l31973l00930J07184M65834K35467N4352J74814L9877l93474
$$ 658568 392593 60620 -240310 -133126 332708 568175 622527 797341 837218 443744
11100D43744j16379M2099K62791J08179l03710l38263k28942l39057l52392J29374
$$ 443744 327365 369464 632255 740434 436724 98461 -130481 -469538 -821930 -692556
11090f92556K31578K06587L6732J12093M09225K75336K82111j7565j00177k54228
$$ -692556 -460978 -254391 -217659 -105566 303659 578995 861106 843541 743364 489136
11080D89136k5227M9083k91958l76673j07368J38377R9038R4567m7604l12992
$$ 489136 463909 512992 221034 -155639 -263007 -124630 -25592 68975 21371 -291621
11070b91621r2874j63512k16400k6069j7662J02509L22120r2535k09523J20407
$$ -291621 -384495 -548007 -764407 -790476 -808138 -705629 -383509 -476044 -685567 -565160
11060e65160K46711p2907j46829j36501J48946L89358J62520j81391k09923k1915
$$ -565160 -318449 -391356 -538185 -674686 -525740 -136382 26138 -155253 -365176 -387091
11050c87091L41488L15648J01427J7185j03551j96752k853L75503P5653J10706
$$ -387091 -45603 270045 371472 388657 285106 88354 85501 461004 536657 647363
11040F47363J90541Q1054J20100r4899o49694n26630j03701l36389k44996J82261
$$ 647363 837904 918958 1039058 944159 294465 -232165 -335866 -672255 -917251 -734990
11030g34990j96168r5394m9981J30298M57824P5570j77639l29659k13617q2207
$$ -734990 -931158 -1026552 -1076533 -946235 -488411 -412841 -590480 -920139 -1133756 -1215963
11020a215963J27663O76033Q67596L00872n9612l30225k97252m99223m01185J74572
$$ -1215963 -1088300 -412267 455329 756201 696589 366364 69112 -430111 -831296 -656724
11010f56724M49248M03019q7402p7204J83470K34928N97170R498m79562n82446
$$ -656724 -207476 195543 108141 30937 214407 449335 1046505 1056003 576441 -6005
11000f005l96867J07558M11636P662j72778k431J55430J68134O4798R2386k03645
$$ -6005 -402872 -295314 116322 123984 -48794 -51225 104205 272339 337137 429523 225878
10989B25878l8588J00877j35823q6470P3341K75703L69696J303m84983m22925
$$ 225878 187290 288167 152344 65874 139215 414918 784614 785917 300934 -121991
10979a21991k68133n1415L04074L63136k68864j49944j96813o6037p9328K3213
$$ -121991 -390124 -441539 -137465 225671 -43193 -193137 -389950 -455987 -535315 -512102
10969e12102L27637K89914j4577Q4358N04248J46553l6666J98344K08130p0636
$$ -512102 -184465 105449 90872 175230 679478 826031 789365 987709 1195839 1125203
10959A125203j68774l32000q7256K58098K38363K29790J53127j70776m82908m38228
$$ 1125203 956429 624429 537173 795271 1033634 1263424 1416551 1245775 762867 324639
10949C24639J38550l2815J8212j1741O5200J06615K7006J3455M30340N25661j3906
$$ 324639 463189 430374 448586 436845 502045 608660 635666 649121 1079461 1605122 1591216
10938A591216k69415o2810j36016j14948k99133l56652k73611Q9586K81970J74093
$$ 1591216 1321801 1258991 1122975 1008027 708894 352242 78631 168217 450187 624280
10928F24280L00615K13827k12641k07669K647k99236m95965o6659L06433L27805
$$ 624280 924895 1138722 926081 718412 721059 421823 -74142 -140801 165632 493437
10918D93437R4797l22175n8942n4751R7769J61496k02314o6856L29100K53198
$$ 493437 588234 266059 207117 152366 250135 411631 209317 142461 471561 724759
10908G24759K07747J38301K2309p7925k58977l37061L728J92105K54905K98498
$$ 724759 932506 1070807 1093116 1015191 756214 419153 422881 614986 869891 1168389
10898A168389K25625m0776J14810r290P1417L39686J20489J21557Q090p4767m29598
$$ 1168389 1394014 1353238 1468048 1458758 1530175 1869861 1990350 2111907 2119997 2045230 1615632
10887A615632p31411n33840J16284L96643L36426O53113O62144J97893K19695
$$ 1615632 884221 350381 466665 863308 1199734 1852847 2514991 2712884 2932579
10878B932579l58487l67945j79615J26858k25456m99771j60935M621j22919J63142
$$ 2932579 2574092 2206147 2026532 2153390 1927934 1428163 1267228 1271849 1148930 1312072
10868A312072L23948J78449K42597N486k08076j46902K0489J18030L13085J11804
$$ 1312072 1636020 1814469 2057066 2062552 1854476 1707574 1728063 1846093 2159178 2270982
10858B270982J23384L6633j94606j17619P4720L18053J72920R8798r9334P8116
$$ 2270982 2394366 2430999 2236393 2118774 2193494 2511547 2684467 2783265 2683931 2762047
10848B762047Q1759J3919L87384N44667L32049J7604M21392M30426j98133m3039
$$ 2762047 2843806 2857725 3245109 3789776 4121825 4139429 4560821 4991247 4793114 4750075
10838D750075L73401N84553N62544J86014K71559P44475O25468p3881p7684K81031
$$ 4750075 5123476 5708029 6270573 6456587 6728146 7472621 8098089 8024208 7946524 8227555
10828H227555O60908J173857J097622J049032J213994J899620K028403K482578
$$ 8227555 8888463 10062320 11159942 12208974 13422968 15322588 17350991 19833569
10820A9833569L211086L952876M693510N582167P037565R496096J2288203J5780942
$$ 19833569 23044655 26997531 31691041 37273208 44310773 53806869 66095072 81876014
10812H1876014K1185445K8070779L5222550L7156537K2165332r179475l3049842
$$ 81876014 103061459 131132238 166354788 203511325 225676657 216497182 183447340
10805A83447340l6672788l0328035k2534035j6524519j1897440q632400o586574
$$ 183447340 146774552 116446517 93912482 77387963 65490523 56858123 50271549
10798E0271549o141343o079540n202296m027118k789407j973427j459028o66365
$$ 50271549 44130206 38050666 32848370 28821252 26031845 24058418 22599390 21933025
10790B1933025o32359p06059m65761l54442n41796k27009J28864N80226R55585
$$ 21933025 21300666 20594607 20128846 19774404 19232608 19005599 19134463 19714689 20670274
10781B0670274K070425K858372L750731M561343N838970P230876R934716J4008611
$$ 20670274 22740699 25599071 29349802 33911145 39750115 46980991 56915707 70924318
10773G0924318K0271719K9872643M4704255N9284790N7318784P076602n2977615
$$ 70924318 91196037 121068680 165772935 225057725 282376509 289453111 236475496
10766B36475496o3038551m8113353l2503223k1990719j5567876j1096828p734302
$$ 236475496 173436945 125323592 92820369 70829650 55261774 44164946 36430644
10759C6430644o141974m584056l534661l072324k570337j709052j202364p59329
$$ 36430644 30288670 25704614 22169953 19097629 16527292 14818240 13615876 12856547
10751A2856547q71425p90959o17503m83615o54909n27612n85188j011032o69791
$$ 12856547 11985122 11194163 10576660 10093045 9438136 8910524 8325336 7314304 6644513
10742F644513j87343l13911n80875m39927J5132k47188j53094r9994j43253k00160
$$ 6644513 6457170 6143259 5562384 5122457 5137589 4890401 4737307 4637313 4494060 4293900
10732D293900k28125r8390j09957J18774j06509o61622m07327k0718p5603J956
$$ 4293900 4065775 3967385 3857428 3976202 3869693 3208071 2800744 2780026 2704423 2706379
10722B706379M06660K46186q4495m87378m22609k17941J05986O4189j417m4758
$$ 2706379 3113039 3359225 3274730 2787352 2364743 2146802 2252788 2316977 2315560 2270802
10712B270802l03867q57129m65084q2950R3910j27888o7813J84312k30843l01040
$$ 2270802 1966935 1109806 644722 561772 655682 527794 459981 644293 413450 112410
10702A12410J73540J94491K01363k957j88811k43483k35402J14216L82263J40860
$$ 112410 285950 480441 681804 678847 490036 246553 11151 125367 507630 648490
10692F48490J44280M96456J06033l74030k28323r2604j78342k55084j24770j93336
$$ 648490 792770 1289226 1395259 1021229 792906 700302 521960 266876 142106 -51230
10682e1230k39240J70903J64319j28676j48727j09480K01599K70909J22879L23027
$$ -51230 -290470 -119567 44752 -83924 -232651 -342131 -140532 130377 253256 576283
10672E76283M83221M72994m2816k2628j85856j38501k278J49927L6210k34386
$$ 576283 1059504 1532498 1489682 1467054 1281198 1142697 1140419 1290346 1326556 1092170
10662A092170k48355J9473j08795j11234J92933j31110l71542l32134l5261o0213
$$ 1092170 843815 863288 754493 643259 836192 705082 333540 1406 -33855 -94068
10652i4068l75431J56096K79119k09184k23723j4120J74062K32501k84154j93165
$$ -94068 -469499 -313403 -34284 -243468 -467191 -481311 -307249 -74748 -358902 -552067
10642e52067R3748J64920L36216L93745K02249J35717k99059k59325K1773J94949
$$ -552067 -458319 -293399 42817 436562 638811 774528 475469 216144 237917 432866
10632D32866J00449J41373J7311m05512l22010j9597j17515j25117K36330L78907
$$ 432866 533315 674688 691999 286487 -35523 -55120 -172635 -297752 -61422 317485
10622C17485K96460P5023M39028J8021k38985J27124o6533p6471j55691k91287
$$ 317485 613945 688968 1127996 1146017 907032 1034156 967623 891152 735461 444174
10612D44174l17738K4949K61297J96694K40041k8291J58056M59843M80060K40382
$$ 444174 126436 151385 412682 609376 849417 821126 979182 1439025 1919085 2159467
10602B159467P76935J331539J096993O34815q24286j133960m02636m83513q58773
$$ 2159467 2936402 4267941 5364934 5999749 5175463 4041503 3638867 3155354 2296581
10593B296581p43472j36588k52606n24922l85152l00596k1405L2248Q7397J86952
$$ 2296581 1553109 1416521 1163915 638993 253841 -46755 -68160 -35912 51485 238437
10583B38437R2727J17004O5542K28084M7613j48917k40444J40083j62728l72044
$$ 238437 331164 448168 513710 741794 789407 640490 400046 540129 377401 5357
10573E357k91185j13351J90991j33641l30669L5814K96680N44032K37958p7651
$$ 5357 -285828 -399179 -208188 -341829 -672498 -636684 -340004 204028 441986 364335
10563C64335k82798j82755K33253J22974q4627l50456k66241K0515K82749l560
$$ 364335 81537 -101218 132035 255009 170382 -180074 -446315 -425800 -143051 -146611
10553a46611k25658J54404N15324M8761m04557k01136J30385N8789l72249l58915
$$ -146611 -372269 -217865 297459 346220 -58337 -259473 -129088 -70299 -442548 -801463
10543h01463j97557L01316P70879J21357m39046P0459K54072j4154n4538L2636
$$ -801463 -999020 -697704 73175 194532 -244514 -174055 80017 65863 11325 43961
10533D3961K08577L50207k0343k50515m03034l32465j64449m51768J44075P96233
$$ 43961 252538 602745 582402 331887 -71147 -403612 -568061 -1019829 -875754 -79521
10523g9521L76846o4127l76613l22319j82765l46727K05982N56836K01226K07668
$$ -79521 297325 233198 -143415 -465734 -648499 -995226 -789244 -232408 -31182 176486
10513A76486J76612J39871K35618k01388l51184n23949j40186K58470L0793N0315
$$ 176486 353098 492969 728587 527199 176015 -347934 -488120 -229650 -198857 -148542
10503a48542L10056R7059k53961J54718K87761j39539l14461m82695o9452K51865
$$ -148542 161514 258573 4612 159330 447091 307552 -6909 -489604 -559056 -307191
10493c07191R4670P760L2541n2555l9779l59210k10972J31999K18617Q0361o376
$$ -307191 -212521 -204761 -172220 -224775 -264554 -623764 -834736 -702737 -484120 -403759 -410135
10482d10135j8806p1094M071M91272L48808j7389q5865L21598L21873j26236J7637
$$ -410135 -428941 -500035 -495964 -4692 344116 326727 240862 562460 884333 758097 775734
10471G75734L9061j35229m2461K23467O5513l83502o44377k6860N70818P13850
$$ 775734 814795 679566 637105 860572 926085 542583 -101794 -128654 442164 1156014
10461A156014J64043m84920k72868P5399n317Q9342j73076m93376J00032L94882
$$ 1156014 1320057 835137 562269 637668 632351 721693 548617 55241 155273 550155
10451E50155M07019J20357l03238m42342k6298K18106M03552N32296L8313n87567
$$ 550155 957174 1077531 774293 331951 305653 523759 927311 1459607 1497920 910353
10441I10353o49387l99861l73624l10573k8527m1425Q2001O6657K9382j80586
$$ 910353 260966 -138895 -512519 -823092 -851619 -893044 -811043 -744386 -715004 -895590
10431h95590L3527P7405J93564M44247L45399L8995m2281K00591M3561m65220
$$ -895590 -862063 -784658 -591094 -146847 198552 237547 195266 395857 439418 -25802
10421b5802m61819R070N1592J15709J46603k03569o7649o6178N7721J52331Q2543
$$ -25802 -487621 -478551 -426959 -311250 -164647 -368216 -435865 -502043 -444322 -291991 -209448
10410b09448K15326J14338l332k96882k264M43671N90479m8199l26532n8523o0561
$$ -209448 5878 120216 116884 -179998 -182262 261409 851888 803689 477157 418634 358073
10399C58073K063j62516K6436K0694j42672K28840J3887J54727L53836k3655m34781
$$ 358073 360136 197620 224056 244750 102078 330918 344805 499532 853368 829713 394932
10388C94932J582k03815k77094N0576L06487N77107K22944m14294n97337l73528
$$ 394932 396514 192699 -84395 -33819 272668 849775 1072719 658425 61088 -312440
10378c12440k01316M8022L07503L9529l1533j46906J84742l5591m51208R777J97140
$$ -312440 -513756 -465734 -158231 -118702 -150235 -297141 -112399 -147990 -599198 -589421 -392281
10367c92281K44849L57536J33305o68509o05985n0878M28799M13216J35134L17487
$$ -392281 -147432 210104 343409 -325100 -931085 -981963 -553164 -139948 -4814 312673
10357C12673K51884J08158J97951j8050k5385J27379m13120p16377o2992K08829
$$ 312673 564557 672715 870666 852616 827231 954610 541490 -174887 -237879 -29050
10347b9050r1185q040K70319K69640K04970Q9601M7329l96078o42662k60404J84843
$$ -29050 -120235 -128275 142044 411684 616654 706255 753584 357506 -285156 -545560 -360717
10336c60717N88610N09625K01110n306m52159o69656k44889K22264L71525K35268
$$ -360717 227893 737518 938628 933322 481163 -188493 -433382 -211118 160407 395675
10326C95675k60655k55901r9491k57661J2632n4792k92033j07360Q6935J73038
$$ 395675 135020 -120881 -220372 -478033 -465401 -520193 -812226 -919586 -832651 -659613
10316f59613J99710k5679p8476r38J04295J64953m7697k71343j43455l6549J92577
$$ -659613 -459903 -485582 -564058 -564996 -460701 -295748 -343445 -614788 -758243 -794792 -602215
10305f02215M27224M25032J98895j27640k99323l73303k04212J85249k4268N3598
$$ -602215 -174991 250041 448936 321296 21973 -351330 -555542 -370293 -394561 -340963
10295c40963K55521J04054j2777J7314j33016m09032k50831l27838j02974k09821
$$ -340963 -85442 18612 5835 23149 -109867 -518899 -769730 -1097568 -1200542 -1410363
10285a410363j83430L13241L13139L54353M59505J35087M0704r7550k66705K97410
$$ -1410363 -1593793 -1280552 -967413 -613060 -153555 -18468 22236 -75314 -342019 -44609
10275d4609N72465J37932k30991j08640J59394J6508m67222m21454n2866j11449
$$ -44609 527856 665788 434797 326157 485551 502059 34837 -386617 -439483 -550932
10265e50932l38127K14869K71133k69756k90864k82179O2289K85987K29725L19442
$$ -550932 -889059 -674190 -403057 -672813 -963677 -1245856 -1183567 -897580 -667855 -348413
10255c48413O64978K79966l37506m58300m85408j02855L88466M64095J46968L24372
$$ -348413 316565 596531 259025 -199275 -684683 -787538 -399072 65023 211991 536363
10245E36363L73826l71293n16231m30404m88591K45820N52188Q7051j92481r2210
$$ 536363 910189 538896 22665 -407739 -896330 -650510 -98322 -11271 -203752 -295962
10235b95962j91358r4492j27880j34842j05297J05497N13293J74442l3765k28234
$$ -295962 -487320 -581812 -709692 -844534 -949831 -844334 -331041 -156599 -190364 -418598
10225d18598q3934q8277j87457m77029m72200J39200M78512L09900M111L1968
$$ -418598 -502532 -590809 -778266 -1255295 -1727495 -1588295 -1109783 -799883 -795772 -763804
10215g63804l34638L0638M09559M30510J10943j10023K01255L12042P9042j66697
$$ -763804 -1098442 -1067804 -658245 -227735 -116792 -226815 -25560 286482 365524 198827
10205A98827j77077R0825R8014l15502k14862Q1280k03359l2598L28843K30301
$$ 198827 21750 112575 210589 -104913 -319775 -238495 -441854 -474452 -145609 84692
10195H4692K29420M9978n5442k61246j42279j82063k97418J2833J22831K46938
$$ 84692 314112 364090 308648 47402 -94877 -276940 -574358 -561525 -438694 -191756
10185a91756O6582J02291J7491o4060J62740o0263j25116J39573j44886k25918
$$ -191756 -125174 -22883 -5392 -69452 93288 33025 -92091 47482 -97404 -323322
10175c23322l57830n90515l81666K73382L80295L04088M15175J86920K5895P9788
$$ -323322 -681152 -1271667 -1653333 -1379951 -999656 -695568 -280393 -93473 -67578 12210
10165A2210J08765K40197N6683Q6698L2543k57936k73853l53572j75724k21378
$$ 12210 120975 361172 417855 504553 537096 279160 5307 -348265 -523989 -745367
10155g45367J1219k3758n2681m80133l82081r2766N7433K56744Q6343K81026M17181
$$ -745367 -734148 -757906 -810587 -1290720 -1672801 -1765567 -1708134 -1451390 -1365047 -1084021 -666840
10144f66840M27796q6148p05946m42752k4272L40396K94660J25318N4961j76091
$$ -666840 -239044 -325192 -1031138 -1473890 -1498162 -1157766 -863106 -737788 -682827 -858918
10134h58918l6932K85862M6491Q8315j11965j82808q6537R3201J33963K91774
$$ -858918 -895850 -609988 -563497 -475182 -587147 -769955 -856492 -763291 -629328 -337554
10124c37554K31367K06734J23091k18188J04529L87948P7819q7609J02812K4700
$$ -337554 -106187 100547 223638 5450 109979 497927 575746 488137 590949 615649
10114F15649l19905l42161k40631J20211O23801M6885m11374m96625j65459O16861
$$ 615649 295744 -46417 -287048 -166837 456964 503849 92475 -404150 -569609 47252
10104D7252O52043k52300o02983m5014J68841n4572O4462N4197L6852N845j60936
$$ 47252 699295 446995 -155988 -201002 -32161 -86733 -22271 31926 68778 74623 -86313
10093h6313j27381J59308P5084k3524j22251K96484L88597K2177j07429l71292
$$ -86313 -213694 -54386 20698 -2826 -125077 171407 560004 582181 474752 103460
10083A03460m63185k23094l6841J77452R4566K23842j68304n60437m57288j18141
$$ 103460 -359725 -582819 -619660 -442208 -347642 -123800 -292104 -852541 -1309829 -1427970
10073a427970K79150O63503N64377M44553J77903k03327N5500J58840j27744l94514
$$ -1427970 -1148820 -485317 79060 523613 701516 498189 553689 712529 584785 190271
10063A90271m52783j55389p6419j51655m7901J66980K59002L0007K5290k8138
$$ 190271 -262512 -417901 -494320 -645975 -693876 -526896 -267894 -237887 -212597 -240735
10053b40735q7217j18170j38430k26607q051j10744j42919K62915L06782j35732
$$ -240735 -327952 -446122 -584552 -811159 -819210 -929954 -1072873 -809958 -503176 -638908
10043f38908J24797l62943k61496K81342Q03679O61789Q6472j15013j62991J1618
$$ -638908 -514111 -877054 -1138550 -857208 -53529 608260 694732 579719 416728 428346
10033D28346k20300l60045k25658N2417M31520J37012L94418M41997j93904m33146
$$ 428346 208046 -151999 -377657 -325240 106280 243292 637710 1079707 885803 452657
10023D52657l76147r9322L75388P3911m95951k94613J57263j7533j16525j7421
$$ 452657 76510 -22812 352576 426487 -69464 -364077 -206814 -224347 -340872 -358293
10013c58293P2660L22758J88975j19141l93663j81615o0742J5282J86605J48308
$$ -358293 -285633 37125 226100 106959 -286704 -468319 -529061 -513779 -327174 -178866
10003a78866J25713M26587M04988M49669O736j36669j21572m08077k35428n8501
$$ -178866 -53153 373434 778422 1228091 1234827 1098158 976586 568509 333081 274580
9993B74580k04225k72290n4103K39790k08142l87398q1422J49563p469k88949
$$ 274580 70355 -201935 -256038 -16248 -224390 -611788 -693210 -543647 -551116 -840065
9983h40065q1863L42943L70661K7091k59085j09941L72905L17099l61614m29486
$$ -840065 -921928 -578985 -208324 -181233 -440318 -550259 -177354 139745 -221869 -651355
9973f51355J21812L64354j1827j40372Q722l184L53979L40287J20401K98193j18698
$$ -651355 -529543 -165189 -177016 -317388 -308666 -311850 42129 382416 502817 801010 682312
9962F82312Q9500Q0412k30640k77144l53328Q9299J43054k10487M6977M17221
$$ 682312 771812 852224 621584 344440 -8888 80411 223465 12978 59955 477176
9952D77176M1244j07131j9947J8994K5298J31754j41890N3216M20695M40347o4546
$$ 477176 518420 411289 391342 410336 435634 567388 425498 478714 899409 1339756 1275210
9941A275210Q185k2445k92528m32504k26467K01944K37372j78171k22374n33795
$$ 1275210 1283395 1260950 968422 535918 309451 511395 748767 570596 348222 -185573
9931a85573l76290L08899K44689J15416M9935Q3643p4454k69425Q0752K56941
$$ -185573 -561863 -252964 -8275 107141 157076 240719 166265 -103160 -22408 234533
9921B34533J06350k02030k86588k06810j87451J03060j34913m7222K79579J40976
$$ 234533 340883 138853 -147735 -354545 -541996 -438936 -573849 -621071 -341492 -200516
9911b00516j07924j26194k56l05150l31504J61568k2428k22707J92397P0933J317
$$ -200516 -308440 -434634 -434890 -740040 -1071544 -909976 -932404 -1155111 -962714 -891781 -890464
9900h90464M08571O33964P56340J67732J42403L54672J38685m42931m55334m78799
$$ -890464 -481893 152071 908411 1076143 1218546 1573218 1711903 1268972 813638 334839
9890C34839l12979M1507O106j21681n6960J7362k02889n48571q8073K78907K45325
$$ 334839 21860 63367 69473 -52208 -109168 -91806 -294695 -843266 -931339 -652432 -407107
9879d07107M5061O19085P91025q4034l70502j58039k2616p2670K88691L41214
$$ -407107 -362046 257039 1048064 964030 593528 435489 412873 340203 628894 970108
9869I70108n9724j57422O6043n08493m95217j42157O569l41809k77446J43044
$$ 970108 910384 752962 819005 310512 -184705 -326862 -320293 -662102 -939548 -796504
9859g96504K72203M9931M1221L62958K61999J64221l36013j99921K54108K45798
$$ -796504 -524301 -474370 -433149 -70191 191808 356029 20016 -179905 74203 320001
9849C20001L1875q3272k21508l77974l24580J79736N23611J85932J7459p4518
$$ 320001 351876 268604 47096 -330878 -655458 -475722 47889 233821 251280 176762
9839A76762j99260J94661K36138n9188k27049Q746R1453l5434j91457k23330p628
$$ 176762 -22498 172163 408301 349113 122064 130810 222263 186829 -4628 -227958 -235586
9828b35586n0381n7728j91847j91645L2725M37189L32442q6486L0490J24651l41607
$$ -235586 -285967 -343695 -535542 -727187 -694462 -257273 75169 -11317 19173 143824 -197783
9817a97783o4435M3115K23702m5728l89398k07278j83677M55742O03634K56811
$$ -197783 -262218 -219103 4599 -41129 -430527 -637805 -821482 -365740 237894 494705
9807D94705j03765m55611m92008k60559k1513J02794P083j71715K79603M92424
$$ 494705 390940 -64671 -556679 -817238 -838751 -735957 -728874 -900589 -620986 -128562
9797a28562l3104k94277k16820j2631J81729R4758K57006L95536J09686m25r5164
$$ -128562 -161666 -455943 -672763 -685394 -503665 -408907 -151901 243635 353321 352896 257732
9786B57732l12605j64551j18290k23080K51830L78903M6957n36569l02869K25565
$$ 257732 -54873 -219424 -337714 -560794 -308964 69939 116896 -419673 -722542 -496977
9776d96977K35756J49374k13736q4244J1217k01015k65988k06802J68872L31212
$$ -496977 -261221 -111847 -325583 -409827 -398610 -599625 -865613 -1072415 -903543 -572331
9766e72331N10922J15261l20423n7923K26428N60788L77200k5245J59495J20657
$$ -572331 -61409 53852 -266571 -324494 -98066 462722 839922 814677 974172 1094829
9756A094829J76048K34084K8522l57768l43719L19421M09332k16435l19096l30922
$$ 1094829 1270877 1504961 1533483 1175715 831996 1151417 1560749 1344314 1025218 694296
9746F94296k95979l93459k17422K30740J63412K6544M12743M74916Q2098q8557
$$ 694296 398317 4858 -212564 18176 181588 208132 620875 1095791 1177889 1089332
9736A089332Q2710L94284M13975M24969N44602L67401l17926o42629l97292K7234
$$ 1089332 1172042 1566326 1980301 2405270 2949872 3317273 2999347 2356718 1959426 1986660
9726A986660J89465P5070k71299j68305j82088n36092k26697M67006K67643j64778
$$ 1986660 2176125 2251195 1979896 1811591 1629503 1093411 866714 1333720 1601363 1436585
9716A436585L8037J16569P5689Q3462j87903q7481L57901M62836M64754K91609
$$ 1436585 1474622 1591191 1666880 1750342 1562439 1474958 1832859 2295695 2760449 3052058
9706C052058J34216K01668P8485J28864K85632l8414j84212k82414j31091L47487
$$ 3052058 3186274 3387942 3466427 3595291 3880923 3842509 3658297 3375883 3244792 3592279
9696C592279O95266M38417o2766l32515n24944l45274j04670J02659K73517K69501
$$ 3592279 4287545 4725962 4663196 4330681 3805737 3460463 3355793 3458452 3731969 4001470
9686D001470j05244n79916j37624N22627L28440L14204M51917N88773Q21982N39094
$$ 4001470 3896226 3316310 3178686 3701313 4029753 4343957 4795874 5384647 6206629 6745723
9676F745723L83473K87390L20562O0505J41748O15664O94795R95303O69048L81041
$$ 6745723 7129196 7416586 7737148 7797653 7939401 8555065 9249860 10245163 10914211 11295252
9666A1295252Q65407J099813J358074J504047J944499K423037K461884L011708
$$ 11295252 12160659 13260472 14618546 16122593 18067092 20490129 22952013 25963721
9658B5963721L614666M270516N291109O764826Q325356J0121827J2333127J5516902
$$ 25963721 29578387 33848903 39140012 45904838 54230194 64352021 76685148 92202050
9650I2202050K0220926K6985676L5494235M7056229O1487116P3533454O9277995
$$ 92202050 112422976 139408652 174902887 221959116 283446232 356979686 426257681
9643D26257681K9265892l4044881p2175110p3529184o0190945m5484077l3752866
$$ 426257681 455523573 421478692 349303582 275774398 215583453 170099376 136346510
9636A36346510k5377791j9440823j5471529j2053811r929413p970896o390589
$$ 136346510 110968719 91527896 76056367 64002556 54073143 46102247 39711658
9629C9711658n133080m164223l542650l031183k386587j662803j738210j611966
$$ 39711658 34578578 30414355 26871705 23840522 21453935 19791132 18052922 16440956
9621A6440956j705406j448819j111276p30542r14539q52816r03788o67310j08080
$$ 16440956 14735550 13286731 12175455 11444913 10530374 9677558 8773770 8106460 7998380
9612G998380l19065q54852j005062m19813N3670o5573J3226R7933l15917n28654
$$ 7998380 7679315 6824463 5819401 5399588 5453258 5387685 5400911 5498844 5182927 4654273
9602D654273o11632m82974J2420j4702k76331j0548O01289O02799k1383q26032
$$ 4654273 4042641 3559667 3572087 3557385 3281054 3270506 3871795 4474594 4453211 3627179
9592C627179l10909M13947p9494j41349m8300n74543r59121m36673K16386K65813
$$ 3627179 3316270 3730217 3650723 3509374 3461074 2886531 1927410 1490737 1707123 1972936
9582A972936R8167N8937j78078j38314J69872l63030m62852m03934j85846N32848
$$ 1972936 2071103 2130040 1951962 1813648 1983520 1620490 1157638 753704 567858 1100706
9572A100706N83579J84657J13343j91573j49942L34869J40306k45393j74924J70247
$$ 1100706 1684285 1868942 1982285 1790712 1640770 1975639 2115945 1870552 1695628 1865875
9562A865875o0244k23337J02012k11125l11274n47o374M0621O945j01537j49667
$$ 1865875 1805631 1582294 1684306 1473181 1161907 1161360 1154986 1195607 1202552 1101015 951348
9551I51348p19j1678L6658L17904K25110m14509o58608k15487j44927J86162Q74562
$$ 951348 950629 938951 975609 1293513 1518623 1104114 445506 230019 85092 271254 1145816
9540A145816J063852J85301n43003n57745j03099j28404l02583k10137K8846m02222
$$ 1145816 2209668 2394969 1851966 1294221 1191122 1062718 760135 549998 578844 176622
9530A76622m63686L4211K49855M24974j44682m17521K65241K86302J82125M6418
$$ 176622 -287064 -252853 -2998 421976 277294 -140227 125014 411316 593441 639859
9520F39859j11320j27313o1649j20635R1058L29472J62283k26137n05684k04491
$$ 639859 528539 401226 339577 218942 310000 639472 801755 575618 69934 -134557
9510a34557Q4602l8644Q6239K03636J44045n274j13729M147o2401j53252J5360
$$ -134557 -49955 -88599 -2360 201276 345321 340047 226318 230465 168064 14812 30172
9499C0172J52456n5758j11286L50997M60559M7070j31268l14706j47143J0959
$$ 30172 182628 126870 15584 366581 827140 874210 742942 428236 281093 292052
9489B92052L76678p5535k98906m8127k69911o9141K26719N11291J88672l77247
$$ 292052 668730 593195 294289 246162 -23749 -92890 133829 645120 833792 456545
9479D56545p80151m87145n8055k41783m31795J19091O33157K53981J03560M8536
$$ 456545 -323606 -810751 -868806 -1110589 -1542384 -1423293 -790136 -536155 -432595 -384059
9469c84059o6009L27337J48894Q2932j96876k96333j98097k90886j04135j97545
$$ -384059 -450068 -122731 26163 109095 -87781 -384114 -582211 -873097 -977232 -1174777
9459a174777N2297K24206l3794k9986M68256K78104k00651l06400j01312J33751
$$ -1174777 -1122480 -898274 -932068 -962054 -493798 -215694 -416345 -722745 -824057 -690306
9449f90306L9889O00135L50039j32101p811L8494l17454l42317N3265P2964k2835
$$ -690306 -650417 -50282 299757 167656 159845 198339 -119115 -461432 -408167 -335203 -358038
9438c58038K09614j85675m06483j45971N8674J53685K01574K02727l78317l78489
$$ -358038 -148424 -334099 -740582 -886553 -827879 -674194 -472620 -269893 -648210 -1026699
9428a026699J89187L19877J82531L5349M45720K45544k55492l47647l76866J17854
$$ -1026699 -837512 -517635 -335104 -299755 145965 391509 136017 -211630 -588496 -470642
9418d70642J68520K61449M14863M32152o3395k77912J84204L99509J35045j43034
$$ -470642 -302122 -40673 374190 806342 742947 465035 649239 1048748 1183793 1040759
9408A040759m43042l80517j34519J1444p8123J19602O01075M74743j31077l94769
$$ 1040759 597717 217200 82681 94125 16002 135604 736679 1211422 1080345 685576
9398F85576p89939n16034n692K22133L15984K41651J02068j23457m02563l45448
$$ 685576 -104363 -620397 -626089 -403956 -87972 153679 255747 132290 -270273 -615721
9388f15721j74399K09694J16988j0708L41772J94059l06206k42144n9040Q0496
$$ -615721 -790120 -580426 -463438 -474146 -132374 61685 -244521 -486665 -545705 -465209
9378d65209k13325l41748J24478O89897O73443L42882j55442m25232o34616j71311
$$ -465209 -678534 -1020282 -895804 -205907 467536 810418 654976 229744 -404872 -576183
9368e76183M04274J13699k81118l63105n6674M92507N06970k10526n37992k16572
$$ -576183 -171909 -58210 -339328 -702433 -759107 -266600 240370 29844 -508148 -724720
9358g24720J91128N3592J19489K78246J40064l74113m83947k52230k6171J70268
$$ -724720 -533592 -480000 -360511 -82265 57799 -316314 -800261 -1052491 -1078662 -908394
9348i08394J40654L34222J96033j73825k38019l31275J60697L62967P8038j52007
$$ -908394 -767740 -433518 -237485 -411310 -649329 -980604 -819907 -456940 -378902 -530909
9338e30909l22682k44170K50983K74615J24263R5928j27767m08881j21547M16788
$$ -530909 -853591 -1097761 -846778 -572163 -447900 -351972 -479739 -888620 -1010167 -593379
9328e93379L23727M05865M48195m22264m12003j50203q0955J55715J38326L18404
$$ -593379 -269652 136213 584408 162144 -249859 -400062 -481017 -325302 -186976 131428
9318A31428J91063l15844m66625n2748r8077m17542j71829J63610K29412N5678
$$ 131428 322491 6647 -459978 -512726 -610803 -1028345 -1200174 -1036564 -807152 -751474
9308g51474k31435J67868M59906J8480o21210j03496N59171N73630N0316l60857
$$ -751474 -982909 -815041 -355135 -336655 -957865 -1061361 -502190 71440 121756 -239101
9298b39101k21567M361l89392l46535M2146L30399L71883L65400Q9526L3441r634
$$ -239101 -460668 -456307 -845699 -1192234 -1150088 -819689 -447806 -82406 7120 40561 30927
9287C0927K05247J74898m61912n18685m7833k86243l25869K70771O14439M38328
$$ 30927 236174 411072 -50840 -569525 -617358 -903601 -1229470 -958699 -344260 94068
9277I4068k67179l70825J58279M40440J27765p2351j02260k27807l23897m40766
$$ 94068 -173111 -543936 -385657 54783 182548 110197 7937 -219870 -543767 -984533
9267i84533k63415Q8925M6935J81919K1325r8808O0510M89608M51673j10137o67128
$$ -984533 -1247948 -1159023 -1112088 -930169 -908844 -1007652 -947142 -457534 -5861 -115998 -783126
9256g83126k47661N1576R4306J04243N0302j38535p4240M79573M12252r3981L6113
$$ -783126 -1030787 -979211 -884905 -780662 -730360 -868895 -943135 -463562 -51310 -145291 -109178
9245a09178K472M0562R7973n2635o30073l94043j00519J64305K79673J20001R9403
$$ -109178 -106706 -66144 31829 -20806 -650879 -1044922 -1145441 -981136 -701463 -581462 -482059
9234d82059M06894O09717L9820l34884j64869J1236j60931J39532L26826q7214
$$ -482059 -75165 534552 574372 239488 74619 85855 -75076 64456 391282 304068
9224C04068k30589j59416k68076n29514l08230L54813K02393L974L43494L47610
$$ 304068 73479 -85937 -354013 -883527 -1191757 -836944 -634551 -630577 -287083 60527
9214F0527J20565K39014J46627j56195n95752l93421J59610K56721J55638j35101
$$ 60527 181092 420106 566733 410538 -185214 -578635 -419025 -162304 -6666 -141767
9204a41767l98683J22395J34840k38754r4409K72813K90326J04283K45553J46294
$$ -141767 -540450 -418055 -283215 -521969 -616378 -343565 -53239 51044 296597 442891
9194D42891J16765L4135J47606m5235m37309j81867J85720L90333N22474J47560
$$ 442891 559656 593791 741397 696162 258853 76986 262706 653039 1175513 1323073
9184A323073j58384k84651j87716k18760R5195K2687m86307l24665j11520J7088
$$ 1323073 1164689 880038 692322 473562 568757 591444 105137 -219528 -331048 -313960
9174c13960j46329O9400K06029K12726J39934q1150l62828j57390K19377J43357
$$ -313960 -460289 -390889 -184860 27866 167800 86650 -276178 -433568 -214191 -70834
9164g0834k32078m67621l98623K4037N5178r0882O6382M10302Q8409Q3761M80388
$$ -70834 -302912 -770533 -1169156 -1145119 -1089941 -1180823 -1114441 -704139 -615730 -531969 -51581
9153e1581L84697J77819K10853N1619L6858r2552n20003q96042m88229O8243q4207
$$ -51581 333116 510935 721788 773407 810265 717713 197710 -698332 -1186561 -1118318 -1202525
9142a202525J71004K92023K31187K12173J28846M7446J35828k9545j89479J82731
$$ -1202525 -1031521 -739498 -508311 -296138 -167292 -119846 15982 -13563 -203042 -20311
9132b0311L77266J74527k9785J62235N0753O7779j01369l54732J71669O6217j87546
$$ -20311 356955 531482 501697 663932 714685 782464 681095 326363 498032 564249 376703
9121C76703P2692J3402K6232j74592n18501l4903K87563K69700K04136J17448
$$ 376703 449395 462797 489029 314437 -204064 -238967 48596 318296 522432 639880
9111F39880K01874N1394k65029l79568l30597J01732J00591j253m62671m72472
$$ 639880 841754 893148 628119 248551 -82046 19686 120277 119024 -343647 -816119
9101h16119j38975K03221K94217K06778M2294j20292j494N9046L09401K8239j22693
$$ -816119 -955094 -751873 -457656 -250878 -208584 -328876 -330370 -271324 38077 66316 -56377
9090e6377J77126J64123k68280j20151L21129L38013J22210j23285l08030j30376
$$ -56377 120749 284872 16592 -103559 217570 555583 677793 554508 246478 116102
9080A16102Q7593L62696J50656m75073p99470m01390K14194K81124M6780p6678
$$ 116102 203695 566391 717047 241974 -557496 -958886 -744692 -463568 -416788 -493466
9070d93466j29187j70591J40263K03315m0121N9357j02012m75083k05774J67229
$$ -493466 -622653 -793244 -652981 -449666 -489787 -430430 -532442 -1007525 -1213299 -1046070
9060a046070M93250O47792J95830m2374K17349K4371J17574K57956P5132l36057
$$ -1046070 -552820 94972 290802 248428 465777 490148 607722 865678 940810 604753
9050F04753k13908o9936j56200k57506l64091p7812K01413k6429j31607j05870
$$ 604753 390845 320909 164709 -92797 -456888 -534700 -333287 -359716 -491323 -597193
9040e97193j10525o7527N5581q1213o4300J82436J20195P2830m9065J30099M71136
$$ -597193 -707718 -775245 -719664 -800877 -865177 -682741 -562546 -489716 -538781 -408682 62454
9029F2454K200m22350J08532N7763m10680p6497R7965K27745K16907j18597p1811
$$ 62454 64654 -357696 -249164 -191401 -602081 -678578 -580613 -352868 -135961 -254558 -326369
9018c26369R9192J11407q6772o3345J10299J39324j4745l83037n39893p81697
$$ -326369 -227177 -115770 -202542 -265887 -155588 -16264 -31009 -414046 -953939 -1735636
9008a735636j25435k0702o9899K26035N01849N00853k60705k77754N1600K79956
$$ -1735636 -1861071 -1881773 -1951672 -1725637 -1223788 -722935 -983640 -1261394 -1209794 -929838
8998i29838J20967J10809L88047L06192R5212K1482l20682m96392n74724Q0071
$$ -929838 -808871 -698062 -310015 -3823 91389 112871 -207811 -704203 -1278927 -1198856
8988a198856M69424Q7142m91290m51416N7334M66086M84118L48503m9042l09454
$$ -1198856 -729432 -642290 -1133580 -1584996 -1527662 -1061576 -577458 -228955 -277997 -587451
8978e87451o23601L1381P52818M37475Q4270O7354j02595k28636o43186n91569
$$ -587451 -1211052 -1179671 -426853 10622 94892 162246 59651 -168985 -812171 -1403740
8968a403740l15478m4251N29666L75349o8113j04601L79330N63160L38455J7169
$$ -1403740 -1719218 -1763469 -1233803 -858454 -926567 -1031168 -651838 -88678 249777 266946
8958B66946m19989j01668L55519O6966q4249q4711J72386K81964J17211n29618
$$ 266946 -153043 -254711 100808 167774 83525 -1186 171200 453164 570375 40757
8948D0757n03358k72686k37755k30306Q1826M54376K15973j083K10880j11584
$$ 40757 -462601 -735287 -973042 -1203348 -1121522 -667146 -451173 -452256 -241376 -352960
8938c52960k71243j24764O7065K73090J18638J68556J03695j97096j0947P8739
$$ -352960 -624203 -748967 -681902 -408812 -290174 -121618 -17923 -215019 -225966 -147227
8928a47227L2627j48331k82024k14522o3919R1011K56678K18099k72661k53579
$$ -147227 -114600 -262931 -544955 -759477 -823396 -732385 -475707 -257608 -530269 -783848
8918g83848J62147L86113K13558K32712J68588O5989J81981l0077n87849m67432
$$ -783848 -621701 -235588 -22030 210682 379270 445259 627240 597163 9314 -458118
8908d58118j03014k140J78525K40207N0107j96334k04526J22569N34807O2807
$$ -458118 -561132 -563272 -384747 -144540 -94433 -290767 -495293 -372724 162083 224890
8898B24890l30378m70710l65383n3211Q4574K61879Q0762J3030J47354K07527
$$ 224890 -105488 -576198 -941581 -994792 -910218 -648339 -567577 -554547 -407193 -199666
8888a99666j76723k22319n0443L13560L68270K91684L70903j61356p35943j4094
$$ -199666 -376389 -598708 -649151 -335591 32679 324363 695266 533910 -202033 -216127
8878b16127K90160k60323k92326j05546j26766j78629M03424M41195l11539m36600
$$ -216127 74033 -186290 -478616 -584162 -710928 -889557 -486133 -44938 -356477 -793077
8868g93077j16162L69729L63328k88279j20485K02087J8703k96896m57338j30407
$$ -793077 -909239 -539510 -176182 -464461 -584946 -382859 -364156 -661052 -1118390 -1248797
8858a248797Q0792K46109M67111O56672M27926R0265k91144m84527j82149K15563
$$ -1248797 -1168005 -921896 -454785 201887 629813 720078 428934 -55593 -237742 -22179
8848b2179R5828k21198N1314K24424J52488l62838k77672K22706L92189L01798
$$ -22179 73649 -147549 -96235 128189 280677 -82161 -359833 -137127 255062 556860
8838E56860n84k29436l72219j27969m73155k18477L20395M66060K23876j45722
$$ 556860 556276 326840 -45379 -173348 -646503 -864980 -544585 -78525 145351 -371
8828c71j74303L5701J97131O370m5959l47206J13434N30126J80777j64725r3274
$$ -371 -174674 -138973 58158 64528 18569 -328637 -215203 314923 495700 330975 237701
8817B37701j96176k77623k50134j67781P0620K73802j15694o9560L61776M24886
$$ 237701 41525 -236098 -486232 -654013 -583393 -309591 -425285 -494845 -133069 291817
8807B91817j6928n93456k70512j52589k9070L9114L07007J88373N0436L49244
$$ 291817 274889 -318567 -589079 -741668 -770738 -731624 -424617 -236244 -185808 163436
8797A63436n3818k68354k94619m63652k35865Q3309p6954K86935N41388N81902
$$ 163436 109618 -158736 -453355 -917007 -1152872 -1069563 -1146517 -859582 -318194 263708
8787B63708K05706p7770k67310k54161k55114N8226K21584p5100P59k26347r3637
$$ 263708 469414 391644 124334 -129827 -384941 -326715 -105131 -180231 -179472 -405819 -499456
8776d99456j11603K2886Q338L50651N90171M70185J12887n27775m61519k19466
$$ -499456 -611059 -588173 -579835 -229184 360987 831172 944059 416284 -45235 -264701
8766b64701m1119J70262K19968m7074p6245k13354k20134L58243O18120K16331
$$ -264701 -305820 -135558 84410 37336 -38909 -252263 -472397 -114154 503966 720297
8756G20297m5301J85529K2157j94263k67255q1567j68438j7945K87738J96097
$$ 720297 674996 860525 882682 688419 421164 339597 171159 153214 440952 637049
8746F37049m00206n52624r4723k03120K01064L38228K15215q4826l39444n78014
$$ 637049 236843 -315781 -410504 -613624 -412560 -74332 140883 56057 -283387 -861401
8736h61401l81644J72952L45172O55669J89870l99669l29897k76181J89032K97751
$$ -861401 -1243045 -1070093 -724921 -69252 120618 -279051 -608948 -885129 -696097 -398346
8726c98346L94843N28077L01777l41000m69004l72400l13536r6572K99028L81676
$$ -398346 -3503 524574 826351 485351 16347 -356053 -669589 -766161 -467133 -85457
8716h5457J20362j81085m96932k47619N21445N16931J28365r9703n68339l83083
$$ -85457 34905 -146180 -643112 -890731 -369286 147645 276010 176307 -392032 -775115
8706g75115M20415L60276J11007L26201l37881n17814r0451Q1578J83841Q7196
$$ -775115 -354700 5576 116583 442784 104903 -412911 -503362 -421784 -237943 -150747
8696a50747K51156L94731L31395j09697k56929j53153n44307l078L0609n9665
$$ -150747 100409 495140 826535 716838 459909 306756 -237551 -240629 -210020 -269685
8686b69685m0630J7773K97824J36237l63572m90632j72979R8869K00797L79436
$$ -269685 -310315 -292542 5282 141519 -222053 -712685 -885664 -786795 -585998 -206562
8676b06562J57944R7317K37277J50235j74162j58620j53174l26127O7420O27461
$$ -206562 -48618 48699 285976 436211 262049 103429 -49745 -375872 -308452 319009
8666C19009N63109J77976J64292k56058l76650l62253k99408k00039j75136m9275
$$ 319009 882118 1060094 1224386 968328 591678 229425 -69983 -270022 -445158 -494433
8656d94433o8471k82940L84445N62728j31615M7106R6650l86800n44133n151L39082
$$ -494433 -562904 -845844 -461399 101329 -30286 16820 113470 -273330 -817463 -822614 -483532
8645d83532L34473j995l279m5016Q1609o0725j38076K65569L35839L77347K02738
$$ -483532 -149059 -151054 -154333 -199349 -117740 -178465 -316541 -50972 284867 662214 864952
8634H64952l57669j94025m1912m73130m73375J47312K06940l871J45993j73251
$$ 864952 507283 313258 271346 -201784 -675159 -527847 -320907 -324778 -178785 -352036
8624c52036k00767K25854K57690L7810j54018R846M23812N41061K49372Q045k52489
$$ -352036 -552803 -326949 -69259 -31449 -185467 -175621 248191 789252 1038624 1046669 794180
8613G94180k57135j02711l26001j97551k22140n0520O7756l0308N9826J93362
$$ 794180 537045 434334 108333 -89218 -311358 -361878 -294122 -324430 -264604 -71242
8603g1242L87616N32481N8690k07472r1166J1768k25918l40366M8912J89875l15811
$$ -71242 316374 848855 907545 700073 608907 620675 394757 54391 103303 293178 -22633
8592b2633l2774K59832L97259M79761K9889n66127l85824K6145j47421k69419
$$ -22633 -55407 204425 601684 1081445 1111334 545207 159383 185528 38107 -231312
8582b31312O0623J45713k81L4858J48237j7194k08846k93419J72703K68929O0844
$$ -231312 -170689 -24976 -25257 9601 157838 140644 -68202 -361621 -188918 80011 140855
8571A40855L27870L6578K24656L79734L59661L29938k02722m42491j59388M3412
$$ 140855 468725 505303 729959 1109693 1469354 1799292 1596570 1154079 994691 1038103
8561A038103M1124q7520K47634L84968M67980O29247P86192J094281J049403J46998
$$ 1038103 1079227 991707 1239341 1624309 2092289 2721536 3507728 4602009 5651412 5798410
8551E798410r15651j108904n16979l88503l11173j12942p9838j53524m17027l10467
$$ 5798410 4882759 3773855 3256876 2868373 2557200 2444258 2364420 2210896 1793869 1483402
8541A483402O0403l5000j26794n22205p3168K79918n8730l69793l13023K79348
$$ 1483402 1543805 1508805 1382011 859806 786638 1066556 1007826 638033 325010 604358
8531F04358J03529k61339J11343L47838K27407P8051J08145J83068J46120k8838
$$ 604358 707887 446548 557891 905729 1133136 1211187 1319332 1502400 1648520 1619682
8521A619682j13649l98847m04114K80744J50612l84806p7344K81002K1141j15943
$$ 1619682 1506033 1107186 703072 983816 1134428 749622 672278 953280 974421 858478
8511H58478j20053q180m9097l3496l0210r3980q0917k23775j12073J89614N47006
$$ 858478 738425 730245 681148 647652 617442 523462 442545 218770 106697 296311 843317
8500H43317K40941j94553j92309j59625k04586J40118L77233J84791P2016j0501
$$ 843317 1084258 889705 697396 537771 333185 473303 850536 1035327 1107343 1096842
8490A096842q4195k28261j45408K5968n2733j11980L2703j33608j03226K61700
$$ 1096842 1012647 784386 638978 664946 612213 500233 532936 399328 296102 557802
8480E57802p7871j48401o3561j84744l15565k08925j90698j81601K79059L09079
$$ 557802 479931 331530 267969 83225 -232340 -441265 -631963 -813564 -534505 -225426
8470b25426j89021j46512K84989L58038M93550L29089j97403j39459J18251k79555
$$ -225426 -414447 -560959 -275970 82068 575618 904707 707304 567845 686096 406541
8460D06541k23078l08432Q0888K2120k60885k60007Q0274K2819Q6821R1526o753
$$ 406541 183463 -124969 -44081 -21961 -282846 -542853 -462579 -439760 -352939 -261413 -268166
8449b68166M04175P48610N71709L3766j82568k10084j0139Q9049L92044J93298
$$ -268166 136009 884619 1456328 1490094 1307526 1097442 1087303 1176352 1568396 1761694
8439A761694Q8358k42500p9397j31567j08194J26513P8170Q8506L645q0497k25057
$$ 1761694 1850052 1607552 1528155 1396588 1288394 1414907 1493077 1581583 1585228 1504731 1279674
8428A279674j67796O7020L47523M24872M42311L65391J11124k69891J24874K11052
$$ 1279674 1111878 1178898 1526421 1951293 2393604 2758995 2870119 2600228 2725102 2936154
8418B936154j60432p0234K24271N62310M99487L10921K58194L80206N30904L10911
$$ 2936154 2775722 2705488 2929759 3492069 3991556 4302477 4560671 4940877 5471781 5782692
8408E782692k49510k15160L1741j16145k00520j75809k94578k28663l97651j78084
$$ 5782692 5533182 5318022 5349763 5233618 5033098 4857289 4562711 4334048 3936397 3758313
8398C758313k07r7133L61265L78660K41201J52706j17440p8864K89611J31776
$$ 3758313 3758106 3660973 4022238 4400898 4642099 4794805 4677365 4598501 4888112 5019888
8388E019888j03623J92919M25079M50006O25929M84366N81091K65594j24735J41937
$$ 5019888 4916265 5109184 5534263 5984269 6610198 7094564 7675655 7941249 7816514 7958451
8378G958451M49595M34438K61341K61545J99815k94726j35109K48088N02656O44625
$$ 7958451 8408046 8842484 9103825 9365370 9565185 9270459 9135350 9383438 9886094 10530719
8368A0530719K62305M60414N55572K74157N71913Q01509Q98526P20161J001298
$$ 10530719 10793024 11253438 11809010 12083167 12655080 13456589 14355115 15075276 16076574
8359A6076574J334518J068119J005523J625485K179212K304720K323483K620798
$$ 16076574 17411092 18479211 19484734 21110219 23289431 25594151 27917634 30538432
8351C0538432L100418L685247M435412N220989O174024O963890P616714Q852720
$$ 30538432 33638850 37324097 41759509 46980498 53154522 60118412 67735126 76587846
8343G6587846J0556244J2504253J4329817J6180140J8384997K0824007K2550089
$$ 76587846 87144090 99648343 113978160 130158300 148543297 169367304 191917393
8336A91917393K2064199J9527123J4428468N690385m483140j3086798j8760359
$$ 191917393 213981592 233508715 247937183 253627568 249144428 236057630 217297271
8329B17297271k1714758k2201074k0725776j8312190j6176298j4166191j2437635
$$ 217297271 195582513 173381439 152655663 134343473 118167175 104000984 91563349
8322I1563349j0587212q846584p657881p082154o235084m883621m163030l945517
$$ 91563349 80976137 72129553 64471672 57389518 51154434 46270813 42107783 38162266
8314C8162266l785686k749648j920018k048242j959521j345320j460905j768835
$$ 38162266 34376580 31626932 29706914 27658672 25699151 24353831 22892926 21124091
8306B1124091j613221j483501j166484m67184n41776p85076q22338r70058p08989
$$ 21124091 19510870 18027369 16860885 16393701 15851925 15066849 14244511 13274453 12565464
8297A2565464k53433J11988p1433j51259j08819j72398l86973p03362p78007q53114
$$ 12565464 12312031 12424019 12352586 12201327 12092508 11920110 11533137 10829775 10051768 9198654
8287I198654o05909k22387k39334k4988K49553N4474j56971l1098j89873m57837
$$ 9198654 8592745 8370358 8131024 8106036 8355589 8410063 8253092 8221994 8032121 7574284
8277G574284l11946j19883m17122m41918p0563l2144k6615J84112O8816j81131
$$ 7574284 7262338 7142455 6725333 6283415 6212852 6180708 6154093 6338205 6407021 6225890
8267F225890j42209R0210J55147K75537K65779j14717m39286m89573r2720k38936
$$ 6225890 6083681 6173891 6329038 6604575 6870354 6755637 6316351 5826778 5734058 5495122
8257E495122m83485m80014k97943l12814j41381m14616o85197m85921J7518L0166
$$ 5495122 5011637 4531623 4233680 3920866 3779485 3364869 2679672 2193751 2211269 2241435
8247B241435k47503j43170K00024k1231k32537k22459j13463k04964K06949L51828
$$ 2241435 1993932 1850762 2050786 2029555 1797018 1574559 1461096 1256132 1463081 1814909
8237A814909m3597k75630l03030q8115K14636m1618k98848n9128m15782j43231
$$ 1814909 1771312 1495682 1192652 1104537 1319173 1277555 978707 919579 503797 360566
8227C60566J37810N2238N6995k8311L4082K48753M04674j30060l66109p056n6494
$$ 360566 498376 550614 607609 579298 613380 862133 1266807 1136747 770638 763582 707088
8216G07088j66482J24359j80682j71686L40657Q408k05870J04751o9597j3126
$$ 707088 540606 664965 484283 312597 653254 661662 455792 560543 490946 477820
8206D77820l3004p6763m28842l89272L41626Q610n59319m74827K41287K82420
$$ 477820 444816 368053 -60789 -450061 -108435 -99825 -659144 -1133971 -892684 -610264
8196f10264L5845M335J25322J82975L48445Q6404L7705L06993n4197o4807j85997
$$ -610264 -574419 -570084 -444762 -261787 86658 173062 210767 517760 463563 398756 212759
8185B12759K0987M03602L25063j24888k84718l88539l97595j83455j92618J80658
$$ 212759 233746 637348 962411 837523 552805 164266 -233329 -416784 -609402 -428744
8175d28744n738l05277R8300M3908Q6587J68921k9919r7752r2264L02799j50219
$$ -428744 -434482 -739759 -641459 -597551 -510964 -342043 -371962 -469714 -561978 -259179 -409398
8164d09398k96579k1056j7177K2340L40615K87156L0934n3960Q0745k9146n1531
$$ -409398 -705977 -727033 -744210 -721870 -381255 -94099 -63165 -117125 -36380 -65526 -117057
8153a17057K7634j87184p3687N7317L8030J05116P2778k63550k67391K12150N32644
$$ -117057 -89423 -276607 -350294 -292977 -254947 -149831 -77053 -340603 -607994 -395844 136800
8142A36800L40225j52629m75244k55793K74741J80433j50021m56308j30669K24403
$$ 136800 477025 324396 -150848 -406641 -131900 48533 -101488 -557796 -688465 -464062
8132d64062J62184P6205J52102J26659J01062J62619J77604J83262J5449j66585
$$ -464062 -301878 -225673 -73571 53088 154150 316769 494373 677635 693084 526499
8122E26499k95263k7986j00981k10131n8768J64019L70603N01537J86066J55584
$$ 526499 231236 203250 102269 -107862 -166630 -2611 367992 869529 1055595 1211179
8112A211179O8353j21209l88992m73695q2434O3810L6300R4990j57176k75038
$$ 1211179 1279532 1158323 769331 295636 213202 277012 313312 408302 251126 -23912
8102b3912j68785j55532l41673q2986J60407P3477j24218j05850k1348j7187J19599
$$ -23912 -192697 -348229 -689902 -772888 -612481 -539004 -663222 -769072 -790420 -807607 -688008
8091f88008N51245J69626J29180l484n9069j22025k45236J01636J11012j4772
$$ -688008 -136763 32863 162043 158559 99490 -22535 -267771 -166135 -55123 -69895
8081f9895O6540J30548J36857K08824O2270l60886o69704n60507K0068N31844
$$ -69895 -3355 127193 264050 472874 535144 174258 -495446 -1055953 -1035885 -504041
8071e04041J43241m78011l28278O0389K9931J4341R1373l2640j36788K14400J28853
$$ -504041 -360800 -838811 -1167089 -1106700 -1076769 -1062428 -971055 -1003695 -1140483 -926083 -797230
8060g97230L14545K53468M46120O23592j72261k53771l1763j81633N7503n1288
$$ -797230 -482685 -229217 216903 840495 668234 414463 382700 201067 258570 207282
8050B07282n45369j23801L66160K36594P0157j26325J9499J04143j02638K0669
$$ 207282 -338087 -461888 -95728 140866 211023 84698 104197 208340 105702 126371
8040A26371N47800M77639o0155m63369r63121k80140J09367K30647Q0535k05520
$$ 126371 674171 1151810 1091655 628286 -334835 -614975 -505608 -274961 -194426 -399946
8030c99946J5936M2023k33934K16482J7631l40557R8741J50384J53861j46499
$$ -399946 -384010 -341987 -575921 -359439 -341808 -682365 -583624 -433240 -279379 -425878
8020d25878l18850j70893J50880J04571K06707J52846O9871K6849M771k4170R4670
$$ -425878 -744728 -915621 -764741 -660170 -453463 -300617 -230746 -203897 -199126 -223296 -128626
8009a28626K07860j83317j59255P5343r5830j8487J94853K00851p0221l17127
$$ -128626 79234 -104083 -263338 -187995 -283825 -302312 -107459 93392 23171 -293956
7999b93956k89507L8091J77383L10416K29743j16430k26251O5659R7234j93935
$$ -293956 -583463 -545372 -367989 -57573 172170 55740 -170511 -104852 -7618 -201553
7989b01553j98911k32343m2492K8083J1845J54088K273j35879k30246J82907M18936
$$ -201553 -400464 -632807 -675299 -647216 -635371 -481283 -479010 -614889 -845135 -662228 -243292
7978b43292j5567j70896J23694N77255M42189j94188j62752l64364k36677m9959
$$ -243292 -258859 -429755 -306061 271194 713383 519195 356443 -7921 -244598 -294557
7968b94557J18435L63447M5045J39512L53780o793o5986k54827N0808M11423p0528
$$ -294557 -176122 187325 232370 371882 725662 718869 652883 398056 448864 860287 789759
7957G89759m17938k29201J00375K27382k57075p16273o08566J18543M25928n1681
$$ 789759 371821 142620 242995 470377 213302 -502971 -1111537 -992994 -567066 -618747
7947f18747m40862K87462M92209K70662M4869k08850Q1662L34148J65146M6045
$$ -618747 -1059609 -772147 -279938 -9276 35593 -173257 -91595 242553 407699 453744
7937D53744q3139k72351k56934Q6337J14579r7881j64287J99632M18657p747l64242
$$ 453744 370605 98254 -158680 -72343 42236 -55645 -219932 -20300 398357 390610 26368
7926B6368k67115l38406j35997J0753j64280k27213p9869J55064J7878j06942
$$ 26368 -240747 -579153 -715150 -704397 -868677 -1095890 -1175759 -1020695 -1002817 -1109759
7916a109759K01119R12440L32499q0207J10486j21780j33932l4161L69007K27536
$$ -1109759 -908640 3800 336299 256092 366578 244798 110866 76705 445712 673248
7906F73248o13313n96601k25887j17707m7139J05310J40765L75727L38706J4624
$$ 673248 59935 -536666 -762553 -880260 -927399 -822089 -681324 -305597 33109 47733
7896D7733m42338o8480M4443r8261J52028K87304J78879k10555J33029L42375
$$ 47733 -394605 -463085 -418642 -516903 -364875 -77571 101308 -109247 23782 366157
7886C66157J64379r8146m08816j66371K45631J08138m960P5203Q7667j89104l47195
$$ 366157 530536 432390 23574 -142797 102834 210972 206012 281215 368882 179778 -167417
7875a67417K6666q3689j3260J59026J09014j19192j2311O1735j93751K8274j21568
$$ -167417 -140751 -224440 -237700 -78674 30340 -88852 -101163 -39428 -233179 -204905 -326473
7864c26473j76694J23582Q6794L21141L21688p0222j52687J87554L94170Q9852
$$ -326473 -503167 -379585 -292791 28350 350038 279816 127129 314683 708853 798705
7854G98705j44666l87890R62o9595N5606O1845k76788j54221j56173j36738k58963
$$ 798705 654039 266149 267111 197516 253122 314967 38179 -116042 -272215 -408953 -667916
7843f67916l1899L11799J94913J49597p4947J350N0355n5212J24911J99344K59293
$$ -667916 -699815 -388016 -193103 -43506 -118453 -117103 -66748 -121960 2951 202295 461588
7832D61588j11281K84062J30016l47245j5498L49345j24625l15956k31474k67897
$$ 461588 350307 634369 764385 417140 401642 750987 626362 310406 78932 -188965
7822a88965n8326J41214J91248J41314q347p9170j65361j29860J2686O0139M05805
$$ -188965 -247291 -106077 85171 226485 218138 138968 -26393 -156253 -143567 -83428 322377
7811C22377M65601M20300q0838k10610J8296P5714K71655P86800J398061J566881
$$ 322377 787978 1208278 1127440 916830 935126 1010840 1282495 2069295 3467356 5034237
7801E034237R14552o25197r37602p07258j065552j148188o48147m27417q1138
$$ 5034237 5948789 5323592 4385990 3678732 2613180 1464992 816845 389428 308290
7792C08290J55769l0204j47378R3238O5117k72807k6914P8903K07747J31476M148
$$ 308290 464059 433855 286477 379715 444832 172025 145111 224014 431761 563237 567385
7781E67385k01758l38384k86000j08167k59745k12825N3826k2008M05006K77938
$$ 567385 365627 27243 -258757 -366924 -626669 -839494 -785668 -807676 -402670 -124732
7771a24732r771R220q8206j6425j9290O8793K65120K04147Q9726p9554j13386
$$ -124732 -134503 -125283 -213489 -229914 -249204 -180411 84709 288856 378582 299028 185642
7760A85642j18679k851K35855P3316k39374J19266J74589P3116Q2636k65892m12819
$$ 185642 66963 64112 299967 373283 133909 253175 427764 500880 583516 317624 -95195
7749i5195k47680O1299m9244l90149k54560O5764K95731O23630M09077P150l53139
$$ -95195 -342875 -281576 -330820 -720969 -975529 -909765 -614034 9596 418673 425823 72684
7738G2684n46141l34776J88498N36065J17736k10154m7204J21232P9216R8310
$$ 72684 -473457 -808233 -619735 -83670 34066 -176088 -223292 -102060 -22844 75466
7728G5466J26135j49656m67968k77931L77943O73419M69221j13020l60577J20961
$$ 75466 201601 51945 -416023 -693954 -316011 357408 826629 713609 353032 473993
7718D73993J46565k75586l63340k65205j05174j292n99k3291j9702L4306J80876
$$ 473993 620558 344972 -18368 -283573 -388747 -390039 -390638 -413929 -433631 -399325 -218449
7707b18449K10090j19375j00573J11798K83351O59332K49287M1696L34465J81876
$$ -218449 -8359 -127734 -228307 -116509 166842 826174 1075461 1117157 1451622 1633498
7697A633498j40278l86988j81467J80909J39749J68692Q0940m87711m02409l28248
$$ 1633498 1493220 1106232 924765 1105674 1245423 1414115 1495055 1007344 604935 276687
7687B76687p4293J88552k8457k49652k28991J33412M97223M60459n07899j048278
$$ 276687 202394 390946 362489 112837 -116154 17258 514481 974940 467041 -581237
7677e81237n90930J41965M17454K13090r1151J23592L16250M04374J56319k87073
$$ -581237 -1172167 -1030202 -612748 -399658 -490809 -367217 -50967 353407 509726 222653
7667B22653l33254k49633o6440j02925O2933J19221J47345M36932L07379k23673
$$ 222653 -110601 -360234 -426674 -529599 -466666 -347445 -200100 236832 544211 320538
7657C20538k14767j86052N4322J83158o4834k01872k22615m69601j65624N04746
$$ 320538 105771 -80281 -25959 157199 92365 -109507 -332122 -801723 -967347 -462601
7647d62601N45523J2613J84901L29464K00723j79169l69486j58947m17292m93012
$$ -462601 82922 95535 280436 609900 810623 631454 261968 103021 -314271 -807283
7637h07283q0223L7947J7357K10734L32509o0506o7829L09104L19691k3012k70934
$$ -807283 -887506 -849559 -832202 -621468 -288959 -349465 -417294 -108190 211501 188489 -82445
7626h2445j78307k34944l16821l34841K75718P20635L39260K3292k56814l21581
$$ -82445 -260752 -495696 -812517 -1147358 -871640 -151005 188255 211547 -45267 -366848
7616c66848l0962J36964q7608m03284r1600J53827j54910k94263r0058j32404
$$ -366848 -397810 -260846 -348454 -751738 -843338 -689511 -844421 -1138684 -1228742 -1361146
7606a361146R6563L35935J45069J51151J836k08318R2696K74902n3691j48877
$$ -1361146 -1264583 -928648 -783579 -632428 -630592 -838910 -746214 -471312 -525003 -673880
7596f73880N27944O12574J36385j27045l52198m63306l18418K74862Q54189P46370
$$ -673880 -145936 466638 603023 475978 123780 -339526 -657944 -383082 471107 1217477
7586A217477J55200l39490l12893J2897J32132p1864n26580j20566N3623k14784
$$ 1217477 1372677 1033187 720294 733191 865323 793459 266879 146313 199936 -14848
7576a4848j5322J29888L8148p0691O8359P0201k23758l9906K26543J94663K97298
$$ -14848 -30170 99718 137866 67175 135534 205735 -18023 -57929 168614 363277 660575
7565F60575K2553j25355J79624M44909j21554k99119k43268k07649J38024N14122
$$ 660575 683128 557773 737397 1182306 1060752 761633 518365 310716 448740 962862
7555I62862L29156k03160n36041p01119m85506k20369j36067m2192R3148P9141
$$ 962862 1292018 1088858 552817 -148302 -633808 -854177 -990244 -1032436 -939288 -860147
7545h60147N2283J61153L19138M072j47539k0236L20535Q7293J29991L05110N615
$$ -860147 -807864 -646711 -327573 -323501 -471040 -491276 -170741 -83448 46543 351653 357268
7534C57268p6107k14844k01653M4056j58880k38339J64256K60966L85023L9498
$$ 357268 281161 66317 -135336 -91280 -250160 -488499 -324243 -63277 321746 361244
7524C61244j51727k8849K00928J05243m0552P333m57381n27678m70345k02035
$$ 361244 209517 180668 381596 486839 446287 453620 -3761 -531439 -1001784 -1203819
7514a203819O8624K68060K42436o5968J83619N14153L76313N3982k69576l9452
$$ -1203819 -1135195 -867135 -624699 -690667 -507048 7105 383418 437400 167824 128372
7504A28372Q239J23563P7436q3217j29779J50135J21991j51618j89405k92020
$$ 128372 136611 260174 337610 254393 124614 274749 396740 245122 55717 -236303
7494b36303q83K6084L591K53663K09952M3446m08148l92686N1060j96423j99533
$$ -236303 -237186 -211102 -207511 46152 256104 299550 -108598 -501284 -450224 -646647 -846180
7483h46180K29043K92001j24666J23527L60148M24521J61821Q3389j63925j99943
$$ -846180 -617137 -325136 -449802 -326275 33873 458394 620215 703604 539679 339736
7473C39736k17963j35231J46331J22100l3804o1421k79762L69361O59443K97813
$$ 339736 121773 -13458 132873 254973 221169 159748 -120014 249347 908790 1206603
7463A206603O5836j61489k51440n40217o00970p8471K67040R2863q3018J06723
$$ 1206603 1272439 1110950 859510 319293 -281677 -360148 -93108 -245 -83263 23460
7453B3460r8280l71j37646Q0553n5798o9253K70182J79917j50744l60272k47676
$$ 23460 -74820 -75191 -212837 -132284 -188082 -257335 12847 192764 42020 -318252 -565928
7442e65928J37176M15945N06467K50109n34926q44926L5961N44328P9833p1161
$$ -565928 -428752 -12807 493660 743769 208843 -636083 -600122 -55794 24039 -47122
7432d7122J91895L56607j90653r886J30917o9139k56458r2691k82632m13959l9041
$$ -47122 144773 501380 310727 300841 431758 362619 106161 13470 -269162 -683121 -722162
7421g22162L78544K24563j911L78357M12655R7339K7335k6806j51305n5136r5643
$$ -722162 -343618 -119055 -120966 257391 670046 767385 794720 767914 616609 561473 465830
7410D65830K1037k095l34738R84K22684r6554m37811n70231k65473J35561J84149
$$ 465830 486867 484772 150034 151018 373702 277148 -160663 -730894 -996367 -860806 -676657
7399f76657K23109N68021J95426k57390l19925k00316J75789L78502J8974o2381
$$ -676657 -453548 114473 309899 52509 -267416 -467732 -291943 86559 105533 43152
7389D3152l2662J16791M548j68466j0802n1438l03184k19018j20235k17918J63438
$$ 43152 10490 127281 131829 -36637 -47439 -98877 -402061 -621079 -741314 -959232 -795794
7378g95794K94249j668K03154L13354N81002N59650j27315l50102k24948n67861
$$ -795794 -501545 -503213 -300059 13295 594297 1153947 1026632 676530 451582 -116279
7368a16279r7459J24834k05157n45559k61278J570j07444K6484K75295L66356
$$ -116279 -213738 -88904 -294061 -839620 -1100898 -1099328 -1206772 -1180288 -904993 -538637
7358e38637J0599j7825L30491M11583J32842k96702l16233J98398j64l55191m07992
$$ -538637 -528038 -545863 -215372 196211 329053 32351 -283882 -85484 -85648 -440839 -848831
7347h48831J00736O60520O51059K63789m09930o86997l3680J15407M40678L28591
$$ -848831 -748095 -87575 563484 827273 417343 -269654 -303334 -187927 252751 581342
7337E81342q6845l53788q8831K52507M42806q9570n25172m86163k74837j19639
$$ 581342 494497 140709 51878 304385 747191 657621 132449 -353714 -628551 -748190
7327g48190j52524p9352p3374J82519O44746L16446k64061n46312o42240l96145
$$ -748190 -900714 -980066 -1053440 -870921 -226175 90271 -173790 -720102 -1362342 -1758487
7317a758487k35216J35867M57101N83188K49109j32617q4969L13899J83447j03793
$$ -1758487 -1993703 -1857836 -1400735 -817547 -568438 -701055 -786024 -472125 -288678 -392471
7307c92471P2207K01523M36173J29031k75743m86008k36727k20147k35191J83652
$$ -392471 -320264 -118741 317432 446463 170720 -315288 -552015 -772162 -1007353 -823701
7297h23701N9689k57729k29427N738L30754L94196L72823r1468m4923P5582p2369
$$ -823701 -764012 -1021741 -1251168 -1245430 -914676 -520480 -147657 -239125 -284048 -208466 -280835
7286b80835j59996J54577K4818j80057K29199L07448K19765P3628K12051J11801
$$ -280835 -440831 -286254 -261436 -441493 -212294 95154 314919 388547 600598 712399
7276G12399K64863J8062l71618k15477k63123m01436k07369k09095n3803J27662
$$ 712399 977262 995324 623706 408229 145106 -256330 -463699 -672794 -726597 -598935
7266e98935K58439L04624K40207J84754q5794R979p0074k96004Q791O33150j0270
$$ -598935 -340496 -35872 204335 389089 303295 313274 243200 -52804 -44013 589137 578867
7255E78867l99067m14557j66771J9700j52003l63310o9053L22698M08186P6219
$$ 578867 179800 -234757 -401528 -381828 -533831 -897141 -966194 -643496 -235310 -159091
7245a59091m76933l36227L29585M33534L93692J7523j23447J67268j2974j09202
$$ -159091 -636024 -972251 -642666 -209132 184560 202083 78636 245904 232930 123728
7235A23728m83635n93405k39393L90525O43114L70189L45597J45689k57956O1354
$$ 123728 -359907 -953312 -1192705 -802180 -159066 211123 556720 702409 444453 505807
7225E05807J61339j43241J03277J68876j19847k83954j36921j37051M6033n9085
$$ 505807 667146 523905 627182 796058 676211 392257 255336 118285 164318 105233
7215A05233K7392l1660l0774R4490Q9639K90711q6490m44109j72062K7994N7623
$$ 105233 132625 100965 70191 164681 254320 545031 458541 14432 -157630 -129636 -72013
7204g2013k0583J11444j9398O297L7872j17452r1965J3404r8419k49785O1654
$$ -72013 -92596 18848 -550 5747 43619 -73833 -165798 -152394 -250813 -500598 -438944
7193d38944O6267p0442j22243Q2102L3977j23633k16419J69864L51876L12080
$$ -438944 -372677 -443119 -565362 -483260 -449283 -572916 -789335 -619471 -267595 44485
7183D4485L17564J46790j69385o50659n05475J81199L9505J2640K35332K34936
$$ 44485 362049 508839 339454 -311205 -816680 -635481 -595976 -583336 -348004 -113068
7173a13068P806q7270j34758J97442j53439l06611M3449J48039M9742N5470K21980
$$ -113068 -105262 -192532 -327290 -129848 -283287 -589898 -546449 -398410 -348668 -293198 -71218
7162g1218K63898J45647R3514L04678K08197R5594N5631j26820j31752o3238j23883
$$ -71218 192680 338327 431841 736519 944716 1040310 1095941 969121 837369 774131 650248
7151F50248J70887K28918K76547L59650L167l63256l42041J51773J45992l44698
$$ 650248 821135 1050053 1326600 1686250 1689417 1326161 984120 1135893 1281885 937187
7141I37187p6417M0583m0103k25693P9256K23053J12020k13206l29683j8496O79192
$$ 937187 860770 901353 861250 635557 714813 937866 1049886 836680 506997 488501 1167693
7130A167693R54414L64278k53329l63848k83336l21309k83203l87718j67772J55715
$$ 1167693 2122107 2486385 2233056 1869208 1585872 1264563 981360 593642 425870 581585
7120E81585J36985Q2575L26474L78317L00479L62694L30655J65333J92076J16342
$$ 581585 718570 801145 1127619 1505936 1806415 2169109 2499764 2665097 2857173 2973515
7110B973515O176m32000q7538K89990J96987K12839K82442K7900j39207q8850
$$ 2973515 2979691 2547691 2460153 2750143 2947130 3159969 3442411 3470311 3331104 3242254
7100C242254J00705J63626Q7375K67164M47599k00471k90812K82833O6325m0363
$$ 3242254 3342959 3506585 3593960 3861124 4308723 4108252 3817440 4100273 4166598 4126235
7090D126235O21514M99441J04504N68985Q10266J166062J693538J674067J642380
$$ 4126235 4747749 5247190 5351694 5920679 6730945 7897007 9590545 11264612 12906992
7081A2906992J536589K031161K579645K713521L777215M950639N750680O877866
$$ 12906992 14443581 16474742 19054387 21767908 25545123 30495762 36246442 43124308
7073D3124308R076755J2611767J6884276K1942506K9644419L7832035M0305489
$$ 43124308 52201063 64812830 81697106 103639612 133284031 171116066 211421555
7066B11421555K4082922j1060251l6727568m0050078l2378644k4249732j8048440
$$ 211421555 235504477 224444226 187716658 147666580 115287936 91038204 72989764
7059G2989764j3159072r905829p505978n837641m666040l985219l131817k892591
$$ 72989764 59830692 49924863 42418885 36581244 31915204 27929985 24798168 21905577
7051B1905577k722119k420240k220419j591341o86773r54975r74143r24432j230657
$$ 21905577 19183458 16763218 14542799 12951458 12264685 11309710 10335567 9411135 8180478
7042H180478j466614j047568j45439J57821M66079K04788m76368q41221n89465
$$ 8180478 6713864 5666296 5520857 5678678 6144757 6349545 5873177 5031956 4442491
7033D442491k68379j51778J7342K4475J7704N8720l00231k63582j89866K40568
$$ 4442491 4174112 4022334 4039676 4064151 4081855 4140575 3840344 3576762 3386896 3627464
7023C627464L13674K67092j81879m39531j90500l30251l74825k87824L81684O91327
$$ 3627464 3941138 4208230 4026351 3586820 3396320 3066069 2691244 2403420 2785104 3476431
7013C476431J96049k31547n44306m76323k12131K22779L95345L07426k16240k11991
$$ 3476431 3672480 3440933 2896627 2420304 2208173 2430952 2826297 3133723 2917483 2705492
7003B705492j15490J63617L57589r1095o3606l58251l96850j01893m6316j17763
$$ 2705492 2590002 2753619 3111208 3020113 2956507 2598256 2201406 2099513 2053197 1935434
6993A935434k54735j48071k01542l2347K29199j49409j91004P6545R2199j48099
$$ 1935434 1680699 1532628 1331086 1298739 1527938 1378529 1187525 1264070 1356269 1208170
6983A208170m83416k05025J95801J88949K17175N8441l03656P0632N86157J49778
$$ 1208170 724754 519729 715530 904479 1121654 1180095 876439 947071 1533228 1683006
6973A683006J0402j85767m56568j20032l31256j15124J01301l344K40255J67924
$$ 1683006 1693408 1507641 1051073 931041 599785 484661 585962 582618 822873 990797
6963I90797L39961k89297o72930k7097J45721K46093j51498L0277L71346M04065
$$ 990797 1330758 1041461 368531 341434 487155 733248 581750 612027 983373 1387438
6953A387438q0032o48709j27037L52489L95523K41680j1204j25738p8436r1167
$$ 1387438 1307406 658697 531660 884149 1279672 1521352 1510148 1384410 1305974 1214807
6943A214807k81350l78444j45674R438k03890j42412q6099j34691j90448M1527
$$ 1214807 933457 555013 409339 418777 214887 72475 -13624 -148315 -338763 -297236
6933b97236K98724L13540M8938j15331J31178N46161K16698o25591n09072K44026
$$ -297236 1488 315028 363966 248635 379813 925974 1142672 517081 8009 252035
6923B52035J86794P5023Q172j6809L89350L38707K15253j42082k70971J04997
$$ 252035 438829 513852 522024 505215 894565 1233272 1448525 1306443 1035472 1140469
6913A140469J76869N2186l31825j15866L91674N64681j7870n06901k80188j10453
$$ 1140469 1317338 1369524 1037699 921833 1313507 1878188 1860318 1353417 1073229 962776
6903I62776K15052R2116J04054L41250N6481k16882k24060K12872L14947J2361
$$ 962776 1177828 1269944 1373998 1715248 1771729 1554847 1330787 1543659 1858606 1870967
6893A870967M51596M46005L5592R2709J62400l13437k16436q019K8004o4584j52292
$$ 1870967 2322563 2768568 2804160 2896869 3059269 2745832 2529396 2521377 2549381 2484797 2332505
6882B332505J87804r9770j19500k80041m77786K40054J33930l4739L52093N07305
$$ 2332505 2520309 2420539 2301039 2020998 1543212 1783266 1917196 1882457 2234550 2741855
6872B741855M16340P16753M94360K7731k77265j20733m85867q20919k96167J45907
$$ 2741855 3158195 3874948 4369308 4397039 4119774 3999041 3513174 2692255 2396088 2541995
6862B541995J85399K48034M00910K79394k6675k59685K2644J09008L15172Q76640
$$ 2541995 2727394 2975428 3376338 3655732 3629057 3369372 3392016 3501024 3816196 4692836
6852D692836O10349M46076L51181L9182j28501N19694P59711Q92358P78653M16306
$$ 4692836 5303185 5749261 6100442 6139624 6011123 6530817 7290528 8182886 8961539 9377845
6842I377845J044235J616618J483786J399300J932422K868224L580443M276661
$$ 9377845 10422080 12038698 13522484 14921784 16854206 19722430 23302873 27579534
6834B7579534N449387O607502P663341R813199J2635757J6470038K2010225K9571018
$$ 27579534 33028921 39636423 47299764 57112963 69748720 86218758 108228983 137800001
6826A37800001L7493210L8782922K1560702j2545914l6458295l8725643l1803939
$$ 137800001 175293211 214076133 235636835 223090921 186632626 147906983 116103044
6819A16103044k3921699j7691506j3600313j0381278q201214o697634n178893
$$ 116103044 92181345 74489839 60889526 50508248 42307034 35609400 30430507
6812C0430507m202929l336836k788215k422423k056401k009438k081522j691609
$$ 30430507 26227578 22890742 20102527 17680104 15623703 13614265 11532743 9841134
6804I841134j121164p62727o56846p76057p93056k58589m39906l18954k5165j06495
$$ 9841134 8719970 7957243 7300397 6524340 5731284 5472695 5032789 4713835 4688670 4582175
6794D582175l15004n10725P8117J20659l85233k46072j04138P6785J49881q9128
$$ 4582175 4267171 3756446 3834563 3955222 3569989 3323917 3219779 3296564 3446445 3357317
6784C357317m68330m33447J47956K28455P9329o1996L2831j9614p1879j3488l64957
$$ 3357317 2888987 2455540 2603496 2831951 2911280 2849284 2882115 2862501 2790622 2777134 2412177
6773B412177l89324k36131l07503r2773O802K56416L87694K72149n3691l4530
$$ 2412177 2022853 1786722 1479219 1386446 1393248 1649664 2037358 2309507 2255816 2221286
6763B221286J13382K93874N6919k49818j01475R4581J42080q4714j65327l02379
$$ 2221286 2334668 2628542 2685461 2435643 2334168 2428749 2570829 2486115 2320788 2018409
6753B018409k91176j5793j982q082j12653l9787J29899L20139K16289k98159m80966
$$ 2018409 1727233 1711440 1709458 1701376 1588723 1548936 1678835 1998974 2215263 1917104 1436138
6742A436138j85487j41987Q3373L6834L3046M5830O1854j09109j9184J47178Q7145
$$ 1436138 1250651 1108664 1192037 1228871 1261917 1307747 1369601 1260492 1241308 1388486 1475631
6731A475631j64423m26604j68335j51242l06082P4798O43877J00689n86305m37858
$$ 1475631 1311208 884604 716269 565027 258945 333743 977620 1078309 492004 54146
6721E4146J67658O02119N97515L05566L70549M74789N09739L35038j42763k84304
$$ 54146 221804 823923 1421438 1727004 2097553 2572342 3082081 3417119 3274356 2990052
6711B990052j33211k59549l81525p02369k54683L715k61708J20231Q82915J251194
$$ 2990052 2856841 2597292 2215767 1513398 1258715 1262430 1000722 1120953 2003868 3255062
6701C255062P47068l66469r25678r03355m24369q4999j31764l34042j94462j77957
$$ 3255062 4002130 3635661 2709983 1806628 1382259 1297260 1165496 831454 636992 459035
6691D59035n06382j41772N90682L81645l56951m27283k47437J79699L06805K54457
$$ 459035 -47347 -189119 401563 783208 426257 -1026 -248463 -68764 238041 492498
6681D92498K01190k9772j3742Q4082M04888M64697j49218n09910m59847j864J05616
$$ 492498 693688 663916 650174 734256 1139144 1603841 1454623 944713 484866 483002 588618
6670E88618j02558k04400k49257M9840J51638J34004K14435K59584O1829j59479
$$ 588618 486060 281660 32403 82243 233881 367885 582320 841904 903733 744254
$$ [...]
##END NTUPLES=NMR SPECTRUM
##END=
