##TITLE=C13_Pr 4967
 CDCl3, 21100 sc

 23.12.2020
##JCAMPDX= 6.0         $$ Bruker NMR JCAMP-DX V2.0
##DATA TYPE= NMR SPECTRUM
##DATA CLASS= NTUPLES
##ORIGIN= UXNMR, Bruker Analytische Messtechnik GmbH
##OWNER= root
$$ XWIN-NMR		Version 3.5
$$ Thu Dec 24 09:57:16 2020 Russian Standard Time (UT+4h)  she@DPX200
##.OBSERVE FREQUENCY= 50.327896
##.OBSERVE NUCLEUS= ^13C
##.ACQUISITION MODE= SIMULTANEOUS
##.ACQUISITION SCHEME= undefined
##.AVERAGES= 19850
##.DIGITISER RES= 17
##SPECTROMETER/DATA SYSTEM= spect
##.PULSE SEQUENCE= zgpg30
##.SOLVENT NAME= Pyr
##.SHIFT REFERENCE= (INTERNAL, Pyr, 0, 222.661)
##AUDIT TRAIL= $$ (NUMBER, WHEN, WHO, WHERE, WHAT)
$$ ##TITLE= Audit trail, XWIN-NMR		Version 3.5
$$ ##JCAMPDX= 5.01
$$ ##ORIGIN= Bruker BioSpin GmbH
$$ ##OWNER= she
$$ F:/spectra/data/she/nmr/c13/1/pdata/1/auditp.txt
$$ ##AUDIT TRAIL=  $$ (NUMBER, WHEN, WHO, WHERE, WHAT)
(   1,<2020-12-24 08:27:30.75 +0400>,<she>,<DPX200>,
      <created by zg, POWCHK disabled, PULCHK disabled
       terminated by command 'halt'
       configuration hash MD5:
       00 E9 B6 7A A2 85 ED C7 34 08 36 98 17 FE 4E 26
       data hash MD5: 32K
       91 01 B0 76 9A 12 30 36 DD 3C 02 C8 AD DD 33 D8>)
(   2,<2020-12-24 08:27:31.85 +0400>,<she>,<DPX200>,
      <Start of raw data processing
       efp BC_mod = 2 LB = 1 FT_mod = 6 PKNL = 1 PHC0 = -265.3271 PHC1 = 27.16242 SI = 32K 
       data hash MD5: 32K
       51 AD B6 88 C2 3D E8 FF B8 77 49 10 95 44 F1 61>)
(   3,<2020-12-24 09:54:53.29 +0400>,<she>,<DPX200>,
      <abs ABSG = 5 
       data hash MD5: 32K
       32 4E 33 A4 52 08 21 91 A5 0C 25 DB 89 1A 5C 39>)
(   4,<2020-12-24 09:56:05.84 +0400>,<she>,<DPX200>,
      <pk PHC0 = -7.782063 PHC1 = 11.2 
       data hash MD5: 32K
       D3 6B 0B 4A B3 2D 93 24 9E 08 58 9E 8D 5C E3 45>)
(   5,<2020-12-24 09:56:09.18 +0400>,<she>,<DPX200>,
      <abs ABSG = 5 
       data hash MD5: 32K
       86 51 EC 90 73 91 B8 02 10 74 FE B1 8B 71 B6 74>)
$$ ##END=
$$ 
$$ hash MD5
$$ F4 5F AF 78 1D B1 B0 75 99 04 C0 DF CF E4 CD 7E
##$RELAX= 
##$RELAX= 
##$RELAX= 
##$RELAX= 
##$RELAX= 
##$RELAX= 
##$RELAX= 
##$RELAX= 
$$ Bruker specific parameters
$$ --------------------------
##$DU= <F:/spectra>
##$EXPNO= 1
##$NAME= <c13>
##$PROCNO= 1
##$TYPE= <nmr>
##$USER= <she>
##$AMP= (0..31)
100 100 100 100 100 100 100 100 100 100 100 100 100 100 100 100 100 100 
100 100 100 100 100 100 100 100 100 100 100 100 100 100 
##$AQSEQ= 0
##$AQ_mod= 1
##$AUNM= <au_zg>
##$AUTOPOS= <>
##$BF1= 50.322709
##$BF2= 200.13
##$BF3= 50.322709
##$BF4= 500.13
##$BF5= 500.13
##$BF6= 500.13
##$BF7= 500.13
##$BF8= 500.13
##$BYTORDA= 1
##$CFDGTYP= 0
##$CFRGTYP= 5
##$CHEMSTR= <none>
##$CNST= (0..31)
1 1 145 1 1 1 1 1 1 1 1 1 1 1 1 1 1 1 1 1 1 1 1 1 1 1 1 1 1 1 1 1 
##$CPDPRG= <waltz16>
##$CPDPRG1= <>
##$CPDPRG2= <waltz16>
##$CPDPRG3= <>
##$CPDPRG4= <mlev>
##$CPDPRG5= <mlev>
##$CPDPRG6= <mlev>
##$CPDPRG7= <mlev>
##$CPDPRG8= <mlev>
##$CPDPRGB= <>
##$CPDPRGT= <>
##$D= (0..31)
$$ [...]
##$SUBNAM4= <"">
##$SUBNAM5= <"">
##$SUBNAM6= <"">
##$SUBNAM7= <"">
##$SUBNAM8= <"">
##$SUBNAM9= <"">
##$SW= 239.972175391363
##$SWIBOX= (0..15)
0 1 3 0 0 0 0 0 0 0 0 0 0 0 0 0 
##$SW_h= 12077.2946859903
##$TD= 32768
##$TD0= 1
##$TE= 0
##$TE2= 300
##$TE3= 300
##$TEG= 300
##$TL= (0..7)
120 120 120 120 120 120 120 120 
##$TP= (0..7)
150 150 150 150 150 150 150 150 
##$TP07= 0
##$TPNAME0= <>
##$TPNAME1= <>
##$TPNAME2= <>
##$TPNAME3= <>
##$TPNAME4= <>
##$TPNAME5= <>
##$TPNAME6= <>
##$TPNAME7= <>
##$TPOAL= (0..7)
0.5 0.5 0.5 0.5 0.5 0.5 0.5 0.5 
##$TPOFFS= (0..7)
0 0 0 0 0 0 0 0 
##$TUNHIN= 0
##$TUNHOUT= 0
##$TUNXOUT= 0
##$USERA1= <user>
##$USERA2= <user>
##$USERA3= <user>
##$USERA4= <user>
##$USERA5= <user>
##$V9= 5
##$VALIST= <valist>
##$VCLIST= <CCCCCCCCCCCCCCC>
##$VD= 0
##$VDLIST= <DDDDDDDDDDDDDDD>
##$VPLIST= <PPPPPPPPPPPPPPP>
##$VTLIST= <TTTTTTTTTTTTTTT>
##$WBST= 1024
##$WBSW= 4
##$XGAIN= (0..3)
0 0 0 0 
##$XL= 0
##$YL= 0
##$YMAX_a= 127714629
##$YMIN_a= -66457360
##$ZGOPTNS= <>
##$ZL1= 120
##$ZL2= 120
##$ZL3= 120
##$ZL4= 120
##$ABSF1= 222.6607
##$ABSF2= -17.33611
##$ABSG= 5
##$ABSL= 3
##$ALPHA= 0
##$AQORDER= 0
##$ASSFAC= 0
##$ASSFACI= 0
##$ASSFACX= 0
##$ASSWID= 0
##$AUNMP= <proc_1d>
##$AZFE= 0.1
##$AZFW= 0.5
##$BCFW= 0
##$BC_mod= 2
##$BYTORDP= 0
##$COROFFS= 0
##$CY= -3
##$DATMOD= 1
##$DC= 0
##$DFILT= <>
##$DTYPP= 0
##$F1P= 0
##$F2P= 0
##$FCOR= 0.5
##$FTSIZE= 32768
##$FT_mod= 6
##$GAMMA= 0
##$GB= 0
##$INTBC= 1
##$INTSCL= 4.134877e-10
##$ISEN= 128
##$LB= 1
##$LEV0= 0
##$LPBIN= 0
##$MAXI= 10000
##$MC2= 0
##$MEAN= 0
##$ME_mod= 0
##$MI= 0.1934396
##$NCOEF= 0
##$NC_proc= 1
##$NLEV= 6
##$NOISF1= 120.0001
##$NOISF2= 80.00006
##$NSP= 0
##$NTH_PI= 0
##$NZP= 0
##$OFFSET= 222.6607
##$PC= 1.4
##$PHC0= -273.1092
##$PHC1= 38.36242
##$PH_mod= 1
##$PKNL= yes
##$PPARMOD= 0
##$PSCAL= 0
##$PSIGN= 0
##$REVERSE= no
##$SF= 50.3227297554925
##$SI= 32768
##$SIGF1= 140
##$SIGF2= 120
##$SINO= 11.81781
##$SIOLD= 32768
##$SREGLST= <13C.CDCl3>
##$SSB= 0
##$STSI= 32768
##$STSR= 0
##$SW_p= 12077.2946859903
##$SYMM= 0
##$S_DEV= 0
##$TDeff= 32768
##$TDoff= 0
##$TI= <>
##$TILT= no
##$TM1= 0
##$TM2= 0
##$TOPLEV= 0
##$USERP1= <user>
##$USERP2= <user>
##$USERP3= <user>
##$USERP4= <user>
##$USERP5= <user>
##$WDW= 1
##$XDIM= 32768
##$YMAX_p= 372081277
##$YMIN_p= -18960575
$$ End of Bruker specific parameters
$$ ---------------------------------
##NTUPLES= NMR SPECTRUM
##VAR_NAME=  FREQUENCY,     SPECTRUM/REAL,   SPECTRUM/IMAG
##SYMBOL=    X,             R,               I
##VAR_TYPE=  INDEPENDENT,   DEPENDENT,       DEPENDENT
##VAR_FORM=  AFFN,          ASDF,            ASDF
##VAR_DIM=   32768,         32768,           32768
##UNITS=     HZ,            ARBITRARY UNITS, ARBITRARY UNITS
##FACTOR=    0.368581032318806, 1,           1
##FIRST=     11204.8945133855, 0,            0
##LAST=      -872.400172604754, 0,           0
##MIN=       -872.400172604754, -18960575,   0
##MAX=       11204.8945133855, 372081277,    0
$$ Real data points
##PAGE= N=1
##DATA TABLE= (X++(R..R)), XYDATA
$$ [...]
13466 1448990 698953 345946 697688 2151250 3236351 2597181 1401223 1369665 1489300
13457 1489300 1262268 1246177 1291393 1017138 910856 1150204 1411284 1747099 1478753 1783974
13447 1783974 2071313 1956041 2528866 3686927 4443748 4757595 3966134 2813860 2158723
13438 2158723 1597422 1521077 2513179 3552538 3256197 2601223 1741117 1942224 3052531
13429 3052531 2879592 2456296 2200966 1841491 1845525 1904284 2143718 2419053 2151432 1276333
13419 1276333 331595 39685 579819 1770349 2512881 1701975 749383 445190 1028313
13410 1028313 2063386 3014938 3295485 3311262 2894938 1841063 1609801 2406744 2877619
13401 2877619 2980218 2838577 2137474 2091512 2779792 3240868 2655511 1732293 1587313 1311312
13391 1311312 1372408 2139045 2303282 2284761 2859015 2786188 1990341 1219354 -252 -535753
13381 -535753 -82583 890882 1941764 2463067 2303789 2302590 3101080 3620596 4005857 4585265
13371 4585265 4601356 3785751 3034822 2721698 2429252 2272407 2417153 2039823 1716367 1779315
13361 1779315 2169756 1777347 2229411 3410619 4436956 4577306 4490288 4011550 3458497
13352 3458497 3510954 3768226 4408700 4650118 4872134 5290079 5109461 3742219 3056388
13343 3056388 3415318 3143858 3058925 2615526 2130325 1811355 1721096 1815718 1536530 1294588
13333 1294588 1590530 2490705 2819751 3257282 4049766 4900101 5049725 4638100 3975245
13324 3975245 2951313 2343748 1703087 547018 204286 914749 1497613 1589968 1728414
13315 1728414 1693125 1588649 1826216 2361938 2460645 2445338 3172605 4199108 4368302 4118860
13305 4118860 4364781 4462886 4359789 3573759 2635187 2488479 3043310 4128686 4673016
13296 4673016 3935034 2690349 2295773 2580233 3290749 3609194 3690341 3733615 4225229 4633632
13286 4633632 4072610 3401409 3480091 4119783 4045644 3710428 4172324 4434320 4297677 4422070
13276 4422070 4974779 5581326 4991811 4036423 3960149 4139608 3860187 3707095 3489717 3333386
13266 3333386 3568704 3895444 4131890 4259949 4776268 4909265 3573902 3056375 2516017
13257 2516017 2526667 3331897 3555033 3102312 2753618 3033283 3166854 3232391 3312679 4234029
13247 4234029 5416224 5415595 5257063 5308725 4923208 4922500 5600054 6698452 6501659 5292630
13237 5292630 4328571 3561066 3149387 3932702 4757043 5015800 4692961 4286440 3797437
13228 3797437 3515844 4508818 5232466 5117361 5088403 5561322 6164901 5662920 5818900 6133811
13218 6133811 5354518 4652269 4667757 4370965 3878056 4130825 4665863 5187475 5685677 6050064
13208 6050064 6222143 5919032 4941586 4607412 5095003 5876127 6396976 6212947 5952452
13199 5952452 5921599 5396069 4955814 5037438 5468953 6065158 6280411 6563296 7145187 7064136
13189 7064136 6435920 5128611 4715501 5352294 5526465 5768022 6340851 6937504 6477583
13180 6477583 5939535 6549906 7259002 7634950 7614584 7216318 6555153 5264326 5575041
13171 5575041 6657070 6750369 6447952 6965488 8234476 8419996 7541193 7040146 7423428
13162 7423428 7302765 7242571 7990027 8433974 8611893 8753210 8421846 7402206 6694973
13153 6694973 7089756 7444176 7671635 8397685 8449468 8940913 9537820 9524250 9210601 9189533
13143 9189533 9404410 8673022 7900904 8024348 8477558 8442725 7993210 8705635 9903536
13134 9903536 10224299 10098589 10134654 9915318 9391517 9599445 10299908 10527107 10267265 10128448
13124 10128448 10256219 10161377 9937091 9660348 9930923 10345151 10931250 11885893 12154398
13115 12154398 12230531 12916684 13321875 14069699 14140604 13020364 12239578 12323970 13084819 13799516
13105 13799516 13367684 13184819 13752616 13820845 13911763 13612373 12434669 11703824 11935158
13096 11935158 12535765 13015615 13233419 13772341 13736146 13236532 12550422 12397464 12407999 12475981
13086 12475981 13489660 14194479 14755698 15692489 16383711 16535098 16835705 16939749 17104039
13077 17104039 17225243 18277904 19288897 19912337 20723186 21038239 20912697 20620689 20397156
13068 20397156 20814613 21221664 21372722 20766416 19755125 19502567 19850583 20387944 20708902
13059 20708902 20783223 20615120 21152186 21722145 21662499 20545979 20168822 21239954 21838944
13050 21838944 22157116 22992231 24233013 24905773 24639805 24774423 25353119 26206239 27564025
13041 27564025 28576398 29219163 29262899 29395775 30556291 31453220 32283732 33238492 33778365
13032 33778365 33581815 33750848 34439562 35610152 37005498 38391563 39583578 40795870
13024 40795870 42255299 44188875 46740037 48242330 49260912 51410468 54668553 57397074
13016 57397074 59107154 61980440 66571684 71780995 76512888 82490835 89311302 96622325
13008 96622325 106131010 118633131 133070933 148748739 166706783 186935947 209061364
13001 209061364 233171090 259324076 287822421 315081350 337164219 348417135 344210717
12994 344210717 324764671 295947619 264621057 235069002 209637354 188323558 169913807
12987 169913807 154237592 140169448 126862844 115455791 106074635 97857354 90583320
12980 90583320 84713142 79574245 74546942 69710624 66212638 63931074 60692648 57634239
12972 57634239 55534689 52932908 50282819 48480699 46746582 44978679 43813904 43212369
12964 43212369 42698760 42029781 42213440 42946056 42547316 42173863 42786731 43224393 43176639
12955 43176639 42486615 41481369 40914004 41149434 41695167 42079471 42862886 44197641 44990540
12946 44990540 45352707 46912396 47899258 48065982 48767826 49509986 50647934 52891076 55282203
12937 55282203 57312605 59028426 60042416 61362430 63015404 64343123 65111500 67062135
12929 67062135 68910572 70969947 73432281 76500871 81229683 87637154 95005298 103026291
12921 103026291 112531029 123359652 136811138 152981012 171170388 191245518 213349622
12914 213349622 237334446 262825942 290364506 318584985 342890214 355015184 349993387
12907 349993387 329180115 298222304 265040614 235004388 208656347 186042943 167832441
12900 167832441 152449223 138107806 125212693 114041427 104740311 96816073 89066285
12893 89066285 82303629 76779604 72077717 68425463 64876741 61169608 57800820 54956031
12885 54956031 52063095 49726727 47828364 46336223 45373780 43358886 42024965 41637090
12877 41637090 40246071 38428403 37419192 36804162 36232483 35256609 34038208 33890075 34604849
12868 34604849 35948005 36140539 35236815 34734414 34170872 33530436 33115165 33265791 33909032
12859 33909032 34900586 35262250 34688523 34550378 35365701 37336317 38963332 40627218 42057267
12850 42057267 42584918 43564327 44526270 45734751 47296000 49185397 51594685 54922983
12842 54922983 57916021 60296092 63819207 67798695 71790917 77425000 84462330 92450568
12834 92450568 102037134 113729059 128489079 145672855 164573392 185211609 207927836
12827 207927836 231881179 256850458 283609379 309539454 330577574 341536164 336458405
12820 336458405 316118744 286449107 254340202 224606648 198550435 176656141 158330967
12813 158330967 142592438 128575941 115797640 104430910 94923888 85869766 77822579
12806 77822579 71319165 66120906 60530006 55094242 51182794 47860295 44370333 40684526
12798 40684526 37182894 34398416 31838617 29637238 29237857 28996412 27030387 25128574
12790 25128574 24911542 24886626 23724236 22035016 20981914 20270087 19345575 18841177 18024491
12781 18024491 17232167 17091771 16987518 16783191 15757346 14044510 12457238 11987732 11565811
12772 11565811 10439718 9736177 10257042 10482348 10601749 10749750 11144839 11902766 12417366
12763 12417366 12281056 11767930 11228730 11023727 10591388 10091258 9643457 7941235 6719406
12754 6719406 6702863 7085839 7323721 7768855 7817382 7357778 7164841 7057494 6842940 7001804
12744 7001804 7506964 7084424 6147081 6448107 6921125 6590970 6321959 6764327 7200420
12735 7200420 6552953 5652559 5507915 5539133 5344989 5642911 5290002 4407359 4017135 4515319
12725 4515319 5172294 5155309 5398292 5397991 5465227 5366819 4207871 3627397 4517399 4817498
12715 4817498 4057589 3129729 2902391 3082488 4138223 5040168 4426826 3562507 4099507
12706 4099507 4584378 4443095 4211909 3606137 2973703 2174893 1304379 1135459 2023060
12697 2023060 3259366 3706934 4174723 4194066 3607034 3509311 4040637 4283880 2892327
12688 2892327 1710392 2017225 3006753 2512352 2065828 2041889 2292892 2993221 2100087
12679 2100087 898961 576863 -141773 -925904 -704572 -322566 83732 226514 1291101
12670 1291101 1751760 1331372 380663 41862 -62080 -137421 287543 906497 1098850 532226
12660 532226 274517 1077713 2610323 3252963 2744617 2461877 2764593 3045992 2774571
12651 2774571 1873263 1950146 2199408 1741611 943032 521353 923141 1571168 1987641 1774572
12641 1774572 1584584 1285792 782239 707559 791119 1454930 1719212 1926394 1913609 1268031
12631 1268031 1069568 1570777 2112226 2662128 2694867 1895560 1548822 1768793 2132512 2356863
12621 2356863 2635991 3171967 3259647 2536365 1468255 698334 1161064 2623566 2705503
12612 2705503 2287422 2079929 1602468 1206423 1262957 176967 -119900 -154234 -242926 77162
12602 77162 189902 -324163 -976117 -70315 988573 1288921 1886746 2467096 1797067 1023828
12592 1023828 179263 -636378 -786520 -709921 -141641 859548 1753015 1115000 119913
12583 119913 -521914 -729315 -290759 211597 237621 462622 381190 237476 932450 1683768
12573 1683768 2221797 2852417 3056782 3354014 3000024 2119204 1735753 1870504 1773607 1256696
12563 1256696 1292172 1786731 2003247 1387925 605016 595999 588402 1355003 2570008 2912226
12553 2912226 2519337 2401184 2001452 1213098 910947 885433 975118 788683 757844 545733
12543 545733 422576 354270 141203 -550231 -986445 -1272461 -1906244 -2582043 -2525887 -1867612
12533 -1867612 -810307 200671 1143158 2014913 1962064 1583173 998869 277985 231684
12524 231684 224583 83232 13825 51134 516817 563432 186724 -237947 -266641 -296462 -880018
12513 -880018 -992910 -1159608 -1078513 -783515 -1655402 -2478099 -2467312 -1647337 -113982 763477
12503 763477 796991 646540 1315627 2562485 2721734 2089667 1545270 1230433 2104373 2365430
12493 2365430 2219882 1759138 352737 -667775 -36749 583788 686873 883613 731887
12484 731887 1112814 1270537 2031941 2063778 1312977 1058779 1225262 1000583 638811 1739542
12474 1739542 3226904 4017228 3573638 3422815 3764583 4420656 4963166 4821179 4577575
12465 4577575 4106999 3355599 2928771 2798754 2854981 3491057 3599683 2835435 928976
12456 928976 -563396 -238506 596415 169354 -1038342 -1904357 -1621129 -1307169 -1244187
12447 -1244187 -927566 -538706 66342 1072647 1390383 854273 866451 1148860 709505
12438 709505 491447 191045 -788478 -1625597 -2154135 -1154377 19059 710045 1561993
12429 1561993 1231128 16721 285612 543419 518982 674974 596633 339930 16850 -657254
12419 -657254 -1327985 -2194047 -2146580 -1014564 -300367 -664246 -1425910 -1453991 -1430920 -1356010
12409 -1356010 -769975 -477364 -174105 -54118 -60635 673618 1504147 1038400 65903 -63727
12399 -63727 -701809 -1175587 -731341 -614002 -616281 -411710 -649798 -2061861 -3075851 -2886077
12389 -2886077 -2856289 -1995303 -851921 325960 1067268 833316 1275761 1352155 1221003
12380 1221003 1494971 2201616 2622348 2145187 1236425 919598 1574865 2500666 2123007
12371 2123007 1389029 59462 -755215 -1132765 -1310245 -923092 -1145195 -1314150 -1197515
12362 -1197515 -1065925 3105 530105 848999 1178813 896827 908122 1157744 1391597
12353 1391597 2069836 2726673 2785956 2158746 1467584 1453304 1759254 1709554 1454590 1158444
12343 1158444 724331 755149 923074 1018341 1553390 2116724 1944620 1252676 467905 372696
12333 372696 -105119 -1355982 -2164880 -1886868 -1292965 -1422296 -1367421 -1425499 -2039745 -2001473
12323 -2001473 -1542541 -836354 -290416 -380101 -670505 -322093 -428647 -650302 -233857 290057
12313 290057 -447454 -613978 -545679 -144906 178683 313864 551755 582111 1103256 1396604
12303 1396604 628140 -823860 -1473331 -663334 179157 -609498 -1882156 -2377699 -1727756
12294 -1727756 -1231278 -797928 24461 1016538 1959648 1926701 1068739 568892 1125418 1438145
12284 1438145 543312 -344654 -462529 -440100 -478135 -246900 371876 967954 904712 -71980
12274 -71980 -121522 949448 1274809 427531 136955 37087 674397 1134137 818137 1090416
12264 1090416 1041002 1058120 911783 320505 -398361 -778539 -661540 -729843 -677343 -663766
12254 -663766 -423906 -312876 -148515 -481196 -879012 -1456192 -2063262 -1807596 -820578 -29597
12244 -29597 723894 968585 600869 559388 306195 -45323 -516924 -1239959 -1830089 -1587298
12234 -1587298 -1315351 -652974 250970 532657 -331410 -1615670 -1162329 -514037 -788430
12225 -788430 -923804 -947133 -1182039 -1454822 -1037611 -1053168 -1455603 -1475331 -952503 -586090
12215 -586090 -527591 -611528 -969331 -1280752 -1038752 -1038917 -958875 -681251 -960305 -1338754 -993775
12204 -993775 -773983 -876954 -1404466 -1414996 -597327 -99960 21516 535202 775308 348722
12194 348722 -146055 -71855 -263648 -500129 -842545 -855194 -857814 -497179 480489 834389
12184 834389 818891 563911 74731 -229419 -334443 -267244 -152232 -49057 -283348 -378048
12174 -378048 -204756 -322472 -107126 461590 739606 230450 -321404 -417056 -805756 -1416055
12164 -1416055 -1437067 -831542 206335 10856 -577577 -1253393 -2610658 -3361617 -3197765
12155 -3197765 -2307852 -1685414 -900549 379343 301335 327466 845854 879705 277055 -16625
12145 -16625 463356 716913 -192848 -1155071 -1445392 -1338419 -1209324 -1023802 -172593 859932
12135 859932 859903 342799 -35837 79921 501888 401661 646303 1212193 1382552 709697
12125 709697 -521355 -721619 -448204 -1112577 -1990242 -2702743 -2796832 -1599528 -665969
12116 -665969 -751474 -1178580 -1165127 -543599 -371902 -160672 506791 784113 240753 -1069361
12106 -1069361 -1861876 -1425417 -1001579 -1673664 -2323350 -2242770 -2439259 -2363159 -2093845 -1959719
12096 -1959719 -1607893 -1267708 -398625 316465 360646 385393 523765 -129275 -952475 -1093107
12086 -1093107 -547420 -246353 -341617 427802 1579700 2194430 2113123 1868744 1567446 1782942
12076 1782942 1975543 1546451 1383249 759679 363614 719358 1164086 1241354 1131499 792576
12066 792576 484846 295291 571701 614931 -24881 -284993 -178447 -436267 -351831 -216479
12056 -216479 -101318 -159476 -462170 -718143 -791946 -644985 -283846 274854 867883 1698798
12046 1698798 1567249 1038700 420180 -433128 -974447 -1013106 -1291453 -913758 -60050 340902
12036 340902 79805 -403877 -683144 -1003259 -2176462 -2683887 -2359579 -2325302 -1724665 -957347
12026 -957347 -452507 -341925 -177420 -316433 -629589 -549272 85886 580257 -106932 -1042021
12016 -1042021 -1966637 -2049042 -1657047 -1006380 -853930 -1688393 -2328772 -3060863 -3305813 -3236451
12006 -3236451 -3370679 -3004008 -2179472 -2305476 -2025877 -1033947 -191418 30219 -154651
11997 -154651 -798038 -1598926 -2168707 -1698638 -1487105 -1582274 -1706927 -1680499 -1391669 -1142202
11987 -1142202 -454050 310342 68681 -282475 -612161 -963700 -1437410 -1637231 -1240137
11978 -1240137 -933186 -336590 273417 463158 470374 398798 248098 172488 -168127 -352845
11968 -352845 -245063 398359 575451 288046 -58106 -511415 -476355 -419810 -542023 -171405
11958 -171405 59295 -634659 -1421745 -513121 -159098 -724393 -792944 -595865 -783455 -1106659
11948 -1106659 -971156 -1075052 -1348615 -1000783 -994293 -729809 -734591 -377299 -670797 -1883865
11938 -1883865 -1761479 -1736945 -2308011 -2504280 -1918199 -796044 -555677 -454582 -650046
11929 -650046 -978972 -864442 -288137 -40515 -202555 -26169 586097 1463240 1853894 1309041
11919 1309041 197078 -1145325 -1915312 -2052966 -1946779 -1914272 -2173325 -1884172 -1342131
11910 -1342131 -1207954 -1754770 -2103683 -1581159 -840513 -174579 -200523 -268148 -572714 -1364213
11900 -1364213 -1554725 -1232055 -986988 -698709 -487380 -359038 -688973 -850710 -994680
11891 -994680 -1748513 -1586179 -1688153 -1945745 -1132244 -320469 -410980 -339916 142981 279189
11881 279189 584800 831274 676166 -465115 -1105934 -920074 -1046512 -1181333 54048
11872 54048 1683755 1909822 1415749 860583 252249 -650780 -1048649 -794514 -321308 269140
11862 269140 1013733 1184875 967439 616090 -572296 -713725 -38357 303445 735845
11853 735845 1191644 1444275 1261270 1174126 678434 -284259 -853235 -1198941 -1447371 -1056592
11843 -1056592 -1106258 -1577632 -1577739 -882558 -522283 -157834 -215389 -133253 36332 20991 232956
11832 232956 284596 484467 507008 375041 405452 414119 544472 828008 1550141 1995194
11822 1995194 1730943 451431 -544256 260288 505640 81969 -155597 47741 142302
11813 142302 21644 -108579 -359097 -704742 -1408733 -1321769 -559422 -422394 -380611 -343115
11803 -343115 -634632 -1031912 -1712522 -2546257 -2627430 -1352545 -10565 125117 -1021640
11794 -1021640 -1928065 -1936284 -1512327 -943996 -604529 -393227 -536288 -811643 -839720 -295532
11784 -295532 1012551 1495755 868368 344965 -134815 -408850 -112126 -692504 -1016783
11775 -1016783 -570493 258278 398026 -145341 -108621 1201874 1645963 822207 306827
11766 306827 -382461 -887010 -554995 -170187 309560 1081733 972526 498076 210136 24594
11756 24594 -390769 -1148886 -997058 -265503 -93559 -101896 673001 1543916 1581538 1346486
11746 1346486 1062577 -256084 -1462661 -1615451 -1226400 -1131365 -1405646 -1563362 -921668
11737 -921668 -610115 -357779 -224789 -983146 -1861934 -1305958 -61554 -754505 -414400
11728 -414400 869397 1805485 1582461 850975 1187782 1247914 1001997 1176528 1027138 555810
11718 555810 755538 1560877 1665221 1469181 1557055 1190605 280101 -894059 -1993245
11709 -1993245 -2312424 -2361136 -2153053 -1962043 -994287 -248834 20146 -612599 -1459131 -1400008
11699 -1400008 -1217772 -1226654 -961861 -155092 816957 1101564 626080 208757 21842 -449866
11689 -449866 -1408978 -1997194 -2303969 -2014574 -1563713 -1317670 -1019349 -168314 1644104
11680 1644104 2098773 1306181 653318 -24491 -1028343 -1674162 -1553102 -1333751 -1235812
11671 -1235812 -209177 -86322 -297472 -214915 -408974 -167368 292512 972396 1007583 461527
11661 461527 -74189 82889 326941 696637 1024021 1063369 227911 -216570 -463221 -459567
11651 -459567 -237400 -924018 -1276785 -1592395 -2431952 -2235111 -1568335 -798234 86063 45723
11641 45723 476997 716621 795357 680582 859245 934318 487770 209281 343490 568584
11631 568584 509242 878914 1493814 1451567 536769 -105192 -410464 -1045851 -1262345 -1461904
11621 -1461904 -2409306 -2623855 -1941153 -579138 388334 635504 1113213 2062840 1938857
11612 1938857 836170 165646 -359435 -322125 153462 47366 104147 102657 -386380 -226520
11602 -226520 -557238 -1174092 -1239613 -1321069 -1223557 -1190812 -1079127 -1416848 -1505449 -1608748
11592 -1608748 -1801755 -1328809 -197960 938428 1813050 1925141 1422751 830262 196949
11583 196949 -48244 65939 53367 88140 199518 -461353 -1062083 -1182429 -1258081 -1642973
11573 -1642973 -1884384 -1398739 -393500 301915 316366 507895 459105 -175896 -920612 -924852
11563 -924852 -731866 -986085 -1421416 -2215005 -2653814 -2576117 -1889757 -1176734 -1743290 -2965461
11553 -2965461 -3585844 -3012512 -2158513 -1691585 -1010605 -493115 -754478 -1810763 -2742613
11544 -2742613 -2871286 -2558790 -2039760 -1786248 -1626700 -1716100 -2305004 -2310884 -1858939 -1212514
11534 -1212514 -1115880 -1534839 -2199947 -2539126 -2413334 -2585822 -2378870 -1573825 -372936
11525 -372936 983669 968432 742610 799745 1019028 1042338 -14814 -367040 44479 760032
11515 760032 801718 -293080 -1132986 -1862646 -1611903 -1474956 -1732252 -2059896 -2594594 -1891049
11505 -1891049 -1148187 -284545 757373 1988646 2438880 1344832 585221 1175508 1625925
11496 1625925 1128293 271406 -818691 -1730145 -2284451 -2020684 -1751878 -2221152 -2453264
11487 -2453264 -2539229 -2343296 -2628439 -2947245 -2717904 -2289374 -2047696 -1525031 -1164006 -1004667
11477 -1004667 -1174509 -1509538 -631202 130147 152165 -53140 124505 419124 361834 63031
11467 63031 -251956 -500846 -894234 -1818399 -2888127 -2593746 -1450098 -556150 -226509
11458 -226509 -323887 -521026 -766148 -652448 -64580 300660 207530 -304847 -530874 -736525
11448 -736525 -791852 -443584 -146661 -67237 -487325 -1193782 -1912096 -2496269 -2419011 -2026778
11438 -2026778 -2390799 -2989099 -3465707 -3212292 -1879518 224605 3817710 4821255 2997673
11429 2997673 2772794 2869909 2970855 3009120 1758204 532436 -323015 -476088 -584317
11420 -584317 -232323 557430 854059 514123 149684 -759803 -2133053 -2507834 -2545018 -1874383
11410 -1874383 -1175031 -614539 -228734 406702 834582 708473 -276712 -1065188 -1403575
11401 -1403575 -1337387 -840465 -1078979 -2094153 -2577704 -2994271 -2785644 -2782091 -3255426 -3929504
11391 -3929504 -3961530 -2924527 -1849324 -1940102 -2579729 -2386319 -1761053 -1023855 -955625 -1076938
11381 -1076938 -1406804 -807264 190071 -39178 -161022 -92004 -14095 -406214 -580664 -545031
11371 -545031 -473970 127907 1246141 1786180 2068204 2170284 1236603 1026905 1243309 571230
11361 571230 -359678 -1000734 -2236126 -2615056 -2163557 -1952554 -2428685 -2492917 -2536639 -3120281
11351 -3120281 -3801389 -4154862 -4505672 -3748950 -2350076 -1375986 -1221763 -820964 -609869
11342 -609869 -1276772 -1367918 -587758 226815 466619 72301 -552717 -968118 -659020 -1099184
11332 -1099184 -1384531 -435332 127143 -470597 -937672 -810956 -931446 -495686 -484522 -812938
11322 -812938 -450634 -202910 -380043 -169266 -117589 142470 -16204 431912 358091 107493
11312 107493 -76122 -933830 -1104212 -833261 -658825 -341163 -449351 -303324 -390884 -932830
11302 -932830 -174081 31248 -326169 -212242 -37085 -125249 -431793 -409625 550401 314902
11292 314902 319398 668271 282722 587667 315290 -182324 204206 331728 349717 354978
11282 354978 -167303 -1101592 -1517502 -732437 787408 1054515 -2800 -1086647 -1561857
11273 -1561857 -1475106 -1607359 -1541668 -1486318 -1730912 -1789335 -1409029 -964760 -990354 -1166396
11263 -1166396 -955984 -272767 -120509 -907278 -1544053 -1247937 -505219 -371495 -369718 -314910
11253 -314910 66233 129765 -694096 -1021441 -984834 -970158 -749221 -980969 -736064 -700544
11243 -700544 -472936 -395124 -866826 -986776 -683882 257494 851476 639948 339886 -686226
11233 -686226 -1187769 -1175827 -989092 -478611 320909 617291 750789 842703 343985 17896
11223 17896 -451692 -914894 -674937 -652518 -1090683 -1130859 -219657 611629 409315 57284
11213 57284 269772 841826 1338652 778518 -457963 -1067718 -686259 -22573 248876 -87600
11203 -87600 -190616 135882 121953 -322951 -573966 -282470 -121921 370353 1135892 1072070
11193 1072070 430839 316875 -154692 -539875 -95224 -18279 -255301 -701980 -1389182 -1821454
11183 -1821454 -1252422 -1176698 -2027304 -2486548 -2352739 -1843875 -753203 238686 678587
11174 678587 692365 -59838 -326480 -365283 -772619 -1169448 -816526 -782253 -940906 -550253
11164 -550253 -368395 309797 1263635 1644197 1606607 1190371 1010640 825020 416366 -464178
11154 -464178 -810989 -481440 -342072 -358470 -1032768 -2060957 -2574657 -1897497 -95012
11145 -95012 821665 151676 -292817 -795892 -1060611 -561997 -191162 257016 498721 760776
11135 760776 720349 570242 556411 425166 285939 -200403 -272372 143290 348084 853974
11125 853974 1466030 1064534 702909 585439 512142 320834 -284818 -896589 -1237088 -974136
11115 -974136 -1127928 -1591120 -1522706 -765071 -354174 -532673 -1157407 -1555738 -1061016 171172
11105 171172 1629411 2350739 2035518 1645806 1304496 1232615 1316149 1065642 829537 674429
11095 674429 852211 1022448 1594800 1563786 1047661 393992 -541745 -1296783 -1702558 -1580087
11085 -1580087 -1229605 -1169084 -861193 -422100 -837726 -1411174 -2008493 -1665089 -1362768 -1401447
11075 -1401447 -918010 -42425 729846 1481202 2222624 2186353 1278212 311443 -194560 -412599
11065 -412599 -918439 -1033462 -1187810 -1920059 -2532004 -3088370 -3148795 -2898870 -2753265 -2112199
11055 -2112199 -884215 -818128 -857122 -634427 -1067348 -1173120 -1185069 -895965 -1344575 -1576232
11045 -1576232 -1159314 -819167 -425966 -596115 -1039789 -1098502 -963151 -113086 685972 910058
11035 910058 1113574 851758 375857 293387 611949 682360 217493 -409788 -566424 -645798
11025 -645798 -1012449 -1273468 -401615 467679 166795 249199 714993 114469 -627645 -1516072
11015 -1516072 -2346840 -2125924 -1096751 -951343 -1057367 -896135 -474998 50922 699006
11006 699006 746200 475352 201790 -168154 489471 1373508 1192463 465293 545600 957698
10996 957698 1125600 1488058 1561877 1276824 1192970 1202671 1273499 1729203 1719324 1310656 890767
10985 890767 667250 531307 535602 756964 454777 710608 827753 1168718 1107666 34469
10975 34469 -615655 -849589 -579002 23668 489915 132843 -163879 361809 1130354 1433682
10965 1433682 1680874 1254384 632350 690152 777796 480131 735357 1667662 2467290 2750591
10955 2750591 2537398 2523999 2234100 1324009 274412 -797532 -1592450 -1096600 437690
10946 437690 1337717 2130596 2486300 1851050 1325156 1359858 1112777 544085 988398 1867563
10936 1867563 2223118 1588047 708137 476723 1129558 1341609 1478051 1578402 1197369
10927 1197369 684150 1253136 2139285 2138634 839859 -277125 -402668 -224431 306568 309581
10917 309581 361357 889420 1541396 2175100 2369989 2906127 3302279 2953814 2513206 2594385
10907 2594385 2403836 2018747 2119397 2704743 3207066 2451032 1738452 1696552 2511372 2969899
10897 2969899 2679459 2339553 1967449 2282508 2978171 3447992 3132181 2925839 3197726
10888 3197726 3804156 4339057 4321110 4103033 4454044 5836615 7219410 7947904 8668963
10879 8668963 9127770 9067332 8070588 7188451 6189700 5374013 4605404 3923133 3661094 4063176
10869 4063176 4848485 5309950 5496160 5444073 5872856 6895166 7021068 6678434 6058896
10860 6058896 5514588 5582101 6509650 6843653 6885338 7959028 9086615 9536338 9726446
10851 9726446 9895081 10040068 10650863 11142564 11515272 11833325 12674085 14133191 15872799
10842 15872799 16703762 16744357 17151600 18281159 19887189 20925845 21747795 22972685 25075199
10833 25075199 27704916 29624227 31499598 33812291 36534935 40762787 45502494 51996110
10825 51996110 60668851 70044426 80639003 92758342 106457926 122061266 138580018
10818 138580018 155005224 170774968 182255819 185250524 177588276 162212834 144313122
10811 144313122 127327624 111935255 98424117 86245035 75882897 67797281 60250158
10804 60250158 53930105 48527600 42912406 38345445 34770530 31545719 29139137 27669336
10796 27669336 25713423 23123609 21243603 20362780 19227347 17490869 15985977 14303723
10788 14303723 12548973 11955913 11899252 11753641 11323254 10827453 10424254 9386206 7715555
10779 7715555 6356633 5951648 6004794 6232283 6194086 5616095 5402431 5576138 5585308 5145367
10769 5145367 5365542 6041374 5998303 5163029 4248809 4070840 4050428 4570321 5491266 5608773
10759 5608773 5591651 5674555 4823300 3140932 2127056 1841831 2062065 1861808 2079497
10750 2079497 2530642 3009101 2826347 2627459 3529634 4100004 3724423 3459829 3026931
10741 3026931 2799995 2601959 2430783 2547998 2886628 3205200 3647624 3796577 4090440
10732 4090440 4028985 3168509 2660062 2495182 1829742 1737181 1844747 2191256 2503463 2111857
10722 2111857 1396320 299257 -556851 -874177 -562662 -305880 156639 1149167 513271
10713 513271 -189814 -248452 -222671 -351228 -281759 -115153 -720348 -1289939 -608944 644278
10703 644278 1200817 958207 -49583 -502301 -230175 173454 158898 -218340 -72692 -313020
10693 -313020 -1199802 -1488223 -999539 -405314 -113346 -48683 140449 8832 -305274 -819126
10683 -819126 -1420481 -1791989 -1597109 -1674790 -1568870 -1268128 -1252002 -1055550 -945976 -798857
10673 -798857 -743939 -698974 -920209 -1448370 -1625100 -1185417 -1322867 -410183 911401 1480796
10663 1480796 1260630 736891 706707 131439 -444982 -1050806 -992607 -864089 -288376 386798
10653 386798 -343082 -986785 -582616 90232 840493 980937 -13055 -360244 -289959 -495610
10643 -495610 -376923 -164900 -726287 -1232040 -1001162 -942599 -898518 -913317 -1186465 -979797
10633 -979797 -666641 318271 360640 -705385 -1583265 -1478601 -1381218 -1776102 -2386952 -2729612
10623 -2729612 -2228382 -1682513 -747313 -177358 -95276 -311963 -701998 -851379 -1051320 -155623
10613 -155623 622489 639689 840093 1439138 1664142 1594363 1249237 835986 115525 -1044627
10603 -1044627 -978229 -954425 -1453164 -1069143 -236655 -532726 -1329058 -1622033 -1032345 111641
10593 111641 -129830 -200139 64658 297964 432101 443128 -52179 -322112 -603461 -896805
10583 -896805 -928212 -719678 -111261 246099 514452 -148567 -1068780 -830654 -331802 -214880
10573 -214880 -833409 -649095 99775 25629 44907 413377 -170582 -930764 -1655356 -1492513
10563 -1492513 -1157640 -855898 -550856 -360878 -78383 -126688 -67999 -200596 -976013 -1709028
10553 -1709028 -2071733 -1445391 -962833 -819551 -407086 -453968 -354575 -177088 -640679 -1280199
10543 -1280199 -1980888 -2327954 -2066606 -2357060 -2715590 -2391865 -2562971 -2009512 -1034545
10534 -1034545 -160856 397511 326541 -100573 -100939 352460 256411 -296437 -872073 -1420726
10524 -1420726 -1306479 -371072 173096 131190 -156568 -322010 -447609 -837080 -1699443 -2442350
10514 -2442350 -2436882 -1885299 -1445877 -1338583 -1246519 -956625 -1103026 -239219 608557 329160
10504 329160 -494565 -1023494 -979469 -544973 232684 849613 843430 247569 378719 1161760
10494 1161760 1179000 395654 -138112 -202034 -268112 -212942 100046 465136 1221835 1876441
10484 1876441 1589140 1374269 930143 590506 651259 844184 692728 668429 565059 1217560
10474 1217560 1703438 1077332 1534132 1704737 1382854 1528662 1435934 1423046 2013120 1422491
10464 1422491 507362 237930 195668 354721 787934 862345 625371 518044 -526555 -1246915
10454 -1246915 -959742 4975 693408 886854 153072 -85917 -147791 316169 1288577 1564296
10444 1564296 1682595 1451832 499038 -294270 -734930 -701037 171829 660451 333954 122894
10434 122894 416971 512802 305745 -101092 -882923 -1835902 -2090811 -1122782 -5238 -436762
10424 -436762 -1121486 -1202888 -371950 149135 -291378 105749 601977 552319 609866 -130580
10414 -130580 -618780 -326845 10958 404654 62376 -217430 -963995 -1648202 -1097214 -491561
10404 -491561 -220168 471296 672216 212507 234155 334568 541974 178571 -550056 -1320092
10394 -1320092 -1909253 -1870025 -1678348 -1957798 -1335072 -973200 -1588030 -2511241 -2379056 -2107411
10384 -2107411 -1784039 -1472282 -1142204 -481906 -287486 -210991 -392365 -471720 -254353 -308225
10374 -308225 -1152522 -1681191 -1570320 -1406000 -1087797 -1269620 -2200388 -1990774 -1029493 -296898
10364 -296898 -522055 -827180 -1462444 -1365327 -973646 234293 1654446 2456110 2382858 1131594
10354 1131594 -110201 -506580 -1135170 -1130148 -1016859 -101326 1664905 2232980 3054283
10345 3054283 2962963 2024507 682164 -567717 -1411605 -1252203 -491954 658552 1248819
10336 1248819 1115913 1233893 1268238 941858 308445 -143946 -731121 -2042952 -2345464
10327 -2345464 -1189828 58059 1220965 2052775 1961745 1380864 875875 386751 -45674
10318 -45674 -340219 -1008119 -1576623 -1684609 -1453947 -1040948 -1938565 -2699605 -1898522 -1261138
10308 -1261138 -1442371 -834152 -421675 -304243 45164 484243 750487 1362199 1260314
10299 1260314 401013 -555078 -1078925 -762652 -382534 -291087 -803571 -2225346 -2561931
10290 -2561931 -1737445 -759234 -417614 -395926 -992706 -1194944 -812361 -1302003 -1617725 -1086499
10280 -1086499 -516708 388743 1103808 1563408 921504 -219777 -988660 -1423103 -686414
10271 -686414 -658899 -1763661 -2850312 -3465248 -2881659 -1609172 -1182502 -1700347 -2052071
10262 -2052071 -2141767 -2103826 -1575718 -1536338 -1251045 -1006752 -131099 894135 565669 -370239
10252 -370239 -951951 -848454 -178563 -315486 23522 760356 870355 486853 -112008 -770305
10242 -770305 -981344 -382985 -660474 -871615 -706668 -937278 -896309 -999881 -771642 -532390
10232 -532390 -408374 -572033 -1599806 -2600133 -2447616 -2315362 -2424703 -1929318 -1363592
10223 -1363592 -1344332 -1146964 -999830 -1538570 -1954402 -2368661 -2756302 -2941253 -2902068 -2485394
10213 -2485394 -1658028 -1664397 -2656918 -3111161 -2647394 -1775405 -1711520 -2158598 -2237748 -2043878
10203 -2043878 -1318372 -570556 -609147 -1168493 -1532070 -1281142 -1083914 -1281359 -1448538 -1993310
10193 -1993310 -2212167 -2302962 -2685758 -2207785 -1134524 -754716 -1177621 -1700617 -2082899
10184 -2082899 -2061548 -648915 1330502 1396799 917056 634887 129834 -377098 -1216188
10175 -1216188 -1795398 -1810947 -1144858 -266588 141947 -84276 332290 1295480 1148564 -38578
10165 -38578 -210183 498126 386427 -84503 -320324 -326161 -149724 -468860 -830260 -707228
10155 -707228 -751993 -1926022 -3552232 -3577494 -2845720 -2839425 -2181368 -793942 -250690 -169440
10145 -169440 -566171 -659902 -962045 -2433769 -2411992 -702908 145261 -217712 -675037 -550640
10135 -550640 -71905 -706550 -1407624 -1791268 -2337761 -2538079 -1856947 -845875 190294
10126 190294 600807 -47840 -535770 -76836 341458 -150801 158721 1200271 1561862
10117 1561862 1314188 702150 206956 537448 591707 549321 630021 676047 272633 84206
10107 84206 587256 1291967 1248425 1220976 1291248 172175 -996711 -830482 -33626 157695
10097 157695 -208256 -354290 28353 796195 931487 380361 88815 -261296 -648947 -884531
10087 -884531 -815733 -390076 53031 86577 -113395 287848 518292 495973 311230 59808
10077 59808 393513 327327 -156944 -352377 -503798 -586229 -588324 -306615 -682237 -762745 -489103
10066 -489103 -614399 -1164281 -1780295 -2587073 -3627567 -3234592 -2064860 -1304523 98976
10057 98976 541256 -813347 -1632752 -1633227 -1082474 -129352 505242 1187180 1607657 1523937
10047 1523937 1291087 927520 494544 -307304 -1326990 -1283027 -610457 -126630 -249605
10038 -249605 -251116 -583373 -947734 180948 1496240 1477362 933544 1077351 824525 742112
10028 742112 962997 723875 1074438 1611346 1067085 -27399 -1070323 -2084777 -2789284
10019 -2789284 -2639431 -1620180 -741973 -795509 -1625426 -1315448 -174723 379540 -476942
10010 -476942 -1431852 -1239589 -964983 -1672555 -2084612 -1686894 -1589900 -994556 -979538 -1775841
10000 -1775841 -1510810 -856890 -593798 46047 480241 733553 823489 638228 626149 964014
9990 964014 1139745 916718 675657 700275 280923 -339611 -917200 -465757 200063 484446
9980 484446 546491 -255480 -943938 -1180249 -1504430 -1721523 -1027806 -148051 -184896 -1154138
9970 -1154138 -1221073 -198382 135603 335581 1022334 724382 -492730 -525101 572324
9961 572324 584317 -141007 -1043545 -1586539 -2222245 -2044527 -611137 153178 206777 -47567
9951 -47567 -152933 -451143 -800271 -764337 -190944 -397203 -1044545 -1661267 -1712204 -1142797
9941 -1142797 -322481 630064 1412172 1960738 2675198 2666779 2186636 2198382 2857456 2767328
9931 2767328 1824806 1091714 395027 59041 593855 749994 1004219 1818991 1507876 884680
9921 884680 1108632 1658767 1555910 536696 -643220 -697055 -574124 -640491 184318 1114707
9911 1114707 1797903 2716415 2599248 1615002 650744 664510 1145431 1358397 1868913 1187264
9901 1187264 -326720 -628211 226275 791383 566582 -222854 -348238 159003 616351
9892 616351 767527 644670 272572 -236144 47171 613699 151134 -195330 -53385 68804
9882 68804 176624 93702 -184280 -22933 269911 42536 -271857 91850 806855 928395
9872 928395 94241 -313051 160522 359975 840519 1477124 1693489 1799824 2059735 2198023
9862 2198023 1997666 2119225 2410150 2396084 1911095 957740 529696 1208588 1855118 2010354
9852 2010354 2183157 2275335 2933951 3002382 2295831 1733288 1570383 1377097 538185 739506
9842 739506 1503553 1425166 1045788 1524777 2054425 1987275 1755678 979663 500369 1283830
9832 1283830 1829857 1311097 1537798 1585879 1238168 1598887 1427507 840477 1182038 1541026
9822 1541026 1119038 389624 -234446 -79905 312705 670714 683065 532308 1088918 2176911
9812 2176911 2208489 1939057 1517511 1423967 1782918 1550114 993974 1050814 2116327 3087609
9802 3087609 3349814 3326883 3008428 2731935 2654004 2572182 2431042 2136866 1985678 1643673
9792 1643673 1932307 2423474 2383397 2321188 2586550 2388758 1407320 1038460 1835214 2315174
9782 2315174 2483186 2730400 2466720 2149359 2444994 3003997 3651417 4465119 4536340 4611224
9772 4611224 4284378 3579784 3058887 2604927 2256795 1520194 1170341 1537184 2400012 3684250
9762 3684250 4697111 5641942 5887497 4962766 4260843 4748396 5571863 5542741 5392271 5824204
9752 5824204 6070143 6424600 7622927 8267996 7869300 6891030 6466918 6598855 7033079
9743 7033079 7381294 7400765 7821468 8378030 8463226 8441476 8606048 9275890 9544452 9539041
9733 9539041 10093579 10197421 10495208 11855394 13498522 14480147 15162483 15849243 15988773
9724 15988773 15552834 15760553 16931261 16482050 15577228 14944221 14910056 14686834 14687437 14923081
9714 14923081 15013087 15173376 15154451 15029285 15316094 15983488 16869755 18264178 19090226 19033988
9704 19033988 18485676 18880567 19712644 19761968 20362343 21372945 22347860 22949007 25105844
9695 25105844 27130790 28785619 31682912 34205410 36487162 39450662 42085082 44642531
9687 44642531 46995867 50561656 55480314 61584079 68162429 75381971 84030463 94665061
9679 94665061 107663050 123057736 142035368 163678316 187543403 215537161 246757074
9672 246757074 279205418 313068976 344915976 367521199 372081277 355362876 323973017
9665 323973017 287375797 252302266 220994108 193888933 170583913 150453376 133988639
9658 133988639 120046158 108381102 98424600 89422592 80949266 73591794 66766352 61388084
9650 61388084 57545666 54306052 50246806 45715878 41946080 38981627 36143956 33551365
9642 33551365 30672872 28188703 26480041 25676809 25047490 24106245 23280295 22033958 19977979
9633 19977979 17779324 15992302 15039890 15087079 15275960 14832531 13950130 12875922 12056954
9624 12056954 11817841 11963880 11733823 11904538 11624790 10795932 10901575 10772670 10250703
9615 10250703 10248178 10813165 10767492 10941318 11759825 11169065 10187566 9174389 7894791 6931150
9605 6931150 6243979 6205546 7218717 7367710 6840996 6297318 5676486 4989346 4792655 4678006
9595 4678006 4806029 4961520 5119464 5609012 6114367 6064620 5330421 4495552 5012889 5882425
9585 5882425 5706924 5331235 5226168 5099956 4803794 5082691 5312409 5685531 5992388 6110813
9575 6110813 5572651 4625164 3873805 2954629 2098182 2304943 3047289 3499101 3911568 4136733
9565 4136733 4160879 3997531 3475027 3202912 2907989 2829846 3011198 3038256 4343190 5385541
9555 5385541 4795756 4266084 3853198 3952002 4129586 3940669 3732962 3855991 3934842 4114422
9545 4114422 4130639 3561648 3046304 3504487 3736443 3430163 2569520 1403647 1372704 1735873
9535 1735873 2149189 2088795 1906696 2365914 2794212 1950761 1698657 1674660 1404198 1705304
9525 1705304 1549795 1434165 971356 -84695 -1200303 -911786 -355270 -163059 385018
9516 385018 593894 492588 -173535 -679674 -714126 -171436 405931 784529 1210147 1359602
9506 1359602 1096330 655397 495344 163066 -269930 -898430 -1329460 -572916 300127 1059013
9496 1059013 1309338 1373594 1456846 1391869 2164900 2527903 1751231 1059438 1259207 2167635
9486 2167635 3383535 3458805 2965356 3356003 3228029 2826556 1599340 596774 -213128
9477 -213128 -1026546 -1521283 -2037930 -1853941 -1069187 -541488 -995283 -944178 -413016 327499
9467 327499 1043489 1939452 2368428 2675885 2799896 2056212 1066821 1007868 1002654 229983
9457 229983 -593291 -935852 -621431 351256 594286 -479910 -1392664 -981657 196632
9448 196632 862393 527172 57524 -153157 195649 144169 -108411 383926 563755 385715
9438 385715 234204 265926 251704 133013 12816 -136985 -665961 -604130 -442725 -1153114
9428 -1153114 -1269647 -1318873 -1626069 -1547404 -1423695 -940094 -394200 217221 527458 400370
9418 400370 221499 -768867 -1033361 -639712 -623840 -950709 -1671210 -2360331 -2039452 -1769961
9408 -1769961 -1278815 -845100 -837215 -740814 -967342 -1838346 -1874146 -1109553 -857006 -1198405
9398 -1198405 -1409459 -516136 328705 271620 -55131 -360860 -185104 -74263 -20315 30164
9388 30164 -313753 -649079 -435875 43146 280523 305414 692657 849370 377274 357060
9378 357060 712041 98361 -853791 -1047200 -1054970 -645064 -120253 -102696 -625646 -849322
9368 -849322 -868988 -877582 -437340 -638175 -620423 -346210 -221014 -162003 -469670 -359281 749511
9357 749511 1409770 945307 -519639 -1416921 -893648 -373617 -278185 -253739 -687950 -1248538
9347 -1248538 -1049511 -278492 30194 -92854 262385 682576 734942 438696 -79749 -537841
9337 -537841 -430195 -662840 -918118 -607363 -484313 -179749 1108128 1583468 1132722 1069679
9327 1069679 878465 469609 683223 1597680 2108464 1243897 215562 -899014 -1395000
9318 -1395000 -759063 -174363 55862 -28700 -61259 295342 415789 295656 547543 809068
9308 809068 837802 541987 23434 -180874 -317663 -34360 -217233 -316667 -26891 -568491
9298 -568491 -1561419 -1440114 -1318237 -800194 35935 242229 -169876 -47717 -92878 206490
9288 206490 381822 -396922 -1105466 -1002783 -858210 -906829 -1123327 -2080341 -2389726 -2428023
9278 -2428023 -1937878 -1162370 -1375653 -832656 578753 1172159 531622 -694916 -1275788
9269 -1275788 -1161171 -1140800 -1724685 -1872882 -1873406 -2120223 -2283811 -2022718 -1801722 -2249867
9259 -2249867 -2303099 -1699061 -628383 -793269 -2144870 -2520144 -2299566 -2173925 -1747204
9250 -1747204 -1454151 -1866054 -2037544 -1727958 -1569883 -1235727 -1009068 -1253001 -1618664 -2101687
9240 -2101687 -2572082 -2673988 -2327906 -1121584 -412192 -329636 -184471 -380586 -61034 -77079
9230 -77079 -696225 -1158061 -1264093 -1413532 -863323 -982827 -1821916 -1726345 -1207659 -616082
9220 -616082 -722336 -790380 -94487 436647 198898 -712989 -1098951 -161075 614167 97522
9210 97522 -559769 -342377 363367 1310714 1170963 866866 681655 66592 232657 610919
9200 610919 313140 -124944 -485194 -841125 -1003687 -283571 485214 -78914 -836229 -820178
9190 -820178 -405143 -682569 -634655 111350 288915 -499303 -1927289 -3182211 -3288884 -3005564
9180 -3005564 -2381001 -2131665 -1875619 -1854068 -2256079 -2865018 -3317956 -3586871 -3762118 -2616308
9170 -2616308 -2173085 -2420188 -1757352 -1185789 -481985 -572718 -1233142 -1366193 -805932 -821486
9160 -821486 -1390963 -1313286 -907913 -549746 -249872 -497121 -58298 249317 927013 1326185
9150 1326185 134450 -401788 -383187 -1015228 -1389953 -1601600 -1325908 -1419596 -1453442 -887254
9140 -887254 -558787 -283964 -377774 -423444 -1220725 -1495587 -1310370 -1793957 -2089458 -1410985
9130 -1410985 -1412414 -1757059 -1958533 -1814059 -1102109 -237211 -8475 -519994 -674522 -261185
9120 -261185 194811 319205 -93742 -369091 -896919 -1656293 -2298329 -2584758 -2258280 -1475323
9110 -1475323 -1241811 -1632593 -1963453 -1740138 -1222847 -80989 1625995 2301742 1600526
9101 1600526 1186746 1326246 1048076 273032 -202653 -184938 -278396 -462390 -783233 -1163794
9091 -1163794 -1360588 -1252625 -461532 -625415 -1737857 -2369511 -2249896 -1608782 -1071677
9082 -1071677 -703695 -4980 337975 -175784 -859236 -1530649 -1571492 -1188568 -1410406 -1839833
9072 -1839833 -1415953 -847741 -493299 -423739 108420 682736 568647 -19530 -401766 -711522
9062 -711522 -313415 502424 313697 297990 242657 -245507 -123908 553553 1010333 993213
9052 993213 363854 -128551 -479432 -91479 356956 849799 911506 696502 569934 174553
9042 174553 -278301 -172179 -14582 218989 660701 475766 265247 350831 232768 2068
9032 2068 -516465 -1652806 -2360347 -1845428 -1627128 -1674888 -936502 -587647 -303968 -10192
9022 -10192 -414247 -1227197 -1285309 -360824 765150 896976 493868 174658 -17778 -506430
9012 -506430 -1426264 -1490079 -939368 -625960 -659342 -823947 -1185860 -834665 -494249 -562284
9002 -562284 72098 1040822 1140469 412250 -95978 -860030 -1364180 -970577 -265284 388531
8992 388531 574279 345263 457287 257765 234312 169297 -346006 -1218786 -1329076 -2285088
8982 -2285088 -2591694 -1302742 -564216 92589 625258 1035213 1274223 1405348 1656054
8973 1656054 1470468 1155757 1258766 1073175 625180 469026 1127955 1004371 47019 -546671
8963 -546671 -874179 -1117391 -955407 -586707 -166793 -628202 -958517 -1190666 -1045736 -669992
8953 -669992 -674697 -1109169 -2270854 -2361854 -1515195 -1511761 -1889520 -1212292 -896004 -1045145
8943 -1045145 -1020087 -760442 -772690 -1155267 -1914092 -2587862 -2394793 -2222202 -1874748 -919417
8933 -919417 -689090 -54199 626258 -114439 -620394 267843 1469605 1544682 1033907 1351738
8923 1351738 2102832 1950882 1446179 1415278 1231979 1451788 1421948 550216 -179091 -24254
8913 -24254 -168919 -812644 -703233 -14048 323864 2506 -844062 -1822755 -1681901 -1249901
8903 -1249901 -1076686 -1990874 -2615032 -2152854 -1659238 -1178651 -906194 -524199 17487 878093
8893 878093 1169703 1509869 1633251 1172542 768335 1383146 1881991 1175738 538794 875878
8883 875878 1220456 1246473 1560394 1206410 750012 1267244 992981 479655 943450 1197540
8873 1197540 922731 614939 -248715 -669492 -450284 389108 1464979 1766187 830834
8864 830834 55014 -159995 311495 807166 1150852 1711448 1361300 1115462 1302402 1657605
8854 1657605 1166623 162476 -357455 196522 1340037 1962070 2241144 2520373 2268205
8845 2268205 1594262 1664624 1526143 523465 -290700 -198351 321928 959474 1110953 979948
8835 979948 687400 -108370 -454066 -173448 22230 -193348 -97841 529589 -121284 -1045821
8825 -1045821 -957818 -763344 170974 1586662 1901290 1225014 444980 704458 1351067 1858807
8815 1858807 1443747 1189785 1557214 2498575 3044902 2773169 2301370 1347678 642561 717996
8805 717996 418155 653952 1159188 1666259 1802666 1395987 486154 -826850 -555519 -784517
8795 -784517 -1177749 -1081198 -1255712 -641871 314880 911289 1560918 2103747 2149130 2498438
8785 2498438 2934832 2359533 1829151 2119923 2375070 2743911 3396684 2920584 1860440
8776 1860440 1424917 1694943 1489297 1631719 1975147 1682985 1671865 2220507 2540145 2781232
8766 2781232 2206369 1618914 1415055 1409250 1554432 1727806 1241171 449122 237689 612658
8756 612658 283919 -3558 511958 1314820 1699326 1567501 855174 634381 1230390 1750083
8746 1750083 1231512 456591 321221 581539 796438 612184 449593 791303 1013482 1097166
8736 1097166 1830747 2684019 2963827 3676180 3824094 3502781 3430736 3833711 3865300 3420302
8726 3420302 2376840 1577940 1493882 1661769 1292508 1375767 2256237 2388167 2398319 2771457
8716 2771457 3183756 3453726 3395169 3485081 3146843 2634314 2359603 2491220 2620920 2500610
8706 2500610 2739867 2962583 2480346 2146629 3033483 4244287 4609796 4331470 4066711
8697 4066711 3182377 2372360 1720920 1888992 2126045 1872170 1650321 1462071 1300900 1443381
8687 1443381 2187043 3786517 5051174 5271627 5441457 5521797 4914799 4026422 3389079
8678 3389079 3788548 4780453 4767067 4540498 4908028 5315784 5916816 6767878 6495356 5664194
8668 5664194 6149747 7269327 8334074 8621809 8012414 6994398 5872168 5232742 4941000
8659 4941000 4820783 5199801 5678960 5860324 6051337 6345718 6151265 6051956 6772742 7484727
8649 7484727 8160281 8437032 8183898 8944924 9541166 9424345 9512023 9775788 10055091 10640093
8639 10640093 11095402 11182694 11257668 10573108 9478166 9003644 9142220 9738203 10893521
8630 10893521 10872987 10185231 10420088 10944382 11777890 12438628 13308545 13986219 14421430 14913960
8620 14913960 15047195 14911924 14968693 15112188 15375414 15947416 16418038 16489055 16679570 17131001
8610 17131001 17346002 17492036 17738179 18501900 19901780 21344928 22272247 22262598 22171833 23644484
8600 23644484 25998542 27735969 28670945 30180033 32547674 34873553 37692811 40865633
8592 40865633 44645607 48332961 51577454 55503152 60390430 67015348 75137066 84088660
8584 84088660 94563627 107301154 122550711 140398527 161088035 185627136 213859054
8577 213859054 244864170 277748615 313490356 347069697 368925246 371972879 353905479
8570 353905479 322297795 286657134 251616125 220498002 194159615 171833491 152017459
8563 152017459 134244630 119700560 108585094 98774729 89697930 82401194 76041966 70028822
8555 70028822 64401488 59782690 55226468 50529542 47556081 45619469 43422128 41027209
8547 41027209 38599916 35779613 32881505 30565107 29147890 28068126 26162292 24309526
8539 24309526 23268388 22087201 20587011 19192734 17766734 16498280 15690264 14642723
8531 14642723 14088112 13883204 13840553 14072253 14152231 14000792 14015420 14429621 14905058 14932730
8521 14932730 14381928 13496680 12490550 12158031 12518878 12941180 12875357 12495414 12048918
8512 12048918 12498093 12688531 12557380 12987335 13167718 12765275 12079083 10603732 9160069
8503 9160069 8210159 7875123 7010260 5629993 4410958 3766989 3731172 4386332 4599457
8494 4599457 4761617 5591081 5835319 5084424 4988608 5732478 6377887 6066933 5343986 4303712
8484 4303712 4052656 3946912 3502313 4205305 4618604 4665323 3833980 2186200 1996740 2467380
8474 2467380 2382195 2228808 2802545 3623194 3397967 3051381 3340572 4466243 5221149 6372212
8464 6372212 7758538 7174143 6086396 5926829 5491181 4755310 4109668 2671425 1405701
8455 1405701 1798009 2298698 2382076 2741627 3032988 3458457 3539262 2907759 2700561 2269305
8445 2269305 2000593 1904879 1602548 1769516 1783437 1643676 1501500 1850262 2289706 2001637
8435 2001637 1202490 741895 1353015 1973289 2587327 3140076 2519852 1913687 2064083 2251853
8425 2251853 1604113 1383563 2479698 3827508 3649927 3053142 3046846 3134343 2904815 1946014
8415 1946014 1061253 1507944 2042297 2177014 2436408 2415750 1871513 1788297 2126962 2324089
8405 2324089 2361365 2420446 2132092 2224898 2510659 1565253 361094 -322326 -93682 379832
8395 379832 168294 -56525 -921677 -1569756 -1382904 -1391788 -1602528 -1711222 -1326368 -770667
8385 -770667 -269301 156123 6040 -91631 -358542 -148315 406318 767164 1096753 1341108
8375 1341108 884625 -65524 -269230 -187958 173331 105097 -217632 -282830 -281053 -799549
8365 -799549 -1194297 -1067826 48165 850315 291751 -54550 700505 571887 115704 292201
8355 292201 423516 679548 437771 -16959 300348 339888 76109 449833 803453 943027
8345 943027 1432936 2591384 3842923 4362660 3734558 2645110 2069247 1952038 1639642
8336 1639642 1147681 962870 904447 606022 -336802 -656026 -796068 -327307 629776 693414
8326 693414 565164 -12236 -480091 -729488 -861199 -1031889 -543255 249197 755667 902167
8316 902167 1532382 2789705 3152697 2700530 2321532 2580438 2832912 2712869 1867811 861618
8306 861618 566126 1066036 1204421 1535990 2054732 2337607 2580764 2011308 1521533 1919127
8296 1919127 2345739 2863215 2710254 1589677 475218 241883 58307 -29399 327262
8287 327262 1021261 1019662 633885 279262 34623 -215906 -189968 832565 1417962 580452
8277 580452 -20352 -204153 81258 526310 106554 -634788 -1321031 -1560897 -919720 -634421
8267 -634421 -383836 574728 1226245 1644206 2237480 2250307 2025892 2270852 2061596 1546211
8257 1546211 1211461 1526165 1703885 1538523 1446268 1448061 1062010 548242 229415 -299677
8247 -299677 -440850 -614914 -398900 42839 724412 721583 271634 350454 654141 1747029
8237 1747029 2607126 2703089 2377002 2557491 3080926 3032837 2585863 2403045 2069905 977554
8227 977554 819373 1181498 1170671 1239103 1728609 2070397 1839599 1365950 1617267 2372680
8217 2372680 2763329 2374919 2029279 2072237 1832970 1301730 1591189 1461342 675097 484248
8207 484248 332052 -3973 653201 1538214 1126931 443873 113719 25043 -656709 -314002
8197 -314002 353560 495378 587640 1116767 1383346 1237601 1747921 1696116 426975 66886
8187 66886 297798 1091608 1651009 1010570 205399 -172804 -944714 -1046978 -1133057 -1156614
8177 -1156614 -541249 -555485 -661366 -39151 1329396 1985702 1337347 277017 -218432
8168 -218432 -589846 -293503 -115538 -195439 11848 548896 1243430 993735 1124973 1930509
8158 1930509 1832371 812391 -412556 -1348684 -1971045 -2500833 -2571596 -2471180 -1857653 -1171099
8148 -1171099 -1240378 -1451269 -1567779 -1057682 -663202 -502346 -306083 -509435 -406523 -232538
8138 -232538 -332583 -389774 -671061 -212406 281006 -392497 -778115 -1678290 -2414518 -1492609
8128 -1492609 -455859 -221214 -396856 -839366 -740579 -215062 229982 593627 1148428 1392346
8118 1392346 817822 162828 -628764 -570415 841991 1573596 544735 -199240 -781583
8109 -781583 -1711508 -2089434 -1767428 -1655298 -800149 -276471 -686296 -1013321 -1274513 -1195325
8099 -1195325 -1113806 -1191417 -926617 -368715 288264 564984 580836 470223 337583 267198
8089 267198 273678 -75727 -872555 -1373889 -1300480 -1383203 -1480733 -1352954 -1655726 -1727112 -1472499
8078 -1472499 -851373 -547871 -310956 -237025 -903224 -1623956 -1230145 -178849 -151388 -417606
8068 -417606 -187596 76761 -202019 -7127 7574 -714913 -959564 -1642596 -2017418 -1540969
8058 -1540969 -211932 887560 1272857 664411 545062 441448 -190526 -211439 -482089
8049 -482089 -668549 -1586903 -2653213 -2872255 -2196535 -1683502 -1553241 -822833 138362 650799
8039 650799 420101 205768 444030 672318 713661 1042483 1022203 71633 -550103 -571975
8029 -571975 -792011 -898366 -720156 -878427 -681797 -187903 -129996 -187077 -360073 -218048
8019 -218048 -296592 -678931 -788350 -770610 -904209 -1088634 -1146172 -1122396 -726898 -653901 -429531
8008 -429531 -348351 -804867 -745426 58775 500734 -93665 -827001 -756218 -642860 163980
7998 163980 1226673 441241 343754 940282 516172 -283301 -912910 -1144022 -627059 441027
7988 441027 1678307 2133067 1618135 1011751 573807 384304 208987 135851 29882 -169218
7978 -169218 -144011 -279949 -157655 -89986 -512043 -974225 -1283492 -1191328 -976702 -1083889
7968 -1083889 -968560 -882898 -1398311 -1468537 -702060 -304965 363839 -102662 -1098164 -1450266
7958 -1450266 -1729060 -2113063 -2475353 -1936899 -843650 415453 1431583 1493239 897809
7949 897809 1225250 1568956 1945618 1895367 636131 -7669 -317675 -856196 -1349251 -2037232
7939 -2037232 -2545796 -2119484 -2188856 -1943153 -2211288 -2817079 -2975394 -2004135 -788821 -422873
7929 -422873 -537319 -437714 -324647 -32977 -128643 -995376 -1195353 -1192842 -1516053 -1291497
7919 -1291497 -1129370 -1741273 -1313928 -732458 -1227367 -1566717 -1929716 -2624791 -1989931 -669227
7909 -669227 108529 534009 1076564 1243573 732146 917322 926048 -418894 -1734729 -1964062
7899 -1964062 -684485 -424876 -736409 -965845 -1527834 -1100400 161325 444245 -546194
7890 -546194 -846666 -150505 -433666 -864541 -950193 -1082319 -734693 -290369 -343411 -409211
7880 -409211 -442161 -286742 214425 -28128 -150369 -16457 434764 1249048 1754388 1745479
7870 1745479 1167246 1006048 1067902 1007848 1025964 1660845 1899908 1082149 -163269 -1170297
7860 -1170297 -893070 -130007 -300769 -64761 794714 1541981 2644407 2592033 2345717 1730231
7850 1730231 376126 -120031 -733245 -840866 89881 374932 576434 1732402 3049026
7841 3049026 2944510 2398436 2664448 2237856 1813474 2120285 2096242 1721202 811684 -221168
7831 -221168 -587173 -545977 301783 136035 -708729 -1142953 -1005856 -174138 -24706 201123
7821 201123 1149828 1921254 1838328 1758931 1827204 1896871 1398837 1431923 1653943 1331924 949771
7810 949771 1111251 1553119 1695585 1850203 1546854 1663635 2116818 2579557 3491851 4041711
7800 4041711 4088187 3857807 4022974 4529129 5228431 5895091 5463621 4242682 2510378
7791 2510378 1629013 1319133 1656862 1964654 2101250 1700077 1300171 1599603 1427197 1085104
7781 1085104 1298290 1802828 1992422 2040655 1880317 1231727 328370 -519867 -513070 -80295
7771 -80295 35354 -451251 -189881 -525108 -456743 379767 94590 -861723 -994859 -504457
7761 -504457 -1017572 -1666096 -1991318 -3088654 -3394769 -2693493 -2243847 -2181769 -1537537 -1085204
7751 -1085204 -1266027 -1324195 -680865 -162033 583329 2398980 2981523 2255746 1909521 1993801
7741 1993801 1833944 1731205 1053812 -4409 -1168704 -1465171 -510651 -134538 -129678 188513
7731 188513 676859 379654 -186946 -803111 -659648 184211 669520 945276 166520 -1123384
7721 -1123384 -758543 517888 1528516 1895374 1817368 1925511 2358148 2909545 3102319
7712 3102319 3431599 3027793 2225031 1206440 559119 2484 419114 1171455 1410868
7703 1410868 1721316 1691827 1120198 453238 506352 919580 886269 205698 -697807 -1040994
7693 -1040994 -1860265 -2369779 -2692141 -2450640 -1192697 -96693 185822 439643 483895
7684 483895 206584 -81489 -304626 -474901 -836718 -1771717 -2293837 -1197309 -453800 -522392
7674 -522392 -758051 -813406 -483560 -311802 -1498045 -3145106 -4035124 -4100585 -3154105 -2391686
7664 -2391686 -2233007 -2019382 -2128025 -1892014 -1794222 -1607502 -1603281 -1387378 -802862 -966985
7654 -966985 -1163747 -1404917 -1972849 -1980110 -1355575 -964090 -1102736 -939194 137922 -94099
7644 -94099 -512638 -161245 218318 -849491 -1843092 -2193651 -1737808 -730244 -127644 -169128
7634 -169128 -1076947 -1325609 -1466383 -2047847 -2196137 -1998764 -1709109 -1319856 -983731 -824106
7624 -824106 -718381 -363368 -540776 -2073833 -3439486 -3879150 -3907320 -4502042 -5419111 -5656415
7614 -5656415 -4489539 -3244483 -2802364 -2070516 -2111770 -2917111 -2831548 -1916556 -1232993 -996305
7604 -996305 -792906 -747736 112488 1418294 1246250 239728 -741026 -1445827 -1784597 -1683726
7594 -1683726 -1884392 -2636668 -2726338 -2322884 -2090919 -1380224 -138300 1546934 1944459
7585 1944459 1093562 -113176 -1168422 -1773252 -2224863 -2848066 -3153543 -2806312 -2491513
7576 -2491513 -1950023 -1056778 -746979 -744918 -1094563 -1114717 -589420 -343879 -83374 371290
7566 371290 485990 586275 584625 162381 103667 252623 -753477 -1356980 -1009795 -1302753
7556 -1302753 -1438725 -1469173 -1239355 -962022 -584019 -745242 -1301736 -2104838 -2529539 -2920820
7546 -2920820 -3066849 -2891593 -2419124 -1961178 -1314380 -1126343 -1563901 -1949160 -2011337 -1841447
7536 -1841447 -2664756 -3651145 -4144140 -4301561 -4161144 -3142195 -1653995 -1193769 -1180875
7527 -1180875 -902189 -1138274 -1225789 -1506328 -2255014 -2867931 -2953482 -2534499 -2250377 -2229112
7517 -2229112 -2828692 -2959533 -1705298 -252696 160975 -461574 -1886499 -2925311 -3140533
7508 -3140533 -2915159 -2741735 -2832842 -2703465 -2673186 -2182014 -1787605 -1652836 -1816704 -1992770
7498 -1992770 -1408873 -1264662 -1072099 -1033273 -982889 -679907 -1030545 -1406847 -637040 620349
7488 620349 1191567 1451101 1294333 1187225 1067938 736216 -482623 -1416492 -1882593 -1824684
7478 -1824684 -2160924 -2230769 -2429323 -2611263 -2743375 -2459010 -1335463 -513164 -419269 -924699
7468 -924699 -959288 654725 1672712 1772249 1458195 -57936 -1380999 -1941865 -1984874 -1614225
7458 -1614225 -897519 147558 791490 900118 68758 135645 893352 1412480 1612229 1401581
7448 1401581 991354 265356 688710 1394940 1301677 909822 302254 -1016977 -1992914 -1356704
7438 -1356704 -458244 -634635 -1379438 -1696674 -1487412 -1413140 -804555 -69968 806819 1073546
7428 1073546 1076289 1091394 414181 -303181 -294783 -41872 11683 877692 2357074 2787329
7418 2787329 2516807 1911118 2451666 3067791 3046908 2935802 2329921 1383274 508743 -128281
7408 -128281 -200736 -330178 -774856 -650655 -246957 -79852 75912 663220 653086 352258
7398 352258 -217435 70990 472211 -328499 -608560 -631949 -659461 -378920 -154710 239407
7388 239407 172749 -216525 -388178 -357420 -325193 -955038 -1187309 -1056812 -1893123 -2222535
7378 -2222535 -1879758 -2233131 -2791106 -2181872 -1117675 -55418 409668 793871 843981
7369 843981 636290 1372754 1719757 1365221 1340264 1287134 958766 1603356 2223906 2182085
7359 2182085 1884911 1821238 1494351 1350609 1318243 1533357 1806542 1632669 1097913 1080476
7349 1080476 1897144 2914970 2633604 1642648 1725834 1914299 2116125 1228203 -111222
7340 -111222 -842410 -777148 -706194 -159109 917902 1299801 345424 -56350 390929 1639585
7330 1639585 1963436 1739440 1593911 729834 659532 -61077 -432197 -197762 -165943 -37740
7320 -37740 266652 106085 -251878 -679010 -360077 -404519 -491068 -709955 -411487 175766
7310 175766 251105 -178811 -901115 -1269057 -1598460 -1409807 -858795 -893650 -1361983 -1270982
7300 -1270982 -603637 -393197 -549794 -132806 -325503 -746237 -509745 -112161 54408 -166579
7290 -166579 52336 360146 22548 -567635 -578253 -850186 -1379661 -1224961 48236 1173084
7280 1173084 1797304 1510845 693851 -184631 -554056 -1026370 -1658832 -2311985 -2690949 -2218700
7270 -2218700 -1529589 -1602821 -1592009 -1199977 -689760 -132383 -75405 -712953 -957985 -302738
7260 -302738 -13714 717278 1338518 1216191 86557 -642335 -317883 13609 -843231 -1589068
7250 -1589068 -1136399 -139053 1030166 1220016 1454100 1603873 1493535 1084948 22710
7241 22710 -806263 -895109 -127070 472710 248495 333357 1087776 1937960 1680376 1193966
7231 1193966 1534816 1658197 2275988 3060569 3303506 3810377 3055762 1222224 778573
7222 778573 1385014 1483154 679783 329247 412555 725578 595797 -239659 -350895 580268
7212 580268 1417130 1326820 1217552 1336523 1414894 1264464 1677001 2426089 1831405 1572849
7202 1572849 1985106 2934007 4568086 5970808 5825004 4588808 4110912 4053207 4372474
7193 4372474 4460058 3092868 1734247 1607397 1867684 2096459 1703439 1876304 2239554
7184 2239554 2188842 2405542 2332267 2270298 2730824 3037021 3022246 2272692 1147471 1051157
7174 1051157 1674251 1588272 1725654 1981179 1377056 1681102 2446540 2613795 2576632 2529954
7164 2529954 2053017 1296494 983982 1738584 2313885 2387184 2261154 1830438 1097224 870912
7154 870912 1350038 935163 299273 486394 940510 882338 502992 760694 1179583 1624288
7144 1624288 2095800 2515923 2844525 3033826 2489182 2725038 3717970 4694271 4827314 4936856
7134 4936856 5323108 4590609 3824568 3665575 3893850 4046847 4124240 4423456 4318965 4090796
7124 4090796 3787600 3406366 3205126 3704005 3934340 3511007 2983287 2778597 3373012 4041735
7114 4041735 5146234 6728195 8007117 8178370 7972533 7227628 5941684 5835309 6769446
7105 6769446 7612424 7893262 7801532 7633750 7133328 6704472 7461876 7548056 7012406 7011033
7095 7011033 8016937 8719612 8957953 9008818 8910927 8930679 9152783 9816303 9918583 9813764
7085 9813764 9670469 9591863 9974588 10459164 10953033 11677357 12149394 12484583 13756459 14760494
7075 14760494 15406750 16033713 16795690 17617317 18635626 20317062 22438570 25652253 28633987
7066 28633987 31390156 34063327 36894721 40190257 43576153 47518865 53185307 60903073
7058 60903073 69872835 80859662 93428901 107193816 122685065 140404771 158355003
7051 158355003 174199307 185043679 186552871 177784282 161710811 143704819 126873139
7044 126873139 112393726 100889389 91296039 82852443 76132094 70426789 65108748 60267683
7036 60267683 55495413 50816052 46907727 44176062 41703385 39510464 37962217 36361818
7028 36361818 34000780 31302268 28738756 26484441 25040622 23787209 22736378 21806018
7020 21806018 21208882 21020940 20144209 18546234 17157787 16358608 15230196 14680089 14862766
7011 14862766 14350873 13613124 12265589 11148417 11000287 10733825 10526911 10301049 9668488
7002 9668488 8963707 8364888 7388522 6717648 6613045 6732723 6621289 6544150 6049482 5744316
6992 5744316 6080527 6926287 7029366 5808631 4705532 4493494 5086888 6009923 6266519
6983 6266519 6271431 6739039 6571652 5372966 3666011 2891774 3360200 4245484 4797939 5004052
6973 5004052 5038434 4522219 4544703 4914013 4873168 4761054 4345043 4598136 5267657 5702139
6963 5702139 5253653 4571703 4179609 4078118 4809872 5180876 5051397 4600887 4808413 5890808
6953 5890808 6509726 5713520 5118536 4800107 4268617 3983819 3714993 3523052 3235265 3571870
6943 3571870 4631873 4800973 3944495 3861134 4580471 5087216 4465357 2976302 2774575
6934 2774575 3446721 3600585 3799777 3796963 3573733 3331975 3632509 3786062 3411504 3316378
6924 3316378 3359521 3731604 4113323 4694358 5229386 5223132 5374612 5458155 5189575 4989874
6914 4989874 4115588 2974307 2049252 1978682 2447887 2461043 2937983 3299987 3496596 4033939
6904 4033939 5060402 5085298 4258233 3489945 3446670 3160513 3041632 3431042 3660286 3968052
6894 3968052 4462845 4598425 4355524 3675870 3579078 3224979 3396677 3160242 3349182 4052688
6884 4052688 4409247 4959861 5585345 5575831 6170876 6750367 6600723 6109653 5184109 4886145
6874 4886145 5060780 5155940 5419272 5585900 5166808 5536331 6992597 7290438 7654309 8130979
6864 8130979 7897368 6885930 5970834 5843009 6238004 7346683 8213515 8387581 7896859
6855 7896859 7700642 7718206 7748781 7835180 7527971 7003446 7136962 7707265 7740274 7408704
6845 7408704 7500194 8120008 8140343 7003039 6099384 6220075 6615389 6904427 8075607 9078485
6835 9078485 10019230 10404706 10499909 11034881 11524910 12526934 13519282 13630224 13640299 14317774
6825 14317774 14894542 15558314 16168915 17378317 19465072 20985487 21291406 21982419 22772896
6816 22772896 24185075 26241644 27660402 29637309 32755292 36798830 41200198 46288931
6808 46288931 51479893 57264222 64633544 73554764 84167487 96385822 110157045 125469777
6800 125469777 142061004 159386782 175358808 187214504 190284374 181970942 166662926
6793 166662926 149828445 133141579 117869092 104842935 92899535 82202701 73658325
6786 73658325 66139102 60488689 55528263 50284281 45864346 42299728 39140639 35912593
6778 35912593 33682874 32993029 32705452 31269152 29008761 27272182 25951255 23971846
6770 23971846 21896726 20956594 20137391 19408161 18932329 18597265 18135455 18342968 19594644
6761 19594644 20012005 18714881 17158063 15974291 14534438 13337024 12427116 12202607 11844382
6752 11844382 10945191 10490907 10898679 10573923 10324721 10546596 10920304 10154146 9366316
6743 9366316 9410456 9705069 10020414 9686432 8723775 8132314 8536320 9159571 9284527 9038934
6733 9038934 8453689 8873149 9631718 9697918 9276822 8732127 8893316 8555641 8768576 10024559
6723 10024559 10894491 11389586 11081960 9787874 8962927 7816443 6170702 5213257 5526343
6714 5526343 5904163 5299320 4754896 4650282 4751568 5621692 6649872 6709297 6989616 6917857
6704 6917857 6670274 6455300 5902362 5511224 5709733 5980225 5438223 4886504 5233706 5976539
6694 5976539 5513042 5234315 5449691 5426691 5136445 5323879 5338682 5120008 5309137 5810726
6684 5810726 5216406 4063767 3231281 2661905 2825599 3036049 3242111 3564927 2779608
6675 2779608 2427459 2819466 3528462 4153043 3871060 3487198 3163153 3181498 3446608 3016090
6665 3016090 2718935 2709878 2762732 3176608 4521061 4952745 4715171 5304213 6459844 6358967
6655 6358967 5317115 4905529 4626536 4269134 4109161 3508034 3489299 3412001 2473615 1318698
6645 1318698 742307 1178270 2250059 2817242 2687011 3042137 3409758 2755274 2390563
6636 2390563 3025659 3704019 4209024 5105764 5135759 4783659 4396326 4492794 4632436 4532171
6626 4532171 4399519 4109280 3498939 3227886 2986599 3240370 2976462 2160051 1853442 2849675
6616 2849675 4600583 5428071 5411562 4733729 4533760 4961172 4966300 4388428 4052811 4662243
6606 4662243 4820949 4139162 3942232 4083619 3731888 3490926 3845267 4225800 4671001 5138568
6596 5138568 4991069 4203052 3702474 3589807 3819360 4462673 4195758 3258199 3217621 2910518
6586 2910518 2133194 1793997 1628623 1835587 3232821 4163411 4172818 4356927 4741906 3923616
6576 3923616 3040996 2767916 3105362 3646740 4278731 4735118 4959684 4829679 4438683 4781649
6566 4781649 5027588 4872909 5023341 5184916 4882532 4764630 4671765 4890602 5592044 6158813
6556 6158813 6357253 6617930 6664098 6039501 5527810 5286947 5731456 6528470 7790165 7866515
6546 7866515 8185408 8573886 8724610 8810090 8486153 8281732 8271542 7978451 8099098 8432363
6536 8432363 8682200 9299820 9351916 9388974 9646869 10568373 11210821 11315800 11756660 11631061
6526 11631061 11287798 11511202 12365561 13108353 14403677 15820629 16733572 17068129 17515709
6517 17515709 18644585 19500063 20991177 23148533 25488241 27962118 29397745 31050275
6509 31050275 33716736 36886231 40289032 44397782 49354367 54398376 59997333 67671337
6501 67671337 77150309 88505637 102488062 118235131 134874836 152169368 168861334
6494 168861334 181477761 185924153 181024514 167286841 149437346 132164291 116418044
6487 116418044 102636725 91633385 82408592 74117513 67104579 60273021 54286391 50097075
6479 50097075 47149346 43504632 39531966 36434555 34055513 31703672 29136737 27266859
6471 27266859 25908170 24756436 24557875 24819316 24003201 22554207 21633238 20600526 19267133
6462 19267133 17969929 17055571 17258041 16805486 16024735 14950699 14369552 15211804 15644425
6453 15644425 15486603 14631977 13801616 13989112 13593121 12758893 11193455 10279942 10895922
6444 10895922 11281838 10867351 10475210 10316008 10199794 10722020 11583111 11766938 11160793
6435 11160793 9976305 9151245 8810896 9446840 10776940 11074382 10856139 10626028 11164913
6426 11164913 12368253 13440948 13535386 13718860 14635964 15566583 16041784 16525549 17821999
6417 17821999 19854064 21501466 22220715 22666816 22086168 20500740 18844000 17552098 16882126
6408 16882126 15935917 14689942 14129968 13870859 13168581 12947105 12748594 13149120 13501526
6399 13501526 13014469 11974448 11079185 10559812 10527096 10463799 10071318 8797715 7421603
6390 7421603 7217530 8175078 8996441 9150870 8536569 8774051 9112789 9016456 9070424 9375366
6380 9375366 9303107 8909673 8629425 8247653 8276449 8778374 9148774 9486541 10524518 11808181
6370 11808181 13143968 13334133 13294262 14223479 15768329 16511285 16848085 16782722 15592823
6361 15592823 14179391 12995393 12272775 11319920 9769423 8632864 8207944 8007934 7229209
6352 7229209 6382549 5696393 5441967 5844750 6722996 7236505 7184863 6895901 6938832 7472820
6342 7472820 7619815 6892393 6388032 6352897 6557648 6852312 6882467 6528646 6015786 4774558
6332 4774558 3442871 3269037 3892178 4343422 3713622 3052583 2939464 2829718 2374612
6323 2374612 2061323 1888247 1281048 902622 1068086 1709673 1848251 1377252 751913 184768
6313 184768 363526 722296 692709 -336541 -341891 473445 1146112 1922409 2722794 3082932
6303 3082932 2108349 1536428 1728017 2289536 2745760 2918832 1661966 728105 779196 461305
6293 461305 906997 1479763 1164245 538104 433649 519807 1087300 1738714 1579926 1327545
6283 1327545 354706 133040 561681 -29618 150621 1069194 1675337 1221636 393529 -99493
6273 -99493 246917 899712 1153873 1524094 1572520 1898561 2583140 2759255 2744152 2622153
6263 2622153 1927127 1729248 2388204 3116251 2951233 2292040 1995288 1957957 1461683 1107321
6253 1107321 255205 369241 2079001 3114888 3152353 2933286 2890272 2846141 3016023 2395988
6243 2395988 1059030 29224 -119303 131665 -27166 -376722 -209577 271552 801328
6234 801328 1116941 895594 785138 726336 945611 1763867 1528007 470621 684293 1273888
6224 1273888 929599 576556 1257073 1327545 1070068 1181392 1305349 1137367 1355515 1486004
6214 1486004 972672 1086814 1376082 1333104 1248020 1889516 1973483 1858448 2320093 3037228
6204 3037228 2972246 2516628 1632057 785872 255645 -109242 43564 106195 491620 1253774
6194 1253774 1624647 1591660 1950782 1961690 1292080 1213664 1692879 2426628 3172802 3403157
6184 3403157 3577025 3137580 2548366 2431044 2620637 3385823 4251850 4437352 3886767 2989518
6174 2989518 2643127 2106834 1679007 1411656 1302358 1218658 1387891 818074 68215 -12261
6164 -12261 547890 861624 415354 533009 1121806 1496698 1327461 1175776 1488620 1651974
6154 1651974 1466003 1330152 1547060 1908517 2248467 2585987 1968810 804080 744011 2075582
6144 2075582 2251518 2270364 1880096 1705328 2142370 3249034 3728582 3544342 3475321 3167095
6134 3167095 3322802 3636051 3645631 4660033 5480589 4667642 4043542 4424496 4853278 4163312
6124 4163312 3610977 3313694 2780615 2034935 1768814 2240889 3686140 5409328 5604558
6115 5604558 4798442 4166624 4364494 4075349 3989695 4703368 4445770 3694229 2960226 1845855
6105 1845855 907006 617938 977429 1378532 2359846 2362912 2272900 2039969 921537 1117277
6095 1117277 2780094 4492896 4879547 4101539 3433010 3305410 3671298 4167034 4111185
6086 4111185 3866474 4466178 4992656 4579966 3881915 3110330 2569479 3257220 4293430
6077 4293430 4756579 4637826 4514031 3538925 3115601 3065450 2645887 2415621 2632147 3110335
6067 3110335 2989666 3093748 3681484 4009810 3632564 2541651 1739043 1637558 1908074
6058 1908074 2673958 3146545 3116830 3697118 3546931 2740976 2115447 1640127 1524185 2132866
6048 2132866 2735760 2412840 1689295 1137135 1108030 1007571 972353 1359755 1941199 1778513
6038 1778513 1397012 1345536 595660 -182945 -408663 -111920 370580 1174426 1067915 223963
6028 223963 -71695 361800 905628 1246364 1463285 1473912 1163239 1097404 932714 606138
6018 606138 670453 687153 404048 873510 1555320 1731116 1534599 682536 258228 -305657
6008 -305657 -1338762 -1894294 -1202372 -580894 -138312 -78682 289552 -1726 -129827 672122
5998 672122 1281176 989823 570481 897016 631937 -521741 -442660 -9913 -124325 -21153
5988 -21153 165264 -534768 -1141480 -384542 252206 210504 -1101618 -1616435 -929911 -1110635
5978 -1110635 -1706236 -1322874 -811422 -534786 -590316 -682871 531510 1255743 1364089 1779745
5968 1779745 1415140 914183 -49480 -1192363 -1698050 -2334308 -1982985 -2145314 -2137370 -1328198
5958 -1328198 -572668 502936 1481173 1731067 1206751 946406 1154684 1448221 1203617
5949 1203617 106061 116395 784805 1939696 2529312 1825226 1477594 570486 -316078
5940 -316078 -174429 1134791 1547599 925001 1326976 1868867 1672256 746773 1262824 1832482
5930 1832482 1714223 1072462 1407690 1599627 1877451 1843680 1711120 1500330 1694935 2548035
5920 2548035 3207671 3100140 2085266 1058529 460002 1163478 2293044 2320613 1837480
5911 1837480 1820197 1426145 1400120 1569924 1511614 1668020 1810509 1374878 1540507 2127455
5901 2127455 1574351 909233 1341849 1617908 1707529 1197725 341136 -174843 -224701 835721
5891 835721 2082713 3386465 3869959 4078295 4361888 4115209 3091183 2141727 1461790
5882 1461790 732241 1146077 1856008 2767528 3469030 3413877 3304986 2739653 2504173 2883951
5872 2883951 2735914 2662777 2113997 1784460 1928431 2139575 2240228 2102991 2243246 1775662
5862 1775662 1556709 1762228 1508040 1225132 1385008 1185431 1370025 1535973 1556470 1109501
5852 1109501 421109 439413 640273 1409885 1592134 1692316 1568600 758377 189118 92358
5842 92358 836912 1852486 2628345 2523010 1602298 1976910 2902549 3598155 3866716 3709541
5832 3709541 3639368 3634910 3769167 3983524 3492988 2620488 2553387 2623405 2564756 2934026 3873196
5821 3873196 4111167 2830643 1637517 1267447 1504028 2378570 2907454 3106223 2827252
5812 2827252 2180326 1905608 1912650 2070648 2571903 3163382 3219767 3545253 4126288 4400033
5802 4400033 4428201 4485556 4587352 4856619 5652049 6192730 6698477 6616383 5760574 5335522
5792 5335522 5553988 5785348 5636275 4770100 4802800 5719723 5999354 5187278 4658879 4888284
5782 4888284 5185421 5025488 4474265 4703934 6082448 8043200 8559572 8285791 7975840
5773 7975840 7374053 6525794 6359731 7697721 8678550 9951848 11267835 11500419 11212290
5764 11212290 11187441 11515457 11885623 12415508 12642687 12614647 12740348 12934747 13026226 13407159
5754 13407159 13815194 14025021 13344355 12941827 13102921 13231776 13653214 14056170 13641832
5745 13641832 14078365 14900562 15497326 15866472 16638693 17856122 17635877 17377182 17784296
5736 17784296 18460155 19199513 20030856 20501373 20947793 21331621 22052228 23800610 25194431
5727 25194431 27379747 29935378 32119294 34138083 36065964 39631635 44013268 49097886
5719 49097886 55893873 63776968 72862769 83738776 95539204 108745876 124128332 140534869
5711 140534869 157289618 173225199 184782856 186996440 179479106 165948186 149339610
5704 149339610 132394833 117067187 103834805 92624801 82733662 74170071 66264172
5697 66264172 60482622 55469310 50945790 47309520 44083297 41563324 38998143 36374257
5689 36374257 34371651 32356034 30431676 29166161 28006344 26816169 25306104 23700939
5681 23700939 21483411 20063534 19752210 18906128 17974986 16779686 16162671 16230593 16400620
5672 16400620 15550250 14290331 13393566 12440776 12196295 11925929 11282046 10803492 10873839
5663 10873839 10607585 9361544 8924350 9258252 9643320 9958771 10226950 9977222 10046171
5654 10046171 10448350 9862387 8741630 8030911 8124203 8736516 8537068 8654373 9569375
5645 9569375 8896841 8136210 8226132 8362368 8334114 7366644 7243849 7238414 7069388 7558333
5635 7558333 7593757 7378488 7210737 7024685 5517650 4457296 3986841 4126436 5048553
5626 5048553 6119902 6258978 5349807 4185019 3228366 3445591 4450849 5911021 6517221
5617 6517221 5847036 5102182 5017255 4823114 4591974 4379806 4263435 4123059 4970450 5937487
5607 5937487 6544733 6037192 5215716 5672231 6234079 6167135 5965367 6262526 6917424 7380572
5597 7380572 6715892 5877060 5645611 5807659 6672524 8275862 9718447 10325672 10480412
5588 10480412 10071839 10306597 10315302 9349815 8299388 8018625 8488553 9087370 9358834 9451482
5578 9451482 9467476 9067832 8865428 8956944 9084986 9027641 8844104 8960731 9408793 8993216
5568 8993216 8510890 8156778 8599492 10126356 11563830 12209301 11389156 10863071 10821847
5559 10821847 11061791 11718861 12442169 13417592 14352623 15161439 15338272 15591934 15885788
5550 15885788 15867358 16075663 16761088 17176681 17441260 17488746 17591075 17871363 18028840 17461341
5540 17461341 17515143 18664956 19129634 19569602 20758147 22010171 22888986 24323657 26299013
5531 26299013 27484378 28571374 29650132 31248611 32920476 34479256 36539740 39076287
5523 39076287 42849720 47165807 51516746 56291366 61764034 69246901 79118745 89429490
5515 89429490 101425312 116751837 133837110 152640650 172186565 191873544 206996544
5508 206996544 211350316 204145368 188519060 169992234 151731666 135910434 122702674
5501 122702674 112046447 102582745 93565331 85150258 77995061 72471651 67885633 63525715
5493 63525715 59328076 56236567 53426119 51713276 50433026 49282128 47721659 46905966
5485 46905966 47325688 47765370 47727377 47495316 47273925 47378128 47591985 47961052 49522040
5476 49522040 51046376 52840785 55219071 58127281 61632525 66071553 71048587 76799802
5468 76799802 83789212 92518618 102351170 113861997 127906318 143646773 162006252 184075731
5460 184075731 209035807 235455764 261254064 282866054 295402016 297535460 293893468
5453 293893468 289679896 288074515 289851996 294573352 299209731 298545170 287591677 266393303
5445 266393303 240905352 216121537 193236451 172682882 154377242 139666751 127832115
5438 127832115 117188984 107690730 100087449 94397902 88711146 82360317 76086943 70765362
5430 70765362 66714282 63519255 60344684 57834018 55606930 51971806 48375602 45701626
5422 45701626 43536980 42123931 40667577 38769481 37309911 35827007 34551419 33180285
5414 33180285 31957877 31444604 30749078 29677278 28919596 28445768 27692209 27000527 25828249
5405 25828249 24491075 23930554 22666592 21304807 20629309 20005962 19500719 20176609 20662161
5396 20662161 21161450 20484278 19172254 18885208 19010846 18398721 17461556 16917002 17283880
5387 17283880 17013252 16458176 15891822 15311498 14365376 13295751 12678686 12381629 11901666
5378 11901666 11086598 10878945 11302384 11044005 10316173 10584426 11047516 11032000 10869500 11106821
5368 11106821 11467600 11605461 10800346 9697264 9258707 9386843 9501291 9399503 9772471
5359 9772471 9535568 8775570 9491740 10596593 11208156 11213663 11007409 10292126 9569968 8706306
5349 8706306 8417429 8413559 7900374 6684944 6397349 6965473 7600092 7804260 7792680 8244646
5339 8244646 8360932 7367832 6308565 7182161 9054472 10562958 11398210 11184748 10396141
5330 10396141 9777683 9045508 7965010 7600258 7849979 8142721 8287793 8069476 7446792
5321 7446792 6297347 5124609 5150532 5813986 6255581 6194025 6727642 6910036 6579592 6909183
5311 6909183 6704543 5650371 5175303 6129358 6584819 5996654 5717825 4612674 3347069
5302 3347069 3257875 4261054 4740400 5430873 5975198 5947474 6138902 7041269 7720189 8039654
5292 8039654 8244951 8236471 8081840 7889472 7671174 7911648 7810813 6988521 6553604 5953676
5282 5953676 5902042 5926279 5213849 4489336 4289037 4494177 4691187 4935950 5361451 5103427
5272 5103427 4867600 5190866 4636050 3783866 3586516 3228424 2768861 2755926 3337953 4205935
5262 4205935 4307152 4041633 4183238 5017955 6233753 6259760 5883410 6159299 6546723 5694567
5252 5694567 4383452 4489371 4919373 4442643 3716499 2921838 2540741 2893596 3317040
5243 3317040 3514255 3473386 3572741 3805462 3897253 3912554 4332642 4918314 4371960 4194781
5233 4194781 4838654 5615349 5331457 5813965 6922018 6563733 5634484 5281186 5035221
5224 5035221 5140874 4742640 4090037 3396753 2490723 1996976 2687922 3529358 2845102 1797506
5214 1797506 1226771 961135 648571 1057809 1453223 1302547 1428284 1523483 2116230 1989677
5204 1989677 1236208 571638 746347 855346 859060 1331466 1398569 1906807 2594852 2927960
5194 2927960 2440494 1794430 889199 1091605 2397472 3432882 3508891 3070828 2803138
5185 2803138 2637849 2488648 2295566 2330300 2768900 3748073 4974675 4663560 3143492
5176 3143492 1728228 1858688 2309181 2246430 1877930 1726330 1557851 2019806 2816572 2837696
5166 2837696 2195078 1512390 1348861 1259238 676769 443514 1488145 2191414 2411493 3028778
5156 3028778 3092381 3003515 2539512 2378999 2272101 2045331 1580500 1021446 1000892 1546503
5146 1546503 2006423 1440220 345121 -514528 221768 896827 1059084 1172874 1010994
5137 1010994 1147539 1575253 2402855 2959697 2537739 1489854 1324202 1700766 2332560
5128 2332560 2418569 1500684 928251 752873 193351 484009 1317736 1252543 485147 222402
5118 222402 145020 -5316 228697 543712 1276466 1952638 2075028 1958136 1855567 1827852
5108 1827852 1496987 946794 67256 -372743 -439160 77641 -25385 -147903 46094 -122955
5098 -122955 508512 1628302 2006720 1085592 -337525 -603928 -1072144 -1633782 -1488520
5089 -1488520 -2070932 -3097559 -3041205 -2165376 -1978090 -1672470 -1549174 -1784252 -1361465 -468265
5079 -468265 136171 143183 -572794 -433330 625079 1664138 2227611 2135837 1466063 1238355
5069 1238355 1355494 347277 -1172778 -1647967 -1262326 -848185 -334921 -330265 -344333 65109
5059 65109 392473 1407061 1213084 431780 17190 -35503 -387014 166569 350469 -24953
5049 -24953 472176 808934 900210 1701822 1943187 935784 688151 952210 453909 201056
5039 201056 -219578 -721249 -1226046 -1647808 -1711471 -2028886 -1709884 -1250995 -846056 -241477
5029 -241477 31208 135936 316505 768021 563284 6809 -149644 -351386 -1234665 -1565479
5019 -1565479 -563541 802327 797320 252677 -27463 -290330 -397885 -459283 -307989 -239830
5009 -239830 -99946 5835 -18837 -371018 -1218722 -1414586 -1293330 -1266068 -1247869 -1211131
4999 -1211131 -982072 -525670 -579837 -1166902 -781262 175469 339516 -39362 -716129 -667762
4989 -667762 373236 746667 650607 1202768 2233827 2699436 3050795 3198259 2313127 1215875
4979 1215875 1480273 1980176 1949156 2114849 1496001 891577 833797 1133225 967442 632664
4969 632664 519131 -299192 -873353 -191807 778735 1136174 558639 -503802 -1046179 -241218
4959 -241218 406442 311018 -75357 -400274 -111691 -63826 -469954 -527646 90252 654059
4949 654059 487801 126860 745526 1003307 1488965 1851585 2347385 2322101 1594390 1112563
4939 1112563 506616 243066 1145828 2153209 2136060 2503984 1854913 524041 40168
4930 40168 -174449 258092 498085 622152 662778 495510 432354 613001 1134877 1432365
4920 1432365 1522792 1018240 121304 -698137 -1507736 -1769607 -977174 276817 856084 1102346
4910 1102346 74457 -1128369 -1609138 -1261790 74933 898539 441738 418383 1126462
4901 1126462 999193 566201 230115 303654 40011 -697199 -957014 -390892 -202712 -554200
4891 -554200 -619491 -420493 169438 554816 457407 473923 681370 -73567 -1536931 -2362708
4881 -2362708 -2160174 -1750258 -1586729 -1632397 -1391845 -1130291 -1136453 -444091 -52584 -13780
4871 -13780 249081 -528778 -2137793 -2882182 -2377692 -2171792 -2287933 -2050764 -2102928 -2398680
4861 -2398680 -1981306 -912348 -331480 -188603 382191 1165129 1621784 1827807 1478540
4852 1478540 1231805 1372740 1055195 289494 -424967 -413256 -674422 -1268174 -2079666 -2981954
4842 -2981954 -2995348 -2599551 -2003630 -1403711 -1424422 -1539916 -1315597 -910080 -738029 -279118
4832 -279118 129447 403786 563813 366456 510300 889823 614088 399085 122112 57441
4822 57441 -133922 -604321 -449970 294385 1448688 1969609 1232336 1066628 932447 39702
4812 39702 -713232 -1570246 -1851366 -1020734 -105809 -216102 -450779 -813627 -974199 -1779454
4802 -1779454 -2690884 -2630006 -1585183 -91235 1203556 1308499 1320069 1673187 1937330
4793 1937330 1494354 193047 -476578 129708 351144 118958 -1116791 -1569276 -819774
4784 -819774 -724469 -534934 -480188 -3129 493569 353241 438657 402670 1034228 1251016
4774 1251016 605697 898793 1349705 1062736 470880 -22517 105463 200839 93413 21580
4764 21580 -608558 -730030 -151588 422601 796827 1262712 1322042 1043749 470843 -131482
4754 -131482 -424916 -749146 -947102 -1182261 -1580551 -1990905 -2012343 -1936799 -1554311 -1161134
4744 -1161134 -1663290 -1585355 -975016 -928690 -1454410 -1837280 -1661176 -1649230 -1378470 -871162
4734 -871162 -26504 344062 -485567 -1082388 -208106 1023462 959115 762979 1250946 1750268
4724 1750268 1261961 832060 378953 -557740 -1643152 -2106452 -1900071 -1745214 -1727838 -1398257
4714 -1398257 -1616715 -1882266 -826108 14413 -158179 -900990 -1559615 -1183614 -325861
4705 -325861 563831 1350908 1805120 1732686 1718521 1520340 355109 385870 847270 323548
4695 323548 58701 414267 463554 245329 -82142 -1229858 -1857409 -1158004 347821 957457
4685 957457 184895 -1243334 -2166403 -2160880 -2255994 -2783545 -2494275 -2846243 -2975680 -2418187
4675 -2418187 -2433063 -2164263 -1480791 -1272488 -1915068 -1988935 -2099719 -2393681 -2865707 -3366525
4665 -3366525 -3468225 -2977919 -2074141 -1268502 -740197 -1307493 -1992050 -2146213 -1735259 -1860913
4655 -1860913 -1962880 -1839665 -1536712 -1193626 -278078 518926 605241 930626 1177613 1066263
4645 1066263 17617 -1275150 -1592031 -1646226 -1294656 -486087 -285812 -527571 -619579 -779387
4635 -779387 -935724 -208873 748427 826615 329629 -817052 -1740020 -2163205 -1726498 -842673
4625 -842673 -566241 -103547 -45367 388567 830993 804158 -108579 -892835 -536408 -107611
4615 -107611 -531797 -847276 -857425 -1404881 -1715712 -1489678 -978997 -573975 -1290077 -1337943
4605 -1337943 -658988 -783628 -1230449 -1341491 -1762869 -1506251 -408060 -238986 -1058104
4596 -1058104 -1228607 -971808 -726848 -12555 154023 158682 369748 231077 -818482 -1043140
4586 -1043140 -460625 -818341 -1225772 -744500 -46943 455914 455151 -140552 -1383362 -2202878
4576 -2202878 -2083779 -2152042 -2204001 -2149642 -2120073 -1857551 -1124960 -318150 -539480 -788628
4566 -788628 53254 218739 -851184 -1416505 -700437 -172904 -774846 -1072677 -1005181 -664550
4556 -664550 -503738 -813609 -721746 -690061 -832790 -878179 -467249 -593938 -1024612 -793649
4546 -793649 -181786 37034 -509144 -988713 -1536429 -1560075 -1167073 -1311976 -1576778 -1611777
4536 -1611777 -1416271 -971074 -760966 -413301 -222745 -134476 166383 388060 430485 -550442
4526 -550442 -1645311 -1578001 -1508198 -1490826 -1080347 -367037 812333 937101 876783 660966
4516 660966 463251 -191457 -1329678 -1799644 -2059950 -2404529 -1863045 -1490912 -1625361 -910606
4506 -910606 11250 33236 497304 628598 -24503 -863483 -1556850 -1759267 -1852691 -1248478
4496 -1248478 -1017311 -1102266 -882527 -14114 808208 645261 169673 -107018 -149198 366590
4486 366590 1282564 909826 -536911 -1492935 -1868205 -1954195 -1886546 -1549127 -962745 -1360644
4476 -1360644 -1763360 -1284589 -439655 -157842 346475 259613 -237668 -739219 -505609 78624
4466 78624 554779 454508 -595932 -1273548 -894485 -68489 -342398 -1068037 -2424880 -2695382
4456 -2695382 -1963109 -1201231 14329 1310262 1709630 1030457 77022 -835908 -818352
4447 -818352 -359337 -78213 -257718 15099 1188988 1556665 1167624 438015 -304030 -1349772
4437 -1349772 -1695897 -988047 -578447 -1319316 -1532336 -1458054 -1725738 -1884916 -1171251 -602430
4427 -602430 -177141 835479 1311745 935856 776003 719550 434567 -340698 -736814 -200501
4417 -200501 -240735 -1037900 -1447366 -1456886 -1279175 -1319078 -1410886 -1335508 -1078413 -807942 -515568
4406 -515568 -499969 -1397796 -1944046 -1460789 -572768 -60798 -603411 -1610243 -2132928 -1890318
4396 -1890318 -1323292 -725843 -762630 -1157221 -1685391 -2387314 -2891033 -2433048 -1447818 -596328
4386 -596328 -375776 -1027612 -1399295 -896509 -984014 -2492731 -3596004 -2580250 -1071294
4377 -1071294 -416996 -396942 -259574 140767 73266 -73220 429087 1289639 2048478 2443536
4367 2443536 2157016 1937369 1707088 1271113 453988 408359 1092939 1091708 712948 742690
4357 742690 670138 843986 1348538 1819015 1895363 2006390 1571961 821222 417437 392551
4347 392551 -90184 -472890 -1153031 -2054404 -2177323 -1740560 -1236393 -840072 -1304714 -1171812
4337 -1171812 -535833 2583 467449 364333 743921 628216 687564 805329 283034 -738292
4327 -738292 -860083 -338264 -107577 336209 659331 439037 -273008 -836857 -1485784 -2132277
4317 -2132277 -1944949 -510171 -107890 -755408 -1337629 -989956 -109364 109047 165945 -218921
4307 -218921 -684738 -1006357 -612938 149171 1303172 1840528 1765392 1923884 2396232 2743993
4297 2743993 3275533 4292203 4337131 3743400 4089579 4114674 2573504 1716528 1825482 1235193
4287 1235193 490879 859636 1440058 1644468 1617189 1427021 1287774 1319616 947031 863866
4277 863866 1410379 1834335 1952907 1055127 -70682 -884595 -905284 -1277563 -1412360 -608457
4267 -608457 331415 663953 549105 451393 271835 50918 381411 1441562 1860813 1295868
4257 1295868 1247527 889900 322730 -699340 -1848344 -2218204 -2255885 -2258335 -1664723 -326295
4247 -326295 436613 503025 263287 -503212 -950130 -1144319 -866536 -183963 329304 98616
4237 98616 -307675 -144017 488833 1047081 505251 -211898 -910825 -1615641 -2311577 -2247954
4227 -2247954 -1308511 -264885 -18686 -109029 -130787 -346587 -426782 -218942 -85732 -819764
4217 -819764 -1729084 -1926369 -1381601 -1016450 -527583 513246 870950 686956 1331057 2132625
4207 2132625 2053301 1426285 290062 137528 401021 248217 -216610 -656680 -863735 -1044895
4197 -1044895 -1270815 -1200297 -1339440 -742453 -366923 -503700 -8974 -283890 -642978 -1007704
4187 -1007704 -1165665 -1060570 -938564 -982823 -637210 -86703 -849833 -1843561 -1652944 -344320
4177 -344320 250448 509185 457892 -517786 -1184514 -1251774 -2087872 -2965512 -3185960 -3037275
4167 -3037275 -3539133 -3823526 -3529083 -2585360 -1607229 -1653085 -1405761 -591553 -299207 -784125
4157 -784125 -1966628 -2148136 -1185425 -414970 -835537 -1273122 -1873976 -2964880 -3484143
4148 -3484143 -3282208 -2361228 -2086121 -2228429 -2610815 -3434329 -3566044 -2981542 -2100192 -1152301
4138 -1152301 -139909 736123 1142695 158459 -927905 -963407 -944411 -1780167 -2645798 -3382710
4128 -3382710 -3243845 -2503808 -1727436 -1240593 -1767437 -2020913 -1299140 -91071 54149
4119 54149 -418598 -363605 -950471 -2028707 -2509744 -2212713 -1507315 -1064448 -506359 26994
4109 26994 -506712 -1709818 -2133925 -2115177 -1747490 -1590029 -1383613 -1120120 -1036648 -1361295
4099 -1361295 -1780882 -2212705 -2038828 -1801850 -1157811 -678427 166255 -243919 -1356032
4090 -1356032 -1575828 -1321976 -1041647 -1551713 -2369950 -2849211 -3389956 -3549374 -2735825 -2125381
4080 -2125381 -2210010 -2303160 -2129868 -1921192 -1947302 -2230576 -1765675 -1173861 -1356670 -1537757
4070 -1537757 -1710555 -1695304 -1650089 -1530176 -2246345 -2160720 -1306231 -362729 -92789 -440065
4060 -440065 -344080 -425499 -867403 -1070243 -1073608 -1755673 -1703220 -1603676 -2040821 -2424648 -1464646
4049 -1464646 -449517 36370 533276 264280 -501785 -814043 -1225415 -1892304 -1825949 -1428220
4039 -1428220 -1140704 -914010 -1236251 -1616739 -2041905 -2312946 -2259816 -1741903 -1113535 -799010
4029 -799010 -753908 -1012663 -909370 -414154 -133355 31545 505055 343510 -339647 -137180
4019 -137180 1005958 2327745 2780468 1898943 599782 -1145842 -2256970 -2193650 -1987387
4010 -1987387 -1758389 -735174 -508640 -187026 174840 310171 148514 -100857 16373
4001 16373 188515 498103 485459 166502 534352 1484312 1734910 714972 -149366 -290665
3991 -290665 -1057857 -932737 -1096782 -1707360 -2377689 -2157399 -1154942 -857879 -1226843 -964450
3981 -964450 -508601 -178587 -174840 -58364 94604 172842 65314 -48278 -632092 -395906
3971 -395906 -554658 -2206185 -3072841 -2914723 -2310514 -1435887 -639664 -510249 -846984 -1367776
3961 -1367776 -1754783 -1529644 -1338902 -1622781 -1752874 -1120133 -430264 -455940 -1335425 -1890795
3951 -1890795 -1644542 -1395753 -1316285 -1234718 -930649 -395308 -225605 -408197 -296906 -858203
3941 -858203 -1435094 -2019977 -3350082 -4120336 -3720488 -3042967 -2277243 -1991012 -2371253 -2722421
3931 -2722421 -2816054 -2407428 -1474371 -515708 390691 888538 554385 -519607 -1169699 -1063793
3921 -1063793 -801252 -616286 -1255093 -1898582 -1816014 -760753 329826 -227167 -1017102
3912 -1017102 -1456676 -1936667 -2169095 -1959678 -1416437 -1115211 -1245689 -1953347 -2612814 -2149863
3902 -2149863 -521916 908258 1246685 148059 -562993 -311756 -276043 144663 664990
3893 664990 134071 -453444 -995264 -1380957 -637997 -861393 -1398922 -1356438 -1351203 -1475104
3883 -1475104 -1421746 -1368494 -1502607 -1194689 -670632 -684548 -806206 -1442852 -1541140 -1232318
3873 -1232318 -1107503 -1047274 -1029379 -575613 248516 446767 308829 547699 833263 657936
3863 657936 224687 502167 255948 -715735 -1213276 -1652331 -1891535 -1805865 -1032105 -481696
3853 -481696 -1142143 -2063952 -2228602 -2063116 -1632822 -911027 -4158 210106 131911 290341
3843 290341 214182 20443 -892180 -1161010 -986444 -1421577 -1789288 -1825332 -987994 -791806
3833 -791806 -2174224 -3390972 -2786166 -1802327 -1160453 -1203327 -1349621 -1007970 -726733 -802989
3823 -802989 -540967 -1129075 -1299400 -620344 -387953 -124199 524134 850873 1095350 1099460
3813 1099460 501653 1016775 1592441 1587057 1123470 1059814 1764234 1761295 1303308 1442199
3803 1442199 1140009 308600 -41184 58996 -837815 -1886037 -2311642 -1954978 -911792
3794 -911792 76346 223499 109604 -19800 -249473 -596154 -775406 -205085 -176205 50787
3784 50787 799610 300756 -648633 -1192046 -1514606 -926089 -541839 -655886 -1201905 -2692030
3774 -2692030 -3258821 -2816659 -1761769 -438324 -336617 -830747 -717887 -701094 -442517
3765 -442517 -1036792 -2699428 -3329120 -2150123 -1642440 -2172563 -2030643 -1266381 -71811
3756 -71811 152712 -152077 2709 -730968 -1619095 -1749126 -1568191 -1264463 -938835 -779296
3746 -779296 -934067 -1527444 -1788341 -1004648 29157 45002 208378 33136 -1012457 -1655219
3736 -1655219 -964793 -691237 -1516583 -1914266 -1380272 -819604 -762939 -321511 82199 557117
3726 557117 671117 -628551 -1532643 -1694074 -1323571 -1666415 -1639837 -1695442 -1681258 -976111
3716 -976111 -790843 -787940 -1371140 -2055181 -2322572 -2397152 -2190197 -1368607 -942472 -1273921
3706 -1273921 -1537213 -1488364 -1762593 -1257264 -1345413 -1357862 -1416860 -1731629 -1523543 -1007712
3696 -1007712 11123 1714519 2250978 732343 -326372 -320376 -290546 -971521 -1122531
3687 -1122531 -848443 -970166 -1526183 -1524047 -1108789 -1296925 -1318009 -1808597 -1860989 -1073673
3677 -1073673 -1303115 -1190616 -778117 -154664 185210 460785 203526 -43925 1319826
3668 1319826 2119867 2143276 1859816 1570642 1875374 1917507 1791152 1012986 262813 462133
3658 462133 432653 -269234 -1697027 -2518431 -2667634 -3125165 -3290431 -2748134 -1656381 -1203825
3648 -1203825 -1462834 -1832174 -1408731 -848471 -976773 -1097331 -1634451 -2786632 -2843683 -2524968
3638 -2524968 -2100101 -1792867 -2131425 -2124307 -2132793 -1980801 -1892097 -1925838 -1110866 -523698 -368914
3627 -368914 -1182761 -2190212 -1246795 223030 465998 -142888 -846972 -1457870 -1569797
$$ [...]
##END NTUPLES=NMR SPECTRUM
##END=
