##TITLE=C13_Pr 4966
 CDCl3, 21100 sc

 22.12.2020
##JCAMPDX= 6.0         $$ Bruker NMR JCAMP-DX V2.0
##DATA TYPE= NMR SPECTRUM
##DATA CLASS= NTUPLES
##ORIGIN= UXNMR, Bruker Analytische Messtechnik GmbH
##OWNER= root
$$ XWIN-NMR		Version 3.5
$$ Wed Dec 23 09:46:23 2020 Russian Standard Time (UT+4h)  she@DPX200
##.OBSERVE FREQUENCY= 50.327896
##.OBSERVE NUCLEUS= ^13C
##.ACQUISITION MODE= SIMULTANEOUS
##.ACQUISITION SCHEME= undefined
##.AVERAGES= 21100
##.DIGITISER RES= 17
##SPECTROMETER/DATA SYSTEM= spect
##.PULSE SEQUENCE= zgpg30
##.SOLVENT NAME= Pyr
##.SHIFT REFERENCE= (INTERNAL, Pyr, 0, 222.661)
##AUDIT TRAIL= $$ (NUMBER, WHEN, WHO, WHERE, WHAT)
$$ ##TITLE= Audit trail, XWIN-NMR		Version 3.5
$$ ##JCAMPDX= 5.01
$$ ##ORIGIN= Bruker BioSpin GmbH
$$ ##OWNER= she
$$ F:/spectra/data/she/nmr/c13/1/pdata/1/auditp.txt
$$ ##AUDIT TRAIL=  $$ (NUMBER, WHEN, WHO, WHERE, WHAT)
(   1,<2020-12-23 09:44:07.40 +0400>,<she>,<DPX200>,
      <created by zg, POWCHK disabled, PULCHK disabled
       terminated by command 'halt'
       configuration hash MD5:
       00 E9 B6 7A A2 85 ED C7 34 08 36 98 17 FE 4E 26
       data hash MD5: 32K
       6F A7 69 25 31 B5 71 EA C5 F3 A1 9A 31 A4 B6 73>)
(   2,<2020-12-23 09:44:11.82 +0400>,<she>,<DPX200>,
      <Start of raw data processing
       efp BC_mod = 2 LB = 1 FT_mod = 6 PKNL = 1 PHC0 = -284.4382 PHC1 = 37.36242 SI = 32K 
       data hash MD5: 32K
       D5 A6 9E 3F BB 1A 4A F5 FC 1C D5 4F 96 E6 8E FD>)
(   3,<2020-12-23 09:44:19.68 +0400>,<she>,<DPX200>,
      <abs ABSG = 5 
       data hash MD5: 32K
       AF FA 9F 50 7D BA C8 5C B0 73 A0 12 BF D7 4F 39>)
(   4,<2020-12-23 09:45:02.82 +0400>,<she>,<DPX200>,
      <pk PHC0 = 18.86923 PHC1 = -10.2 
       data hash MD5: 32K
       50 5E 28 A7 C3 AA 56 D1 4F B3 58 91 AD 60 66 7E>)
(   5,<2020-12-23 09:45:06.32 +0400>,<she>,<DPX200>,
      <abs ABSG = 5 
       data hash MD5: 32K
       9C 5E 49 46 0B 59 B9 21 93 CB D9 88 A9 29 C6 CA>)
(   6,<2020-12-23 09:45:33.89 +0400>,<she>,<DPX200>,
      <pk PHC0 = 0.2418483 PHC1 = 0 
       data hash MD5: 32K
       1F D4 82 F5 59 E5 66 C6 C6 5E 6D 31 63 5F 88 04>)
$$ ##END=
$$ 
$$ hash MD5
$$ F1 FC 86 3A F3 C2 91 E7 C4 2B 12 9B F0 12 0F 6D
##$RELAX= 
##$RELAX= 
##$RELAX= 
##$RELAX= 
##$RELAX= 
##$RELAX= 
##$RELAX= 
##$RELAX= 
$$ Bruker specific parameters
$$ --------------------------
##$DU= <F:/spectra>
##$EXPNO= 1
##$NAME= <c13>
##$PROCNO= 1
##$TYPE= <nmr>
##$USER= <she>
##$AMP= (0..31)
100 100 100 100 100 100 100 100 100 100 100 100 100 100 100 100 100 100 
100 100 100 100 100 100 100 100 100 100 100 100 100 100 
##$AQSEQ= 0
##$AQ_mod= 1
##$AUNM= <au_zg>
##$AUTOPOS= <>
##$BF1= 50.322709
##$BF2= 200.13
##$BF3= 50.322709
##$BF4= 500.13
##$BF5= 500.13
##$BF6= 500.13
##$BF7= 500.13
##$BF8= 500.13
##$BYTORDA= 1
##$CFDGTYP= 0
##$CFRGTYP= 5
##$CHEMSTR= <none>
##$CNST= (0..31)
1 1 145 1 1 1 1 1 1 1 1 1 1 1 1 1 1 1 1 1 1 1 1 1 1 1 1 1 1 1 1 1 
##$CPDPRG= <waltz16>
##$CPDPRG1= <>
##$CPDPRG2= <waltz16>
##$CPDPRG3= <>
##$CPDPRG4= <mlev>
$$ [...]
##$SUBNAM4= <"">
##$SUBNAM5= <"">
##$SUBNAM6= <"">
##$SUBNAM7= <"">
##$SUBNAM8= <"">
##$SUBNAM9= <"">
##$SW= 239.972175391363
##$SWIBOX= (0..15)
0 1 3 0 0 0 0 0 0 0 0 0 0 0 0 0 
##$SW_h= 12077.2946859903
##$TD= 32768
##$TD0= 1
##$TE= 0
##$TE2= 300
##$TE3= 300
##$TEG= 300
##$TL= (0..7)
120 120 120 120 120 120 120 120 
##$TP= (0..7)
150 150 150 150 150 150 150 150 
##$TP07= 0
##$TPNAME0= <>
##$TPNAME1= <>
##$TPNAME2= <>
##$TPNAME3= <>
##$TPNAME4= <>
##$TPNAME5= <>
##$TPNAME6= <>
##$TPNAME7= <>
##$TPOAL= (0..7)
0.5 0.5 0.5 0.5 0.5 0.5 0.5 0.5 
##$TPOFFS= (0..7)
0 0 0 0 0 0 0 0 
##$TUNHIN= 0
##$TUNHOUT= 0
##$TUNXOUT= 0
##$USERA1= <user>
##$USERA2= <user>
##$USERA3= <user>
##$USERA4= <user>
##$USERA5= <user>
##$V9= 5
##$VALIST= <valist>
##$VCLIST= <CCCCCCCCCCCCCCC>
##$VD= 0
##$VDLIST= <DDDDDDDDDDDDDDD>
##$VPLIST= <PPPPPPPPPPPPPPP>
##$VTLIST= <TTTTTTTTTTTTTTT>
##$WBST= 1024
##$WBSW= 4
##$XGAIN= (0..3)
0 0 0 0 
##$XL= 0
##$YL= 0
##$YMAX_a= 110180059
##$YMIN_a= -91467913
##$ZGOPTNS= <>
##$ZL1= 120
##$ZL2= 120
##$ZL3= 120
##$ZL4= 120
##$ABSF1= 222.6606
##$ABSF2= -17.33621
##$ABSG= 5
##$ABSL= 3
##$ALPHA= 0
##$AQORDER= 0
##$ASSFAC= 0
##$ASSFACI= 0
##$ASSFACX= 0
##$ASSWID= 0
##$AUNMP= <proc_1d>
##$AZFE= 0.1
##$AZFW= 0.5
##$BCFW= 0
##$BC_mod= 2
##$BYTORDP= 0
##$COROFFS= 0
##$CY= -3
##$DATMOD= 1
##$DC= 0
##$DFILT= <>
##$DTYPP= 0
##$F1P= 0
##$F2P= 0
##$FCOR= 0.5
##$FTSIZE= 32768
##$FT_mod= 6
##$GAMMA= 0
##$GB= 0
##$INTBC= 1
##$INTSCL= 4.134877e-10
##$ISEN= 128
##$LB= 1
##$LEV0= 0
##$LPBIN= 0
##$MAXI= 10000
##$MC2= 0
##$MEAN= 0
##$ME_mod= 0
##$MI= 0.1934396
##$NCOEF= 0
##$NC_proc= 2
##$NLEV= 6
##$NOISF1= 120.0001
##$NOISF2= 80.00006
##$NSP= 0
##$NTH_PI= 0
##$NZP= 0
##$OFFSET= 222.6606
##$PC= 1.4
##$PHC0= -265.3271
##$PHC1= 27.16242
##$PH_mod= 1
##$PKNL= yes
##$PPARMOD= 0
##$PSCAL= 0
##$PSIGN= 0
##$REVERSE= no
##$SF= 50.3227297554925
##$SI= 32768
##$SIGF1= 140
##$SIGF2= 120
##$SINO= 11.81781
##$SIOLD= 32768
##$SREGLST= <13C.CDCl3>
##$SSB= 0
##$STSI= 32768
##$STSR= 0
##$SW_p= 12077.2946859903
##$SYMM= 0
##$S_DEV= 0
##$TDeff= 32768
##$TDoff= 0
##$TI= <>
##$TILT= no
##$TM1= 0
##$TM2= 0
##$TOPLEV= 0
##$USERP1= <user>
##$USERP2= <user>
##$USERP3= <user>
##$USERP4= <user>
##$USERP5= <user>
##$WDW= 1
##$XDIM= 32768
##$YMAX_p= 401872287
##$YMIN_p= -2383308
$$ End of Bruker specific parameters
$$ ---------------------------------
##NTUPLES= NMR SPECTRUM
##VAR_NAME=  FREQUENCY,     SPECTRUM/REAL,   SPECTRUM/IMAG
##SYMBOL=    X,             R,               I
##VAR_TYPE=  INDEPENDENT,   DEPENDENT,       DEPENDENT
##VAR_FORM=  AFFN,          ASDF,            ASDF
##VAR_DIM=   32768,         32768,           32768
##UNITS=     HZ,            ARBITRARY UNITS, ARBITRARY UNITS
##FACTOR=    0.368581032318806, 1,           1
##FIRST=     11204.8891383381, 0,            0
##LAST=      -872.405547652183, 0,           0
##MIN=       -872.405547652183, -2383308,    0
##MAX=       11204.8891383381, 401872287,    0
$$ Real data points
##PAGE= N=1
##DATA TABLE= (X++(R..R)), XYDATA
$$ [...]
18030 379842 133243 -331924 -680778 -596497 -384873 -25412 225597 -172660 -238371 269608
18020 269608 679104 511635 77766 131658 134445 238965 92549 -220803 -380899 -420212
18010 -420212 -916386 -1213921 -795643 -531953 -214478 -164974 125917 359294 262465 155692
18000 155692 -77624 216214 633163 632652 143488 -255319 -15707 418523 582530 637146
17990 637146 393848 -152580 -369678 94765 490153 708197 518985 342689 408800 25754
17980 25754 -569785 -943304 -996629 -803091 -679806 -922738 -1089902 -1041903 -1153620 -942268
17970 -942268 -472825 -202145 -302521 -671751 -1030339 -1180233 -1086167 -1008604 -1070657 -744810
17960 -744810 -157776 223920 285055 272528 154679 113383 279812 -83664 -498756 -478009
17950 -478009 -646122 -496401 -283537 -95585 386990 821129 883045 989770 799241 5415
17940 5415 -579536 -652714 -378912 81084 73109 -340413 -712621 -448291 55783 208376
17930 208376 58775 -408506 -755062 -670187 -569219 -774403 -711376 -672500 -698684 -682801
17920 -682801 -555773 1788 506910 719302 827977 747022 435174 225409 9858 -17449
17910 -17449 -76722 -323949 -354870 -515775 -500391 -380112 -211769 -128277 -172590 63564 -38998
17899 -38998 -246734 20549 159207 140104 -147328 -481981 -354107 -351605 -149613 279744
17889 279744 552571 562757 -7137 -346604 -405739 -739125 -1001666 -884059 -509027 -173765
17879 -173765 -164298 -460310 -619675 -541038 -650850 -259815 -49532 -135240 -181748 -239602 -292603
17868 -292603 -328952 -326301 -521858 -726732 -560926 -363995 -243301 -463714 -911887 -1060659
17858 -1060659 -688184 -232377 -186011 -498952 -563630 -559853 -718589 -1292822 -1370989 -810606
17848 -810606 -217584 80425 89345 448635 1067643 1387420 1121581 633553 365586 16956
17838 16956 -428684 -911421 -1257054 -1035538 -561280 -266767 90974 147814 5161 398034
17828 398034 627734 371311 -40429 -52016 611490 1255867 1551992 1362505 923859 302006
17818 302006 175060 773326 1148255 1445824 1294150 833044 559098 580985 740538 851753
17808 851753 989192 1142713 1006272 889245 1150284 1283937 889877 468631 -19399 -369317
17798 -369317 -164714 179606 314205 374733 231102 79098 186330 31222 17473 171025
17788 171025 113870 -168860 -416763 -763842 -848130 -733729 -476379 -130097 -166068 -104629
17778 -104629 -309768 -695010 -564934 -162913 -11537 -10639 -181353 -453225 -585403 -375459
17768 -375459 -74943 87522 -12172 -143908 -304636 -325971 -313429 -200893 -236556 -239821 19061
17757 19061 386126 509433 283720 -381510 -1013187 -1086555 -1016362 -859048 -529377 -615227
17747 -615227 -486492 -10537 -184519 -656585 -829475 -772867 -840452 -868219 -483529 51383
17737 51383 -78944 -478766 -468512 135173 653829 1127991 1155760 915655 414221 -84205
17727 -84205 -204121 157303 579253 862913 585689 89016 374605 901404 901017 610624
17717 610624 440812 -2446 -457628 -531518 -611795 -838397 -1190688 -1335884 -1065305 -636737
17707 -636737 -439758 -624626 -542296 -788070 -976855 -605111 -304148 -653205 -552585 -259818
17697 -259818 -204542 116082 330812 167193 -95831 -34477 50116 118764 24180 -109130
17687 -109130 -138065 -242702 -263003 282148 679895 734006 103613 -223245 -375102 -884743
17677 -884743 -1296660 -1373035 -972013 148108 714331 615874 369237 -186293 -192565 211971
17667 211971 -25427 -528402 -950730 -1033952 -1223622 -999051 -702807 -1020452 -905425 -413093
17657 -413093 -445614 -595716 -454338 -605788 -862277 -1076722 -1093284 -794295 -671868 -516789
17647 -516789 -340565 -221059 -222570 -339241 -251111 -342857 -433469 -335256 132463 267969 -125240
17636 -125240 -553286 -722958 -914807 -973630 -1215223 -1459739 -1434353 -1287416 -1058943 -806932
17626 -806932 -842589 -872100 -730152 -247942 131744 178113 31448 282839 540008 860217
17616 860217 1418989 1431519 841554 560478 273863 -466779 -606843 -339771 -499723 -527628
17606 -527628 -201107 60688 221654 363052 251676 365836 198414 159333 85247 -14030
17596 -14030 -359259 -465233 -175688 -224911 -284714 -223957 -225771 -312713 -337523 43351 372700
17585 372700 543783 649135 841060 1188622 966292 680033 581229 319700 291512 445602
17575 445602 624082 693120 698107 297495 -85360 -52341 97273 168974 138484 26878 265136
17564 265136 294437 -101805 -483995 -773044 -823389 -860241 -983803 -990697 -582086 -7118
17554 -7118 270112 95215 -68518 -57377 14827 244265 431616 200260 137045 400770
17544 400770 577039 439619 -153018 -671825 -628619 -556274 -305171 142961 514057 274927
17534 274927 -220097 -494063 -443666 -436390 -828415 -909674 -250120 448183 438357 57354 -121981
17523 -121981 69564 263296 38212 -422900 -673062 -739802 -1012072 -1080096 -1048426 -779790
17513 -779790 -537716 -671843 -872030 -734623 -423677 -3566 452134 531896 427357 311517
17503 311517 471069 512701 291633 257402 105645 -135153 -450923 -731844 -649153 -536906
17493 -536906 -465788 214618 844221 1108373 997218 932563 868711 927304 900489 745863
17483 745863 869366 1081982 944260 563345 133315 379248 801934 842660 507968 -118695
17473 -118695 -510125 -533277 -585306 -601510 -158236 272529 742934 1280609 904270 305482
17463 305482 150221 531078 276068 -340046 -926696 -1190913 -755523 83767 392663 333326
17453 333326 134803 -276905 -556498 -873748 -730819 -549717 -545123 -475430 -350178 184612
17443 184612 610949 389956 322159 361996 122575 -473 4776 6150 -103642 -271478 -204991
17432 -204991 -353131 -309064 -163537 -175636 -123032 138915 170574 181426 7533 -491719
17422 -491719 -904520 -1235130 -1624399 -1868321 -1452517 -864126 -224214 468467 813545 1324334
17412 1324334 1513845 1209779 618004 -171436 -794590 -635350 -233658 -50248 248653
17403 248653 522049 356958 259375 314886 369139 679270 715655 407233 307727 421904
17393 421904 518054 697809 648060 217921 -11675 54860 57704 -197011 -655739 -795834
17383 -795834 -606105 -327175 -281919 -336642 -87385 392674 946752 1202510 1101258 907745
17373 907745 602483 236783 141127 464074 720233 655630 509751 302266 330469 790819
17363 790819 1159789 1056911 851423 652463 211958 -385385 -758295 -994234 -835717 -699368
17353 -699368 -749161 -582728 -305969 -266849 -222187 -137295 178044 435240 188856 -154391
17343 -154391 -256179 -136779 -125471 -102847 -62763 -183496 -205440 -264139 -112470 -79322 -553767
17332 -553767 -1095093 -1422151 -1477080 -1318393 -1361621 -1381116 -1162196 -1009275 -700427 -435816
17322 -435816 -553393 -617820 -276112 21631 3884 -283204 -135434 -152872 -337831 -270814
17312 -270814 40867 -44368 -181556 -405120 -457800 -246218 -240747 -354670 -789220 -989516
17302 -989516 -808803 -609212 -432925 -122942 -190577 -278201 -114136 -86794 -260637 -390619
17292 -390619 -411910 -556073 -751950 -918827 -1144666 -885299 -545315 -624921 -588499 -470672
17282 -470672 -280197 -24652 151047 176369 100115 772 196024 153227 -190185 106317
17272 106317 438211 472808 461202 554671 744359 967704 1054384 1026369 721308 500117
17262 500117 221182 -152606 -159873 -17946 -132095 -5200 243959 339517 688767 654277
17252 654277 287309 154009 338381 577301 300108 37638 141666 119931 -236274 -34007
17242 -34007 335793 453463 905217 1079231 821229 566932 619974 676183 833413 1023167
17232 1023167 511450 -205596 -723518 -417372 97077 -240665 -509293 -397764 -251778
17223 -251778 -187789 42491 358455 224707 94482 -81012 -67346 2723 147 92539 298007
17212 298007 490743 94116 -187208 -89385 81620 23603 144258 588416 537938 254208
17202 254208 369903 331671 -49343 -170893 -19638 310448 358094 379587 398551 156902
17192 156902 -34171 -127120 -424445 -462101 -444544 -602153 -722431 -1022119 -1257809 -1039761
17182 -1039761 -861480 -1035662 -913217 -692289 -772459 -596776 -160780 4487 31217 49977
17172 49977 310196 631498 562029 260791 106636 191559 542143 439127 276602 233284
17162 233284 430570 793987 781449 143808 -213319 -90568 -184214 -247392 -376877 -453776
17152 -453776 -406502 -390814 -248730 -282610 -426334 -659240 -1157813 -1396445 -1167411 -722826
17142 -722826 -428664 -439430 -252603 151811 113052 -263297 -595246 -645960 -415673 -535102
17132 -535102 -487339 -527689 -470972 -175193 -74105 367218 1077108 1130858 773520 551050
17122 551050 464213 185711 -355147 -1098528 -1523721 -1370742 -1151006 -1012890 -1025869 -1038751
17112 -1038751 -1063067 -1038191 -919195 -531482 -137688 124887 344712 318609 30012 -331903
17102 -331903 -443605 -493630 -387617 -181814 -62520 -193052 -456950 -293459 -174664 -20091
17092 -20091 10599 -427954 -843697 -1185465 -1162947 -663482 -501807 -545510 -760015 -791450
17082 -791450 -729521 -712443 -360766 138609 186321 57910 384355 898646 650920 558273
17072 558273 514205 201533 -90581 -29200 86661 -12192 -276340 -146865 252160 233012
17062 233012 372937 564298 630095 421876 134991 90619 156936 201785 137265 -360954
17052 -360954 -676924 -568406 -113670 453049 836175 754395 614838 165341 -115074 -349476
17042 -349476 -589526 -350992 -223805 -471841 -433577 -322666 -584124 -566971 -39104 250160
17032 250160 282314 333699 166639 -397416 -934446 -1043829 -1282485 -1148751 -1091150 -1165835
17022 -1165835 -685191 -482820 -730987 -417905 -43643 550214 1209513 1295577 1179993 955709
17012 955709 674883 601016 775334 576064 487348 377333 806872 817114 266273 1959
17002 1959 -38939 -274461 -484850 -827411 -1323977 -1788798 -1612232 -1370990 -1207813 -1033695
16992 -1033695 -385597 282996 380805 252746 404649 785535 982987 1008685 481373 -332077
16982 -332077 -855512 -1080758 -984234 -1147963 -1519873 -1483482 -1085147 -727645 -694732 -571812
16972 -571812 -419576 -253618 -211715 -355837 -467986 -713451 -757481 -444808 -492054 -392303
16962 -392303 -762694 -1110620 -813641 -298689 -213854 -667028 -1006568 -1182477 -1181002 -726127
16952 -726127 -258900 -16633 354217 687604 320029 189787 -67440 -652507 -860785 -939290
16942 -939290 -642371 -39422 116129 278776 626888 841585 787983 947370 697157 633329
16932 633329 647611 687918 762721 405381 154851 12315 -217279 -484152 -696555 -808633
16922 -808633 -1023845 -1143461 -750060 -558875 -648966 -744108 -524540 -405616 -686859 -994444
16912 -994444 -811703 124099 723733 613084 929149 1545558 1317052 772823 451302 495476
16902 495476 588321 394058 -36831 -345723 -36956 152385 196911 327987 517251 455546
16892 455546 126478 323902 692202 796474 885664 890269 728901 662153 727351 866750
16882 866750 983346 380539 -151117 -225641 -226234 -365136 -523704 -621715 -447578 -188027
16872 -188027 188780 584551 665394 288224 -136332 -179709 96623 510536 907540 1217405
16862 1217405 950955 261995 -116265 -407133 -788536 -887942 -828161 -1043024 -1254306 -1065288
16852 -1065288 -886007 -749938 -365648 -2356 -276711 -741746 -1088814 -941266 -654703
16843 -654703 -698242 -790087 -795054 -806631 -688805 -431859 -251346 109987 -33543 -548835
16833 -548835 -661797 -149293 350372 328333 271009 356332 127331 -210867 -224179 -263643
16823 -263643 -395071 -837384 -1009485 -765264 -404482 -38755 363105 402121 320979 473747
16813 473747 680389 426949 128505 76808 -452591 -1038192 -1266920 -1200091 -957759 -1154682
16803 -1154682 -1531760 -1189928 -950773 -721895 -452729 -213912 -110361 -580059 -962418
16794 -962418 -935515 -865792 -405418 434634 1241399 1489740 962250 350280 132851 246228
16784 246228 406245 855598 977061 1010295 932510 839778 370245 106537 143898 -86562
16774 -86562 147344 797258 896562 439262 54501 -101144 -327402 -206212 241304 536068
16764 536068 382537 -74611 -83419 -143011 -191019 -499157 -906171 -982169 -841631 -807956 -665546
16753 -665546 -694674 -771729 -782654 -921004 -843226 -644725 -355214 96898 593737 675456
16743 675456 804502 773150 1050562 1275415 586201 -446341 -646808 -229390 -113644 123070
16733 123070 175534 -181502 -515742 -189735 456694 341055 127597 213280 229719 -227762
16723 -227762 -932487 -997678 -743037 -562709 -459252 -509164 -685994 -882183 -1024191 -817374
16713 -817374 -286162 41293 67903 166010 388371 396019 143425 -265523 -191768 243181
16703 243181 130282 -345156 -629240 -469728 -239594 -37797 219196 287621 129840 125190
16693 125190 153329 113355 37378 -298373 -616226 -285634 229932 395073 339008 164435
16683 164435 62867 135001 176102 1028 -73701 -243296 -474157 -547028 -580181 -514950 -482252
16672 -482252 -311079 -233593 -214327 -72282 -97835 -327679 -254843 62772 358957 510728
16662 510728 631889 316698 -151301 -296551 -122313 -166505 -145709 -94528 -226793 -339556
16652 -339556 -558904 -787234 -765961 -680493 -1060627 -1377306 -1061526 -446867 188182 50831
16642 50831 -301652 -293390 -328224 -59867 445699 363648 -31432 -227351 -217593 6001 230662
16631 230662 362278 586712 585845 126176 162833 392921 275456 451981 468977 48039
16621 48039 -135184 -25885 483211 809395 667275 314277 219192 397033 574084 478502
16611 478502 463254 302428 179493 214329 38556 161038 261512 -202474 -787145 -539062
16601 -539062 -127506 -112166 1111 -62826 -60598 347864 702356 850731 571755 339603
16591 339603 30750 63399 148211 -199334 -279230 -5376 247940 193900 -97713 -312617
16581 -312617 -536428 -911283 -1094581 -1047994 -967896 -551592 94228 -84879 -367817 -469694
16571 -469694 -734990 -1012770 -613969 -346297 -205869 -34016 -321564 -509249 -13816 163483
16561 163483 80256 406334 827950 898743 385435 163671 337899 531899 1007494 841952
16551 841952 353537 124178 203557 555386 413288 155519 -340333 -830056 -866869 -967113
16541 -967113 -998562 -751658 -189636 535590 1001010 868395 744869 790339 943307 679509
16531 679509 237303 200279 131294 -19148 -209296 117920 233389 64366 -65681 127023
16521 127023 818682 1297835 1073619 798180 627576 248451 -7059 -293211 -625533 -406985
16511 -406985 -195883 -118918 -45649 -39723 169908 364095 -151805 -571006 -414333 338581
16501 338581 750636 528553 112675 -303743 -482635 -340876 157346 326502 -29584 -147964
16491 -147964 -54044 -4869 15931 85691 196369 314371 363949 326487 333052 815417 558945
16480 558945 -13331 -68297 97756 150733 328483 534757 390329 478208 566470 691465
16470 691465 602600 505461 403363 213425 268410 483784 347245 265104 326084 98496
16460 98496 84432 188369 263674 -10825 -305013 -306200 300005 880963 950963 870061 581600
16449 581600 85685 182381 551351 569320 430792 506592 454264 80599 -211880 -461118
16439 -461118 -388611 -387700 -191183 194934 436165 567008 702048 8047 -672589 -583763
16429 -583763 -478021 -405238 137832 286970 102035 88391 -25030 -43979 -37450 -356254
16419 -356254 -670000 -428314 51977 315053 627384 475900 -243837 -965152 -1028675 -581785
16409 -581785 -370022 -217981 -153779 -30876 135827 137494 86769 -12112 -96664 -159440 -34882
16398 -34882 482696 604695 218685 57383 135253 269838 355413 512782 498418 408009
16388 408009 66528 -497861 -768694 -545838 -106886 113236 -128848 -507019 -679350 -309487
16378 -309487 13692 -212281 -521370 -350026 -210384 -427037 -467038 -633280 -962635 -988877
16368 -988877 -851606 -481814 -115257 68444 67010 30352 -57712 -189156 -663687 -1353748
16358 -1353748 -1355588 -973194 -657076 -441519 -345897 -97711 -314587 -688523 -730218 -748360
16348 -748360 -678163 -658234 -243793 61249 -138275 -471331 -169308 -53986 -296996 -249138
16338 -249138 -156996 37589 193844 333463 350843 168144 220263 -167456 -635435 -481312
16328 -481312 -311070 -278061 -189689 -215606 -361489 -480441 -413843 -271181 -649780 -980259
16318 -980259 -810876 -607959 -84987 29093 -398738 -445926 -689149 -867200 -696924 -785470
16308 -785470 -911728 -685300 -546602 -315833 -150984 -129039 -417234 -1191466 -1808953 -1847376
16298 -1847376 -1276715 -1024637 -1245586 -1579920 -1606319 -1362564 -1364194 -1448844 -1424933 -1493248
16288 -1493248 -1542894 -1269641 -815323 -564234 -411766 -230062 -663385 -825071 -809818 -736540
16278 -736540 -607433 -467977 -256964 -239435 72837 298740 -359 -98362 65502 549919
16268 549919 903730 774419 397430 95127 267692 399572 400783 236240 146567 344425
16258 344425 588184 406175 -113733 -403752 -159911 14658 -46363 -298685 -437798 -302258
16248 -302258 -327215 -30955 345118 379777 -5110 -286822 -330061 -625000 -1006577 -1077868
16238 -1077868 -704777 -459399 -684072 -612179 -609301 -393283 431954 838894 1085308 943291
16228 943291 595856 380272 252326 271711 158613 -28670 -86733 -70069 -269995 -84186
16218 -84186 274239 436728 423185 289458 174998 160791 490984 735823 512701 460181
16208 460181 395918 -100109 -270847 -100601 -258457 -350309 -304990 -318081 -241461 -115335
16198 -115335 -102428 8743 269289 165680 -161440 -190013 -104721 23132 -52066 -197709
16188 -197709 -280029 -380578 -362205 -214583 -202843 -395570 -597574 -612929 -309848 -207409
16178 -207409 -150709 -9344 -7402 -222201 -430676 -519651 -279035 66641 223467 -144009
16168 -144009 -465217 -475269 -622494 -634195 -268893 -94416 -68272 21550 -484146 -1159604
16158 -1159604 -985843 -507121 -288093 -133794 -74263 -311764 -488310 -85306 362981 400877
16148 400877 8297 -123153 158092 462253 531281 385596 147063 -243367 -512527 -800167
16138 -800167 -922832 -662252 -318880 -425505 -655373 -529423 -117501 124269 -48933 -383742
16128 -383742 -51420 277318 660747 1032346 1032197 661099 397198 538594 390906 420264
16118 420264 656013 691209 572623 164636 279030 616153 349225 -83722 -688078 -974021
16108 -974021 -1085083 -1864563 -1957365 -1402266 -1400101 -1678456 -2016136 -2058056 -1341012 -295447
16098 -295447 -24636 -499225 -679546 -683761 -1000539 -1249381 -1318670 -799139 -171577 383528
16088 383528 462999 -188396 -1275169 -2011982 -2204471 -1959186 -1916585 -2020449 -1484176 -961512
16078 -961512 -461933 -162848 -249262 49570 25593 -42196 -55965 133131 -96068 -195046
16068 -195046 -90921 -459945 -998678 -1313263 -730918 -184080 47226 -299991 -962939 -1208198
16058 -1208198 -932505 -726330 -829840 -831637 -553690 -317658 -238251 -385646 -237110 60797
16048 60797 142644 -120774 -489227 -775273 -908869 -825132 -729234 -982466 -1264708 -1552814
16038 -1552814 -1629195 -1434425 -1475473 -1622283 -1097689 -781243 -972416 -887348 -920056 -1067696
16028 -1067696 -971317 -750807 -513058 -359436 -36497 199099 192164 458571 616744 470250
16018 470250 202633 -480634 -741482 -913524 -1003447 -1061572 -1139764 -978033 -777455 -534897
16008 -534897 -138617 -68910 -456650 -815182 -782634 -479851 -158766 34875 149179 234318
15998 234318 700445 1104091 412694 -84810 -1943 -251154 -546932 -463802 -54146 549958
15988 549958 595677 -80591 -798603 -881613 -557625 -178192 165040 558319 631020 243312
15978 243312 -15170 124734 33617 28354 368768 542309 538357 254500 245671 642261 929959
15967 929959 821845 588861 483294 228827 -150300 -338523 -745784 -1141692 -1223820 -1030372
15957 -1030372 -631184 -381733 -366147 -451094 -579317 -761853 -1067815 -1542592 -1731784 -1648769
15947 -1648769 -1583514 -1233518 -714133 -116441 299536 498821 535631 648413 550556 183640
15937 183640 -307588 -451788 -240852 -283350 -279529 -335243 -230835 -227214 -224200 113681 240350
15926 240350 134585 370052 437696 62555 -93315 -67393 -279925 -390264 -318820 -321991
15916 -321991 54813 663203 775758 636810 591131 734340 670530 338810 -235429 -279509
15906 -279509 -153671 289859 763329 818061 618492 740764 1281412 1645092 1513841 1176010
15896 1176010 666305 453091 500335 549929 449881 671212 369097 -377167 -887722 -1507810
15886 -1507810 -1707189 -1703571 -1560470 -1197465 -906163 -846112 -732806 -696528 -860970 -1010274
15876 -1010274 -870069 -713594 -593740 -714517 -895960 -1057697 -1184584 -898200 -187342
15867 -187342 244089 367620 291639 71474 -304540 -665926 -641204 -504353 -572688 -312507
15857 -312507 406318 568729 149469 -638762 -794641 -886562 -975668 -712436 -263927 6874
15847 6874 17735 -27463 69226 -63004 -474758 -673960 -759444 -634494 -468698 -621464 -982163
15836 -982163 -1030623 -447024 -312679 -744594 -887041 -731957 -723204 -605139 54417 331884
15826 331884 400037 378669 -13298 -36073 560804 1158515 1535242 1464416 1357913 1037757
15816 1037757 222327 -235012 -191500 -283629 -691490 -893572 -701218 -807562 -987743 -740771
15806 -740771 -457584 -607233 -540573 -320113 -196786 -115773 -302144 -274696 -132530 -228616
15796 -228616 -277664 -205139 -6578 115936 4225 -355185 -564914 -258597 117975 169448
15786 169448 231714 54026 -49453 114115 498860 499476 378549 637759 819374 451155
15776 451155 33946 144624 537101 608989 376084 436686 348215 37868 124641 349803
15766 349803 344259 35134 148378 199519 -281333 -943638 -987690 -582294 -643975 -880621
15756 -880621 -700117 -518248 -692538 -474152 -121642 164420 -53289 -529025 -769736 -626845
15746 -626845 -146933 -69567 -28582 -120311 -776415 -857569 -241597 344909 270430 71357
15736 71357 -22751 138082 660582 1263442 1462417 1426660 1219700 1162620 973269 341104
15726 341104 -167069 -409738 -361688 -378332 -563759 -601941 -951979 -1039826 -814636 -672019
15716 -672019 -439806 -450683 -826559 -1113201 -1364997 -1444085 -1029999 -708539 -369690 -226460
15706 -226460 28916 363842 260727 -214041 -705799 -877603 -989207 -913756 -523792 -116610
15696 -116610 493024 424768 -36016 -236396 -189905 -196856 -312153 -371129 -498895 -507687 -346794
15685 -346794 -228310 -360954 -689017 -956650 -860590 -478180 118879 422512 248737 318153
15675 318153 273975 204313 266941 14422 -207718 -95254 42692 -49228 -492542 -888995
15665 -888995 -510768 -692552 -826329 -402676 -20176 324991 594400 758869 361250 -208517
15655 -208517 -581386 -594630 -432627 -26911 199096 62951 -1797 28649 259483 431011
15645 431011 409830 898498 1289308 1070214 1039850 984494 413446 -264997 -584547 -583308
15635 -583308 -356108 -27184 176883 -217568 -702688 -297832 -155364 -195621 -134351 -273976
15625 -273976 -222358 -298966 -610045 -911279 -929047 -646783 -576486 -596682 -681824 -678272 -197942
15614 -197942 100379 328252 421705 377563 563173 666383 701237 741431 604964 93228
15604 93228 -310037 -196095 -664306 -943127 -745992 -858035 -914438 -372282 507195 708133
15594 708133 191053 -303221 -856048 -1119488 -990210 -512289 -145631 193394 546388 666687
15584 666687 758018 459501 341353 645363 695549 402532 230856 -19026 -158669 237150
15574 237150 503500 249662 -191864 -656350 -824345 -761311 -519425 -408993 -722780 -1149446
15564 -1149446 -1275221 -1133877 -998425 -1094352 -1174738 -933144 -433548 -145250 -461346 -724258
15554 -724258 -229511 126192 -251327 -577713 -534263 2550 125227 -199069 -492921 -857431
15544 -857431 -1401516 -1704395 -1744167 -1732083 -1620952 -1600063 -1386721 -942182 -687449 -843323
15534 -843323 -760008 -343506 -450831 -693875 -772120 -980370 -1103127 -724401 -530888 -468279
15524 -468279 -227776 -176530 -478635 -1016701 -1361755 -1325722 -755428 -189659 239741 439131
15514 439131 630207 556130 144541 8455 119918 60976 -156842 -438262 -542500 -538763
15504 -538763 -439678 -618439 -872024 -1206044 -1203359 -745337 -440867 -653912 -396919 210926
15494 210926 400178 571431 943208 672455 334577 375520 103651 205359 318401 364238
15484 364238 505205 583106 861930 1033365 767543 307972 -109160 -286797 -636040 -1491395
15474 -1491395 -1800309 -1455461 -1283061 -1598531 -1618260 -1122322 -520828 -194069 -98979 6472
15464 6472 509037 889798 922049 1021983 959626 1103876 1232937 1099096 729618 369607
15454 369607 315383 54155 -405843 -404770 -120627 -112538 -398792 -533648 -622390 -702228 -562427
15443 -562427 84974 838295 915392 388057 -201908 -658464 -1024046 -1097930 -1064524 -963778
15433 -963778 -885580 -923631 -825484 -462659 -235538 -190092 -41211 -74436 -140887 -108209 -26246
15422 -26246 12941 370947 314427 -262503 -678002 -1171328 -1476387 -1412005 -1049815 -748459
15412 -748459 -394784 -297537 -491103 -495592 -385511 -59575 415617 539067 188088 -429392
15402 -429392 -799418 -845485 -516127 -332 77853 -110710 -83501 -223637 -218526 37072
15392 37072 95089 221119 352290 296191 35174 -458156 -512110 -699787 -1097249 -1358697
15382 -1358697 -850864 -144200 38456 -101332 -436902 -287591 -170771 -154259 174289 404467
15372 404467 296739 -84540 -288546 -307339 -287436 -212593 -424357 -735734 -1037552 -975384
15362 -975384 -830284 -892879 -1301103 -1514301 -1355304 -1176304 -642207 -33410 435251 361214
15352 361214 18566 -112268 -98681 22589 -289541 -533454 -438855 -475657 -826803 -881147
15342 -881147 -839437 -905927 -908935 -607676 -315773 -422474 -716955 -809744 -727605 -583378 -574931
15331 -574931 -520845 -440541 -93145 179531 343278 403342 269584 -127414 -471902 -347454
15321 -347454 -7808 -7452 -182273 -117791 411 199457 257774 483967 1242077 1611838
15311 1611838 1313661 830990 576058 530209 234864 -215215 34114 813718 1142122 999265
15301 999265 436790 -25120 -262573 -749009 -768163 -267538 -377004 -1004566 -1285956 -1048459
15291 -1048459 -811239 -551733 -367978 -630057 -486476 -261264 -364855 -658690 -1008507
15282 -1008507 -1088688 -817132 -537214 -505847 -486819 -185791 227221 305323 3982 147307
15272 147307 473380 401518 -184441 -671690 -936832 -955146 -854546 -928911 -1115570 -1113024
15262 -1113024 -725160 -359818 28098 -90500 -446291 -364012 -36895 151630 141535 154541
15252 154541 256244 206041 101827 -20625 244235 621239 403181 257853 214645 96132
15242 96132 192746 38399 -145935 -412043 -755514 -971550 -601010 -192993 -489611 -815577
15232 -815577 -928720 -707383 -660308 -624576 -563167 -313835 -408366 -649921 -663833 -476125
15222 -476125 -429370 -426361 -35097 345549 524833 768879 556484 127204 -81268 -46205
15212 -46205 -159168 -657101 -968182 -901338 -744868 -715972 -767948 -828808 -516060 -428711 -561244
15201 -561244 -706956 -663093 -720651 -1070123 -1293465 -1315048 -744237 -223479 -330001 -72814
15191 -72814 26464 -175256 -218497 -38784 224084 373648 -51846 -770619 -839501 -253293
15181 -253293 -91650 -68213 168606 255479 218375 21370 315231 510230 499095 548769
15171 548769 738090 1027149 707310 598964 702826 -88197 -783666 -820746 -428809 83073
15161 83073 218679 -177624 -698611 -861928 -622020 -182296 218611 592172 523591 187753
15151 187753 -587515 -1051093 -1300498 -969161 -427714 101027 164820 103489 103085 -98410
15141 -98410 -118677 -245184 -453048 -464504 -129075 253233 112554 81386 115001 -304564
15131 -304564 -663125 -390522 -63431 -117965 -381726 -545313 -442963 -708943 -979474 -1015714
15121 -1015714 -1046141 -1325191 -1395979 -1283232 -1075101 -1156835 -1131617 -911355 -517070 -320217
15111 -320217 -193598 11068 212405 -42533 -559773 -463392 -121331 -129137 -815097 -1062459
15101 -1062459 -401928 99304 534794 892740 697358 836679 1038207 745965 612674
15092 612674 526464 536537 419386 61884 70912 778553 1278416 1521806 1377093 1142580
15082 1142580 1117526 731937 579281 448362 60876 -249944 -598809 -612473 -393326 -48289
15072 -48289 387046 799908 576871 -19537 428875 1132597 767898 301850 509291 752666
15062 752666 880668 897620 498089 -292299 -896377 -1144714 -1052329 -1079710 -626332 21520
15052 21520 476542 637031 734112 497312 189745 -11766 -193867 -158934 -31803 -15684
15042 -15684 -79110 -76958 -56171 14007 92659 99695 248935 -118040 -843727 -1177142 -1137027
15031 -1137027 -1127287 -1374093 -1404307 -814414 -546546 -653871 -511901 -174098 364389 541030
15021 541030 151864 -300906 -377195 -164912 2619 -115016 -370437 -391339 -471799 -610215
15011 -610215 -457853 -439288 -591603 -295182 -89603 -436060 -778008 -590506 -591119 -720477
15001 -720477 -320037 -197347 28667 257892 404452 -50323 -885039 -1311095 -1087694 -669039
14991 -669039 -889673 -1175309 -1028455 -656983 -233476 99396 206041 181726 154871 -28276
14981 -28276 -255376 -136493 215766 334949 404879 326672 -6510 68743 286217 786080
14971 786080 1415585 1511704 985049 500357 164518 -118690 47124 546063 560692 303089
14961 303089 632552 1028812 826647 473115 149285 -26280 160348 479730 707217 582611
14951 582611 115476 -261628 -578516 -721796 -527590 -314287 -186582 -265671 -910913 -1083218
14941 -1083218 -768581 -744881 -803925 -950046 -1106455 -973744 -861434 -867046 -1079293 -1262098
14931 -1262098 -1386389 -1605871 -1801978 -1732089 -1234538 -870448 -883276 -903476 -965460 -925014
14921 -925014 -553396 -217910 -99052 -232919 -515025 -400970 -1762 531201 1073021 1198756
14911 1198756 767371 35690 -222597 -538112 -980947 -1172922 -972392 -589789 -424720
14902 -424720 -533194 -524850 -361542 -254962 -176674 141918 270947 448577 229916 -235980
14892 -235980 -383183 -338940 -305915 -342431 -392436 -733735 -929931 -1078057 -1086027 -1167283 -1383014
14881 -1383014 -1432202 -1252450 -1166010 -1601105 -1549829 -1165995 -953372 -1214938 -1814011 -1931969
14871 -1931969 -1372931 -860857 -906954 -626367 -314481 -478463 -147273 330413 466181 555498
14861 555498 222289 258108 320076 350238 840043 1168585 1055136 733713 215545 -140812
14851 -140812 -130349 -274672 -232750 -145744 -240792 -249694 -275908 -137754 61276 -6884 22106
14840 22106 -120918 -146117 91039 66967 -56385 -477359 -1146337 -1228231 -1072709 -1164583
14830 -1164583 -1136954 -1097535 -1283485 -1238733 -861408 -277413 -56544 -147116 -316089 -350858
14820 -350858 -641349 -770664 -806894 -974616 -891294 -469539 -351557 -219559 148811 422703
14810 422703 602484 573523 231938 293900 903809 1186494 914319 697470 470458 -157770
14800 -157770 -552853 -802797 -925685 -966858 -877054 -540253 -98723 116143 -180630 -404550
14790 -404550 -554589 -761501 -667552 -237403 369890 787551 665354 314413 309086 320994
14780 320994 182720 -137492 -550294 -1082640 -1077931 -509708 36082 112664 -121195 -462665
14770 -462665 -782089 -919637 -757577 -393208 -427487 -352767 -214231 -203277 -173951 -108167
14760 -108167 15225 207140 58537 -697581 -1046867 -577287 -118 237527 21464 -373267
14750 -373267 -638655 -726489 -558773 -41107 208534 16463 25716 498499 549133 -131250
14740 -131250 -622465 -362294 -145824 -56646 -243295 -741171 -697369 -847116 -864968 -698340
14730 -698340 -897671 -1102324 -1349243 -1575722 -1468843 -1267253 -1369903 -1246533 -1040414 -896517
14720 -896517 -1105589 -1028044 -1167445 -1142275 -525908 170884 139828 -177879 -478574 -656680
14710 -656680 -420869 -20435 157996 40218 -126880 -195865 98400 663681 1112728 1129050
14700 1129050 701465 351670 187511 -132986 -666393 -759135 -603353 -444092 85074 410236
14690 410236 441199 255635 -194506 -547066 -403900 -34293 208321 435051 578263 332464
14680 332464 314843 300707 266423 96983 -294358 -464688 -404034 -479013 -612125 -530450 -400492
14669 -400492 -621440 -620241 -592864 -503520 -469969 -682566 -817016 -574665 -478513 -532534 -590139
14658 -590139 -467210 -389030 -450881 -954697 -1194909 -1111767 -1116898 -1066190 -588708 -365928 -318524
14647 -318524 333040 634580 167750 33523 539369 634871 211477 236855 400812 168773
14637 168773 -180259 -115358 387456 870140 880417 811395 652819 63899 -82987 302664
14627 302664 552634 419299 127630 -178837 -275084 -452261 -761277 -902554 -388329 306304
14617 306304 651075 581056 324309 -105339 -270981 -281912 -611122 -554918 -428912 -250541
14607 -250541 238929 371959 60961 -185391 -300424 -407121 -141862 -26697 -285963 -610009
14597 -610009 -745932 -443537 -388477 -518401 -782004 -1059088 -1196916 -1523694 -1875068 -1787819
14587 -1787819 -1125609 -671153 -481423 -125552 218590 410886 758894 1039838 1176219
14578 1176219 845026 332513 332713 777826 584291 134712 548870 510086 -409568 -1029071
14568 -1029071 -963322 -735462 -366517 207471 402031 -211397 -427432 49060 391647 39667
14558 39667 -354410 -253103 29931 -47201 -16581 -324780 -509592 -353596 -173188 -98710
14548 -98710 -50436 -10241 -195878 -234243 -186201 -286421 -188540 159967 452975 345958 57504
14537 57504 125654 522276 537809 403895 358009 572267 991814 738861 102232 -90257
14527 -90257 101081 194095 316242 574840 480046 486758 886196 1161604 850046 457632
14517 457632 229420 -96299 -650674 -1128375 -1098628 -964626 -769219 -313120 572062 1019014
14507 1019014 399553 -261230 -574295 -520684 -245606 -46893 63979 195391 207212 238086
14497 238086 129243 -40202 255028 505509 570307 483360 98844 -432915 -777271 -1042650
14487 -1042650 -1612339 -1838868 -1555768 -1106707 -630093 -258676 109656 418546 757336
14478 757336 1098252 745719 199366 -32724 -153760 -282486 -336959 61912 342255 246030
14468 246030 208251 159344 -84967 -172712 -262076 -548385 -601756 -349062 -350313 -255904 -353146
14457 -353146 -270492 233401 289347 -270417 -641345 -418695 -259509 -219113 -144078 -12200
14447 -12200 318322 350420 390864 364450 209606 235299 386272 471518 337408 144280 80185
14436 80185 -229077 -445832 -182793 -168427 -392156 -649880 -600713 -240707 -423670 -683216
14426 -683216 -768674 -770533 -870028 -742812 -684615 -351802 285306 731034 550898 154660
14416 154660 -106609 -501433 -1047121 -1072162 -890730 -1187081 -1166032 -988998 -778624 -720927
14406 -720927 -360806 -304397 -154125 152344 -3444 -351557 -675200 -599023 -54615 407365
14396 407365 536086 377926 -42037 -699826 -1129900 -1014187 -1034235 -1018063 -808346 -702994
14386 -702994 -484989 55799 51917 -66444 -307374 -583703 -643833 -573070 -474489 -154055
14376 -154055 87512 108215 25728 -17104 -169493 -375656 -549807 -328593 -409726 -582268
14366 -582268 -566979 -518508 -589099 -816022 -732116 -148441 461870 513262 335512 355359 268831
14355 268831 -12841 -149622 -338163 -555603 -791030 -565553 -105983 -280171 -433261 -690010
14345 -690010 -1075532 -1204934 -1025965 -1025714 -1091191 -934675 -1008895 -1156710 -1464806 -1788782
14335 -1788782 -1815498 -1550506 -909391 -309188 35121 105900 105010 50713 62232 328390 885081
14324 885081 898472 343824 -38212 -208813 -499038 -534690 -290393 -413807 -479403 -612592
14314 -612592 -404391 -260017 -286647 -417413 -109972 44193 -380837 -762991 -840078 -836606
14304 -836606 -709136 -212330 132985 -371282 -1095024 -1336211 -1050341 -728498 -499558 -304623
14294 -304623 103865 757288 1126187 942162 666246 349824 -305765 -603114 -528173 -346573
14284 -346573 -425543 -719612 -972402 -1094595 -756322 -215054 492247 815799 926158 982580
14274 982580 785373 490364 224653 359271 13165 -513987 -449927 -242525 -535755 -874885
14264 -874885 -882433 -499628 -36401 -100792 -171054 -146335 -260517 -4780 46839 -157555 -272206
14253 -272206 -86600 125302 138197 -245856 -461304 -229933 89088 315543 390554 196879
14243 196879 -54635 -389362 -1037679 -1442807 -1391461 -807263 -119545 376772 471085 409653
14233 409653 593047 334287 196295 96596 -346950 -407145 -358714 -442106 -432204 -240774 -358715
14222 -358715 -454354 -400330 -240564 -727070 -743157 -103736 534392 626992 275325 -39933
14212 -39933 -456811 -996958 -980711 -518405 -423546 -488963 -523364 -803884 -899558 -186164 346175
14201 346175 602820 499900 393275 643492 767634 457613 380093 568851 732937 914900
14191 914900 1064583 1017900 835411 546730 493412 548500 110928 50084 100301 -42827
14181 -42827 -120624 -176080 -534302 -643718 -223839 141641 -139593 -724321 -1151187 -1120908
14171 -1120908 -919359 -554436 -85116 -146770 -196311 -325207 -438099 -211707 -170483 -388639
14161 -388639 -529093 -417303 -435791 -628373 -503521 -105212 -128214 -183204 274138 952478
14151 952478 781654 472228 515382 661812 392205 -157783 -355872 -216127 -440591 -820014
14141 -820014 -852896 -747595 -789572 -786061 -580432 -247364 -4284 -89006 -371691 -438291 -192346
14130 -192346 -233330 -849663 -1214140 -1104045 -1153929 -1611595 -1986230 -1910655 -1475372 -900418
14120 -900418 -599041 -360983 -304221 -281361 -522130 -1092265 -1605445 -1569748 -1095371 -441336
14110 -441336 -110338 -144282 -341978 29526 470503 234510 172672 -190884 -434839 -613409
14100 -613409 -655039 -606879 -599343 -478768 -253273 -4485 158254 302189 348017 109907
14090 109907 -409173 -674227 -735542 -725104 -469635 -266511 -186948 -224296 -648542 -1020434
14080 -1020434 -1227197 -1435814 -1589493 -1669004 -1581891 -1405076 -1522201 -1587054 -1116362 -692723
14070 -692723 -896544 -778423 -519436 -1083001 -1507937 -1256809 -837748 -472584 -244004 -283212
14060 -283212 -460840 -728526 -890187 -290846 388975 540090 412558 208650 231549 570544
14050 570544 202682 -597097 -818963 -830147 -755744 -459771 -140903 90504 79975 340888
14040 340888 700317 592426 484956 695355 548978 294545 -53079 -1824 325892 754298
14030 754298 757626 450529 46683 -402156 -885017 -839752 -118478 -184183 -650834 -719960
14020 -719960 -615826 -670510 -911129 -1113949 -862801 -337893 41298 335983 632929 686606
14010 686606 529024 62474 -143738 85358 94216 148147 93354 -274335 -735505 -844464
14000 -844464 -888251 -722112 -621734 -740500 -1080920 -1182407 -1016283 -750084 -576129 -451116
13990 -451116 -356228 -388493 -187548 -93326 138486 475120 626090 314742 32850 137234
13980 137234 286015 256062 94472 -123882 -273073 15693 184993 254103 540203 403196
13970 403196 48236 -24932 -285054 -708650 -904416 -831740 -869058 -866429 -626238 -383418
13960 -383418 -355259 -479697 -395110 82483 717095 663133 559090 793955 994289 805188
13950 805188 370608 -236242 -405737 32025 644108 721499 389661 -139740 -426145 -588636
13940 -588636 -777970 -565237 122418 509968 688228 663162 267532 -196303 -158026 538648
13930 538648 853928 712902 247195 -270252 -279866 -343711 -499485 -467655 -365465 109030
13920 109030 676550 809119 891408 1016959 1229821 961492 14870 -647792 -722727 -608414
13910 -608414 -278352 -42143 -37218 -85974 -110594 -319504 -419300 -258899 -394809 -751020
13900 -751020 -1199592 -1199368 -1061190 -840084 -776808 -964531 -1185002 -1321807 -968238 -410398
13890 -410398 240568 178998 260454 414108 348275 345321 326932 127841 -180981 -96269 251226
13879 251226 230892 287251 557850 587174 496963 519655 742607 774590 823170 399524 -111811
13868 -111811 -232960 264289 1031157 1370521 998081 836807 929143 1023518 839251 985964
13858 985964 1001096 983360 1087892 911807 719040 485067 351688 383165 401625 631705
13848 631705 292919 -109612 34719 173720 214751 236750 313602 105505 25744 106932
13838 106932 31599 303560 597607 357165 -234839 -682373 -751879 -797185 -1097515 -969838
13828 -969838 -606053 -568842 -673019 -708705 -1023485 -1217897 -1391961 -1599469 -1142840 -580496
13818 -580496 -145864 198936 149048 -210754 -610206 -893339 -1209305 -747638 -207006 -2196
13808 -2196 354634 269582 75083 -113046 -293759 -515355 -818553 -741034 -625145 -983008
13798 -983008 -1422555 -1763957 -1896144 -1979601 -1583018 -960932 -994492 -1024239 -576031 -201396
13788 -201396 -295522 -615889 -893030 -927120 -611267 -348201 -383353 -362139 -143271 129137
13778 129137 504516 511875 269289 100984 104095 130188 157640 -6153 -96888 -854 175035
13767 175035 295335 318716 260805 -72506 -147439 62628 102352 267312 -141093 -725154
13757 -725154 -1125765 -1365002 -1208279 -834511 -562114 -638063 -825675 -749383 -78786 520552
13747 520552 475677 179119 -41901 -464433 -716553 -482311 -131850 -33065 -84061 132670
13737 132670 561372 601573 279586 29631 27769 202339 437574 349727 51815 -295840
13727 -295840 -760053 -820693 -962025 -1038901 -754883 -545822 -445045 -391455 -369434 -324076
13717 -324076 -354901 -499870 -514667 -261416 -260000 -13117 20297 72289 151943 182966 -17301
13706 -17301 -564971 -704164 -627515 -603988 -881697 -1150827 -847458 -584610 -739712 -744389
13696 -744389 -484706 -341099 -295411 -104249 -33827 115959 271337 171969 -241294 -290622
13686 -290622 75502 17887 -509850 -739685 -691610 -522397 -514661 -370641 -209537 -220644
13676 -220644 -425633 -396501 -322606 -154323 63824 -96350 -135231 -189736 41111 368369
13666 368369 -35795 -332728 -463638 -447897 -385686 -235231 267860 419221 573951 436970
13656 436970 52008 -132551 -30048 26452 -13341 -151854 -214472 -151915 -125557 -284791
13646 -284791 -463509 -417629 -94896 129737 167629 -63374 -147908 143752 164752 -30616
13636 -30616 -159439 -80186 16530 -120548 22795 329796 554031 552134 160738 -366237
13626 -366237 -304878 108226 357135 554782 477529 10610 -517488 -629105 -606696 -609478
13616 -609478 -660602 -578914 -222195 -215931 -274322 -113627 -241195 -365121 -590372 -851715
13606 -851715 -712145 -418806 -523749 -803580 -925240 -1122028 -1195586 -1141731 -784124 -318178
13596 -318178 -386292 -524673 -695109 -1089700 -1041459 -1063672 -1163848 -905737 -582110 -433535
13586 -433535 -350214 -438903 -611284 -431235 -336400 -623710 -1100787 -1556583 -1746235 -1846532
13576 -1846532 -2003094 -2046809 -2184299 -2383308 -2058873 -1370184 -623335 -102922 92380 105791
13566 105791 55098 -260168 62135 515599 658484 448401 -252060 -649483 -653318 -318212
13556 -318212 -205815 -378648 -300424 -9218 141392 -32967 -254846 -417060 -187873 -29001
13546 -29001 52108 -144733 -432686 -615987 -752831 -774647 -968649 -1052498 -1310246 -1405620
13536 -1405620 -956906 -315609 -33483 -262009 -743205 -909256 -667272 -208764 -47520
13527 -47520 -62459 178033 187917 -57572 -130092 -22585 -56707 -215475 -21823 89127 -34227
13516 -34227 -166828 -297224 -274448 -142959 -380329 -568130 -384122 -230762 -623114 -1128530
13506 -1128530 -1353109 -1120542 -361165 -10646 -74447 -12809 360721 818819 1000106 1090171
13496 1090171 822104 215329 -392101 -401437 -113233 225359 136836 -300238 -755213 -764677
13486 -764677 -406038 -203533 -369068 -589160 -350493 -472388 -988850 -986750 -949583 -669585
13476 -669585 -649954 -883639 -912459 -522856 -59301 -38916 -481528 -968487 -1402495 -1714371
13466 -1714371 -1635107 -1099238 -635696 -250345 -238870 -231966 -568935 -730315 -632632 -520323
13456 -520323 -300570 -503699 -583159 -474604 -436153 -436267 -550497 -470973 -432883 -834848 -1417603
13445 -1417603 -1574689 -1239499 -801030 -546186 -374223 -266653 -435582 -643244 -633163 -472994
13435 -472994 -481684 -885573 -1053518 -610868 -492770 -724617 -954870 -977143 -583791 -219026
13425 -219026 277675 768945 877129 698435 323369 36475 -60012 -170930 -564477 -458053
13415 -458053 -445779 -113240 527412 940930 1069248 989090 903194 900501 629092 192039
13405 192039 198490 365547 452774 501039 531602 498152 295994 90802 129618 91518 -114993
13394 -114993 252604 673242 632547 147618 -72223 -166585 59963 467755 554813 493236
13384 493236 542934 657301 381574 249916 214859 171482 -28789 -443660 -630224 -788045
13374 -788045 -581740 -459782 -206994 117349 -87927 -316125 -175488 358645 570918 191107
13364 191107 165983 274642 -219280 -684960 -1128940 -1105677 -606260 -233398 -98477 185603
13354 185603 297679 111037 165813 300607 218369 -77512 -7637 613717 1151196 1131695
13344 1131695 1018963 1271019 1168741 687123 94872 -806691 -1204316 -1002879 -248078
13335 -248078 238196 293706 503677 478673 186632 334735 436984 253514 216414 437603
13325 437603 417964 -60303 -468322 -141405 317034 694043 1172054 1383893 1162874 768111
13315 768111 451334 539273 1145640 1275960 592449 518980 902786 1051721 725527 573607
13305 573607 631868 670345 851638 1220312 942775 444241 534829 675795 465871 242552
13295 242552 138246 97958 45417 39391 193914 400455 997928 746020 57074 -353020
13285 -353020 -178303 584703 922150 1027860 1148698 866703 366895 -313112 -608131 -488974
13275 -488974 -312847 148927 314519 60953 -284340 -298900 -433682 -532060 -121783 29106
13265 29106 98802 630751 1217145 1418174 1389482 909991 342304 238950 408154 431183
13255 431183 285606 156764 156812 130845 -41759 57785 323265 517587 573009 45244 -868654
13244 -868654 -1278786 -630653 100856 271845 483105 577247 424389 -116399 -300610 -15587
13234 -15587 -289408 -651456 -593538 -641013 -633134 -377659 -691 510912 927455 1245580
13224 1245580 1377628 1329448 1235929 1148096 979733 887054 1105157 1364598 1546585 1920428
13214 1920428 2119999 2268244 2011701 1689665 1522805 1565512 1435776 1277753 1385920 968914
13204 968914 190943 93633 110074 -34818 74720 388656 415920 420233 633695 957172
13194 957172 1195606 1474495 1475748 1348796 1344574 1048679 850854 480999 108254 148833
13184 148833 759861 1403481 1515613 1240772 1207174 1395837 1400404 1262476 1281530 1154941
13174 1154941 1106250 1127570 1066918 776661 179703 -85853 -285247 82214 430150 443159
13164 443159 558806 701924 592180 452297 226912 -3030 352516 557888 75013 -269447
13154 -269447 -287971 -181039 172972 534772 566863 638259 950685 988319 859189 734872
13144 734872 779873 1134063 1035730 623434 338803 176604 315653 222641 202119 461834
13134 461834 598944 804285 940487 1158017 1278949 1063158 969112 652607 398069 454532
13124 454532 772336 1019254 1013719 842761 963708 1200451 1391523 1412963 1522292 1392490
13114 1392490 1253177 1008677 673442 471901 64089 -91157 -43277 281030 491434 594760
13104 594760 797115 1149700 1428794 1506812 1451135 1501669 1714778 1795070 2016877 2233132
13094 2233132 2271270 2089536 1690775 1490138 1643394 1535651 1346953 1690907 1834086 1451852
13084 1451852 1191578 1095378 1044991 918884 809866 935962 1177911 1155283 610012 275896
13074 275896 453029 604062 838728 1330341 1439478 1597598 1846987 1857325 1738438 1983959
13064 1983959 2376973 2359141 1772389 1274624 1244852 1468438 1293833 1231450 1572652 1691166
13054 1691166 1643182 1713392 1725777 1653417 1848957 2012421 2262830 2508143 2649972 2407342
13044 2407342 1977324 1675242 1448061 1451502 1844769 1956320 2003771 2341892 2649743 2764313
13034 2764313 2857442 2767785 2603224 2569788 2569104 2492356 2595543 2885561 2978185 3132039 3062700
13023 3062700 3017215 2968241 3248163 3618023 4192881 4727154 4837194 4758878 5050842 5420648
13013 5420648 5485314 5334079 5482978 5893686 6028691 6122637 6164497 6093622 6535101 7399393
13003 7399393 7775706 7725221 7968586 8600816 9238746 9693721 10105600 10864291 12178983
12994 12178983 13603828 14447595 15490280 17133243 18930992 21196216 24316891 27778424
12986 27778424 31561443 36077936 41586732 48241610 56545735 66950204 79581396 95458525
12978 95458525 115864281 142139078 176583183 221005504 275838670 336231838 384584567
12971 384584567 394160079 358107420 298438764 239339475 191518776 154874235 126719479
12964 126719479 105343530 88804785 75709788 65617821 57576685 50876734 45412964
12957 45412964 40773376 36659848 33014635 30012934 27224834 25062136 23525540 22261167
12949 22261167 20808746 19217112 18252890 17512415 16539837 15337475 14186193 13336766 12913253
12940 12913253 12432428 11883782 11404498 10982884 10624499 10384156 10232471 10026657 9940046
12931 9940046 10060447 10133321 10398864 10537173 10618592 10756443 10841281 11106528 11048690 11157814
12921 11157814 11807104 12158692 12717412 13773292 14684308 15962748 18067813 20247921 21653858
12912 21653858 22322840 21812947 20852081 20069498 19613877 19477466 19893232 21110354 22589699
12903 22589699 24276837 26434052 29200091 32311981 36152031 41098274 47069790 54390593
12895 54390593 63082410 73804818 86987483 103463043 125074945 154052989 191829200
12888 191829200 239937457 299016378 361073536 401872287 396044992 347455648 283966227
12881 283966227 226061137 179733639 145104144 119604900 100058102 84733618 72595876
12874 72595876 62770686 54699601 47875826 42431293 38304479 34636487 31023549 27666110
12866 27666110 25248557 23281446 21869987 20517489 18964154 17588566 16430157 15512151
12858 15512151 14795286 14293634 13798734 13369290 12676174 12210963 12236367 12122823 11820732
12849 11820732 11600853 11220289 11204059 11397763 11248175 11088801 11049354 10892978 10821212 10988707
12839 10988707 10851442 10579895 10102583 10204593 10392084 10330100 10365485 10076086 9874468 10320073
12829 10320073 10961651 11024649 11291545 11912195 12526337 13358055 14247640 14722750 15380753
12820 15380753 16579072 17904308 19266599 21203207 23316166 25854463 28843243 32082958
12812 32082958 36081080 41351076 48191141 56277473 65289881 76400800 90601569 109109097
12804 109109097 133098194 164244491 204691425 255419095 314552626 370296351 397214650
12797 397214650 377404280 323333074 261641753 208338796 166495169 134832005 111046527
12790 111046527 92885967 78787287 67447417 58340715 51071498 44786107 39386107
12783 39386107 35052067 31787177 28762956 26133202 23883355 21853006 20251577 19103900
12775 19103900 17895123 16690521 15474821 14028283 12758538 12017454 11233639 10383385
12767 10383385 9694164 9032505 9043485 9083347 9026001 8877645 7883351 6851148 6426742 6313161
12757 6313161 6170399 5713223 5153375 4924673 5116646 5242194 4973670 4671905 4622791 4443439
12747 4443439 4283375 4308227 3904848 2956068 2550501 2954253 3004694 2899266 3218121 3555435
12737 3555435 3452006 2735327 2253831 2135796 2086701 1936505 2127016 2152739 2020510 1728027
12727 1728027 1212627 1059004 892878 1089086 1617260 1980377 2565410 2535680 2244734 2389994
12717 2389994 2569059 2708936 2809600 2836629 2970254 3042946 2869650 2357164 1800167 1823957
12707 1823957 1949805 2017601 2144088 2006939 1964493 1985658 1956359 2059532 2133976 2084995
12697 2084995 1835439 1530665 1565925 1509883 1370711 1610692 2045184 1994936 2184978 2149741
12687 2149741 1822296 1319367 1269043 1491774 1494661 1488943 1638309 2160678 2580276 2802572
12677 2802572 2627497 1940249 1306794 1145329 1359561 1344384 1090076 929335 904199 813018
12667 813018 623697 634968 563654 677913 664184 619064 668823 1017363 1130684 899302
12657 899302 1283331 1727160 1845495 2000781 2412503 2584285 1998322 1253699 904462 917038
12647 917038 662846 371316 187972 -195291 -285430 124494 694447 1172640 1229989 1192696
12637 1192696 1197978 1658976 1692550 1094111 854494 817965 918569 1101312 1138309 1036981
12627 1036981 858126 728095 712770 322141 24731 83518 302205 396737 57565 -719472
12617 -719472 -1029332 -599462 -421817 -239795 -214521 -266656 -422941 -486248 -29933 429726
12607 429726 568859 607409 626117 746565 817896 865702 1370570 1652567 1489176 1023496
12597 1023496 540699 545770 981427 1107575 1005463 1180522 1601390 1809059 1470937 826761
12587 826761 550759 423947 599269 1227177 1262281 1174134 954376 703721 622881 51948
12577 51948 -718350 -690249 -217860 -34224 295041 1008892 1553243 1538661 1295021 1413850
12567 1413850 1586983 1455224 1255256 1087773 736224 222113 -548388 -1180448 -1143170 -941615
12557 -941615 -541331 312155 1193282 1504876 1399670 1075061 663001 506923 651459 486792
12547 486792 -101974 -425196 -439266 -292505 -364162 -120986 -32350 13172 191549 638347
12537 638347 1073176 1126598 1457642 1649013 1781410 1614936 1237652 799927 77158 -24369
12527 -24369 179496 266836 375068 245790 30609 13125 172155 298980 573273 848185
12517 848185 539616 370198 429711 569416 652059 607274 732471 472514 454851 241788
12507 241788 32113 -123151 -255399 -146353 208790 473185 624535 878508 904890 856417
12497 856417 782117 603362 411199 187564 308619 500084 361716 257784 59285 -144151
12487 -144151 -146463 99188 114199 -400514 -644703 -402796 166579 421105 121222 -305480
12477 -305480 -474941 -190153 381878 839972 759630 753787 857056 840641 622353 231729
12467 231729 313205 304849 -252877 -364959 -328308 -465396 -189033 434135 605949 484285
12457 484285 722470 982594 959056 764668 719961 676461 665237 489879 8569 -227914
12447 -227914 231434 752255 890901 854255 944408 1027105 675565 349210 224321 -267461
12437 -267461 -240753 464329 688083 666435 738808 512588 354903 727871 718226 468144
12427 468144 693284 1206596 969570 229751 262830 768700 799178 554623 464220 487671
12417 487671 320961 443286 438740 370846 406397 294809 -382118 -1080996 -965723 -649628
12407 -649628 -606860 -703348 -488046 94258 52890 487899 1204493 1486060 1265369 377689
12397 377689 -91392 135772 312361 229901 -5930 -140062 117286 297387 306375 153146
12387 153146 -295182 -597539 -686284 -493422 44400 441619 507296 124395 -220322 119910
12377 119910 591352 1049648 1254498 633878 -162103 -359709 286972 510986 225101 65692
12367 65692 -359716 -349660 94462 203357 601765 783337 275355 -273985 -440252 -165978
12357 -165978 -27525 157195 637305 829066 872056 789313 599451 480070 630395 889077
12347 889077 1149159 1225814 1152286 832538 507231 87426 286151 875235 938425 994435
12337 994435 927728 1024979 1361398 1151852 855416 971372 678021 422665 289438 132550
12327 132550 1945 -156658 -147013 -132382 -191697 -314693 -698069 -920076 -877054 -500410
12317 -500410 163360 247460 -57619 -266522 -210224 107410 -28613 -552442 -894585 -902435
12307 -902435 -894637 -1074081 -819381 -434502 -200338 -273499 -400800 -245045 46788 -155778
12297 -155778 -226845 70484 181998 -89063 -1730 341857 296043 417959 602845 151853
12287 151853 -352680 -245299 -49252 115642 415078 596031 384260 -199204 -623362 -581501
12277 -581501 144947 606841 531909 419836 90386 77527 -16771 -157472 -159417 -489162
12267 -489162 -758918 -226258 250321 503603 681647 336202 211619 464173 1047731 1465793
12257 1465793 1204359 323334 -297887 -379563 -526277 -706703 -543490 -295408 -433738 -718161
12247 -718161 -349907 113327 475925 550176 98547 -381824 -839780 -743193 -366182 62552
12237 62552 16466 -414788 -432018 -181515 -208687 97938 124039 -179651 -35925 291361
12227 291361 427666 362372 343902 399351 401483 407118 83493 -398428 -728370 -813749 -598294
12216 -598294 -375659 -480363 -825355 -1002432 -997065 -778123 -716091 -501275 -331653 -105472
12206 -105472 14455 615 -80536 -140670 111527 198130 68371 326461 430260 178179
12196 178179 131113 69217 208082 304673 35526 -292151 -685142 -770104 -352539 -229373
12186 -229373 -41363 -645 -18717 295309 581439 950601 1183367 1043171 784575 625979
12176 625979 235489 -195021 -371053 -427782 -515956 -312886 54964 63668 156311 223131 449399
12165 449399 828085 944578 882669 774678 621756 321080 -67037 -25767 3580 -28148
12155 -28148 416886 1002784 807420 37614 -269382 -326928 -404740 -548421 -400264 -338424
12145 -338424 -576556 -661360 -417833 -71750 140600 32989 66645 495553 784266 791445
12135 791445 977038 1241390 1154808 814555 126228 -387853 -519699 -656375 -996316 -1347163
12125 -1347163 -1399602 -1111518 -851963 -964059 -1361941 -922212 -394109 -147680 64357 -205515
12115 -205515 -478662 -374800 -496619 -647098 -526297 -918778 -1230420 -1081181 -802248 -717380
12105 -717380 -805783 -833986 -277354 266457 126127 -73424 -145141 -324016 -436383 -335935
12095 -335935 -101460 179241 505130 547045 372817 259450 113894 22199 5460 90788
12085 90788 226996 498516 783578 264924 -598061 -817375 -680951 -580411 -746206 -1078775
12075 -1078775 -1402288 -972293 -327950 82946 410265 390050 316654 56593 -243147 -163037
12065 -163037 55561 130250 205655 590058 893409 824951 810419 1064799 963901 446830
12055 446830 -142847 -706956 -983266 -1041086 -1026884 -467583 257373 474639 425418 218812
12045 218812 128378 232663 -74118 -519214 -819442 -1093777 -1247099 -1343692 -998599 -457237
12035 -457237 -348168 -494629 -586237 -680318 -200456 105661 101367 110030 52916 -256539 -193371
12024 -193371 -322618 -400039 -220174 -53430 60046 87615 500131 841375 1114874 1179444
12014 1179444 1309123 1573932 1595713 1441472 1069139 677898 633878 536134 399629 543454
12004 543454 546173 749158 761457 669109 536672 329247 539589 672471 418477 325946
11994 325946 470997 737223 802961 940782 1168623 1019212 846201 350188 125492 394857
11984 394857 878252 1003663 663290 528853 511993 483159 253007 295298 626796 880060
11974 880060 1210333 925528 51222 -561117 -491711 1916 546255 457922 28843 -125723
11964 -125723 -463858 -734860 -561762 -215370 53073 221488 271989 105923 -444732 -953300
11954 -953300 -958547 -683788 -508898 -727466 -678256 -8310 -114356 -394781 374428 722163
11944 722163 510296 305181 10689 -255999 -42546 183170 -166442 -546875 -731459 -831948
11934 -831948 -708885 -385590 -33895 154117 360527 460760 380055 445388 570898 382724
11924 382724 215407 235196 -25913 -39961 272411 406354 679905 928348 1341270 1396442
11914 1396442 1453684 1229967 535311 293778 446736 867824 999361 607747 21779 -119714
11904 -119714 -66962 -150442 -543539 -1025821 -717151 -274459 -251041 -713400 -850180 -625524
11894 -625524 -478680 -484836 -199706 -185692 -763085 -964699 -697715 -145266 374367 428241
11884 428241 147473 20906 25939 260329 628231 828489 962411 1217385 1235115 1173015
11874 1173015 1224373 1110096 784180 446672 174713 62922 653764 1234487 1301826 1149275
11864 1149275 991801 559489 10608 -141894 -307857 -305814 105016 430256 294828 418703
11854 418703 735325 732066 645858 483170 232195 591091 1019788 970146 940608 1255581
11844 1255581 1109437 733488 365114 182420 134453 471589 725768 696595 687550 555672
11834 555672 487973 770468 1006514 838916 610396 723567 570062 7212 -485337 -803960
11824 -803960 -460448 -176421 -384205 -648748 -824336 -1068480 -843203 -224229 98388 3540
11814 3540 248924 575080 515823 323841 -453125 -1118126 -1295805 -1156490 -585054 77432
11804 77432 315109 430510 914939 869905 452894 -131730 -482522 -504713 -478761 -316543
11794 -316543 -126122 -345371 -845812 -713677 -273445 -46043 -177452 -316049 -257831 -139863
11784 -139863 16731 -100957 -228602 -203450 -206784 -248889 -318850 -28348 351367 580115
11774 580115 788098 997773 1533822 1182950 606059 525964 181725 -333361 -409179 -14721
11764 -14721 414795 328967 -137572 -231146 -352869 -511147 -623769 -590413 -340574 -101200
11754 -101200 171767 491581 183074 -55131 22921 -37509 -52466 111750 89399 111672
11744 111672 519100 948735 1133896 1046371 521426 39345 -32202 -25153 -99835 114655
11734 114655 474881 576807 197175 766549 944537 626054 608588 -119222 -280471 -194292
11724 -194292 -5523 190312 139940 -57776 -81310 242620 606081 828116 1269300 1492283
11714 1492283 1531681 1128762 622327 241139 -269933 -478489 -420262 -374425 -105260 -118390
11704 -118390 -692523 -1257806 -1506800 -1148202 -587507 -191512 83165 145452 239230 469170
11694 469170 77302 -177095 -58370 -121615 -424822 -715265 -624880 -325609 191971 305406
11684 305406 394250 711792 1007697 960942 705690 777207 1214296 1259838 835106 267565
11674 267565 76006 259477 126245 -123401 488212 989038 993059 778784 403012 203534
11664 203534 -237561 -352063 -196077 -6805 -212606 47096 458195 414893 405228 576754
11654 576754 175504 -46538 242204 305579 -170708 -665118 -619357 -725928 -1256538 -1120641
11644 -1120641 -242924 334082 686808 752518 490740 356027 -23355 -304922 -201091 170341
11634 170341 214826 -166305 -181276 -195351 -72876 169064 -63335 -512489 -739298 -465714
11624 -465714 -65746 -511635 -791665 -341114 -1334 142598 311639 594178 797764 518827
11614 518827 248515 25175 -131741 175612 714418 789461 430829 -242991 -529367 -238346
11604 -238346 -24040 333043 380912 231767 81875 -93731 -237721 -358060 -719377 -789051
11594 -789051 -287809 45208 -33025 -400915 -732937 -830061 -443797 -246150 95273 454897
11584 454897 530493 364457 194292 2989 -349704 -534454 -462928 -175097 89346 134043
11574 134043 -62193 27140 389575 -104386 -479070 -222916 175380 238207 204239 78053
11564 78053 -73962 -233022 -169400 42901 252211 372910 466261 114352 -376775 -518537
11554 -518537 -734873 -636388 -562709 -628459 -571264 -717499 -1223072 -845139 -308407 -607043
11544 -607043 -1043455 -1050437 -839201 -455678 84766 373353 107195 -385747 -429437 -236723
11534 -236723 123224 665474 915672 746257 124182 -426491 -564112 -381179 -844067 -1079997
11524 -1079997 -752142 -516673 -630087 -540099 -246665 173140 487776 649614 760255 801121
11514 801121 359200 -134822 -357309 -287699 182973 432852 537878 268930 96861 288583
11504 288583 251232 -187445 -378180 -368547 -291287 151316 209349 138783 136767 -90050 -58214
11493 -58214 35866 -94763 -53697 230844 405271 571412 487041 644509 640565 402524 522399
11482 522399 850488 923044 689017 573614 397113 324565 97858 -239574 -198843 27584
11472 27584 -75961 -134020 -63315 -30462 68013 -74798 -611330 -951845 -862285 -138254 384912
11461 384912 296038 514858 465011 419588 183616 -251637 -621208 -1002221 -963703 -692797
11451 -692797 -513059 -205432 -340822 -280950 -172107 -87434 147650 277229 189646 164058
11441 164058 312545 192108 104559 114391 260198 407592 211062 191737 104924 -84644
11431 -84644 -386552 -683328 431901 1134014 1300157 1611623 1415498 1137394 928695 914697
11421 914697 790272 314483 -263226 -561513 -427559 -366753 -115852 213697 286331 27187
11411 27187 74170 272728 336783 -21836 -689509 -963162 -447584 -208659 -262387 -169961
11401 -169961 -159908 -718533 -1167306 -1070909 -824956 -489352 -278497 -444792 -799829 -681015
11391 -681015 -693044 -992457 -664362 -98667 -136235 -162569 180227 337494 69997 -218104
11381 -218104 -252711 -202100 -550470 -973307 -1060387 -896929 -744376 -425617 -255615 -324665
11371 -324665 -403868 -489694 -649797 -829254 -935017 -1132948 -1365166 -1428611 -1230532 -1113646
11361 -1113646 -1007977 -1069244 -1146332 -759005 -300111 23425 453144 651893 463577 358928
11351 358928 727758 1231627 1259451 879440 415595 221176 153265 172514 515184 305580
11341 305580 -132759 -336774 -396802 -255100 -146539 -240004 -263757 -331029 -397065 -560606
11331 -560606 -621930 -634002 -843938 -761415 -266982 73051 238035 168866 116969 -62609
11321 -62609 -459403 -667353 -814048 -895531 -1055913 -1371276 -1526103 -1389692 -1230689 -956384
11311 -956384 -891488 -789598 -622108 -551181 -984105 -1354316 -1198435 -738191 149072 684152
11301 684152 611255 344487 424615 429033 -5980 -355801 -253661 340898 672020 792274
11291 792274 445769 17371 -52825 146174 89902 2880 201163 486184 776514 593453
11281 593453 273819 766607 1142230 1433568 1678919 1436556 732939 304466 -51701 436
11271 436 367202 262787 75348 423221 364386 268637 696943 710992 188318 109082 137420
11260 137420 75811 -37712 -65462 111694 66613 30955 -193135 -708332 -742697 -423978
11250 -423978 -556739 -758276 -953399 -961937 -677126 -292990 -13953 64088 115510 141477
11240 141477 44081 -111197 -180031 -302793 -234938 -42010 19008 -1894 -91531 -72524 -1396
11229 -1396 -26181 -237172 -410123 -414096 -146647 178502 361140 231227 -192041 -511811
11219 -511811 -746439 -683767 -580517 -670698 -841980 -711079 -480937 -463224 68249 939171
11209 939171 1381777 1105077 975244 1179797 1228114 826905 133826 -238211 -37168 302203
11199 302203 -277428 -1179011 -1567451 -1436770 -945277 -464984 -126336 -24041 -118283 -18516
11189 -18516 125193 787545 752975 -195981 -911035 -724916 -278792 27118 273285 357224
11179 357224 242410 -374750 -582632 -318578 -132582 45938 26966 -21110 -94056 -148045
11169 -148045 28866 -76629 -231988 -294016 20727 367080 632567 700264 493362 570926
11159 570926 722959 458206 257907 345478 132203 -64036 24267 -364451 -1058915 -1679997
11149 -1679997 -1751466 -1789528 -1709562 -1379841 -1340508 -1343586 -707127 -73258 335415 794590
11139 794590 1167025 1120063 895148 808990 629720 570406 611392 561650 198070 -42318
11129 -42318 -95532 -343185 -530485 -800462 -600860 -200337 73038 284010 224383 80042
11119 80042 403939 769959 993038 1186954 999602 620199 446677 365273 711137 1011110
11109 1011110 975977 654546 374142 316188 363310 350288 -9792 -56659 -68529 -521339
11099 -521339 -703908 -308388 -335847 -340297 -144255 47969 -92464 -440619 -316057 34993
11089 34993 215458 -171178 -653525 -459159 103673 80552 -249436 -192071 13715 14173 -578887
11078 -578887 -1242686 -1168040 -713102 -115384 363621 59157 -654972 -946823 -990335 -852100
11068 -852100 -614270 -296295 -21444 230588 183203 103050 -22655 -368155 -800465 -722810
11058 -722810 -492726 -141680 102613 421879 318222 -127940 -402793 -339572 -58662 -74092
11048 -74092 33007 10789 -90047 424254 1016948 951583 349100 -253420 -533719 -99136
11038 -99136 228941 164621 21515 -268732 -345994 -370838 -323898 -254652 -114555 30805 386523
11027 386523 774622 1288283 1528382 1073158 869471 1035774 862042 523074 175807 -6743
11017 -6743 -192244 15017 -85305 -386359 -448967 -415603 -217237 -29497 -107517 -638059
11007 -638059 -996414 -1090481 -1187412 -1510040 -1837283 -1800307 -1842898 -1573843 -1127685 -730183
10997 -730183 -386110 -154360 218015 573205 618155 336463 244296 337886 54956 -188580
10987 -188580 -309471 -639967 -955125 -499116 271128 -6039 -171096 133397 157163 23506
10977 23506 -199359 -12529 343129 527208 373116 -203952 -355050 94682 191009 266398
10967 266398 648623 838656 924332 1334786 1362881 952186 552658 463910 369744 -33791
10957 -33791 25442 46780 -118862 -378702 -606778 -622635 -869460 -1350513 -1261872 -874074
10947 -874074 -716207 -586222 -538175 -725909 -634994 -251951 36217 282478 623819 776605
10937 776605 704790 142659 -5330 177771 491949 325029 165529 273029 185454 -12526
10927 -12526 294525 842793 490124 -146381 -209838 122910 171629 -312377 -810220 -811858
10917 -811858 -873512 -873558 -539563 -347757 -223285 -304726 -631886 -1078213 -1213748 -562971 235675
10906 235675 375194 119080 -186085 -456790 -745081 -682965 -335697 -1763 127881 -42626
10896 -42626 -196706 55244 93928 54630 185174 358908 214748 -231287 -221602 -66694
10886 -66694 -10192 17072 -53158 -398190 -399001 -291866 -136229 -286255 -334159 -491828 -325454
10875 -325454 -104996 385176 708861 576169 155373 65772 377835 442201 335010 434053
10865 434053 423466 383602 384077 493872 442282 -6920 -265054 -7699 131111 172196 -8279
10854 -8279 214356 900249 1252906 1425725 1239157 793626 616370 354551 -183232 -621495
10844 -621495 -727865 -634010 -458221 30128 629522 935384 650789 429093 448372 292129
10834 292129 100721 -76456 -257552 -616987 -720341 -500285 -383653 -648509 -956855 -842468
10824 -842468 -211644 499620 1114668 1354342 1283343 1227324 1445507 1785625 1900262 1937399
10814 1937399 1911506 1629612 1634032 1999511 2594839 2755587 2856941 3264117 3730979 4534767
10804 4534767 5299633 5414794 5737887 7272938 9299588 11102460 13310914 16589510 20472250
10795 20472250 22880124 22317678 19486826 15858292 12339589 9412230 7255604 6066872
10787 6066872 5603591 5206626 4688856 4117272 3519364 3115459 2539963 1789383 1617768
10778 1617768 1736624 1827678 1690341 1358295 1309050 1492120 1215232 667087 528626 768641
10768 768641 857635 725068 247532 373689 907604 982577 1219909 1633599 1862187 1937273
10758 1937273 1665393 1837556 1832476 979991 191682 57297 -19180 199519 358992 432508
10748 432508 489398 596569 705067 702078 880996 932000 510376 112391 241483 572788
10738 572788 873088 743167 118851 -58751 316488 577204 521488 446290 527957 1112975
10728 1112975 1356147 1140930 473313 85447 92643 -185762 -157811 -330698 -641360 -992081
10718 -992081 -1006463 -556582 -219208 -17581 122459 138479 -45621 -11064 394695 879869
10708 879869 1038574 1123313 1143843 859177 579333 346054 517525 492343 436522 203806
10698 203806 -23068 -156271 -588379 -532760 -290695 -108481 -195517 -203233 -55393 193209
10688 193209 222692 190707 100837 227809 -21611 -160160 -208597 -344365 -321893 -102642
10678 -102642 -16035 -427699 -549089 -793656 -631638 -539340 -424710 -68838 161027 30461
10668 30461 -103890 188465 455764 73930 -331695 -457667 -399940 -194743 97778 429009
10658 429009 489098 104330 -699348 -1166009 -1054065 -489766 -196835 -180660 -516638 -662477
10648 -662477 -455886 -575374 -1076684 -1160046 -542529 403832 761506 910751 1360619 1141576
10638 1141576 349684 -144295 -48396 25052 -163655 -851933 -958732 -548045 -58029 482213
10628 482213 557415 357477 212357 -258616 -801347 -1083955 -690049 -209936 92952 274808
10618 274808 269545 212584 275400 115668 -138314 -83235 115799 439715 621715 597869 497541
10607 497541 385415 475614 501254 184814 179468 874765 1100938 687849 682149 1028120 1569284
10596 1569284 1562060 1000291 697891 794236 879409 800521 137696 -255966 -416118 -767870
10586 -767870 -1008654 -795315 -375743 21037 -89179 -208905 -75288 -145063 -313386 -44206
10576 -44206 246009 324071 434058 214579 -316111 -336413 -96624 70588 100074 -32633
10566 -32633 -353789 -656642 -713667 -1099670 -1304373 -1050205 -966496 -840942 -662309 -344903
10556 -344903 -205849 -278743 -529739 -248244 225573 468642 830903 1009235 924912 565000
10546 565000 204275 43111 -225082 -352088 -81827 87310 327405 604668 570932 648926
10536 648926 944032 855547 318189 -165377 -367361 -171241 -2381 -559244 -805309 -559882
10526 -559882 -271782 -263386 -520728 -666814 -1012541 -1316380 -1345629 -1195101 -737699 -416547
10516 -416547 -23080 617780 886601 780964 618027 368157 75289 147241 26609 -699975
10506 -699975 -802296 -541290 -109758 569721 655569 654951 492150 80532 50786 244947
10496 244947 471841 628751 483943 379718 356197 331824 538090 762707 527949 147863
10486 147863 -102722 -81421 -122839 -435201 -234913 263797 321161 134174 -174547 -570659
10476 -570659 -724944 -847145 -589716 -76480 433364 762269 635323 302542 259562 391606
10466 391606 383898 234694 -165194 -239346 217128 548641 828018 1126294 745702 462247
10456 462247 683770 580677 485301 718918 1091235 912782 395356 -15 -161072 -32906
10446 -32906 -30261 -311472 -595808 -786875 -575410 -479794 -473191 -458794 -430291 -292938 -354516
10435 -354516 -501613 -366262 -136444 312576 186821 -2677 -247656 -303890 -201095 -316601
10425 -316601 -207833 57752 -72437 -55155 -302586 -522884 -67035 440476 643597 832532
10415 832532 491407 9879 -11066 -100043 -106756 196279 755320 736721 467261 898634
10405 898634 1552603 1684333 1608407 1257406 977269 956824 1007447 878895 223897 -440424
10395 -440424 -206921 225706 228414 64393 233912 665537 921221 571326 168457 158401
10385 158401 297218 479827 751049 816362 613395 383595 452742 637181 701384 560413
10375 560413 325186 339963 353573 215463 62164 -53348 -248143 -271442 95139 239297
10365 239297 -34709 -231310 -289296 -53346 211546 249349 501268 762887 701819 361439
10355 361439 173169 196923 197625 328699 148747 -400635 -796622 -1460556 -1768501 -1449086
10345 -1449086 -1282296 -1177695 -932502 -887592 -691819 -138592 -6249 -289786 -370493 -379447
10335 -379447 -306026 -125711 265797 866432 1247369 1254697 1008480 621511 403480 143662
10325 143662 -89892 106849 316210 22921 -465658 -404873 -519984 -629191 -748272 -734342
10315 -734342 -735475 -694160 -534314 -274150 -225948 -252132 -414897 -385007 -333658 -181668 -92747
10304 -92747 194435 523818 527114 218609 24125 -493770 -995068 -689965 -414179 -233138
10294 -233138 -152037 -224852 -9563 487081 655003 915777 1314328 1125224 599543 284175
10284 284175 175006 320355 501766 583135 524296 525707 481170 236290 -108276 7138
10274 7138 367968 343690 105537 -324211 -834876 -912827 -750115 -786459 -927359 -946101 -1010637
10263 -1010637 -919422 -791331 -442736 -246817 51589 270389 477843 576300 749310 894429
10253 894429 620446 90111 -541012 -413180 126804 184216 -44335 -330526 -201053 62620
10243 62620 192688 565963 1165793 1446286 1164697 956624 618039 198652 128044 338951
10233 338951 889448 1016626 783349 898332 874134 505387 179065 187935 307000 522195
10223 522195 683987 468846 222245 -99518 -190710 -110393 -25243 -144039 -643873 -850939
10213 -850939 -467444 -97825 199003 287357 309753 418891 -12331 -547502 -453877 -461186
10203 -461186 -510863 -600756 -898502 -1087536 -1102209 -575679 -293994 -439236 -547375 -687082
10193 -687082 -769122 -707544 -634148 -1038818 -1118118 -739205 -292502 78602 -7290 -289836
10183 -289836 -146783 12165 -136801 79045 452078 733408 615520 119383 -111792 -380608
10173 -380608 -574057 -358832 49559 365162 316847 -438868 -896825 -701892 -463381 -391005
10163 -391005 -575671 -730245 -760697 -552319 -370246 -328854 -159616 -409992 -681550 -516574
10153 -516574 -45123 116516 -233763 -376841 -413557 -211047 -90510 7485 314263 505982
10143 505982 780605 1298056 1462865 1336792 1203611 1028376 566920 355248 346333 260709
10133 260709 -1478 -617698 -639130 -20479 212493 311956 193916 2504 -279459 -352899
10123 -352899 -477103 -801270 -892671 -642942 52429 489397 518255 584050 798001 850057
10113 850057 946670 803652 572854 473678 178018 -159272 -882618 -1168525 -708858 -420866
10103 -420866 -204974 -192893 -379007 -650332 -934460 -765054 -635492 -476406 -441592 -603418
10093 -603418 -292310 159072 314548 443034 163632 -160208 -129095 -159511 -4983 320089
10083 320089 916475 1114276 885690 498178 250951 7147 -356462 -805867 -815160 -447699
10073 -447699 -126057 -242699 -420999 -233868 168458 480302 449976 -68364 -474863 -252389
10063 -252389 -273309 -678828 -1028632 -1252694 -1179551 -912523 -952633 -994507 -860925 -520689
10053 -520689 -493603 -1156299 -1645856 -1537872 -1252790 -1379283 -1190150 -339165 387467 580396
10043 580396 304875 -342750 -882874 -1198114 -1375587 -1391954 -885755 -331929 370751 854239
10033 854239 616158 116301 -122825 -231658 -244650 -173095 -385151 -628851 -628367 -254280
10023 -254280 -121977 -411092 -529720 -308496 -15179 186595 238657 -95667 -442670 -151711
10013 -151711 186167 78263 -105372 -271721 -195932 -229216 -757969 -741470 -516820 -338994
10003 -338994 296459 892942 929993 745719 971666 1125702 961318 372738 -83949 -205819
9993 -205819 -272112 -311848 -480132 -390694 -179256 49924 -7034 -273735 -255156 -195110 -572329
9982 -572329 -673125 -450079 -434556 -336865 -111643 -87554 -164688 -47308 -44357 -212336 -139899
9971 -139899 57978 185908 -225875 -323323 -17448 -87961 -295893 8505 274055 383340
9961 383340 563045 670538 717589 451085 -86648 -14271 669113 808815 225681 -305281
9951 -305281 -766529 -707063 -694652 -1098005 -1042022 -975762 -737148 -403093 -775794 -973018
9941 -973018 -541609 67661 153943 -61487 -95871 -30607 -237182 -674706 -986251 -1453580
9931 -1453580 -1279390 -824871 -657139 -648919 -823093 -724230 -538600 -302758 -328603 -395327
9921 -395327 -421645 -436146 -732265 -814667 -547799 -116670 326787 -35924 -438669 -597304
9911 -597304 -461086 -231732 -15780 -34883 -525682 -948771 -639329 -150411 -217061 -346362
9901 -346362 -536608 -545830 -610156 -732497 -851164 -795251 -824760 -1190309 -1397683 -1076206 -727280
9890 -727280 -343948 49661 289114 618460 1290676 1704324 1253948 390015 -179534 -262198
9880 -262198 -85989 177252 238869 286459 493674 497782 614799 519881 371816 171153 59566
9869 59566 68714 -167188 -637602 -818321 -675482 -450825 -94938 168312 -90658 -444622
9859 -444622 -444892 -508023 -742462 -806126 -683009 -364802 -304619 -516604 -320495 119911 554967
9848 554967 508397 210165 -241873 -382623 -29361 598319 414414 163496 203145 567479
9838 567479 682835 234979 -220118 -416633 -403293 -359012 -245373 -174941 -289851 -415737
9828 -415737 -736429 -1347848 -1382541 -1068126 -474089 -91457 -453479 -708898 -385858 239220
9818 239220 710258 621531 418280 20182 -641770 -1291588 -1274269 -551284 108865 448642
9808 448642 806926 663173 502434 482276 189486 -221940 -566021 -499072 -587133 -340626
9798 -340626 77773 299775 582868 803758 299199 -349777 -713413 -705490 -639692 -584691
9788 -584691 -557559 -491722 -185525 131602 7838 -278106 -323720 63532 356250 -226670
9778 -226670 -661220 -304236 129995 485113 410032 188411 16564 -85654 -432477 -551292
9768 -551292 -424937 -520346 -534559 -317372 -654009 -1028228 -890423 -274053 473627 638299
9758 638299 540447 667961 1053018 908038 391204 -94071 -13162 380312 1033704 1306626
9748 1306626 1338892 1447394 1592153 1626570 1564967 1779512 1693668 1542913 1517930 1650140
9738 1650140 1764828 2015117 2401672 2763753 3253078 3699766 4320119 5256679 6328340
9729 6328340 7773010 9357836 10672161 12497086 15325638 18927717 23481642 29062429
9721 29062429 35287300 40795753 42944037 40381371 34761207 28647717 23158458 18512307
9713 18512307 14821338 11797440 9384913 7700182 6464052 5831534 5396119 4900158 4651391
9704 4651391 4358276 3506429 2796083 2430613 2495000 2873657 3013017 3079016 2954324 2451145
9694 2451145 1814302 1128055 577817 419714 300116 336024 469883 901261 1334921 1669746
9684 1669746 1543489 1088754 939098 668162 474613 283448 -249856 -457218 -319650 -63824
9674 -63824 367319 377998 238720 406637 303440 17647 -402144 -595326 -507283 -482605
9664 -482605 -581870 -264221 55427 435616 666330 738621 848976 795634 674967 760286
9654 760286 856606 619330 103225 -364359 -439837 -483139 -487314 -384900 -339441 -697525 -1005225
9643 -1005225 -754937 -271038 -39029 -55044 -40033 54431 -82466 -212835 -231556 -215022
9633 -215022 -240938 -293217 -230077 -156715 -333715 -861640 -608513 48624 71367 -402807 -946905
9622 -946905 -1147278 -1275783 -1354067 -868105 -36085 222813 346739 581937 738503 1075834
9612 1075834 1242443 1091713 561157 -102655 -161274 295036 429440 229788 63728 228777
9602 228777 334376 18124 58442 -250369 -757116 -372925 -43492 142121 306921 237646
9592 237646 8817 67117 547451 863847 1255826 1130131 901075 785157 728153 884209
9582 884209 848157 430382 -24317 -431899 -628218 -619930 -326838 -279932 -75011 54056
9572 54056 -295131 -668030 -1019188 -1195045 -1107620 -725012 -413375 -395164 -554158 -580255
9562 -580255 -844982 -1144714 -966754 -937968 -934924 -430704 193808 606467 618181 818857
9552 818857 1014159 808158 698114 794183 720556 273405 75663 95063 275882 307313
9542 307313 -8656 -114103 -109635 -127815 145814 33405 -449818 -773602 -769467 -723545 -802111
9531 -802111 -839427 -961971 -767453 -399851 94323 45967 -516343 -754541 -551562 -373591
9521 -373591 -398958 -609523 -576776 -289833 -119703 149216 200730 147038 305505 544124
9511 544124 563178 664688 902769 1010396 953676 750704 321153 -278982 -590774 -349027
9501 -349027 230245 573726 383294 7971 -400370 -114955 412583 692521 806302 447574
9491 447574 -293258 -567805 -283578 -160208 -140828 -145263 -78636 100439 200832 -15741
9481 -15741 -172817 -56576 34762 136282 181113 125043 134831 315002 181213 -153981 -66425
9470 -66425 66567 -179300 -464448 -567585 -424048 -57394 -75875 -96634 -173213 -73385 122481
9459 122481 340394 280357 -337347 -765671 -505437 -151244 60480 -152527 -627374 -695230
9449 -695230 -616152 -912521 -930228 -396132 -152813 -118591 -105051 42145 54439 -163142 -548376
9438 -548376 -542619 -131458 -145754 -286530 -454816 -398333 -134342 -248836 197841 467532
9428 467532 275889 -61401 33840 699467 1100835 1041480 573466 364438 437616 188109
9418 188109 -361157 -435386 -184764 -266628 -390589 -149752 -94338 -363123 -57630 158905
9408 158905 112710 9162 -67928 -265385 -372586 -324121 -495967 -579808 -380492 -48519
9398 -48519 -50208 -202342 -205749 -39628 -16864 42634 -136273 -449531 -412345 -344065 -539925
9387 -539925 -777694 -785754 -469534 -60483 315752 258240 65987 -132317 -113435 161196
9377 161196 123230 -466050 -737636 -387281 148387 157411 -214480 -449461 -607676 -940738
9367 -940738 -1258647 -1428660 -1427956 -1034364 -745505 -874803 -1086629 -1379404 -1734097 -1499031
9357 -1499031 -1204775 -1039896 -700458 -634549 -627709 -397861 -372702 -152427 167096 196605
9347 196605 -223981 -656902 -1021297 -1083122 -743868 -394125 -302845 16639 194936 -13014
9337 -13014 -219906 375599 617480 464445 275815 -252633 -753032 -614575 -428837 -694523
9327 -694523 -984785 -706452 -221360 410756 996954 698131 118914 -55104 -267628 -545444
9317 -545444 -222143 228893 193466 -111 278546 507908 670866 618003 320717 217471
9307 217471 427537 704595 1076074 903624 183731 -152919 100746 225427 655345 1093613
9297 1093613 1271161 1184313 886494 464585 183717 -16345 -254942 -369347 62831 617024
9287 617024 716213 371610 -14872 -141482 -98086 -43548 141137 460889 441689 82556
9277 82556 -110663 -231698 -674032 -806235 -547340 -252488 -232990 -654826 -877561 -867074
9267 -867074 -1033879 -1033594 -817151 -570013 19081 383515 539899 781165 843286 836525 542600
9256 542600 111181 -183792 -345599 -322288 -490364 -439423 -380879 -492966 -705761 -662470
9246 -662470 -108262 46805 76744 234219 127631 -201726 -488591 -379134 -414522 -540988
9236 -540988 -569927 -664273 -758472 -753799 -443439 -281039 -237610 -76867 65639 47117 303174
9225 303174 552266 400809 222804 221659 7146 -695919 -1479360 -1551535 -1405096 -1124468
9215 -1124468 -1002673 -1074606 -833288 -381254 -63484 -302705 -441546 -279717 -61993 274965
9205 274965 536031 883902 1012696 954833 1113433 950823 575648 71500 217654 731798
9195 731798 735329 244950 -116802 -196512 -293743 -695836 -841299 -515342 -46979 -255701
9185 -255701 -174366 220624 141044 -481507 -1123267 -1315236 -1246705 -1114569 -972182 -955441
9175 -955441 -1443555 -1360176 -837582 -137080 321948 291381 35502 -141272 87177 233789
9165 233789 -23448 -162752 -231575 -152284 -47734 -158982 -95356 -161916 -304700 -302339 -109162
9154 -109162 -198981 -672285 -817691 -602614 -359592 -88869 -41042 -574928 -1047280 -991059
9144 -991059 -479677 -266664 14493 61454 -161248 -481157 -387448 -233087 -453676 -682799
9134 -682799 -451369 6072 -271225 -528107 -1049382 -1644939 -1495268 -851591 -283452 113547
9124 113547 498547 287773 -155155 -143936 -70588 -148796 -179283 -207359 -395804 -256463 -166927
9113 -166927 -155045 -591380 -956298 -842169 -1070401 -1340583 -1360525 -867029 -404419 -331380
9103 -331380 -20435 12589 -142288 -145270 -560233 -958916 -862997 -717055 -501670 -758225
9093 -758225 -1053907 -1114830 -778933 -441567 -132298 -533487 -1219849 -1374390 -1262055 -1166644
9083 -1166644 -1148325 -958500 -415007 -51655 -368226 -883282 -1195354 -910340 -1051476 -943214
9073 -943214 -407246 -305476 -455416 -491221 -501756 -398444 -541010 -593107 -512772 -274259
9063 -274259 -251712 -616986 -742122 -517444 -306197 150002 453969 635950 839778 1083147
9053 1083147 1052256 551089 26449 -304475 -238242 -83373 -283536 -386861 -225837 176942
9043 176942 616441 767188 570057 -16136 -87348 235459 490026 601748 568831 552097
9033 552097 452209 -114504 -695154 -929096 -967402 -684097 -598259 -900245 -657354 -210634
9023 -210634 -191227 108899 522600 359541 -46669 -399990 -901066 -1000090 -602648 -237309
9013 -237309 -355575 -411112 -149755 33450 103295 122383 132820 569449 663289 204095 -64153
9002 -64153 -256968 -527314 -300463 -310441 -458044 -13368 341382 335258 134698 -187552 -427814
8991 -427814 -627736 -531013 62175 306715 41914 47975 -300015 -853474 -1212459 -1225362
8981 -1225362 -802925 -521426 -324768 -34618 182901 -37918 -588080 -924044 -1268729 -1457856
8971 -1457856 -955757 -916007 -1031028 -822783 -588141 -350283 89981 338163 431404 618592
8961 618592 331125 15283 -453223 -555193 -432578 -241507 249141 668943 751190 674101
8951 674101 726669 422291 212480 235714 309773 425867 321100 -58844 -162090 -89611
8941 -89611 -21066 174564 443617 586419 618590 988735 1301702 1372948 1419564 1298059 1258405
8930 1258405 1494221 1529286 1391066 1226537 903018 617922 169386 -416247 -583312 -341208
8920 -341208 -365324 -498020 -344530 204060 366200 -140140 -389002 -320338 -178358 21115
8910 21115 257843 54731 -257894 -299528 380563 1083828 880993 470472 126772 -101041
8900 -101041 -67032 164370 259091 113801 -133045 -278816 -211004 150284 311182 434950
8890 434950 271106 -52244 -277395 -578032 -1116346 -1259590 -672673 -372000 -679903 -1030359
8880 -1030359 -851551 -385459 28168 181679 2911 -254824 -161099 8230 57847 -341743
8870 -341743 -675243 -719986 -812644 -594326 -796622 -1282863 -1247912 -1055811 -604758 -33878
8860 -33878 229187 -204974 -262450 337333 382683 205988 -73292 -207087 -284467 -520714
8850 -520714 -789037 -507001 -325218 -345005 -235883 -225353 -540592 -598838 -228478 -25803
8840 -25803 70331 -176041 -480398 -648728 -745995 -765120 -714993 -875169 -971768 -806304 -442073
8829 -442073 -60648 -27386 76582 219292 372034 388002 220186 97692 379054 356553
8819 356553 150736 272482 321362 187802 -92526 -316683 -355554 -309426 -244745 -257439 -152159
8808 -152159 -39009 -93537 -120511 -142336 -409478 -449194 -465293 -469011 -197598 -166799 -413487
8797 -413487 -774273 -943738 -972024 -1155948 -1273477 -766002 -280454 -52691 80090 248106
8787 248106 717720 1050759 623828 244820 207073 342905 173720 -142631 -188344 -331959
8777 -331959 -86620 -131170 -340281 -325236 -488812 -779411 -583175 20655 92778 413246
8767 413246 252468 -147211 -372303 -432136 -572413 -746230 -825416 -984068 -800502 -701628
8757 -701628 -490952 390520 927047 1053061 853151 175071 64078 272458 142301 -374350
8747 -374350 -410258 -194948 -89949 -307352 -389356 -321934 -498650 -456759 -159875 -80596 -27451
8736 -27451 -165861 38547 80689 -28095 219249 410965 507541 553042 303951 122846
8726 122846 -43587 185501 848495 645806 -148789 -712149 -1010426 -1300085 -1677340 -1537715
8716 -1537715 -856669 -577944 -694157 -994586 -798205 -53220 60002 -403614 -664410 -642921
8706 -642921 -798031 -568606 164735 578303 563602 291062 -121884 589 107883 -31371
8696 -31371 142408 358756 383967 303084 207312 5980 5957 194562 431588 347964 196614
8685 196614 -7391 117216 488530 588358 758546 867718 404948 -313218 -181114 425888
8675 425888 917302 638675 254226 -268533 -998159 -1554650 -1371275 -356287 401378 110345
8665 110345 -424663 -57363 346022 234619 -52584 356283 682601 319540 -441186 -1039091
8655 -1039091 -887219 -620438 -716469 -289897 375613 614752 600012 624781 919550 946358
8645 946358 677753 601624 199429 -86081 288644 499778 353362 538720 586515 291672
8635 291672 28071 90838 110083 127643 202546 626644 1025418 780876 555772 549096 306583
8624 306583 274032 298878 196706 -77579 -194462 -432790 -640175 -566506 -729635 -701382
8614 -701382 -489242 -237993 -195752 -287949 -424111 -395581 -68215 -289796 -1057018 -1284476
8604 -1284476 -1150181 -1028781 -748563 -3422 282579 588905 1050827 1117119 698751 303705
8594 303705 281267 432774 510328 454686 179759 -347803 -704802 -363704 167660 162731 61329
8583 61329 -45299 -196223 -652943 -705498 -569466 -503618 37903 548060 826123 1082477
8573 1082477 1182678 1217859 902393 495712 485325 455114 178696 -161570 -400787 -387465
8563 -387465 -33667 -29222 -259040 -238928 -34063 250562 273273 -39972 -243395 -205915 -90404
8552 -90404 -272377 -435335 -773942 -654974 -62671 58732 -29729 -33054 -57166 -242139 -384181
8541 -384181 -409615 -526275 -831281 -756529 -160171 349663 670464 729642 315970 118339
8531 118339 -31272 -161486 -71916 314428 229137 -241833 -495564 -818471 -1010068 -1084517
8521 -1084517 -971955 -616665 -323213 -218978 -128755 178600 253062 115155 -291146 -678567
8511 -678567 -657469 -359815 -579809 -1052581 -1123082 -1003809 -764584 -344167 73916 322845
8501 322845 270009 -70007 -562368 -732109 -546443 -287137 -258711 -246534 -255117 -431488 -891227
8490 -891227 -1068009 -976646 -1098839 -1082891 -919076 -572118 31010 323788 357848 381264
8480 381264 581727 712524 547090 285947 130241 -35272 88151 464745 513032 525773
8470 525773 635815 769117 643885 334858 232071 -325938 -510728 -273082 -227458 -248882
8460 -248882 -104052 250899 -98096 -586175 -489275 44067 351849 -205450 -676119 -794337
8450 -794337 -381879 80512 100019 -374314 -492088 -18606 300028 162266 -349600 -446715
8440 -446715 -158822 64659 -13241 20551 147248 -4277 259525 655218 669425 595100
8430 595100 -38648 -555797 -619456 -711255 -923324 -923195 -850634 -571151 -284911 -35564 159423
8419 159423 248596 332004 376361 22792 -528771 -649270 -643816 -430991 -150065 -146153 -233261
8408 -233261 -236627 -33606 173766 370614 611008 523350 193838 266866 598757 576834 354325
8397 354325 -231906 -671024 -774478 -977509 -920336 -487350 82718 262310 171319 -101601
8387 -101601 -186993 37400 -80702 11555 318874 681052 790010 258846 -221132 -258751
8377 -258751 20708 -205536 -160796 -122518 -18252 -45029 -365503 -540915 -401802 -253867
8367 -253867 -194659 182290 644249 1041700 1483157 1181392 803893 656164 473779 299005
8357 299005 197302 69463 29470 258434 276364 -74766 -175407 -257257 -240970 74685
8347 74685 221644 76321 -221176 -621289 -620879 -609839 -711301 -489568 -262952 -487685 -648083
8336 -648083 -808454 -703952 34367 491001 274398 -39883 -158880 -531804 -680909 -134441
8326 -134441 482157 322003 356950 756998 871277 636518 524351 438504 349514 73965
8316 73965 -264361 -333694 -375994 -601081 -904911 -728473 -436411 -444619 -701708 -847586 -901766
8305 -901766 -1149100 -1295208 -745161 -306694 -166823 -204480 -372076 -646654 -511221 -26892
8295 -26892 157983 -187991 -280589 -445683 -476168 17527 124545 19315 -355614 -511056
8285 -511056 -480132 -643604 -767089 -830855 -1111366 -1690854 -1538729 -405418 460795 686644
8275 686644 561269 332618 430860 537087 495856 402825 -178621 -425320 -352573 -422071 -450153
8264 -450153 -10968 495200 622269 270930 -595011 -1106643 -1384547 -1519464 -1086206 -643610
8254 -643610 -421977 -338370 -544363 -931812 -1337113 -1418303 -1171278 -1062869 -801808 -487738
8244 -487738 -228621 -138688 -69488 -123259 -73890 -147234 -351636 -231317 -640647 -1216722 -978437
8233 -978437 -614958 -619200 -700773 -846547 -1169703 -1291322 -1075239 -399875 26341 -159998
8223 -159998 -171693 -52647 76071 152645 535758 717700 699586 765894 625207 401699
8213 401699 312525 -106088 -542032 -578062 -857391 -635421 -320432 -374397 -544929 -454944
8203 -454944 -52318 224540 163609 162297 73507 -210540 -205934 -214952 -734844 -795624 -596085
8192 -596085 -473424 -919319 -1258636 -1139325 -1168571 -1235003 -840371 -317087 -168824 -232963
8182 -232963 -219390 -143362 -108210 183783 312192 190401 283058 722553 1104217 1014012 553295
8171 553295 234265 234655 209288 113075 91738 -282347 -718453 -980778 -669396 -95032 480539
8160 480539 545646 199185 -118524 -199693 -107555 -201649 -158694 139688 136024 -50023 -175142
8149 -175142 148101 344873 149047 170732 168674 -149915 -956587 -1296394 -911969 -487417
8139 -487417 -426222 -359184 -56964 250084 353316 72505 -104382 -95541 -173082 -33733 128946
8128 128946 -70165 -85128 183288 442546 695801 608087 570902 629346 511730 210404
8118 210404 -177889 -307278 -133143 -98860 -103549 127510 199458 112971 -200985 -752166 -930725
8107 -930725 -485314 -438660 -691052 -949514 -1219061 -1321893 -795952 -131628 81621 -68195
8097 -68195 -236537 -509347 -759161 -855713 -726084 -266880 -7225 -291644 -881261 -1200380
8087 -1200380 -1410217 -1192993 -584653 -208068 129278 436093 189186 96700 216934 127351
8077 127351 81972 40480 -549938 -965789 -1213418 -1143551 -834686 -599574 -928109 -1055495
8067 -1055495 -825284 -324925 784977 1186738 1109651 894073 766839 836194 916322 587156
8057 587156 235577 12540 -129661 -84206 -523272 -673455 -314769 45890 281063 27251
8047 27251 -248713 -527297 -834292 -365360 285042 25140 -604169 -910025 -884018 -695951
8037 -695951 -707731 -504592 -358892 -682128 -654277 -2327 333805 273890 138498 301334
8027 301334 688173 651603 392402 333913 537802 787669 1161899 1090258 772785 755941
8017 755941 467778 174254 351318 394473 311943 440866 379626 337152 74218 -548782
8007 -548782 -1136615 -1053136 -807469 -575598 -298031 -435522 -435858 -299421 -216677 -269986 -458277
7996 -458277 -637510 -822394 -732153 -309294 -130228 8397 298089 297122 127085 33746 -369554
7985 -369554 -791061 -756385 -694607 -997445 -1137506 -997905 -826834 -643563 -245911 -112397
7975 -112397 -324892 -570714 -763773 -601293 -173318 23045 69470 -379049 -718017 -420517
7965 -420517 -107454 126455 718803 1215993 841028 335864 -13863 -485184 -625720 -237127
7955 -237127 237880 764106 1095379 1285241 1285893 684244 300786 200114 -223743 -693161
7945 -693161 -733370 -406340 263815 952009 851839 701884 750219 825709 973256 544696
7935 544696 -99949 -254175 -167107 -8668 -129469 -553319 -1015571 -762250 -426735 -704386
7925 -704386 -966427 -1011909 -1039748 -1108827 -1151945 -920652 -631498 -500905 -601168 -562274 -200700
7914 -200700 60573 392801 825920 972583 681113 326199 138979 302604 314060 112810
7904 112810 79849 620681 1099421 893309 728455 406983 211283 234526 251987 272681
7894 272681 464994 458152 62818 -85600 86380 -60263 -9502 126203 15310 -429172
7884 -429172 -830640 -406849 -199416 -717580 -1034669 -989427 -863394 -737895 -732190 -722982 -356944
7873 -356944 -66820 -464155 -645917 -413405 -277441 -17010 337785 237454 259255 225802
7863 225802 -167928 -216328 19331 -12638 4911 -251257 -291149 120637 -35537 -371374
7853 -371374 -25324 566116 739319 374830 16046 -201243 -44622 -56544 -139565 -161333
7843 -161333 -335215 -484415 -82533 201472 339216 535185 277956 -162543 -587660 -772814
7833 -772814 -709276 -503632 -27634 148484 224611 453381 537296 518408 638247 862432
7823 862432 835283 631958 494909 421180 328169 265892 276066 387505 520710 471857 376953
7812 376953 561605 741812 559521 -20989 -211916 -74361 301890 495865 370611 304264
7802 304264 422284 910155 692973 225660 -31585 -421301 -399789 3446 349154 735624
7792 735624 1203580 932630 -2477 -450924 -379628 -37546 -62081 -234425 -141149 -109178
7782 -109178 117043 218878 232662 155910 136700 219510 661527 876808 707799 746319 887178
7771 887178 1091253 1064259 780089 713571 523000 417953 342029 209213 191636 66961
7761 66961 -17579 257625 532693 928176 819372 327164 90145 -403952 -835758 -748257
7751 -748257 -523964 -646744 -526028 -253609 -120144 -337623 -468727 -73474 652914 886309
7741 886309 969491 981308 742224 393727 -124488 -266685 -235980 -111969 15187 88411
7731 88411 -258705 -1155884 -1761559 -1809318 -1780544 -1937579 -1790328 -1352564 -1003620 -779425
7721 -779425 -530675 -120008 216349 -47033 -251856 -406483 -479930 -349579 -696448 -1171953
7711 -1171953 -1308694 -526127 273233 242981 -393683 -710614 -561183 -453367 -344021 -453905
7701 -453905 -584064 -838998 -1105417 -823400 -488908 -142814 210623 286968 501741 759586
7691 759586 901580 607053 202572 339273 765523 829687 156500 -578239 -815904 -688404
7681 -688404 -22169 460647 660042 871022 870627 887492 803173 269586 -66945 -207941 -197108
7670 -197108 -19835 6388 -133751 -258699 -148583 294976 417507 88210 57803 170397
7660 170397 342517 516676 679708 655802 436875 75166 -76951 -182324 -332637 -458499
7650 -458499 -610542 -761741 -901399 -1041081 -874678 -474225 -100777 232827 272632 149810
7640 149810 26264 -10904 -225458 -576925 -679935 -432021 -472478 -494071 -200159 323211
7630 323211 644997 366644 -169632 -152564 98141 375724 503940 503127 849318 825914 377849
7619 377849 -161635 -598901 -494036 -219572 121443 128545 71166 243145 -76033 -359098
7609 -359098 -175881 -107032 -487755 -668351 -845039 -681306 -343255 144566 487599 498937
7599 498937 276983 -6256 -189414 -609833 -1042288 -1157614 -952955 -776575 -735753 -904758
7589 -904758 -899470 -459636 -337522 -676801 -878781 -865932 -593214 -175091 -132298 -239438
7579 -239438 -404089 -448466 -243240 -54555 230422 467982 782103 659079 -53772 -880098
7569 -880098 -1403073 -1391474 -1066799 -521284 -216417 -242945 -201960 -241638 -324399 -101907 88023
7558 88023 116669 51774 288522 290183 45245 176447 435037 425009 357492 363572 209041
7547 209041 -84186 -144777 -75122 -424271 -685610 -443300 -160909 328097 937717 1055919
7537 1055919 815646 615684 454485 415691 -305757 -1017013 -1182544 -925544 -423814 -89154
7527 -89154 216960 435406 496488 461997 243116 285600 427997 462086 453926 399259 546479
7516 546479 860105 701035 494055 306128 -82292 -481646 -392664 37984 9848 -103068
7506 -103068 -3064 -45639 143334 22040 -184328 67180 342698 248519 400483 52951
7496 52951 -329720 -85716 587032 834738 629072 483574 593124 320020 -56942 99288
$$ [...]
##END NTUPLES=NMR SPECTRUM
##END=
