##TITLE=C13_Pr 4964
 CDCl3, 640 sc

 17.12.2020
##JCAMPDX= 6.0         $$ Bruker NMR JCAMP-DX V2.0
##DATA TYPE= NMR SPECTRUM
##DATA CLASS= NTUPLES
##ORIGIN= UXNMR, Bruker Analytische Messtechnik GmbH
##OWNER= root
$$ XWIN-NMR		Version 3.5
$$ Fri Dec 18 11:24:21 2020 Russian Standard Time (UT+4h)  she@DPX200
##.OBSERVE FREQUENCY= 50.327896
##.OBSERVE NUCLEUS= ^13C
##.ACQUISITION MODE= SIMULTANEOUS
##.ACQUISITION SCHEME= undefined
##.AVERAGES= 641
##.DIGITISER RES= 17
##SPECTROMETER/DATA SYSTEM= spect
##.PULSE SEQUENCE= zgpg30
##.SOLVENT NAME= CDCl3
##.SHIFT REFERENCE= (INTERNAL, CDCl3, 0, 222.661)
##AUDIT TRAIL= $$ (NUMBER, WHEN, WHO, WHERE, WHAT)
$$ ##TITLE= Audit trail, XWIN-NMR		Version 3.5
$$ ##JCAMPDX= 5.01
$$ ##ORIGIN= Bruker BioSpin GmbH
$$ ##OWNER= she
$$ F:/spectra/data/she/nmr/c13/1/pdata/1/auditp.txt
$$ ##AUDIT TRAIL=  $$ (NUMBER, WHEN, WHO, WHERE, WHAT)
(   1,<2020-12-18 11:22:46.79 +0400>,<she>,<DPX200>,
      <created by zg, POWCHK disabled, PULCHK disabled
       terminated by command 'halt'
       configuration hash MD5:
       00 E9 B6 7A A2 85 ED C7 34 08 36 98 17 FE 4E 26
       data hash MD5: 32K
       77 21 E0 8D F8 00 09 4B 03 57 88 16 DA EC F5 AA>)
(   2,<2020-12-18 11:23:06.73 +0400>,<she>,<DPX200>,
      <Start of raw data processing
       efp BC_mod = 2 LB = 1 FT_mod = 6 PKNL = 1 PHC0 = -278.0625 PHC1 = 32.76242 SI = 32K 
       data hash MD5: 32K
       62 CE C1 BB 7F 83 8E 6A AE 2A A7 37 EB 73 1C B0>)
(   3,<2020-12-18 11:23:09.56 +0400>,<she>,<DPX200>,
      <abs ABSG = 5 
       data hash MD5: 32K
       C5 D6 9F 52 53 9A 40 C0 E1 AF B5 DC 00 07 CF 9D>)
(   4,<2020-12-18 11:23:42.17 +0400>,<she>,<DPX200>,
      <abs ABSG = 5 
       data hash MD5: 32K
       E5 A7 BB AE 2D 4D BD DF 24 EE 6E 97 D3 15 60 70>)
(   5,<2020-12-18 11:23:58.46 +0400>,<she>,<DPX200>,
      <pk PHC0 = -5.04712 PHC1 = 5 
       data hash MD5: 32K
       9B B5 60 6B 00 88 4A 01 32 00 F6 7A 34 67 3A 63>)
$$ ##END=
$$ 
$$ hash MD5
$$ DC 79 77 BA 03 AA 6B 27 D4 10 29 12 6C 4E 99 85
##$RELAX= 
##$RELAX= 
##$RELAX= 
##$RELAX= 
##$RELAX= 
##$RELAX= 
##$RELAX= 
##$RELAX= 
$$ Bruker specific parameters
$$ --------------------------
##$DU= <F:/spectra>
##$EXPNO= 1
##$NAME= <c13>
##$PROCNO= 1
##$TYPE= <nmr>
##$USER= <she>
##$AMP= (0..31)
100 100 100 100 100 100 100 100 100 100 100 100 100 100 100 100 100 100 
100 100 100 100 100 100 100 100 100 100 100 100 100 100 
##$AQSEQ= 0
##$AQ_mod= 1
##$AUNM= <au_zg>
##$AUTOPOS= <>
##$BF1= 50.322709
##$BF2= 200.13
##$BF3= 50.322709
##$BF4= 500.13
##$BF5= 500.13
##$BF6= 500.13
##$BF7= 500.13
##$BF8= 500.13
##$BYTORDA= 1
##$CFDGTYP= 0
##$CFRGTYP= 5
##$CHEMSTR= <none>
##$CNST= (0..31)
1 1 145 1 1 1 1 1 1 1 1 1 1 1 1 1 1 1 1 1 1 1 1 1 1 1 1 1 1 1 1 1 
##$CPDPRG= <waltz16>
##$CPDPRG1= <>
##$CPDPRG2= <waltz16>
##$CPDPRG3= <>
##$CPDPRG4= <mlev>
##$CPDPRG5= <mlev>
##$CPDPRG6= <mlev>
##$CPDPRG7= <mlev>
##$CPDPRG8= <mlev>
##$CPDPRGB= <>
##$CPDPRGT= <>
##$D= (0..31)
$$ [...]
##$SUBNAM4= <"">
##$SUBNAM5= <"">
##$SUBNAM6= <"">
##$SUBNAM7= <"">
##$SUBNAM8= <"">
##$SUBNAM9= <"">
##$SW= 239.972175391363
##$SWIBOX= (0..15)
0 1 3 0 0 0 0 0 0 0 0 0 0 0 0 0 
##$SW_h= 12077.2946859903
##$TD= 32768
##$TD0= 1
##$TE= 0
##$TE2= 300
##$TE3= 300
##$TEG= 300
##$TL= (0..7)
120 120 120 120 120 120 120 120 
##$TP= (0..7)
150 150 150 150 150 150 150 150 
##$TP07= 0
##$TPNAME0= <>
##$TPNAME1= <>
##$TPNAME2= <>
##$TPNAME3= <>
##$TPNAME4= <>
##$TPNAME5= <>
##$TPNAME6= <>
##$TPNAME7= <>
##$TPOAL= (0..7)
0.5 0.5 0.5 0.5 0.5 0.5 0.5 0.5 
##$TPOFFS= (0..7)
0 0 0 0 0 0 0 0 
##$TUNHIN= 0
##$TUNHOUT= 0
##$TUNXOUT= 0
##$USERA1= <user>
##$USERA2= <user>
##$USERA3= <user>
##$USERA4= <user>
##$USERA5= <user>
##$V9= 5
##$VALIST= <valist>
##$VCLIST= <CCCCCCCCCCCCCCC>
##$VD= 0
##$VDLIST= <DDDDDDDDDDDDDDD>
##$VPLIST= <PPPPPPPPPPPPPPP>
##$VTLIST= <TTTTTTTTTTTTTTT>
##$WBST= 1024
##$WBSW= 4
##$XGAIN= (0..3)
0 0 0 0 
##$XL= 0
##$YL= 0
##$YMAX_a= 4349938
##$YMIN_a= -1052225
##$ZGOPTNS= <>
##$ZL1= 120
##$ZL2= 120
##$ZL3= 120
##$ZL4= 120
##$ABSF1= 222.6606
##$ABSF2= -17.33621
##$ABSG= 5
##$ABSL= 3
##$ALPHA= 0
##$AQORDER= 0
##$ASSFAC= 0
##$ASSFACI= 0
##$ASSFACX= 0
##$ASSWID= 0
##$AUNMP= <proc_1d>
##$AZFE= 0.1
##$AZFW= 0.5
##$BCFW= 0
##$BC_mod= 2
##$BYTORDP= 0
##$COROFFS= 0
##$CY= -3
##$DATMOD= 1
##$DC= 0
##$DFILT= <>
##$DTYPP= 0
##$F1P= 0
##$F2P= 0
##$FCOR= 0.5
##$FTSIZE= 32768
##$FT_mod= 6
##$GAMMA= 0
##$GB= 0
##$INTBC= 1
##$INTSCL= 4.134877e-10
##$ISEN= 128
##$LB= 1
##$LEV0= 0
##$LPBIN= 0
##$MAXI= 10000
##$MC2= 0
##$MEAN= 0
##$ME_mod= 0
##$MI= 0.1934396
##$NCOEF= 0
##$NC_proc= -3
##$NLEV= 6
##$NOISF1= 120.0001
##$NOISF2= 80.00006
##$NSP= 0
##$NTH_PI= 0
##$NZP= 0
##$OFFSET= 222.6606
##$PC= 1.4
##$PHC0= -283.1096
##$PHC1= 37.76242
##$PH_mod= 1
##$PKNL= yes
##$PPARMOD= 0
##$PSCAL= 0
##$PSIGN= 0
##$REVERSE= no
##$SF= 50.322729756361
##$SI= 32768
##$SIGF1= 140
##$SIGF2= 120
##$SINO= 11.81781
##$SIOLD= 32768
##$SREGLST= <13C.CDCl3>
##$SSB= 0
##$STSI= 32768
##$STSR= 0
##$SW_p= 12077.2946859903
##$SYMM= 0
##$S_DEV= 0
##$TDeff= 32768
##$TDoff= 0
##$TI= <>
##$TILT= no
##$TM1= 0
##$TM2= 0
##$TOPLEV= 0
##$USERP1= <user>
##$USERP2= <user>
##$USERP3= <user>
##$USERP4= <user>
##$USERP5= <user>
##$WDW= 1
##$XDIM= 32768
##$YMAX_p= 494280018
##$YMIN_p= -12039110
$$ End of Bruker specific parameters
$$ ---------------------------------
##NTUPLES= NMR SPECTRUM
##VAR_NAME=  FREQUENCY,     SPECTRUM/REAL,   SPECTRUM/IMAG
##SYMBOL=    X,             R,               I
##VAR_TYPE=  INDEPENDENT,   DEPENDENT,       DEPENDENT
##VAR_FORM=  AFFN,          ASDF,            ASDF
##VAR_DIM=   32768,         32768,           32768
##UNITS=     HZ,            ARBITRARY UNITS, ARBITRARY UNITS
##FACTOR=    0.368581032318806, 1,           1
##FIRST=     11204.8891385315, 0,            0
##LAST=      -872.405547458802, 0,           0
##MIN=       -872.405547458802, -12039110,   0
##MAX=       11204.8891385315, 494280018,    0
$$ Real data points
##PAGE= N=1
##DATA TABLE= (X++(R..R)), XYDATA
$$ [...]
$$ plain form
15629 947270 2395432 3772397 3959621 887035 -1750791 -3907682 -4934446 -5913469 -7359831
15620 -7359831 -5011343 -2359777 -2884591 -3788385 -3493323 -3598349 -3367895 -1565111 -1763259
15611 -1763259 -5167909 -7043263 -5602433 -1838513 85969 -54784 268019 -596637 -1689339
15602 -1689339 -1097592 159263 -244003 -436648 930402 2617845 2388368 481146 1514086
15593 1514086 3188643 3763646 2975260 2738944 1772287 350977 560876 2714274 4083963
15584 4083963 4378563 3118860 2129521 2137215 1477110 819361 1676373 1261503 314185 -1628391
15574 -1628391 -266311 1315630 -176358 -1202943 -2750134 -4015328 -3769570 -2832188
15566 -2832188 -3001695 -1183864 -839813 192640 1859948 1361178 530674 2032918 5867155
$$ packed form
15629I47270J448162J376965J87224l072586k637826k156891j026764r79023j446362
15620g359831K348488K651566n24814r03794K95062j05026K30454J802784j98148
15611a763259l404650j875354J440830L763920J924482j40753L22803q64656j092702
15602a689339N91747J256855m03266j92645J367050J687443k29477j907222J032940
15593A514086J674557N75003p88386k36316r66657j421310K09899K153398J369689
15584D083963K94600j259703r89339P694o60105o57749Q57012m14870r47318j942576
15574a628391J362080J581941j491988j026585j547191j265194K45758R37382
15566b832188j69507J817831L44051J032453J667308m98770q30504J502244L834237
$$ plain form
15557 5867155 6551466 4663392 2682220 2956434 4638367 5137632 3831471 3500348 3925834
15548 3925834 4116552 3416776 1261516 68555 -638337 -879027 -3533758 -4420425 -3416007
15539 -3416007 -3388222 -2922861 -1475163 -415008 -277805 1017239 2558156 2530519 1561781
15530 1561781 2331326 1385837 907488 -657642 -3268843 -4535769 -6620203 -7497700 -5844022
15521 -5844022 -4733028 -5476806 -4403265 -891737 2808080 4421851 4006867 2104580
15513 2104580 497894 1557198 3503080 3181493 1461150 11060 1368485 3706460
15505 3706460 3873339 2876378 1553446 -848322 -701985 2048182 2759825 4421533 6282720
15496 6282720 5898854 4800755 3941873 3402637 1376927 -2599785 -4425555 -2508186 -1203501
$$ packed form
15557E867155O84311j888074j981172K74214J681933M99265j306161l31123M25486
15548C925834J90718o99776k155260j192961p06892k40690k654731q86667J004418
15539c416007K7785M65361J447698J060155J37203J295044J540917k7637r68738
15530A561781P69545r45489m78349j565130k611201j266926k084434q77497J653678
15521e844022J110994p43778J073541L511528L699817J613771m14984j902287
15513B104580j606686J059304J945882l21587j720343j450090J357425K337975
15505C706460J66879r96961j322932k401768J46337K750167P11643J661708J861187
15496F282720l83866j098099q58882n39236k025710l976712j825770J917369J304685
$$ plain form
15487 -1203501 281313 2035001 3432677 3302990 2385505 1196824 111996 1254092
15479 1254092 3778688 5446759 5087640 4186821 2243334 2856897 4309033 3419136 2430959
15470 2430959 3716869 3437671 1865913 1238456 1328332 68083 -2778544 -2925355 466331
15461 466331 3028592 2541162 1377983 -135417 375129 1211281 1596889 2843237 2684191
15452 2684191 531911 -1216954 -2075306 -4818146 -7497384 -8184130 -7063300 -5227826
15444 -5227826 -2266139 -373582 -864701 -2677056 -4969199 -4883401 -2680625 -1504997 -2192681
15435 -2192681 -1073614 230895 -434012 242624 2286864 3534930 413650 -3216613
15427 -3216613 -2333670 -2148649 -907449 2635824 3551373 2840248 2911628 1737743 402151
$$ packed form
15487a203501J484814J753688J397676j29687r17485j188681j084828J142096
15479A254092K524596J668071l59119r00819j943487O13563J452136q89897r88177
15470B430959J285910k79198j571758o27457Q9876j260249k846627j46811L391686
15461D66331K562261m87430j163179j513400N10546Q36152L85608J246348j59046
15452B684191k152280j748865q58352k742840k679238o86746J120830J835474
15444e227826K961687J892557m91119j812355k292143Q5798K202776J175628o87684
15435b192681J119067J304509o64907O76636K044240J248066l121280l630263
15427c216613Q82943J85021J241200L543273R15549p11125P1380j173885j335592
$$ plain form
15418 402151 929420 1877046 1264987 -1861117 -2959315 -1322375 599467 1825395 1352146
15409 1352146 489616 -2303388 -5823713 -3939026 -656147 186591 1249516 4435544
15401 4435544 6718427 5754573 6445248 7220219 6741092 6302222 6415617 6798151 7351961
15392 7351961 7152164 4136347 3269421 3710666 1592141 615860 -351321 -945384 -1997117
15383 -1997117 -1868869 -2234235 -1862303 792164 2501044 1744939 14363 -161836 1322705
15374 1322705 1593077 -313904 -1886511 -3126104 -5005737 -5849614 -5377381 -3830590 -2202807
15365 -2202807 -2748757 -3541112 -3805835 -2740253 -584870 569334 3083306 3413805 2778406
15356 2778406 2711231 4038051 5019487 4569529 3046125 430229 -2707740 -3233837 -519591
$$ packed form
15418D02151N27269R47626o12059l126104j098198J636940J921842J225928m73249
15409A352146q62530k793004l520325J884687L282879Q42738J062925L186028
15401D435544K282883r63854O90675P74971m79127m38870J13395L82534N53810
15392G351961j99797l015817q66926M41245k118525r76281r67181n94063j051733
15383a997117J28248l65366L71932K654467J708880p56105j730576j76199J484541
15374A322705K70372j906981j572607j239593j879633q43877M72233J546791J627783
15365b202807n45950p92355k64723J065582K155383J154204K513972L30499o35399
15356B778406o7175J326820R81436m49958j523404k615896l137969n26097K714246
$$ plain form
15347 -519591 2819599 3989205 1542126 -127711 869285 1056599 630841 1029206 -309292
15338 -309292 -1132746 -141748 653253 461087 1270592 2008450 4101738 7847631 8780924
15329 8780924 7963510 6429337 6269085 5217354 2954832 788596 753391 1606478 1889045
15320 1889045 1258193 1683825 3786217 5118104 5538519 5536907 4140175 3211425 4695171
15311 4695171 7250379 7203421 3955683 3161800 2368736 139759 -137224 -495612 -951454
15302 -951454 153973 955732 1195546 1539551 1423875 1391918 87415 -522691 -2426293
15293 -2426293 -4156647 -2879608 -517370 320370 1207197 2349920 2548913 3833523 3447207
15284 3447207 1944642 2758046 2882649 2644330 1983113 -804493 -1258617 64052 94786
$$ packed form
15347e19591L339190J169606k447079j669837R96996J87314m25758L98365j338498
15338c09292q23454R90998P95001j92166Q09505P37858K093288L745893R33293
15329H780924q17414j534173j60252j051731k262522k166236l5205Q53087K82567
15320A889045o30852M25632K102392J331887M20415j612j396732r28750J483746
15311D695171K555208m6958l247738p93883p93064k228977k76983l58388m55842
15302i51454J105427Q01759K39814L44005j15676l1957j304503o10106j903602
15293b426293j730354J277039K362238Q37740Q86827J142723J98993J284610l86316
15284C447207j502565Q13404J24603k38319o61217k787606m54124J322669L0734
$$ plain form
15275 94786 119781 149515 -486313 -1457685 -3379395 -4670330 -6081212 -7914908 -6316164
15266 -6316164 -2318265 -379647 476033 185261 -603329 -63525 1334506 2388762 5060004
15257 5060004 5820567 4684594 4451910 4738196 3513418 2254400 2988504 2995580 927809
15248 927809 641334 2495406 3567606 4013054 3606383 3467757 3047082 -103814 -5321846
15239 -5321846 -8097399 -8754214 -7853800 -5636234 -4567529 -4073657 -961711 1652352 2225654
15230 2225654 348023 -224799 -542545 -2445195 -3476083 -2910267 -1154316 -2890330 -2493576
15221 -2493576 1122739 3725696 3733043 5922558 8519339 8716586 5831690 981953 290660
15212 290660 2048830 2430619 672520 -793663 -699055 122948 868279 1463194 1707956
$$ packed form
15275I4786K4995K9734o35828r71372j921710j290935j410882j833696J598744
15266f316164L997899J938618Q55680k90772p88590N39804J398031J054256K671242
15257E060004P60563j135973k32684K86286j224778j259018P34104P076k067771
15248I27809k86475J854072J072200M45448m06671j38626m20675l150896n218032
15239e321846k775553o56815R00414K217566J068705M93872L111946K614063N73302
15230B225654j877631n72822l17746j902650j030888N65816J755951j736014L96754
15221b493576L616315K602957P347K189515K596781J97247k884896m849737o91293
15212B90660J758170L81789j758099j466183R4608Q22003P45331N94915K44762
$$ plain form
15203 1707956 1537856 144053 -885932 124677 988539 2122678 1813593 242965 1163610
15194 1163610 3659700 4131833 3489048 2238902 2903474 4106194 3797533 1190674 -1403057
15185 -1403057 -1007914 1521672 3568454 1946754 -711733 477198 3185937 4952020
15177 4952020 4011374 2252307 -270129 -481011 -35086 -1392393 -2377106 104611 735227
15168 735227 -1212491 -1605471 -2572204 -3710370 -2762851 -59910 232396 -3937813 -6595482
15159 -6595482 -5413784 -3594639 -2391316 -975459 361982 2077533 1514414 356648
15151 356648 857566 494195 283439 2796168 5209196 6158304 6107618 5399727 3839234
15142 3839234 3341720 4063800 3845836 2819622 297767 -1247727 252821 412662 1006460
$$ packed form
15203A707956j70100j393803j029985J010609Q63862J134139l09085j570628R20645
15194A163610K496090M72133o42785j250146O64572J202720l08661k606859k593731
15185a403057L95143K529586K046782j621700k658487J188931K708739J766083
15177D952020r40646j759067k522436k10882M45925j357307r84713K481717O30616
15168G35227j947718l92980r66733j138166R47519K702941K92306m170209k657669
15159f595482J181698J819145J203323J415857J337441J715551n63119j157766
15151C56648N00918l63371k10756K512729K413028R49108n0686p07891j560493
15142C839234m97514P22080k17964j026214k521855j545494J500548J59841N93798
$$ plain form
15133 1006460 1387375 -881765 -3721997 -6464823 -6436223 -4691179 -4241567 -3970030 -2581306
15124 -2581306 -1593970 524992 2261954 3340578 5778302 7110471 6414594 6379802 5595131
15115 5595131 5069230 3320396 -842939 -3545167 -3542189 -2584637 -3819671 -4260497 -2375811
15106 -2375811 -1040150 -3488232 -4612234 -2792224 -1258819 -1215593 -1681077 -3942947 -5352093
15097 -5352093 -1526043 1952809 1866426 2711513 3962731 4345362 3614467 1303104 -1748677
15088 -1748677 -3046881 -2392510 -1011179 -1163775 -1476548 -2383089 -3659150 -3179688 -3400140
15079 -3400140 -2080233 -1920872 -3692777 -3950812 -2881968 -3467199 -5894622 -7320797 -5521751
15070 -5521751 -2613422 -328844 622085 -392397 -1557124 -136659 -287508 -1284412 -2264826
$$ packed form
15133A006460L80915k269140k840232k742826K8600J745044M49612K71537J388724
15124b581306R87336K118962J736962J078624K437724J332169o95877l4792p84671
15115E595131n25901j748834m163335k702228K978R57552j235034m40826J884686
15106b375811J335661k448082j124002J820010J533405M3226m65484k261870j409146
15097e352093L826050L478852q6383Q45087J251218L82631p30895k311363l051781
15088a748677j298204O54371J381331j52596l12773r06541j276061M79462k20452
15079c400140J319907J59361j771905k58035J068844n85231k427423j426175J799046
15070e521751K908329K284578R50929j014482j164727J420465j50849r96904r80414
$$ plain form
15061 -2264826 103692 1845870 1319473 1074878 -1390629 -2855881 -977577 1499100
15053 1499100 1783748 1775931 3912557 4561213 4929488 5529460 5432035 6475090 6504212 4300396
15043 4300396 2408722 1865058 209558 -543722 419240 1345472 3156142 5313054 7895623
15034 7895623 6843459 8110954 12170560 9847140 3672136 410015 -785363 417847
15026 417847 1902089 3502708 3501168 3096989 6013 -2484559 -4001721 -4521344 -2383658
15017 -2383658 279134 1264841 2618476 2571353 2603970 4653123 5244172 1961085 470848
15008 470848 700560 2304600 4035119 4895076 3715682 87453 -799059 -3249061 -5120352
14999 -5120352 -5838642 -6931519 -8276561 -9018698 -9704218 -8205032 -5838896 -4082003 -3768856
$$ packed form
15061b264826K368518J742178n26397k44595k465507j465252J878304K476677
15053A499100K84648p817K136626O48656L68275N99972r7425J043055K9122k203816
15043D300396j891674n43664j655500p53280R62962R26232J810670K156912K582569
15034G895623j052164J267495M059606k323420o175004l262121j195378J203210
15026D17847J484242J600619j540m04179l090976k490572j517162n19623K137686
15017b383658K662792R85707J353635m7123L2617K049153N91049l283087j490237
15008D70848K29712J604040J730519Q59957j179394l628229q86512k450002j871291
14999e120352p18290j092877j345042p42137o85520J499186K366136J756893L13147
$$ plain form
14990 -3768856 -4046729 -1717238 1949434 2518200 1673615 2917987 3473420 1148168 -1205721
14981 -1205721 -1843264 -2310827 -1966359 -1582817 -1611463 -1998338 -3258238 -5118405 -6734481
14972 -6734481 -5149192 -1817201 1546827 1487142 966517 373081 563769 159722 -525179
14963 -525179 -2393978 -3528344 -39460 3060389 1821052 -1257908 -2351030 -1713873
14955 -1713873 -2790307 -3687362 -3167910 -2767499 -2605214 -2580503 -2855143 -3469855 -2812010
14946 -2812010 -1234804 -718071 -529808 533944 1456535 500558 395318 4008358 5176303
14937 5176303 2500909 -2462931 -4624533 -4212121 -1496986 1516494 517120 -450136 1929677
14928 1929677 4830718 5346239 5440664 5402744 5109680 6419056 7475638 8058994 6819238
$$ packed form
14990c768856k77873K329491L666672N68766q44585J244372N55433k325252k353889
14981a205721o37543m67563L44468L83542k8646l86875j259900j860167j616076
14972f734481J585289L331991L364028n9685n20625n93436J90688m04047o84901
14963e25179j868799j134366L488884L099849j239337l078960j093122O37157
14955a713873j076434q97055N19452M00411J62285K4711k74640o14712O57845
14946b812010J577206N16733J88263J063752R22591r55977j05240L613040J167945
14937E176303k675394m963840k161602M12412K715135L013480r99374r67256K379813
14928A929677K901041N15521R4425l7920k93064J309376J056582N83356j239756
$$ plain form
14919 6819238 4996934 3271620 564900 -2088343 -6162919 -4777988 188844 3085118
14911 3085118 3244350 1724742 350986 -5721 249636 869651 789227 1310666 2512091
14902 2512091 3786138 4159452 3238354 2341755 1952246 1845899 708486 1033647 2189580
14893 2189580 2991271 1831662 -1886577 -2161652 1294117 4721493 4898172 4193071 4763665
14884 4763665 5184334 4949411 7957585 9829480 8664247 7761181 8035642 7824405 5941859
14875 5941859 5265397 4947440 5065740 6415938 6326055 4389751 1744063 -976313 -2246450
14866 -2246450 -1908422 -1756742 -2436078 -1463437 53715 239258 842936 1524639 1090900
14857 1090900 2499317 3393946 3513116 2348002 1492113 71505 -561555 241949 648319
$$ packed form
14919F819238j822304j725314k706720k653243m074576J384931M966832K896274
14911C085118J59232j519608j373756l56707K55357O20015q0424N21439J201425
14902B512091J274047L73314r21098q96599l89509j06347j137413L25161J155933
14893B189580Q01691j159609l718239k75075L455769L427376J76679p05101N70594
14884D763665M20669k34923L008174J871895j165233r03066K74461k11237j882546
14875E941859o76462l17957J18300J350198q9883j936304k645688k720376j270137
14866b246450L38028J51680o79336R72641J517152J85543O03678O81703m33739
14857A090900J408417Q94629J19170j165114q55889j420608o33060Q03504M06370
$$ plain form
14848 648319 2763327 5020302 4404918 4725422 5950851 6097497 4156049 1025366 1662888
14839 1662888 2289233 873372 133747 -1505124 -617400 1239461 1019044 2451045 4979600
14830 4979600 5929893 6377807 5263520 2781380 2170027 2859721 4104947 3241337 2186060
14821 2186060 4035368 5854395 6075103 4128206 2075465 3561360 4103186 2914503
14813 2914503 3494662 4746608 6090911 7002892 5243403 3191532 2946297 3464644 3322704
14804 3322704 2674906 1489264 2498745 2364718 355891 -1078708 -1093529 -2108101 -3199533
14795 -3199533 -3443525 -3262113 -2719576 -2138715 -2458325 -2124748 -522438 -191016 -453364
14786 -453364 225438 326675 -2257754 -3912353 -3260529 -2756126 -2351057 -1553552 -739142
$$ packed form
14848F48319K115008K256975o15384L20504J225429J46646j941448l130683O37522
14839A662888O26345j415861p39625j638871Q87724J856861k20417J432001K528555
14830D979600R50293M47914j114287k482140o11353O89694J245226q63610j055277
14821B186060J849308J819027K20708j946897k052741J485895N41826j188683
14813B914503N80159J251946J344303R11981j759489k051871k45235N18347j41940
14804C322704o47798j185642J009481j34027k008827j434599j4821j014572j091432
14795c199533k43992J81412N42537N80861l19610L33577J602310L31422k62348
14786d53364O78802J01237k584429j654599O51824N04403M05069P97505Q14410
$$ plain form
14777 -739142 -84379 -1002415 -1560362 -971974 -1062273 -527242 -57770 181174 916997 3270661
14767 3270661 5580588 7563632 8253651 8731912 8205404 5271028 2159816 1352016 2193812
14758 2193812 2131396 1470931 1363666 3566203 6131010 7078019 7870937 7215242 3580016
14749 3580016 927909 -1566955 -2076967 -355072 154837 910544 1866125 613313 226994
14740 226994 1848098 2826225 1591339 475442 2175399 2911893 2790005 2471895 2704028
14731 2704028 1189786 147067 -204482 -1052136 375051 782012 -344562 -818647 840906
14722 840906 1476618 2100574 1455279 1627147 1318233 1826882 4911076 7032650 5938326
14713 5938326 3733901 3313744 4616899 5997070 7418259 7889714 8077748 6604020 4582264
$$ packed form
14777g39142O54763r18036n57947N88388r0299N35031M69472K38944P35823K353664
14767C270661K309927J983044O90019M78261n26508k934376l111212q07800Q41796
14758B193812o2416o60465j07265K202537K564807R47009P92918o55695l635226
14749C580016k652107k494864n10012J721895N09909P55707R55581j252812l86319
14740B26994J621104R78127j234886j115897J699957P36494j21888l18110K32133
14731B704028j514242j042719l51549q47654J427187M06961j126574m74085J659553
14722H40906O35712O23956o45295J71868l08914N08649L084194K121574j094324
14713E938326k204425m20157J303155J380171J421189M71455J88034j473728k021756
$$ plain form
14704 4582264 3517869 2828510 2157461 2727864 3314736 3416764 3291892 3246907 639308
14695 639308 -1929615 -3553302 -3924991 -1770374 961570 3197742 3042271 2774354 4364787
14686 4364787 7619568 7427029 2615955 -1530702 -3558330 -3515655 -1712886 887866 3072153
14677 3072153 5694060 4287686 2243324 1660094 1308502 1503798 1280341 1661676 1717138
14668 1717138 2195434 1325623 59501 2722042 4816413 4814931 4030780 1498105 -992292
14659 -992292 -890933 1119106 1396460 2189725 4647116 7936418 7002329 5218520 3711849
14650 3711849 1988722 754328 924640 2140168 3646494 5312944 4913678 4940696 4598413
14641 4598413 4014508 2105668 897459 -630787 -1840777 -2255407 -1062208 610168
$$ packed form
14704D582264j064395o89359o71049N70403N86872J02028j24872m4985k607599
14695F39308k568923j623687l71689K154617K731944K236172j55471k67917J590433
14686D364787L254781j92539m811074m146657k027628M2675J802769K600752K184287
14677C072153K621907j406374k044362n83230l51592J95296k23457L81335N5462
14668A717138M78296q69811j266122K662541K094371j482p84151k532675k490397
14659i92292J01359K010039K77354P93265K457391L289302r34089j783809j506671
14650C711849j723127j234394J70312J215528J506326J666450l99266K7018l42283
14641D598413n83905j908840j208209j528246j209990m14630J193199J672376
$$ plain form
14633 610168 2359028 3638264 3232071 1956457 -1089744 -2254976 -1501289 40704 1315818
14624 1315818 1338184 -1312324 -3424653 -3261077 -4811465 -4616560 -1823776 -652894 -1292310
14615 -1292310 -3086837 -5006785 -3630534 -524859 251573 -1262194 -1419106 180021
14607 180021 746984 1715637 1633734 210387 -103377 -196634 634449 3722923 5035096
14598 5035096 3080852 -252916 -2886177 -3989297 -2947784 -312436 4241106 7184422
14590 7184422 6035160 4004142 2841781 1113710 1049587 1540159 127519 -2455920 -2653787
14581 -2653787 -3450947 -4682233 -3499718 -2623010 -2990180 -3160492 -2447532 -1906730 -3120476
14572 -3120476 -6386647 -10544721 -11725339 -10619939 -8735294 -8275385 -6684683 -4138509
$$ packed form
14633F10168J748860J279236m06193j275614l046201j165232P53687J541993J275114
14624A315818K2366k650508k112329J63576j550388J94905K792784J170882o39416
14615a292310j794527j919948J376251L105675P76432j513767j56912J599127
14607A80021N66963R68653q1903j423347l13764r3257Q31083L088474J312173
14598E035096j954244l333768k633261j103120J041513K635348M553542K943316
14590G184422j149262k031018j162361j728071o4123M90572j412640k583439j97867
14581b653787p97160j231286J182515Q76708l67170j70312P12960N40802j213746
14572c120476l266171m158074j180618J105400J884645M59909J590702K546174
$$ plain form
14564 -4138509 -1580258 -433109 -634762 -1106973 -1290841 -2014188 -3723733 -3287600 -3324489
14555 -3324489 -5294230 -4570997 -2504391 -1875245 -953798 519727 1011604 200557 -885003
14546 -885003 -536185 169732 651566 3089172 3798118 3574899 4583039 3798876 3363131
14537 3363131 2332086 2524096 4292682 5815480 4521960 -733089 -3972558 -2182369
14529 -2182369 -1996205 -2016628 -724736 -1044663 -2662351 -3416225 -4494552 -4504963 -2090705
14520 -2090705 808814 2411772 3863204 4756755 2075989 -1974557 -2671424 -801743
14512 -801743 1403780 3427686 4747672 4405210 2367714 823285 -644353 -738607 -456273
14503 -456273 -1027278 383522 3571153 5417845 5368325 3677392 3541584 3748747 3460253
$$ packed form
14564d138509K558251J147149k01653m72211j83868p23347j709545M36133l6889
14555c324489j969741P23233K066606O29146R21447J473525M91877q11047j085560
14546h85003L48818P05917M81834K437606P08946k23219J008140p84163m35745
14537C363131j031045J92010J768586J522798j293520n255049l239469J790189
14529b182369J86164k0423J291892l19927j617688p53874j078327j0411K414258
14520b090705K899519J602958J451432Q93551k680766m050546o96867J869681
14512h01743K205523K023906J319986l42462k037496j544429j467638r4254K82334
14503d56273n71005J410800L187631J846692m9520j690933j35808K07163k88494
$$ plain form
14494 3460253 2155356 1864986 44458 -2227114 -2277076 -1851927 -1825021 -2110264 -2430335
14485 -2430335 -2830151 -3996260 -2125340 806246 1859370 3268912 5043914 4976149 5250243
14476 5250243 6750436 6672260 5382711 2906309 3159088 2261047 -914298 -1412585 -2002722
14467 -2002722 -2744554 -2005483 -1196255 -37039 1930592 2905697 -349866 -2115163 247800
14458 247800 -79594 861532 3410502 3822392 4125994 4737530 3878500 1559627 1274235
14449 1274235 2447286 2730702 3108628 3803484 3479882 3508161 3704436 1519809 -441333
14440 -441333 2588834 3420113 3713663 5557789 6025081 3909123 4207385 4536349 4828514
14431 4828514 5575733 4140974 3302540 1151594 920492 607173 110814 -568906 -1656396
$$ packed form
14494C460253j304897k90370j820528k271572m9962M25149K6906k85243l20071
14485b430335l99816j166109J870920K931586J053124J409542J775002o7765K74094
14476E250243J500193p8176j289549k476402K52779q98041l175345m98287n90137
14467b002722p41832P39071Q09228J159216J967631R75105l255563j765297K362963
14458B47800l27394R41126K548970M11890L03602O11536q59030k318873k85392
14449A274235J173051K83416L77926O94856l23602K8279J96275k184627j961142
14440d41333L030167Q31279K93550J844126M67292k115958K98262L28964K92165
14431D828514P47219j434759q38434k150946k31102l13319m96359o79720j087490
$$ plain form
14422 -1656396 -718152 729457 1341645 -661620 -1680730 463383 1688566 2215722 1917484
14413 1917484 1675366 2072472 2676572 2628257 1386062 2387472 2721904 2017231 2529193
14404 2529193 1164793 75735 710897 1306236 2056900 2045247 -554066 -651716 300239
14395 300239 2128034 2099134 2043681 2616467 3628956 4735452 3855537 2854413 2679807
14386 2679807 2303571 1600059 801947 -96756 -384800 342154 2202518 3231722 1622270
14377 1622270 1015234 -852723 -3505223 -4675429 -4167933 -3289054 -4247198 -4155348 -1959245
14368 -1959245 439612 1812661 677048 -304923 160822 -75803 866550 1298307 -1092320
14359 -1092320 -4268999 -4847038 -2661763 1570172 4496173 5409209 6277992 4104204 1322099
$$ packed form
14422a656396R38244J447609O12188k003265j019110K144113J225183N27156k98238
14413A917484k42118L97106O04100m8315j242195J001410L34432p04673N11962
14404B529193j364400j089058O35162N95339P50664j1653k599313r7650R51955
14395C00239J827795k8900n5453N72786J012489J106496q79915j001124j74606
14386B679807l76236p03512p98112q98703k88044P26954J860364J029204j609452
14377A622270o07036j867957k652500j170206N07496Q78879r58144R1850K196103
14368a959245K398857J373049j135613r81971M65745k36625R42353M31757k390627
14359a092320l176679n78039K185275M231935K926001R13036Q68783k173788k782105
$$ plain form
14350 1322099 337983 -1067986 -1535643 96832 1835110 2931960 3274388 2829511 2357442
14341 2357442 2551089 787239 709856 1597466 -782448 -3499609 -2974764 -1267992 -731430
14332 -731430 -1732122 -1308981 -407846 382623 1499896 -465966 -2775224 -4245526 -4685896
14323 -4685896 -3338760 -545149 53071 -113739 -1383921 -2690981 -2472876 -1248950 39469
14314 39469 -811172 485689 2896068 3695288 2927249 -434521 -2833795 -2226201 -831259
14305 -831259 -1026295 -2441719 -3499805 -1916646 1926274 4220838 3247337 3292778 4273773
14296 4273773 2826863 1545828 134464 -631743 2614947 7753524 10607224 10522492 8580543
14287 8580543 7435495 6818571 4576384 86493 -2928074 -1856107 1411298 3035380
$$ packed form
14350A322099r84116j405969m67657J632475J738278J096850L42428m44877m72069
14341B357442J93647j763850p7383Q87610k379914k717161N24845J706772N36562
14332g31430j000692M23141R01135P90469J117273j965862k309258j470302m40370
14323d685896J347136K793611N98220j66810j270182j307060K18105J223926J288419
14314C9469q50641J296861K410379P99220p68039l361770k399274O07594J394942
14305h31259j95036j415424j058086J583159L842920K294564r73501M5441R80995
14296D273773j446910j281035j411364p66207L246690N138577K853700q4732j941949
14287H580543j145048o16924k242187m489891l014567J071967L267405J624082
$$ plain form
14279 3035380 3737584 2591549 3343458 3232958 950564 473525 2204185 3592447 5294325
14270 5294325 5655230 4082085 2697373 1631169 2080375 -308123 -2114539 -1491608 -628813
14261 -628813 1560033 1778904 73872 -1229442 -1368914 -661748 213586 2139844 4237669
14252 4237669 5866338 6117885 3842912 -118297 -2665156 -3835108 -3348481 -1012103
14244 -1012103 417942 1887925 1418680 -71886 73459 -465036 -405307 236595 -287675
14235 -287675 242207 2994693 5966540 6163565 2633486 998364 624564 1356268 1381259
14226 1381259 824410 691437 391063 -666109 -916981 -445997 707019 1530148 1747762
14217 1747762 1857559 2751098 4064862 4744461 3895950 4122436 6375827 5419906 4213109
$$ packed form
14279C035380P02204j146035P51909j10500k282394m77039J730660J388262J701878
14270E294325L60905j573145j384712j066204M49206k388498j806416O22931Q62795
14261f28813K188846K18871j705032j303314j39472P07166Q75334J926258K097825
14252D237669J628669K51547k274973l961209k546859j169952M86627K336378
14244a012103J430045J469983m69245j490566J45345n38495N9729O41902n24270
14235b87675N29882K752486K971847J97025l530079j635122l73800P31704K4991
14226A381259n56849j32973l00374j057172k50872M70984J153016Q23129K17614
14217A747762J09797Q93539J313764O79599q48511K26486K253391r55921j206797
$$ plain form
14208 4213109 4110052 3906856 4006609 4743136 2770149 -920363 -3371151 -4180599 -4745733
14199 -4745733 -4191404 -4005328 -4403900 -3322575 -2601108 -213166 1620052 1673373 1075678
14190 1075678 -810084 -1429428 273376 2685935 3044490 1824340 579436 -2532147
14182 -2532147 -4118480 -4973685 -6313808 -5621948 -3662606 -976044 70207 -405018 1127347
14173 1127347 2216386 1607980 1833490 1637900 644216 167641 198825 1957290 2286676
14164 2286676 2661124 2187470 989430 -1305520 -3354790 -2948439 -1891600 -664032 690278
14155 690278 224714 -312402 -636638 189728 -149670 -839451 -1019989 -1144699 -963613 1396378
14145 1396378 3098598 2346970 2070010 2506539 1739763 238319 -1576813 -2513508 -2636713
$$ packed form
14208D213109j03057k03196R9753P36527j972987l690512k450788q09448n65134
14199d745733N54329J86076l98572J081325P21467K387942J833218N3321n97695
14190A075678j885762o19344J702804K412559L58555j220150j244904l111583
14182b532147j586333q55205j340123O91860J959342K686562J046251m75225J532365
14173A127347J089039o08406K25510j95590r93684m76575L1184J758465L29386
14164B286676L74448m73654j198040k294950k049270M06351J056839J227568J354310
14155F90278m65564n37116l24236Q26366l39398o89781j80538j24710J81086K359991
14145A396378J702220p51628k76960M36529p66776j501444j815132r36695j23205
$$ plain form
14136 -2636713 -31625 1897327 2142975 1669466 -357771 -419084 439059 1770166 2967426
14127 2967426 2285334 1498195 -733545 -2377793 -2392249 1373677 2879652 663459 79651
14118 79651 -621223 -1103588 689430 2418477 -768953 -3783629 -4518734 -5371714 -4966791
14109 -4966791 -1852336 -1097586 -904183 -2356965 -3619706 -2251343 766618 3500855
14101 3500855 3165242 2094907 874824 -256315 977852 3276233 1772318 -1210650
14093 -1210650 -4225029 -6285212 -7185014 -6567719 -4726179 -3200573 -1534517 1792641
14085 1792641 3480043 2906033 2485244 2848270 4695684 4349851 890211 -2124735 -4189804
14076 -4189804 -2549675 -692536 295244 1997054 521269 -189221 -798032 1694712 3594357
$$ packed form
14136b636713K605088J928952K45648m73509k027237o1313Q58143J331107J197260
14127B967426o82092p87139k231740j644248j4456L765926J505975k216193n83808
14118G9651p00874m82365J793018J729047l187430l014676p35105q52980M04923
14109d966791L114455P54750J93403j452782j262741J368363L017961K734237
14101C500855l35613j070335j220083j131139J234167K298381j503915k982968
14093a210650l014379k060183q99802O17295J841540J525606J666056L327158
14085A792641J687402n74010m20789L63026J847414l45833l459640l014946k065069
14076d189804J640129J857139R87780J701810j475785p10490o08811K492744J899645
$$ plain form
14067 3594357 2712974 4021395 6444281 5699816 4903986 2359233 308581 -1253063 -2085869
14058 -2085869 -2505608 -2932221 -2309449 -1825710 -2930531 -3482032 -4481483 -6315474 -6720516
14049 -6720516 -3959525 -1624037 1152962 2714487 2122355 -1489244 -2891319 -929639
14041 -929639 -1428919 -4876376 -7157113 -5644504 -3559173 -2342929 -2148674 -1638085 -171166
14032 -171166 -198322 -803629 -1668974 -1959804 -1132830 -2829932 -2537257 -64811 1966374
14023 1966374 2302197 1272822 256708 -2401685 -6102035 -4673926 -2718127 -3176504
14015 -3176504 -3370760 -3162921 -3139678 -2862378 -547130 235831 1040294 3598226 2741917
14006 2741917 106479 -2880612 -5042379 -4671470 -3444061 -2844980 -3710275 -4078362 -3497796
$$ packed form
14067C594357q81383J308421K422886p44465p95830k544753k050652j561644q32806
14058b085869m19739m26613O22772M83739j104821n51501r99451j833991m05042
14049f720516K760991K335488K776999J561525n92132l611599j402075J961680
14041i29639m99280l447457k280737J512609K085331J216244J94255N10589J466919
14032a71166k7156o05307q65345k90830Q26974j697102K92675K472446K031185
14023A966374L35823j029375j016114k658393l700350J428109J955799m58377
14015c176504j94256K07839K3243K77300K315248P82961Q04463K557932q56309
14006B741917k635438k987091k161767L70909J227409N99081q65295l68087N80566
$$ plain form
13997 -3497796 -2512663 -1286730 280372 1359830 3233108 4619853 4905390 3968159 3260818
13988 3260818 3328226 2555671 1111012 -906813 -1474668 -2345964 -3409693 -3338975 -4907708
13979 -4907708 -4509095 -2606270 -4113955 -3881333 -1919766 -1296479 -2323691 -4914192 -6519501
13970 -6519501 -5312306 -2175027 521612 1608282 2998594 3815679 2896029 59306
13962 59306 -1171009 42969 263782 -1144097 -75017 941362 326963 -821396 -2137230
13953 -2137230 -2945411 -3829875 -2557492 -721329 -2389674 -2254480 500101 373110 -959453
13944 -959453 -1209585 -477341 -1935369 -3338419 -3100549 -833304 849289 1292119 713793
13935 713793 976457 1624342 1450232 1570894 599192 -560335 -401083 -652871 -1825094
$$ packed form
13997c497796R85133J225933J567102J079458J873278J386745K85537r37231p07341
13988C260818O7408p72555j444659k017825n67855q71296j063729P0718j568733
13979d907708L98613J902825j507685K32622J961567O23287j027212k590501j605309
13970f519501J207195L137279K696639J086670J390312Q17085r19650k836723
13962E9306j230315J213978K20813j407879J069080J016379o14399j148359j315834
13953b137230q08181q84464J272383J836163j668345J35194K754581j26991j332563
13944i59453k50132P32244j458028j403050K37870K267245J682593M42830n78326
13935G13793K62664O47885j74110J20662r71702j159527J59252k51788j172223
$$ plain form
13926 -1825094 153368 1159586 -224731 -454840 -152148 -191445 -115115 1763990 3016330
13917 3016330 3357886 2556649 2146267 2702142 3633998 4271064 3207610 836464 110564
13908 110564 172118 225861 543352 1211835 2136940 1143491 -591468 -2218764 -1962123 -661902
13898 -661902 577864 1692821 2743695 3722717 1041573 -1392017 -343861 2552716
13890 2552716 3391744 1040826 -1138442 -1238769 -563852 -1219865 -1143674 -1533645 -2682896
13881 -2682896 -2110505 109763 530560 249830 -885847 -1471826 -1962048 -828045 48145
13872 48145 520026 422664 -557117 309375 2973549 4456938 4458946 4699223 3830496 1828603
13862 1828603 -725629 -1053792 -1184991 -2193158 -3208128 -3287132 355566 1914494 2249831
$$ packed form
13926a825094J978462J006218j384317k30109L02692l9297P6330J879105J252340
13917C016330L41556q01237m10382N55875R31856O37066j063454k371146p25900
13908A10564O1554N3743L17491O68483R25105r93449j734959j627296K56641J300221
13898f61902J239766J114957J050874R79022k681144k433590J048156K896577
13890B552716Q39028k350918k179268j00327O74917o56013P6191l89971j149251
13881b682896N72391K220268M20797k80730j135677n85979m90222J134003Q76190
13872D8145M71881r7362r79781Q66492K664174J483389K008K40277q68727k001893
13862A828603k554232l28163j31199j008167j014970p9004L642698J558928L35337
$$ plain form
13853 2249831 2608426 1977594 -341476 -3002958 -3115888 -2576921 -2078391 301350 3468700
13844 3468700 2907482 -277947 129384 1766089 883927 -2040060 -4799736 -6948398 -6907352
13835 -6907352 -5472150 -5058615 -5282015 -6180763 -5049622 -1223231 1253566 1517475 -42357
13826 -42357 -1093981 -1116755 -1364223 174304 1377766 2267691 4345114 3540108 -1378770
13817 -1378770 -5480393 -8046459 -6264581 -4116644 -4740706 -4928976 -3652791 -2631912
13809 -2631912 -2883792 -688557 1922463 2648163 860392 -1503375 -2243736 -4204598 -5768489
13800 -5768489 -5083756 -2614100 607620 2359879 3767928 4557429 2479530 328481
13792 328481 1195480 293926 -1437843 17409 2448326 1775722 529090 -702214 -2130329
$$ packed form
13853B249831L58595o30832k319070k661482j12930N38967M98530K379741L167350
13844C468700n61218l185429M07331J636705q82162k923987k759676k148662M1046
13835f907352J435202M13535k23400q98748J131141L826391K476797K63909j559832
13826d2357j051624k2774k47468J538527J203462Q89925K077423q05006m918878
13817a378770m101623k566066J781878K147937o24062j88270J276185J020879
13809b631912k51880K195235K611020P25700j787771k363767p40361j960862j563891
13800e768489O84733K469656L221720J752259J408049P89501k077899k151049
13792C28481Q66999r01554j731769J455252K430917o72604j246632j231304j428115
$$ plain form
13783 -2130329 -1168391 1008528 2945780 2919718 4711186 6152058 2555848 962578 1857349
13774 1857349 1430699 856903 1325487 1364528 -472326 -1705349 -509398 348948 -535466
13765 -535466 399280 1657795 2149586 1654180 1534515 1523419 419352 -677161 -1462255
13756 -1462255 -1168023 283730 -83731 -303845 -114650 -394329 -844402 243827 667113
13747 667113 -165859 -574808 -190329 1692814 4011743 7080692 5366204 -308424 -2892606
13738 -2892606 -3683869 -5396973 -4858742 -3308571 -3853246 -4149015 -3222597 -2624222 -1323196
13729 -1323196 -409652 109346 893696 1450637 1948202 1170670 1110783 914612 1826604 4381669
13719 4381669 5234910 4818203 5224272 4809986 4767992 6800321 9092963 11019803 12326280
$$ packed form
13783b130329R61938K176919J937252k6062J791468J440872l596210j593270Q94771
13774A857349m26650n73796M68584L9041j836854j233023J195951Q58346q84414
13765e35466R34746J258515M91791m95406j19665j1096j104067j096513p85094
13756a462255K94232J451753l67461k20114J89195k79679m50073J088229M23286
13747F67113q32972m08949L84479J883143K318929L068949j714488n674628k584182
13738b892606p91263j713104N38231J550171n44675k95769R26418N98375J301026
13729a323196R13544N18998P84350N56941M97565p77532n9887j96171R11992K555065
13719D381669Q53241m16707M06069m14286m1994K032329K292642J926840J306477
$$ plain form
13710 12326280 12649244 10299837 6272475 3281561 3508436 4024837 3966722 5297648 6658667
13701 6658667 5682788 2645111 480777 -2105128 -5695254 -6799997 -6950190 -5709608
13693 -5709608 -5423427 -6331891 -4943977 -2996828 61868 2913000 3682172 2668725 956603
13684 956603 1026996 954114 -252326 656781 2812821 4386933 6635018 8176700 8252937
13675 8252937 6765961 3530768 2581790 3328263 2629435 1131883 1559425 1372451 1423244
13666 1423244 1398457 1675488 1365058 2729271 3400171 2271548 2326705 3270592 2641498
13657 2641498 1792154 1103300 -592272 18122 1143198 -52323 -39021 961526 1896770
13648 1896770 3289377 3211161 2946274 1898544 774268 1431278 827992 -253638 -1717951
$$ packed form
13710A2326280L22964k349407m027362k990914K26875N16401n8115J330926J361019
13701F658667r75879l037677k164334k585905l590126j104743j50193J240582
13693e709608K86181r08464J387914J947149L058696K851132P69172j013447j712122
13684I56603P0393p2882j206440R09107K156040J574112K248085J541682P6237
13675H252937j486976l235193r48978P46473o98828j497552M27542j86974N0793
13666A423244k4787K77031l10430J364213O70900j128623N5157R43887o29094
13657B641498q49344o88854j695572O10394J125076j195521J3302J000547R35244
13648A896770J392607p8216k64887j047730j124276O57010o03286j081630j464313
$$ plain form
13639 -1717951 -3054081 -4630904 -5360401 -2310776 1798231 3329098 1751951 -1122285
13631 -1122285 -1914123 -1330089 -1876042 -1895183 -735604 -1042565 -2091583 -2627373 -3513855
13622 -3513855 -4622024 -6182106 -6842203 -5048966 -3123075 -2553570 -1137241 659447
13614 659447 1512729 1837850 513009 53011 -2477236 -6144877 -7536607 -7845811 -5487705
13605 -5487705 -2316169 1521212 3882205 2602768 523926 1290775 596941 -434680
13597 -434680 -2499 1977182 2939534 3027963 3925413 3555568 1131457 -996455 -3762074
13588 -3762074 -3513682 -1095909 -54922 390247 1247627 3705355 1712406 50678 -223988
13579 -223988 490929 1948426 2117704 1317234 741558 -524408 -23347 1890561 2808091
$$ packed form
13639a717951j336130j576823p29497L049625M109007J530867j577147k874236
13631a122285p91838N84034n45953j9141J159579l06961j049018n35790q86482
13622c513855j108169j560082o60097J793237J925891N69505J416329J796688
13614F59447Q53282L25121j324841m59998k530247l667641j391730l09204K358106
13605e487705L171536L837381K360993j279437k078842P66849o93834j031621
13597d34680M32181J979681R62352Q8429Q97450l69845k424111k127912k765619
13588c762074K48392K417773J040987M45169Q57380K457728j992949j661728k74666
13579b23988P14917J457497J69278q00470n75676j265966N01061J913908R17530
$$ plain form
13570 2808091 3449030 2872844 1709941 2670209 6404542 8991185 8156847 4922249 3695324
13561 3695324 2158594 -909393 -1164118 -274654 -676280 -2559244 -5035709 -8073754 -8908151
13552 -8908151 -8695141 -8337091 -7304428 -8971782 -10104135 -7725505 -5621550 -4226550
13544 -4226550 -2664519 -1826151 -1824559 -4246422 -5087441 -4904244 -4345217 -3236975 -3278020
13535 -3278020 -3584942 -2815526 -1780104 -498072 519924 -1199341 -4404091 -4011056 -1221659
13526 -1221659 1134044 831562 913428 1436709 384144 -183146 -1591111 -2963336 -2694851
13517 -2694851 358083 5099471 6058962 5169859 2987822 1286253 1915758 2094773 2518743
13508 2518743 1469375 -1024319 -1339967 -306926 95525 565858 2165999 1374630 -1094558
$$ packed form
13570B808091O40939n76186j162903R60268L734333K586643q34338l234598j226925
13561C695324j536730l067987k54725Q89464m01626j882964k476465l038045q34397
13552h908151K13010L58050J032663j667354j132353K378630K103955J395000
13544d226550J562031Q38368J592k421863q41019J83197N59027J108242m1045
13535c278020l06922P69416J035422J282032J017996j719265l204750L93035K789397
13526a221659K355703l02482Q1866N23281j052565n67290j407965j372225K68485
13517b694851L052934M741388R59491q89103k182037j701569O29505J79015M23970
13508B518743j049368k493694l15648J033041M02451M70333J600141p91369k469188
$$ plain form
13499 -1094558 -1622866 -783271 -942943 -1396157 -1172295 -126035 -2460495 -3307796 -3334005
13490 -3334005 -3113643 -1115531 -547682 711073 2373984 2162198 2027124 3230982 5447168
13481 5447168 6271511 4794486 4616029 4401919 4417486 1112019 495241 4813252 7302451
13472 7302451 6582797 4058129 2642883 1523773 2052387 2299841 377359 -1634650 -1961902
13463 -1961902 -389419 889897 -152406 -1648789 -1508028 587009 -273875 -3709872
13455 -3709872 -4532827 -3551545 -3916416 -5614883 -6216992 -4718836 -4055440 -4915136 -7876469
13446 -7876469 -9948146 -7942009 -4284351 -711519 1304588 3303577 4252707 2350618
13438 2350618 37773 280879 1041768 -493505 -2456503 -594475 2496176 1874538 245176
$$ packed form
13499a094558n28308Q39595j59672m53214K23862J046260k334460q47301k6209
13490c334005K20362J998112N67849J258755J662911k11786j35074J203858K216186
13481E447168Q24343j477025j78457k14110J5567l305467o16778M318011K489199
13472G302451p19654k524668j415246j119110N28614K47454j922482k012009l27252
13463a961902J572483J279316j042303j496383J40761K095037q60884l435997
13455c709872q22955R81282l64871j698467o02109J498156O63396q59696k961333
13446g876469k071677K006137L657658L572832K016107J998989R49130j902089
13438B350618k312845K43106P60889j535273j962998J862028L090651o21638j629362
$$ plain form
13429 245176 -244731 -311624 -241916 999496 2218206 1505702 1410124 1442218 1085736 542545
13419 542545 -951289 -2420295 -2440071 -1396170 1327161 3407136 3677911 3773501 2052172
13410 2052172 1811590 833822 -2936748 -5780584 -5869373 -5957235 -4513718 -1739383 1861862
13401 1861862 2266821 1237919 1765257 425745 -1805430 -1256588 370425 -762511 -2588833
13392 -2588833 -1768184 -622038 -658819 855612 4045791 6762503 8952670 11053981 12584746
13383 12584746 12122301 10165494 7112389 4383902 2258367 206846 -725628 -18394
13375 -18394 -2981691 -5063057 -4129995 -3482363 -2810845 -3009986 -2186367 -1968193 -2165119
13366 -2165119 -2271028 -1048542 -111050 8199 828775 2074937 2776724 3352100 3398330
$$ packed form
13429B45176m89907o6893O9708J241412J218710p12504r5578L2094l56482n43191
13419E42545j493834j469006j9776J043901K723331K079975K70775R5590j721329
13410B052172k40582r77768l770570k843836q8789q7862J443517K774335L601245
13401A861862M04959j028902N27338j339512k231175N48842J627013j132936j826322
13392b588833Q20649J146146l6781J514431L190179K716712K190167K101311J530765
13383A2584746m62445j956807l053105k728487k125535k051521r32474P07234
13375a8394k963297k081366R33062O47632O71518j99141Q23619K18174j96926
13366b165119j05909J222486R37492J19249Q20576J246162P01787N75376M6230
$$ plain form
13357 3398330 2198128 148422 1153413 2755253 3352490 2886190 3668200 4380296 4469209
13348 4469209 4901428 5231571 5713938 5607439 4564502 4432897 4839782 3837343 919114
13339 919114 -957713 -1154004 -159136 -457644 -2541741 -1950578 -1129805 -24166 1597237
13330 1597237 990955 -2026169 -2113607 -782936 -5199882 -5736432 -1761143 95569 218619
13321 218619 -589392 -1076829 -1231110 -32458 2127235 2643092 4056319 5032941 4746532
13312 4746532 3091004 255951 -44684 847693 978371 2202219 1267650 1718177 1237770
13303 1237770 983922 2055780 1722524 273529 -819374 1204813 3430217 4162307 3486804
13294 3486804 829435 -754168 220742 2415175 2761081 3405969 5469118 4610988 2241454
$$ packed form
13357C398330j200202k049706J004991J601840N97237m66300P82010P12096Q8913
13348D469209M32219L30143M82367j06499j042937j31605M06885j002439k918229
13339I19114j876827j96291R94868k98508k084097N91163Q20773J105639J621403
13330A597237o06282l017124q7438J330671m416946n36550L975289J856712J23050
13321B18619q08011m87437j54281J198652K159693N15857J413227R76622k86409
13312D746532j655528k835053l00635Q92377J30678J223848r34569M50527m80407
13303A237770k53848J071858l33256j448995j092903K024187K225404P32090o75503
13294C486804k657369j583603R74910K194433L45906O44888K063149q58130k369534
$$ plain form
13285 2241454 470728 512646 641402 499177 3245195 5107707 4503811 2503401 837411
13276 837411 1752875 2103495 373106 -2199746 -1568791 1795723 1261604 -1351215 -1116237
13267 -1116237 1813343 4735995 5888789 4333499 1595851 1704896 3372177 1746960
13259 1746960 1179982 2207293 3401404 4632204 5870731 4508005 1639980 541380
13251 541380 -414434 -3041862 -4631921 -5357494 -4725707 -2224772 -2788412 -4494721 -4134843
13242 -4134843 -3847322 -2214458 1575873 5527836 8482691 9394067 8513710 8220403 4816388
13233 4816388 625161 -1993796 -2211209 -972580 -487355 570296 139048 -1088423 -1776476
13224 -1776476 -2659799 -1790009 -1203511 -2472118 -1922703 266578 1631988 2226626 2271709
$$ packed form
13285B241454j770726M1918J28756j42225K746018J862512o03896k000410j665990
13276H37411R15464L50620j730389k572852O30955L364514n34119k612819K34978
13267a116237K929580K922652J152794j555290k737648J09045J667281j625217
13259A746960n66978J027311J194111J230800J238527j362726k868025j098600
13251E41380r55814k627428j590059p25573O31787K500935n63640j706309L59878
13242d134843K87521J632864L790331L951963K954855R11376q80357k93307l404015
13233D816388m191227k618957k17413J238629M85225J057651m31248j227471o88053
13224a776476q83323Q69790N86498j268607N49415K189281J365410N94638M5083
$$ plain form
13215 2271709 2602210 3247085 3288667 2099805 -317858 -4088104 -5195378 -2255195 375605
13206 375605 3424010 4259357 5187335 5877124 5591984 5719727 3667268 851092 -401564
13197 -401564 -2760300 -3416963 -4416268 -6817050 -6944186 -5061172 -3902125 -3927373 -3564786
13188 -3564786 -4533519 -4760792 -3533588 -2512736 -795291 2556295 3887138 2639309
13180 2639309 479483 881971 3249193 5156425 7817074 11944186 13355511 11498231
13172 11498231 9755914 7664037 5421311 1629040 -3739565 -6797287 -6525782 -4842569
13164 -4842569 -2185666 723782 2183586 463547 -101137 -52977 258281 -48788 786004
13155 786004 2523084 2718327 2848037 2276164 -1266752 -4257733 -4032192 -4249241 -5537477
$$ packed form
13215B271709L30501O44875M1582j188862k417663l770246j107274K940183K630800
13206C75605L048405Q35347R27978O89789k85140J27743k052459k816176j252656
13197d01564k358736o56663r99305k400782j27136J883014J159047k5248L62587
13188c564786r68733k27273J227204J020852J717445L351586J330843j247829
13180B639309k159826M02488K367222J907232K660649M127112J411325j857280
13172A1498231j742317k091877k242726l792271n368605l057722K71505J683213
13164d842569K656903K909448J459804j720039n64684M8160L11258l07069Q34792
13155G86004J737080J95243J29710n71873l542916k990981K25541k17049j288236
$$ plain form
13146 -5537477 -2288222 1521966 2309728 1425990 1411225 3900424 6600232 7389629 6662010
13137 6662010 5205114 3450615 3028887 2338106 2925263 3582799 1769839 2655649 6101997
13128 6101997 8436277 7355744 5979920 4293588 1182533 -629863 -268478 667454
13120 667454 2272284 2473440 3285197 4741488 6206267 6837692 5787310 3759984 2594838
13111 2594838 2561885 3150869 3860497 4819268 4940512 3358899 1146618 1000158 1174281
13102 1174281 377871 647224 1627236 1099263 -1775872 -3410525 -1482716 -105149 -960445
13093 -960445 -757318 1909745 4433190 6594204 6431983 4821734 2442550 434220 -1582708
13084 -1582708 -2268878 -2883982 -3399420 -895983 2973054 4918782 6334358 6282871 5348128
$$ packed form
13146e537477L249255L810188P87762q83738j4765K489199K699808P89397p27619
13137F662010j456896j754499m21728o90781N87157O57536j812960Q85810L446348
13128F101997K334280j080533j375824j686332l111055j812396L61385R35932
13120F67454J604830K01156Q11757J456291J464779O31425j050382k027326j165146
13111B594838l2953N88984P09628R58771J21244j581613k212281j46460J74123
13102A174281p96410K69353R80012n27973k875135j634653J927809J377567q55296
13093i60445K03127K667063K523445K161014j62221j610249k379184k008330k016928
13084a582708o86170o15104n15438K503437L869037J945728J415576n1487r34743
$$ plain form
13075 5348128 3674883 1974281 2539554 4635986 5900190 4775703 2316860 1614408
13067 1614408 2038007 786116 -257293 -310256 884747 2294133 4102226 5072213 3615412
13058 3615412 2274134 2627128 2195345 1908547 1039493 254627 890953 1044312 712772
13049 712772 1198548 3903564 6697019 7778575 9423511 7917147 5949736 3796634
13041 3796634 3253195 4853495 6973122 8940568 9168648 8355242 5768955 2868807 1080989
13032 1080989 1671711 2834329 4627887 4334688 4118992 3848469 4516652 5094254 4774310
13023 4774310 5161367 4832562 6094221 7963063 7459866 7059544 6408368 7775871 10365639
13014 10365639 10611742 12316580 13927479 14181041 14968823 15424722 14560982 12541520 11633566
$$ packed form
13075E348128j673245j700602N65273K096432J264204j124487k458843p02452
13067A614408M23599j251891j043409n2963J195003J409386J808093R69987j456801
13058C615412j341278L52994m31783k86798q69054p84866O36326J53359l31540
13049G12772M85776K705016K793455J081556J644936j506364j967411k153102
13041C796634n43439J600300K119627J967446K28080q13406k586287k900148j787818
13032A080989N90722J162618J793558k93199k15696k70523O68183N77602l19944
13023D774310L87057l28805J261659J868842n03197m00322o51176J367503K589768
13014A0365639K46103J704838J610899K53562P87782M55899q63740k019462r07954
$$ plain form
13005 11633566 9943526 8938537 11178289 15766038 16845874 18502133 22097249 23491521
12997 23491521 25380681 30453123 34097218 34245199 36176975 43187592 54980884 66935973
12989 66935973 79202939 91587503 108313897 132061444 164901846 206345793 260280448
12982 260280448 326772858 400677702 465092898 489831602 457440031 387522114 311094096
12975 311094096 244386774 193472787 154696707 123339361 101199623 83780169 69654012
12968 69654012 60577851 54210160 48708764 44141770 40702543 37789941 35400211 32500567
12960 32500567 27490150 23854045 21986047 21429863 20330470 18298466 16018659 14654879
12952 14654879 14686374 13713035 10540502 7605748 9010780 11824444 12294577 10847504 8717609
$$ packed form
13005A1633566j690040j004989K239752M587749J079836J656259L595116J394272
12997B3491521J889160N072442L644095J47981J931776P010617J1793292J1955089
12989F6935973J2266966J2384564J6726394K3747547L2840402M1443947N3934655
12982B60280448O6492410P3904844O4415196K4738704l2391571o9917917p6428018
12975C11094096o6707322n0913987l8776080l1357346k2139738j7419454j4126157
12968F9654012r076161o367691n501396m566994l439227k912602k389730k899644
12960C2500567n010417l636105j867998n56184j099393k032004k279807j363780
12952A4654879L1495r73339l172533k934754J405032K813664M70133j447073k129895
$$ plain form
12943 8717609 9211848 11317944 12616165 14043449 15918504 15999378 14270631 12761383 11017316
12934 11017316 12068515 13941745 13342460 12880305 14576458 16549954 17611710 17253133
12926 17253133 16234715 17174002 17981670 18630019 21492551 26651561 29282746 30356635
12918 30356635 30945885 30290901 28245407 23348426 21400572 23657039 25687465 27783387
12910 27783387 30189207 32307838 33992629 38108375 43915921 48745169 54654824 64428695
12902 64428695 77551358 94432922 114578811 138446209 170307065 213379795 270752450
12895 270752450 342157095 420206310 482801544 494280018 444724920 366257456 292063435
12888 292063435 231348371 182101417 145421533 120084842 100220817 86776313 76441389
$$ packed form
12943H717609M94239K106096J298221J427284J875055Q0874j728747j509248j744067
12934A1017316J051199J873230n99285m62155J696153J973496J061756l58577
12926A7253133j018418R39287Q07668O48349K862532N159010K631185J073889
12918C0356635N89250o54984k045494m896981j947854K256467K030426K095922
12910B7783387K405820K118631J684791M115746N807546M829248N909655R773871
12902F4428695J3122663J6881564K0145889K3867398L1860856M3072730N7372655
12895B70752450P1404645P8049215O2595234J1478474m9555098p8467464p4194021
12888B92063435o0715064m9246954l6679884k5336691j9864025j3444504j0334924
$$ plain form
12881 76441389 66920173 59203306 52863212 48871365 46104209 43567774 37287654 32180073
12873 32180073 27571717 22887464 20289809 17084786 13997800 11499418 11599850 11983285
12865 11983285 12851390 13864404 15174889 15561356 16437441 16334231 15602984 14014291 14839610
12856 14839610 13003209 10869038 10985453 10706500 10707190 10652545 10216755 11850033 11024198
12847 11024198 8684907 8843775 9986851 11330464 11878714 11424887 12559518 14325008
12839 14325008 14596565 16498608 18239622 15332976 13367793 14764503 16373405 17877670
12831 17877670 16715120 15629537 16902922 17315466 17167060 18426558 22620095 28208532
12823 28208532 30617720 32251712 35122152 40727027 48126236 54657773 61336277 71480512
$$ packed form
12881G6441389r521216p716867o340094l991847k767156k536435o280120n107581
12873C2180073m608356m684253k597655l205023l086986k498382J00432L83435
12865A1983285Q68105J013014J310485L86467Q76085j03210p31247j588693Q25319
12856A4839610j836401k134171J16415k78953O90n4645m35790J633278q25835
12847A1024198k339291J58868J143076J343613N48250m53827J134631J765490
12839A4325008K71557J902043J741014k906646j965183J396710J608902J504265
12831A7877670j162550j085583J273385M12544j48406J259498M193537N588437
12823B8208532K409188J633992K870440N604875P399209O531537O678504J0144235
$$ plain form
12815 71480512 85155202 100267103 120164400 145685928 178707993 222933144 282373745
12808 282373745 354786592 429248510 481790958 479145256 420675827 340974961 267192741
12801 267192741 209197930 168098467 136888762 115277698 99435312 83966564 69090275
12794 69090275 56656130 48356688 44366993 41657522 38448764 34129011 28103224 22272507
12786 22272507 21679348 21824088 20133012 18877263 20277254 17687114 12656795 10330772
12778 10330772 10859052 11498303 11773548 11347099 11254370 10832689 12270521 14859273 17029297
12769 17029297 17111979 13494180 9738992 8941284 8672180 7154265 4832268 3350355 4482799
12760 4482799 7860922 8235878 5676412 3605588 3297011 5201083 5521814 4327743 3622916
$$ packed form
12815G1480512J3674690J5111901J9897297K5521528L3022065M4225151N9440601
12808B82373745P2412847P4461918N2542448k645702n8469429p9700866p3782220
12801B67192741n7994811m1099463l1209705k1611064j5842386j5468748j4876289
12794F9090275j2434145q299442l989695k709471l208758m319753o025787n830717
12786B2272507n93159J44740j691076j255749J399991k590140n030319k326023
12778A0330772N28280O39251K75245m26449r2729m21681J437832K588752K170024
12769A7029297Q2682l617799l755188p97708k69104j517915k321997j481913J132444
12760D482799L378123L74956k559466k070824l08577J904072L20731j194071p04827
$$ plain form
12751 3622916 3774386 4748642 4673120 3842325 1562418 -338598 -183749 293729 2446951
12742 2446951 2894231 729553 1455974 3691722 5027380 5076990 5715087 8687212 10693494
12733 10693494 9711649 7371525 6230998 5409253 2380461 -3083772 -7074335 -5709885
12725 -5709885 -156595 5336738 9391719 9148754 7948629 6120800 3374905 860428
12717 860428 -180918 490973 -1427711 -3648975 -1730197 467908 -7950 -1576891 -3971374
12708 -3971374 -4971582 -1860545 -141228 587538 2983232 4789500 5396046 2915686
12700 2915686 109504 425720 1681929 850331 577963 2588943 3186321 2112713 -102742
12691 -102742 -1753202 -3002976 -3236375 -1450070 662910 1553615 1227673 593377 -1138470
$$ packed form
12751C622916J51470R74256p5522q30795k279907j901016J54849M77478K153222
12742B446951M47280k164678P26421K235748J335658M9610O38097K972125K006282
12733A0693494r81845k340124j140527q21745l028792n464233l990563J364450
12725e709885N553290N493333M054981k42965j200125j827829k745895k514477
12717H60428j041346O71891j918684k221264J918778K198105m75858j568941k394483
12708c971374j000208L111037J719317P28766K395694J806268O06546k480360
12700B915686k806182L16216J256209q31598k72368K010980N97378j073608k215455
12691a02742j650460j249774k33399J786305K112980Q90705l25942o34296j731847
$$ plain form
12682 -1138470 -200003 2828011 3357148 3163849 2866951 2541538 2348104 1806588 1969611
12673 1969611 2713380 2637910 37196 -1343566 -1796471 -2968351 -3490097 -2263521 -1661958
12664 -1661958 -1866482 -1420782 381306 2018188 2385302 3021412 2173269 91577 57323
12655 57323 -2607528 -3097868 514303 4066335 6684088 7175344 6562382 6435596 8402082
12646 8402082 8694464 8633781 8546166 7326807 6253700 5021552 2416313 921836 139428
12637 139428 -2479366 -3710324 -3237021 -2443156 -2521516 -4160250 -3445869 -1338374 -912525
12628 -912525 480932 1609503 2012411 1898596 957015 298741 188924 -1020364 -2581470
12619 -2581470 -1844814 -381360 89234 221558 -51628 892398 2273900 2260103 1285062
$$ packed form
12682a138470R38467L028014N29137j93299k96898l25413j93434n41516J63023
12673A969611P43769p5470k600714j380762m52905j171880n21746J226576O01563
12664a661958k04524M45700J802088J636882L67114O36110q48143k081692l4254
12655E7323k664851m90340L612171L552032K617753M91256o12962j26786J966486
12646H402082K92382o0683q7615j219359j073107j232148k605239j494477p82408
12637A39428k618794j230958M73303P93865p8360j638734P14381K107495M25849
12628i12525J393457J128571M02908j13815r41581o58274j09817j209288j561106
12619b581470P36656J463454M70594J32324k73186R44026J381502j3797r75041
$$ plain form
12610 1285062 122738 -376574 1107755 1903327 1164329 86713 -1385739 -3842075 -4492860
12601 -4492860 -3934676 -2488136 -2693055 -3984809 -3936572 -2564932 -2334185 -2455152 940893
12592 940893 3531762 2833502 2475916 3689515 3482954 3694493 5169268 4760339 3754350
12583 3754350 3938980 3670366 3440560 1437278 249782 2361181 4646128 5977232 6769277
12574 6769277 4387864 2481376 1552799 -885098 -1667307 1118291 4298892 5452158
12566 5452158 2257812 -1532693 -2590594 -1285812 33657 -148252 559861 1571592
12558 1571592 551171 93481 -1742626 -3927244 -2892042 1088804 4868576 5601884
12550 5601884 5181763 4434480 4678101 3790723 1031716 1517057 3130577 3321274 2170359
$$ packed form
12610A285062j162324m99312J484329P95572p38998j077616j472452k456336o50785
12601d492860N58184J446540k04919j291754M8237J371640K30747j20967L396045
12592I40893K590869o98260l57586J213599k06561K11539J474775m08929j005989
12583C754350J84630k68614k29806k003282j187496K111399K284947J331104P92045
12574F769277k381413j906488r28577k437897p82209K785598L180601J153266
12566E452158l194346l790505j057901J304782J319469j81909P08113J011731
12558A571592j020421m57690j836107k184618J035202L980846L779772P33308
12550E601884m20121p47283K43621q87378k759007M85341J613520J90697j150915
$$ plain form
12541 2170359 2825088 5247288 4532610 3599363 3422475 1573986 -1132269 -3321832 -3146095
12532 -3146095 -2507814 -2738579 -2436020 -2688668 -3450923 -3349424 -3470759 -2809428 -1219102
12523 -1219102 -1469135 -2613967 -4541855 -4825682 -2453560 -1329782 -750671 62495 259261
12514 259261 618059 1505576 3775865 5430285 6955318 7205974 4578080 2503320 1969893
12505 1969893 1072332 168814 -516249 -1055331 -363179 124527 -864602 -780532 -747693 411496
12495 411496 1793302 4194281 5907216 6201062 4871061 4117407 3499384 4211561 6629665
12486 6629665 8176825 7705858 5878555 5435987 6401534 7030171 6325055 8204795 10250363
12477 10250363 7321113 3861396 1668053 -401372 -469322 1474275 3329612 2047875
$$ packed form
12541B170359O54729K422200p14678r33247j76888j848489k706255k189563J75737
12532c146095O38281k30765L02559k52648p62255J01499j21335O61331J590326
12523a219102k50033j144832j927888k83827K372122J123778N79111Q13166J96766
12514B59261L58798Q87517K270289J654420J525033K50656k627894k074760n33427
12505A969893q97561r03518o85063n39082O92152M87706r89129Q4070L2839J159189
12495D11496J381806K400979J712935K93846j330001p53654o18023P12177K418104
12486F629665J547160m70967j827303m42568R65547O28637p05116J879740K045568
12477A0250363k929250l459717k193343k069425o7950J943597J855337j281737
$$ plain form
12469 2047875 1208683 3187342 4576675 3240216 154589 -1831205 -565811 -222073
12461 -222073 -438268 250072 468843 -1772096 -4751918 -6130065 -5736519 -2814511 673354
12452 673354 -31278 -1840664 -1215093 -535236 74539 3499074 3594557 1241704 1074021
12443 1074021 2596436 2908861 2968311 3806109 2026959 1207543 1672748 972685 -472592
12434 -472592 -631218 -2212072 -4369293 -4018280 -2737395 -2339877 -1455592 145424 2268750
12425 2268750 1081316 -1929969 -4175869 -4927929 -4119585 -2418427 1268781 4394430
12417 4394430 4538866 2506182 1374096 2963957 4167363 3872221 4035783 3064065 2977878
12408 2977878 3611299 5128199 5858654 4750162 2638273 1214923 1717590 2423078 3066914
$$ packed form
12469B047875q39192J978659J389333j336459l085627j985794J265394L43738
12461b22073k16195O88340K18771k240939k979822j378147L93546K922008L487865
12452F73354p04632j809386O25571O79857O09775L424535R5483k352853j67683
12443A074021J522415L12425N9450Q37798j779150q19416M65205p00063j445277
12434d72592j58626j580854k157221L51013J280885L97518Q84285J601016K123326
12425B268750j187434l011285k245900p52060Q08344J701158L687208L125649
12417D394430J44436k032684j132086J589861J203406k95142J63562r71718q6187
12408B977878O33421J516900P30455j108492k111889j423350N02667P05488O43836
$$ plain form
12399 3066914 2755621 1950618 857135 -1153337 -1413922 -87195 -3876 -1191459 -1105782
12390 -1105782 1375965 3913657 2634067 -863224 -2561185 -468038 192069 -391712
12382 -391712 717772 2424468 3489777 4426749 3962041 4188864 5729472 7120520 6350108
12373 6350108 5610395 4301085 2422884 1561454 3056335 5616533 5679116 5619750 4518342
12364 4518342 2342530 1904836 449628 -612728 -1930343 -1528983 1170164 2452409
12356 2452409 1720978 3600498 5893472 5151675 3391258 697235 -1908399 -3738106
12348 -3738106 -5363183 -5735815 -3083147 -158591 1623154 2972233 3498004 3590307 2860310
12339 2860310 715203 -1207320 -2074074 -2951769 -2261746 -969204 -350668 814868 1832100
$$ packed form
12399C066914l11293q05003j093483k010472k60585J326727Q3319j187583Q5677
12390a105782K481747K537692j279590l497291j697961K093147O60107n83781
12382c91712J109484J706696J065309R36972m64708K26823J540608J391048p70412
12373F350108p39713j309310j878201q61430J494881K560198O2583n9366j101408
12364D518342k175812m37694j455208j062356j317615M01360K699147J282245
12356B452409p31431J879520K292974p41797j760417k694023k605634j829707
12348c738106j625077l72632K652668K924556J781745J349079N25771R2303p29997
12339B860310k145107j922523q66754q77695O90023J292542O18536J165536J017232
$$ plain form
12330 1832100 2409741 2321868 3865755 6015351 8408181 7530203 6511438 7035504 7935016
12321 7935016 6739681 3272432 3087393 3994726 3721113 3294648 2398923 1351778 1473162
12312 1473162 3230068 3407640 5315269 9507921 10217724 7661802 6868749 5833651 4099212
12303 4099212 5325380 5951917 4637010 2284923 -390348 -365787 -297734 -1995546 -3745376
12294 -3745376 -3480581 -3290948 -3089412 -2491404 -3412658 -4789973 -4065600 -2589026 -917274
12285 -917274 1953477 4095092 4863827 4015328 4643598 3102105 74902 -1345190 -2804809
12276 -2804809 -1770189 370579 1111231 2680001 3019586 1942118 657326 2239595
12268 2239595 5169855 6025933 6280035 5322054 1985505 -402582 -368864 1877392 4656184
$$ packed form
12330A832100N77641q7873J543887K149596K392830q77978j018765N24066Q99512
12321G935016j195335l467249j85039R07333k73613m26465q95725j047145J21384
12312A473162J756906J77572J907629M192652P09803k555922p93053j035098j734439
12303D099212J226168O26537j314907k352087k675271K4561O8053j697812j749830
12294c745376K64795J89633K01536N98008r21254j377315P24373J476574J671752
12285i17274K870751K141615P68735q48499O28270j541493l027203j420092j459619
12276b804809J034620K140768P40652J568770L39585j077468j284792J582269
12268B239595K930260Q56078K54102r57981l336549k388087L3718K246256K778792
$$ plain form
12259 4656184 6188311 5383368 2274601 -521904 -998295 -396146 2422993 5118204 4657981
12250 4657981 1667836 -139855 -715662 -1004487 879593 2462095 1544027 -535974 -2755219
12241 -2755219 -3463257 -1107431 -780654 -3192728 -3695099 -1416558 2152612 4117349 3602132
12232 3602132 2402932 1404252 450769 96017 -1247753 -1580275 28605 711171 2366762
12223 2366762 2431064 910788 -1825211 -3238620 -3903772 -3897458 -2929249 -1400072 -323325
12214 -323325 96738 -532252 -2436915 -5288063 -5466454 -2536552 189118 1530396 3643122
12205 3643122 3357408 1855179 1610786 1786822 798183 128393 2440756 1468694 1158653
12196 1158653 2644550 2988255 2471298 172156 -58960 1024716 3434756 5491566 7366065
$$ packed form
12259D656184J532127q04943l108767k796505m76391O02149K819139K695211m60223
12250D657981k990145j807691n75807k88825J884080J582502r18068k080001k219245
12241b755219p08038K355826L26777k412074n02371K278541L569170J964737n15217
12232C602132j199200r98680r53483l54752j343770l32522J608880O82566J655591
12223B366762O4302j520276k735999j413409o65152O314R68209J529177J076747
12214c23325M20063o28990j904663k851148j78391K929902K725670J341278K112726
12205C643122k85714j502229k44393J76036r88639o69790K312363r72062l10041
12196A158653J485897L43705n16957k299142k31116J083676K410040K056810J874499
$$ plain form
12187 7366065 5788753 2643384 1463109 283160 227702 271382 432475 1583816 -1603760
12178 -1603760 -7291114 -6396617 -977078 3059657 3712731 1223469 -392294 -2333001
12170 -2333001 -3632419 -4367968 -5111463 -6513242 -5155303 -3287963 -4377662 -6172441
12162 -6172441 -5324665 -3970752 -3075791 -713554 838899 24840 380067 1587844 2058027
12153 2058027 2021068 1523128 685063 -269981 1221258 2190737 3237793 4699776 5393525
12144 5393525 5444781 5626660 5120296 5756425 5143427 5055388 7149362 6221548 3560182
12135 3560182 2522758 2908222 2029117 2866015 5257180 5471555 4529202 4526015 3286060
12126 3286060 1115556 517488 1564643 479208 440528 -137946 -945104 -2432769 -5075619
$$ packed form
12187G366065j577312l145369j180275j179949n5458M3680J61093J151341l187576
12178a603760n687354Q94497N419539M036735O53074k489262j615763j940707
12170b333001j299418p35549p43495j401779J357939J867340j089699j794779
12162f172441Q47776J353913Q94961K362237J552453q14059L55227J207777M70183
12153B058027l6959m97940q38065r55044J491239R69479J047056J461983O93749
12144E393525N1256J81879n06364O36129o12998q8039K093974r27814k661366
12135C560182j037424L85464q79105Q36898K391165K14375r42353l187j239955
12126C286060k170504n98068J047155j085435l8680n78474q07158j487665k642850
$$ plain form
12117 -5075619 -3631427 -490392 2637509 3486467 3481525 3632952 3494950 5453141 5782769
12108 5782769 4666570 3425497 3304797 4426550 3388964 1070607 -1477365 -2241115
12100 -2241115 -1785074 -1416936 -2119664 -2419457 -3469425 -5184324 -4670980 -3258697 -634289
12091 -634289 2817661 3248856 2320470 584568 -1074745 -1626318 -2493987 -3019757 -2177829
12082 -2177829 -2446225 -593614 1855155 3748956 4121692 2965279 3626477 6346333 5517341
12073 5517341 2140114 320052 143461 -759245 -1854057 -1941531 -1780187 -2555819 -2397462
12064 -2397462 -1305240 77844 -194937 -1384098 -841963 1952572 3407011 3266540 2623713
12055 2623713 1787244 2235430 3026066 2616583 682737 -702955 -735588 303684 567890
$$ packed form
12117e075619J444192L141035L127901Q48958m942J51427j38002J958191L29628
12108E782769j116199j241073j20700J121753j037586k318357k547972p63750
12100b241115M56041L68138p02728k99793j049968j714899N13344J412283K624408
12091f34289L451950M31195r28386j735902j659313n51573q67669n25770Q41928
12082b177829k68396J852611K448769J893801L72736j156413O61198K719856q28992
12073E517341l377227j820062j76591r02706j094812q7474J61344p75632J58357
12064b397462J092222J383084k72781j189161N42135K794535J454439j40471o42827
12055B623713q36469M48186P90636m09483j933846j385692l2633J039272K64206
$$ plain form
12046 567890 916448 531731 1500695 1908479 996386 171185 -527643 -1586958 -419928
12037 -419928 3159923 4755228 4278498 2390098 2856297 3776784 4231798 5895770 6833486
12028 6833486 4934847 1946790 79530 -153587 -516923 -1561882 206690 3051734
12020 3051734 3619249 1540935 -1522940 -3537494 -2406512 -532 -123854 -1744510
12012 -1744510 -1567114 379059 285135 -453613 -354961 -1748374 -1881397 -1717751 -3390045
12003 -3390045 -3287189 -3882711 -5014575 -3556054 -2523923 -709588 1428104 2852276
11995 2852276 1849705 2376747 4620924 5668973 4934359 4502839 4450346 5003270 4941948
11986 4941948 4226316 2971631 1884328 -196326 -2707921 -2194233 -1098100 -663617 -2700678
$$ packed form
12046E67890L48558l84717R68964M07784r12093q25201o98828j059315J167030
12037d19928L579851J595305m76730j888400M66199R20487M55014J663972R37716
12028F833486j898639k988057j867260k33117l63336j044959J768572K845044
12020C051734N67515k078314l063875k014554J130982K405980j23322j620656
12012a744510J77396J946173r3924p38748R8652j393413j33023J63646j672294
12003c390045J02856n95522j131864J458521J032131J814335K137692J424172
11995B852276j002571N27042K244177J048049p34614m31520n2493N52924o1322
11986D941948p15632j254685j087303k080654k511595N13688J096133M34483k037061
$$ plain form
11977 -2700678 -6403261 -7166205 -5587408 -4695755 -4463943 -5071411 -5131278 -2541788 200104
11968 200104 -458060 -115575 1088645 1655832 3374291 4197825 3954282 5139193 5150231
11959 5150231 3741968 3559808 4352009 4822850 5373139 3703420 4683615 6432194 6155429
11950 6155429 3225708 -650675 -2896202 -1846993 -317239 1241252 770018 -1931838
11942 -1931838 -1867227 1376029 3518646 4618006 6191133 5963043 6050872 5799857 4518352
11933 4518352 3161469 1881401 1622045 1542010 1313017 2005727 3527205 3470237 725469
11924 725469 -2370301 -3906544 -1386760 2511342 3946189 3442916 2832531 1300848 -1642563
11915 -1642563 -4780923 -4620101 -1939664 -1244884 -1275460 -183596 2037078 2189555 1154219
$$ packed form
11977b700678l702583p62944J578797Q91653K31812o07468n9867K589490K741892
11968B00104o58164L42485J204220N67187J718459Q23534k43543J184911J1038
11959E150231j408263j82160P92201M70841N50289j669719R80195J748579k76765
11950F155429k929721l876383k245527J049209J529754J558491m71234k701856
11942a931838O4611L243256K142617J099360J573127k28090Q7829k51015j281505
11933D518352j356883j280068k59356q0035k28993O92710J521478n6968k744768
11924G25469l095770j536243K519784L898102J434847n03273o10385j531683k943411
11915a642563l138360J60822K680437O94780l0576J091864K220674J52477j035336
$$ plain form
11906 1154219 698538 290727 -224382 -39345 -279376 -188531 808297 1696904 1364863 3761077
11896 3761077 5345397 2420430 -79338 -1418315 -4940925 -5917974 -4025995 -503954
11888 -503954 1764043 1436410 1388722 1465004 146290 179453 1801618 3074008 2861548
11879 2861548 3215848 3590330 2278925 545412 -742977 -2512277 -5611371 -6369057 -4824336
11870 -4824336 -4081650 -4328490 -4179703 -4406093 -4108787 -5247381 -4861003 -2016234 123179
11861 123179 1349156 3106850 5525895 7634294 7272617 5389205 3284851 3087074 2096129
11852 2096129 -971802 -2839050 -3247462 -5667520 -4148363 412610 1497023 1496094 3039366
11843 3039366 2556103 416490 -221868 -1405170 -3309783 -3071251 -3575927 -3210304 -2929514
$$ packed form
11906A154219m55681m07811n15109J85037k40031R0845R96828Q88607l32041K396214
11896C761077J584320k924967k499768j338977l522610r77049J891979L522041
11888e03954K267997l27633m7688P6282j318714L3163J622165J272390k12460
11879B861548L54300L74482j311405j733513j288389j769300l099094p57686J544721
11870d824336P42686k46840J48787k26390K97306j138594L86378K844769K139413
11861A23179J225977J757694K419045K108399l61677j883412k104354j97777r90945
11852B096129l067931j867248m08412k420058J519157M560973J084413r29J543272
11843C039366m83263k139613o38358j183302j904613K38532n04676L65623K80790
$$ plain form
11834 -2929514 -2289672 347618 3440788 4898732 3274692 1060779 -298052 -2069772
11826 -2069772 -3516088 -3114155 -2277830 -4404452 -5360613 -2771560 -1360802 754855 1966361
11817 1966361 802711 -415884 -209261 -463077 -883039 552824 687135 1140958 2329284
11808 2329284 2662356 3472358 4176866 1077565 -2405811 -2758722 -3825816 -5154767 -5277027
11799 -5277027 -4252939 -3172652 -791214 1754999 760445 -930323 -2016737 -754538
11791 -754538 2020757 3782476 4456603 4104458 3461300 4216419 4310972 2133353 916880
11782 916880 -1148284 -3201366 -3292653 -3182062 -2129079 -1249405 -439778 488535 -1064257
11773 -1064257 -4245549 -4533882 -933547 3661606 6523434 6500491 4192276 4005610 4163531
$$ packed form
11834b929514O39842K637290L093170J457944j624040k213913j358831j771720
11826b069772j446316M01933Q36325k126622r56161K589053J410758K115657J211506
11817A966361j163650j218595K06623k53816m19962J435863J34311M53823J188326
11808B329284L33072Q10002P04508l099301l483376l52911j067094j328951j22260
11799e277027J024088J080287K381438K546213r94554j690768j086414J262199
11791g54538K775295J761719O74127l52145o43158P55119R4553k177619j216473
11782I16880k065164k053082r1287J10591J052983Q79674Q09627R28313j552792
11773a064257l181292k88333L600335M595153K861828k2943k308215j86666J57921
$$ plain form
11764 4163531 2902487 2901069 2823888 3141962 2616920 -408550 -2180906 -1419489 378017
11755 378017 286085 1549712 2506359 -356726 -1565053 -653699 -439156 -224850 -2134906
11746 -2134906 -3516934 -1622383 -348545 894670 1978793 2291228 1871327 692034
11738 692034 -2241228 -3384121 -2231297 -2093660 -4232285 -7790281 775935 10832126
11730 10832126 12290239 13199634 10964083 6160691 2956940 1703241 -601150 -440360
11722 -440360 -10170 2326438 4183301 4025547 3617035 3475780 2991819 3283795 3840820
11713 3840820 5488926 7155456 8747664 10045725 9468115 8031417 6387182 3870294
11705 3870294 1989607 2389482 1512937 319399 1144789 2449747 2571553 2868020 2715395
$$ packed form
11764D163531j261044j418p7181L18074n25042l025470j772356P61417J797506
11755C78017r1932J263627R56647k863085j208327R11354K14543K14306j910056
11746b134906j382028J894551J273838J243215J084123L12435m19901j179293
11738F92034k933262j142893J152824J37637k138625l557996Q566216J0056191
11730A0832126J458113R09395k235551m803392l203751j253699k304391J60790
11722d40360M30190K336608J856863j57754m08512j41255m83961K91976N57025
11713C840820J648106J666530J592208J298061n77610j436698j644235k516888
11705C870294j880687L99875q76545j193538Q25390J304958J21806K96467j52625
$$ plain form
11696 2715395 2762973 5768179 7188558 6938789 8866879 9460776 6937198 5573688 6257959
11687 6257959 5921671 4211611 2177208 2527362 7152116 10807801 8489291 2876500
11679 2876500 218281 643865 -18680 -1883804 -2348269 -1447451 -370585 -1491685 -4130660
11670 -4130660 -4893350 -3923159 -2907356 -1668476 -892428 -314442 -508652 -917879 -869641
11661 -869641 -1113586 -1179287 -775680 355551 -671422 -1303035 -2275115 -2655293 -2848950
11652 -2848950 -2032951 -2332670 -3623365 -2671461 -384359 876648 653106 -1605657 -2402981
11643 -2402981 -1404352 1631769 6273572 8498771 6838531 5970900 5331701 3827971 980316
11634 980316 -1289587 -1659039 -1354265 9049 2709964 5240090 5514321 4443689 3159099
$$ packed form
11696B715395M7578L005206J420379k49769J928090N93897k523578j363510O84271
11687F257959l36288j710060k034403L50154M624754L655685k318510n612791
11679B876500k658219M25584o62545j865124m64465R00818J076866j121100k638975
11670d130660p62690R70191J015803J238880P76048N77986j94210m09227M8238
11661h69641k43945o5701M03607J131231j026973o31613r72080l80178j93657
11652b848950Q15999k99719j290695R51904K287102J261007k23542k258763p97324
11643b402981R98629L036121M641803K225199j660240q67631o39199j503730k847655
11634I80316k269903l69452L04774J363314K700915K530126K74231j070632j284590
$$ plain form
11625 3159099 4134422 4857166 4258245 3719427 1090633 -962085 -1965916 -359992 1751104
11616 1751104 3382108 4479802 4015434 3528355 3912008 5413986 6177075 5782742 4824847
11607 4824847 4050987 3988071 4196418 5047377 4067529 1552247 -634971 -1243404 -1857218
11598 -1857218 -683477 188595 2410799 4653764 3386329 3603237 4261065 5644886 6744958
11589 6744958 6340432 4734839 3701788 3365259 72797 -3402113 -4228276 -3423695 -2115971
11580 -2115971 -2254872 -3394246 -4481611 -4642755 -4248180 -4947595 -7090716 -8750459 -6585716
11571 -6585716 -2203148 571177 2058579 1179849 1334548 2604733 1996349 266875 371604
11562 371604 979734 1718432 509210 576975 1527194 1273316 1389799 1516997 719064 1482358
$$ packed form
11625C159099R75323P22744n98921n38818k628794k052718j003831J605924K111096
11616A751104J631004J097694m64368m87079L83653J501978P63089l94333r57895
11607D824847p73860o2916K08347Q50959r79848k515282k187218o08433o13814
11598a857218J173741Q72072K222204K242965j267435K16908O57828J383821J100072
11589F744958m04526j605593j033051l36529l292462l474910q26163Q04581J307724
11580b115971j38901j139374j087365j61144L94575o99415k143121j659743K164743
11571f585716M382568K774325J487402q78730J54699J270185o08384j729474J04729
11562C71604O08130P38698j209222O7765R50219k53878J16483J27198p97933P63294
$$ plain form
11552 1482358 1616361 1796832 860964 1079899 2718392 3548859 5193795 5142765 1858130
11543 1858130 1207495 1942188 1342370 1381720 2007755 -357329 -1133076 515130 2369494
11534 2369494 4940422 5499175 5923429 5038054 4400551 3405186 2341091 2728140 3853226
11525 3853226 4032812 3737812 3090757 3303719 5623923 4969315 3860271 1626527 -281297
11516 -281297 1030593 715238 -705535 -1935445 -3119977 -2638923 -396001 -586742 -3697176
11507 -3697176 -4344889 -2698308 -2391561 -1374573 1672246 4998972 8005930 7010830 4194018
11498 4194018 2193453 916347 1214420 1690093 1807654 2581067 3218072 4249423 5547182
11489 5547182 4909413 3800685 2580758 661681 -629739 635257 1346838 326053
$$ packed form
11552A482358J34003J80471r35868K18935J638493Q30467J644936n1030l284635
11543A858130o50635P34693n99818L9350O26035k365084p75747J648206J854364
11534B369494K570928N58753M24254q85375o37503r95365j064095L87049J125086
11525C853226J79586k95000o47055K12962K320204o54608j109044k233744j907824
11516b81297J311890l15355j420773j229910j184532M81054K242922j90741l110434
11507c697176o47713J646581L06747J016988L046819L326726L006958r95100k816812
11498D194018k000565j277106K98073M75673J17561P73413O37005J031351J297759
11489E547182o37769j108728j219927j919077j291420J264996P11581j020785
$$ plain form
11481 326053 -543929 -3444598 -5377112 -4569699 -3441159 -5051979 -5287352 -3877577 -3362066
11472 -3362066 -4678386 -6029364 -7357120 -7939548 -7504412 -9187025 -9745390 -8266549 -5301061
11463 -5301061 -3563237 -2157284 -1477593 -1171528 -1958517 -4086787 -6376429 -6227459 -3661269
11454 -3661269 -940432 563865 1601628 2099861 2101033 2391391 2321166 -473077 -1161518
11445 -1161518 624829 2037407 2906299 3401630 3046042 662705 -302237 -1011680 -768265
11436 -768265 1179267 208333 -1869471 -3033780 -2570131 315999 997792 2399262 4688985
11427 4688985 5244373 5226426 4932802 2389126 -502895 -1303754 116507 1777521 3270950
11418 3270950 3260791 808408 -811089 471341 1920505 4373525 6544700 3796379
$$ packed form
11481C26053q69982k900669j932514Q07413J128540j610820k35373J409775N15511
11472c362066j316320j350978j327756n82428M35136j682613n58365J478841K965488
11463e301061J737824J405953O79691L06065p86989k128270k289642J48970K566190
11454c661269K720837J504297J037763M98233J172K90358p0225k794243o88441
11445a161518J786347J412578Q68892M95331l55588k383337r64942p09443K43415
11436g68265J947532r70934k077804j164309M63649K886130O81793J401470K289723
11427D688985N55388j7947k93624k543676k892021q00859J420261J661014J493429
11418C270950j0159k452383j619497J282430J449164K453020K171175k748321
$$ plain form
11410 3796379 1557367 1904476 3210794 3054777 1273309 486420 91710 711384 2672816
11401 2672816 4775722 6773375 6549433 4765859 4021602 4532363 4505892 2290981 994333
11392 994333 -131335 -813675 -1130139 146562 263273 -506208 1800662 2904242 3337955
11383 3337955 1699901 -1109626 -37663 -362314 -903517 -853467 -2251082 -3880756 -4077431
11374 -4077431 -3407248 -2176182 -1115007 -1412083 -2026553 -1403887 -1494872 -3172924 -3088771
11365 -3088771 -3610027 -4499177 -5149869 -3340986 -1080213 -112767 87501 588479 2928485
11356 2928485 4944134 4615752 3197850 2241406 712887 54695 817472 1160937 1643210
11347 1643210 1993710 1449877 687109 -843764 -233935 3157539 5390682 4260445 1305938
$$ packed form
11410C796379k239012L47109J306318j56017j781468p86889l94710O19674J961432
11401B672816K102906J997653k23942j783574p44257N10761k6471k214911j296648
11392I94333j125668o82340l16464J276701J16711p69481K306870J103580M33713
11383C337955j638054k809527J071963l24651n41203N0050j397615j629674j96675
11374d077431O70183J231066J061175k97076o14470O22666r0985j678052Q4153
11365c088771n21256q89150o50692J808883K260773R67446K00268N00978K340006
11356B928485K015649l28382j417902r56444j528519o58192P62777L43465M82273
11347A643210L50500n43833p62768j530873O09829L391474K233143j130237k954507
$$ plain form
11338 1305938 -1889191 -3300024 -3177865 -1842183 -345742 -244873 778228 2107780
11330 2107780 4442141 4898455 3387035 1535301 306129 -798178 824632 4766130
11322 4766130 7435703 6926829 3759847 905349 -2226544 -3327683 -1407404 -1550299
11314 -1550299 -1710969 -1170795 570484 660082 -186588 767608 3388326 4757835 4200063
11305 4200063 3615622 1244327 279773 -561505 -874459 -684807 -286478 45882 -965176
11296 -965176 -2847552 -4501528 -3875163 -414681 1278997 735192 -1534912 -4201114 -4431742
11287 -4431742 -3404231 -1948708 -246348 1561403 860134 -2008127 -3324582 -3295774 -2644592
11278 -2644592 -826118 527978 483763 369970 1688252 3366249 2924360 1350194 -881694
$$ packed form
11338A305938l195129j410833J22159J335682J496441J00869J023101J329552
11330B107780K334361M56314j511420j851734j229172j104307J622810L941498
11322D766130K669573n08874l166982k854498l131893j101139J920279j42895
11314a550299j60670N40174J741279Q9598q46670R54196K620718J369509n57772
11305D200063n84441k371295r64554q41278l12954J89652L98329L32360j011058
11296i65176j882376j653976O26365L460482J693678n43805k270104k666202k30628
11287d431742J027511J455523J702360J807751p01269k868261j316455K8808O51182
11278b644592J818474J354096m4215j13793J318282J677997m41889j574166k231888
$$ plain form
11269 -881694 -2123996 -1833054 -127382 333076 257808 830817 412607 1261936 1244140 1210320
11259 1210320 1719280 1908240 383545 -713571 -238019 865024 1015713 953749 -2273157
11250 -2273157 -3729874 -1872988 892406 2882417 3505014 3530780 4095834 3717870 2239515
11241 2239515 473786 950551 1518976 1069947 1302793 908648 2235335 3283598 1883611
11232 1883611 -1355314 -2799443 -2288842 -2660351 -2501318 -1607767 -563118 -358111 -1171979
11223 -1171979 -1921821 -3090606 -3715005 -2615414 -669404 -298507 222190 1218623 1477466
11214 1477466 -437993 -310207 665552 -832680 -665331 1410649 1884771 -885678 -4371548
11205 -4371548 -4804336 -3129308 -974561 645619 -169011 -1879971 -2635119 -1959357 -2071639
$$ packed form
11269h81694j242302K90942J705672M60458p5268N73009m18210Q49329j7796l3820
11259A210320N08960J88960j524695j097116M75552J103043J50689o1964l226906
11250b273157j456717J856886K765394J990011O22597K5766N65054l77964j478355
11241B239515j765729M76765N68425m49029K32846l94145J326687J048263j399987
11232A883611l238925j444129N10601l71509J59033Q93551J044649K05007q13868
11223a171979p49842j168785o24399J099591J946010L70897N20697R96433K58843
11214A477466j915459J27786R75759j498232J67349K075980M74122k770449l485870
11205d371548m32788J675028K154747J620180q14630j710960p55148O75762j12282
$$ plain form
11196 -2071639 -3842015 -2803254 -420247 580025 825619 732166 876038 1412410 -1475634
11187 -1475634 -3604938 -2926415 -2117844 -751185 988853 1545718 503465 -1210999 -3502370
11178 -3502370 -5965123 -6078199 -5979142 -4930107 -3010175 -3327964 -5160688 -5853982 -6196670
11169 -6196670 -7047860 -4988106 -2562657 -1219755 267105 2782749 4076148 3730088
11161 3730088 5465819 6352739 5530777 5675871 4175152 1423541 -229488 -2059 1063819
11152 1063819 1029950 1506087 1420515 -787415 -2130534 -997816 854551 2279949 1826656
11143 1826656 116898 -713314 -2032423 -1638238 251054 -619906 -3130312 -4290469 -5237494
11134 -5237494 -4057872 -1198606 -71097 934644 697306 149282 219281 2246294 3840953
$$ packed form
11196b071639j770376J038761K383007J000272K45594r3453J43872N36372k888044
11187a475634k129304O78523Q08571J366659J740038N56865j042253j714464k291371
11178c502370k462753j13076R9057J049035J919932l17789j832724o93294l42688
11169f196670q51190K059754K425449J342902J486860K515644J293399l46060
11161C730088J735731Q86920q21962J45094j500719k751611j653029K27429J065878
11152A063819l3869M76137q5572k207930j343119J132718J852367J425398m53293
11143A826656j709758q30212j319109L94185J889292q70960k510406j160157r47025
11134e237494J179622K859266J127509J005741k37338n48024O9999K027013J594659
$$ plain form
11125 3840953 4236056 2442996 589897 -589149 -281565 3319565 3112632 -1406577 -5208357
11116 -5208357 -8371713 -10134740 -8905574 -7864995 -5816319 -3409475 -1745857 185361
11108 185361 2307225 3336653 5306683 4318504 1369262 -1115536 -871463 -1012181 -733591
11099 -733591 1338722 2142500 1826366 -672463 -3691948 -5078902 -2826082 -1091975 -545610
11090 -545610 523481 729780 674671 3267740 4033171 2308006 1925063 2554294 1654459
11081 1654459 -640030 -3157381 -4564902 -3461487 -1717983 227732 1832788 2695966
11073 2695966 3084011 1579903 2456150 6990171 11425233 10161611 4715097 1976403
11065 1976403 1052794 1343788 1167983 1087959 4133844 6654140 7356022 8763209 9051936
$$ packed form
11125C840953L95103j793060j853099j179046L07584L601130k06933m519209l801780
11116e208357l163356j763027J229166J040579K048676K406844J663618J931218
11108A85361K121864J029428J970030r88179k949242k484798K44073j40718K78590
11099g33591K072313Q03778l16134k498829l019485j386954K252820J734107N46365
11090e45610J069091K06299n5109K593069P65431j725165l82943O29231q99835
11081A654459k294489k517351j407521J103415J743504J945715J605056Q63178
11073B695966L88045j504108Q76247M534021M435062j263622n446514k738694
11065A976403r23609K90994j75805q0024L045885K520296P01882J407187K88727
$$ plain form
11056 9051936 8748414 7669031 5079478 1800231 -1308342 -1909492 1401182 2454937
11048 2454937 -1855016 -3998730 -4474960 -5566897 -5642206 -5654623 -5130582 -3512968 -2230907
11039 -2230907 -589756 837517 836478 140789 585110 3175675 4248222 4466251 5268925
11030 5268925 6565540 10655889 14911978 19834371 28478149 39334560 52362496 69125862
11022 69125862 90393884 111655337 114846447 94499834 69272525 50664107 38256795
11015 38256795 29552259 22819409 18662976 14083268 10166157 8023580 6376219 6184514
11007 6184514 3048851 -49511 -821723 454816 1081950 261463 -659124 -454383 293895
10998 293895 -1283535 -1331688 1799752 2320508 1129202 2742219 4332044 3587635 3361052
$$ packed form
11056I051936l03522j079383k589553l279247l108573o01150L310674J053755
11048B454937m309953k143714m76230j091937p5309j2417N24041J617614J282061
11039b230907J641151J427273j039o95689M44321K590565J072547K18029Q02674
11030E268925J296615M090349M256089M922393Q643778J0856411J3027936J6763366
11022F9125862K1268022K1261453L191110k0346613k5227309j8608418j2407312
11015C8256795q704536o732850m156433m579708l917111k142577j647361j91705
11007F184514l135663l098362p72212J276539O27134q20487r20587K04741P48278
10998B93895j577430m8153L131440N20756j191306J613017J589825p44409k26583
$$ plain form
10989 3361052 2223378 2247849 1704192 548985 2038250 2054929 -175482 -3125503 -2122189
10980 -2122189 -40956 1831346 3012087 3041087 1708457 -721342 -3046607 -5341649
10972 -5341649 -6853045 -7470702 -8015829 -7899603 -6798708 -3230687 744113 3096756 2509331
10963 2509331 674998 412908 2425909 3919107 5112999 5806914 5596942 3159004 3220521
10954 3220521 4563032 1680807 -1250150 -1607782 509764 1914871 896431 870859 1666601
10945 1666601 474004 144364 959574 1020441 1071143 227732 -2883753 -3563189 -2226102
10936 -2226102 -140226 2952838 5274738 6091827 6637863 7028338 5693992 2836995 2355472
10927 2355472 3855160 3892947 2847939 1376994 1896560 3901648 3043452 853142 -233738
$$ packed form
10989C361052j137674K4471n43657j155207J489265J6679k230411k950021J003314
10980b122189K081233J872302J180741K9000j332630k429799k325265k295042
10972e341649j511396o17657n45127J16226J100895L568021L974800K352643n87425
10963B509331j834333k62090K013001J493198J193892O93915k09972k437938O1517
10954C220521J342511k882225k930957l57632K117546J405107j018440k5572P95742
10945A666601j192597l29640Q15210O0867N0702q43411l111485o79436J337087
10936b226102K085876L093064K321900Q17089N46036L90475j334346k856997m81523
10927B355472J499688L7787j045008j470945N19566K005088q58196k190310j086880
$$ plain form
10918 -233738 -873177 -1463236 -1587073 -74887 1844763 2765770 3704087 5531362 4224068
10909 4224068 3163125 1480161 833800 2244672 2494806 2997331 4311668 5123802 4609619
10900 4609619 816648 -2860593 -2743414 -2121503 -498628 1216464 1733629 448406 -1204074
10891 -1204074 -3613467 -4170605 -4632175 -1432255 2196722 2248776 -361471 -2432380 -675541
10882 -675541 1727517 -82558 -3775464 -4450638 -2428331 1540128 4152553 3096798
10874 3096798 1171698 -115626 -847768 -1880828 -4555409 -4543794 -3413582 -4767861 -5395439
10865 -5395439 -3019364 976661 2151968 1448179 1966343 1151787 819779 598364 -1251052
10856 -1251052 -1801181 -3556992 -5501381 -4112831 -1940818 -1367031 13743 960007 1340512
$$ packed form
10918b33738o39439n90059j23837J512186J919650R21007R38317J827275j307294
10909D224068j060943j682964o46361J410872K50134N02525J314337Q12134n14183
10900D609619l792971l677241J17179O21911J622875J715092N17165j285223j652480
10891a204074k409393n57138m61570L199920L628977N2054k610247k070909J756839
10882f75541K403058j810075l692906o75174K022307L968459K612425j055755
10874C096798j925100j287324p32142j033060k674581J1615J130212j354279o27578
10865e395439K376075L996025J175307p03789N18164q14556l32008k21415j849416
10856a251052n50129j755811j944389J388550K172013N73787J380774R46264L80505
$$ plain form
10847 1340512 1699603 2753817 3539431 1712122 -468146 -2353908 -1102488 1775391
10839 1775391 4146287 4797072 2547345 1286231 708185 -632029 -1544577 -555551 1998813
10830 1998813 4370281 7016281 7197427 5592704 5064994 3879093 775843 -96046 1083356
10821 1083356 4185772 4808920 4527221 5218107 7874053 9986604 10507345 10097199 10915267
10812 10915267 15878462 19758880 22484110 27251690 33226821 42292289 56166970 73815211
10804 73815211 91400133 102017587 97618608 81325352 62427486 45763701 34925860
10797 34925860 27932933 24059476 21321141 18686162 15724857 12905274 10022878 10022433 11461272
10788 11461272 12265549 13447669 11022111 8464470 6806823 5693827 5645730 4603971
$$ packed form
10847A340512L59091J054214P85614j827309k180268j885762J251420K877879
10839A775391K370896O50785k249727j261114n78046j340214r12548R89026K554364
10830A998813K371468K646000J81146j604723n27710j185901l103250q71889J179402
10821A083356L102416O23148k81699O90886K655946K112551N20741m10146Q18068
10812A0915267M963195L880418K725230M767580N975131R065468J3874681J7648241
10804G3815211J7584922J0617454m398979j6293256j8897866j6663785j0837841
10797C4925860o992927l873457k738335k634979k961305k819583k882396m45J438839
10788A1461272Q04277J182120k425558k557641j657647j112996m8097j041759
$$ plain form
10780 4603971 4766418 3606794 1203291 2394585 5478235 5995215 5917362 5428211 5152760
10771 5152760 5036479 5315496 7290604 7685791 6856322 7962930 9711564 8892436 8346809
10762 8346809 8677776 6631803 3403025 692143 395127 1910895 2699315 3294169 6212372
10753 6212372 5447457 2829829 2986590 3762433 2331089 637959 -473526 142477 968271
10744 968271 482147 347154 -872754 -3259553 -3162671 203731 291160 -1890861 -2420003
10735 -2420003 -2603372 -3830151 -4303470 -3528334 -2968932 -2708255 9997 2227715 2186394
10726 2186394 3454236 4880795 5573588 7849240 8070388 7182374 6905618 5306555 3379935
10717 3379935 4168681 5360282 4745569 3411619 2051320 379258 4491 -860316 -2144438
$$ packed form
10780D603971J62447j159624k403503J191294L083650N16980p7853m89151k75451
10771E152760j16281K79017J975108L95187q29469J106608J748634q19128n45627
10762H346809L30967k045973l228778k710882k97016J515768P88420N94854K918203
10753F212372p64915k617628J56761P75843j431344j693130j111485O16003Q25794
10744I68271m86124j34993j219908k386799R6882L366402Q7429k182021n29142
10735b420003j83369j226779m73319P75136N59402K60677K718252K217718m1321
10726B186394J267842J426559O92793K275652K21148q88014k76756j599063j926620
10717C379935P88746J191601o14713j333950j360299j672062l74767q64807j284122
$$ plain form
10708 -2144438 -606453 171666 -509500 -806290 -1467934 -2510133 -3345650 -3677005 -1470378
10699 -1470378 940913 1062714 1880672 2943960 525145 -1916303 -1112970 747707 2699501
10690 2699501 3778953 4636053 3178016 1670791 2679843 3367782 3909600 1892558 1655962
10681 1655962 2676820 2105967 2144854 4602946 4928968 2597275 4995 -1522232 -1402924
10672 -1402924 -2611506 -5770165 -6693285 -3579459 -1205612 242300 -944696 -3285010
10664 -3285010 -2944426 -3202519 -2530321 1289732 4411934 4875831 4239468 2025051 -604164
10655 -604164 -2615595 -2489201 -1101485 -511632 -1330209 -766058 353501 729531 2100240
10646 2100240 3860943 3370441 687137 95369 1923329 4577417 5147254 4365878 2998485
$$ packed form
10708b144438J537985P78119o81166k96790o61644j042199q35517l31355K206627
10699a470378K411291J21801Q17958J063288k418815k441448Q03333J860677J951794
10690B699501J079452Q57100j458037j507225J009052O87939N41818k017042k36596
10681A655962J020858n70853L8887K458092L26022k331693k592280j527227J19308
10672a402924j208582l158659r23120L113826K373847J447912j186996k340314
10664c285010L40584k58093O72198L820053L122202M63897o36363k214417k629215
10655f04164k011431J26394J387716N89853q18577N64151J119559L76030J370709
10646B100240J760703m90502k683304n91768J827960K654088N69837p81376j367393
$$ plain form
10637 2998485 1422203 -829652 -3026070 -4262832 -4988817 -6537461 -8783166 -8619159
10629 -8619159 -4900085 -1782206 94431 492489 -22799 33676 1190417 2216071 3166053
10620 3166053 2520789 -878066 -3129749 -4373346 -4648566 -4269053 -2932673 -2966445 -2925910
10611 -2925910 -2554666 -2782343 -2778537 -1180004 874540 805292 1587489 2215241 1493767 719512
10601 719512 -1403825 -2363425 -2337534 -3085808 -3002004 -1036001 -437672 -1858511 -3457093
10592 -3457093 -2968040 -2582615 -2261279 -1514878 -2170766 -648370 817451 -186989 -975638
10583 -975638 -366015 1960648 3319727 2442298 653295 -715366 -280 1869523 2058164
10574 2058164 1330999 1738584 2013067 99149 -1352877 -2248499 -2182501 -446589 1148114
$$ packed form
10637B998485j576282k251855k196418j236762p25985j548644k245705J64007
10629h619159L719074L117879J876637L98058n15288N6475J156741J025654R49982
10620C166053o45264l398855k251683j243597k75220L79513J336380l3772M0535
10611b925910L71244k27677L806J598533K054544o9248P82197O27752p21474p74255
10601G19512k123337r59600K5891p48274Q3804J966003N98329j420839j598582
10592c457093M89053L85425L21336P46401o55888J522396J465821j004440p88649
10583i75638O09623K326663J359079q77429j789003j368661P15086J869803J88641
10574B058164p27165M07585K74483j913918j452026q95622O5998J735912J594703
$$ plain form
10565 1148114 2423178 2546395 2657310 2764937 874188 -877593 -3440738 -6048427 -8217944
10556 -8217944 -8078457 -6855299 -6040405 -4628762 -4143413 -4564849 -3833468 -2062419 -2183269
10547 -2183269 -4047005 -3735126 -689189 1109982 817840 -436187 -848820 -977111 -1302184
10538 -1302184 -737794 1015722 1924288 1741042 2085778 3349094 5826462 6948927 4894396
10529 4894396 3559154 1429005 193373 1516225 2830886 3558322 2032939 287377
10521 287377 -1534889 -3056147 -3863774 -4436458 -4741364 -3080436 -868011 -1011633 -2208675
10512 -2208675 -924399 4420357 9415557 11042524 9206736 7816948 5978448 4786281
10504 4786281 3889952 2527271 1626586 2336827 2406144 -34212 -1687061 -1850430 -1740403
$$ packed form
10565A148114J275064J23217J10915J07627j890749j751781k563145k607689k169517
10556h217944J39487J223158Q14894J411643M85349m21436P31381J771049j20850
10547b183269j863736L11879L045937J799171k92142j254027m12633j28291l25073
10538a302184N64390J753516R08566j83246L44736J263316K477368J122465k054531
10529D894396j335242k130149j235632J322852J314661P27436j525383j745562
10521B87377j822266j521258q07627n72684l04906J660928K212425j43622j197042
10512b208675J284276N344756M995200J626967j835788j389788j838500j192167
10504D786281q96329j362681r00685P10241O9317k440356j652849j63369J10027
$$ plain form
10495 -1740403 -784999 -1078104 -1278525 33763 1776421 1694422 -187167 -316124 880471
10486 880471 998067 2079165 3651169 3626594 3858316 3549837 1333404 1194179 1521134
10477 1521134 3707598 6015669 7259519 6141816 4129610 3078320 2091624 3260349
10469 3260349 4423205 2807561 718047 -498487 -2691687 -1961867 -112687 870853
10461 870853 2089673 2995373 1684311 -2429316 -5237485 -5570149 -5073896 -2694326 528752
10452 528752 325295 -41666 1054606 3627131 3991162 3327214 3612981 1872915 -1130430
10443 -1130430 -2016057 -3647021 -6684272 -7963417 -6968253 -3662692 -1804500 -325738
10435 -325738 876729 719112 209929 -366461 -1346926 -380488 863706 709298 -887642
$$ packed form
10495a740403R55404k93105k00421J312288J742658q1999j881589j28957J196595
10486H80471J17596J081098J572004k4575K31722l08479k216433j39225L26955
10477A521134K186464K308071J243850j117703k012206j051290r86696J168725
10469C260349J162856j615644k089514j216534k193200P29820J849180R83540
10461H70853J218820R05700j311062m113627k808169l32664M96253K379570L223078
10452E28752k03457l66961J096272K572525L64031o63948K85767j740066l003345
10443a130430q85627j630964l037251j279145R95164L305561J858192J478762
10435c25738J202467j57617n09183n76390r80465R66438J244194j54408j596940
$$ plain form
10426 -887642 -3031490 -4237860 -3096890 -1323910 -1986607 -1818879 -1005809 -622095 -531869
10417 -531869 538760 -174919 -3137475 -4447351 -1993010 619913 2192139 2042102 2287793
10408 2287793 2741067 2070487 1807908 1130726 661504 -712540 -2772323 -1401129 -1655545
10399 -1655545 -4721326 -5688450 -3509544 -174728 -74741 733907 2571685 1705520 233600
10390 233600 -1711757 -2590922 -3769713 -5266257 -3624203 -1733679 -2594699 -3549433 -4134878
10381 -4134878 -4358391 -2309074 -729929 1272098 4657755 4788343 993344 23877 -1144990
10372 -1144990 -1608930 -1376639 -949599 -339434 1405038 2458617 2985326 2459834 3185813
10363 3185813 4918270 4697802 3142448 3261502 3708660 3501831 2695092 3300895 5822376
$$ packed form
10426h87642k143848j206370J140970J772980o62697J67728Q13070L83714R0226
10417e31869J070629p13679k962556j309876K454341K612923J572226j50037K45691
10408B287793M53274o70580k62579o77182m69222j374044k059783J371194k54416
10399a655545l065781r67124K178906L334816R9987Q08648J837778q66165j471920
10390B33600j945357q79165j178791j496544J642054J890524q61020r54734n85445
10381d134878k23513K049317J579145K002027L385657J30588l794999r69467j168867
10372a144990m63940K32291M27040O10165J744472J053579N26709n25492P25979
10363C185813J732457k20468j555354J19054M47158k06829q06739O05803K521481
$$ plain form
10354 5822376 6052130 2158303 -1339116 -2043763 -120008 2120701 2247179 3084533 2896128
10345 2896128 1113230 -1009416 -399476 -414292 -2130735 -3162305 -3202911 -496633 724435
$$ packed form
10354E822376K29754l893827l497419p04647J923755K240709J26478Q37354j88405
10345B896128j782898k122646O09940j4816j716443j031570m0606K706278J221068
$$ [...]
##END NTUPLES=NMR SPECTRUM
##END=
