##TITLE=C13_Pr 4962
 CDCl3, 21900 sc

 17.12.2020
##JCAMPDX= 6.0         $$ Bruker NMR JCAMP-DX V2.0
##DATA TYPE= NMR SPECTRUM
##DATA CLASS= NTUPLES
##ORIGIN= UXNMR, Bruker Analytische Messtechnik GmbH
##OWNER= root
$$ XWIN-NMR		Version 3.5
$$ Fri Dec 18 10:26:53 2020 Russian Standard Time (UT+4h)  she@DPX200
##.OBSERVE FREQUENCY= 50.327896
##.OBSERVE NUCLEUS= ^13C
##.ACQUISITION MODE= SIMULTANEOUS
##.ACQUISITION SCHEME= undefined
##.AVERAGES= 21900
##.DIGITISER RES= 17
##SPECTROMETER/DATA SYSTEM= spect
##.PULSE SEQUENCE= zgpg30
##.SOLVENT NAME= CDCl3
##.SHIFT REFERENCE= (INTERNAL, CDCl3, 0, 222.661)
##AUDIT TRAIL= $$ (NUMBER, WHEN, WHO, WHERE, WHAT)
$$ ##TITLE= Audit trail, XWIN-NMR		Version 3.5
$$ ##JCAMPDX= 5.01
$$ ##ORIGIN= Bruker BioSpin GmbH
$$ ##OWNER= she
$$ F:/spectra/data/she/nmr/c13/1/pdata/1/auditp.txt
$$ ##AUDIT TRAIL=  $$ (NUMBER, WHEN, WHO, WHERE, WHAT)
(   1,<2020-12-18 10:25:21.28 +0400>,<she>,<DPX200>,
      <created by zg, POWCHK disabled, PULCHK disabled
       terminated by command 'halt'
       configuration hash MD5:
       00 E9 B6 7A A2 85 ED C7 34 08 36 98 17 FE 4E 26
       data hash MD5: 32K
       70 FE 28 30 3B 1A 80 39 EB E4 97 77 94 19 6C 47>)
(   2,<2020-12-18 10:25:29.73 +0400>,<she>,<DPX200>,
      <Start of raw data processing
       efp BC_mod = 2 LB = 1 FT_mod = 6 PKNL = 1 PHC0 = -279.1041 PHC1 = 28.96242 SI = 32K 
       data hash MD5: 32K
       D9 13 83 98 72 1F 73 B0 29 D3 43 17 A5 B5 85 A5>)
(   3,<2020-12-18 10:25:40.17 +0400>,<she>,<DPX200>,
      <abs ABSG = 5 
       data hash MD5: 32K
       EA 78 D1 DD 84 AE E8 90 4E AF FB 00 45 49 69 A7>)
(   4,<2020-12-18 10:26:13.71 +0400>,<she>,<DPX200>,
      <pk PHC0 = 1.041629 PHC1 = 3.8 
       data hash MD5: 32K
       B3 32 AE 9D FF 64 E9 B2 F1 2B 62 F1 53 E1 9E D3>)
(   5,<2020-12-18 10:26:16.85 +0400>,<she>,<DPX200>,
      <abs ABSG = 5 
       data hash MD5: 32K
       4C 4D 3D F8 0D 78 38 48 2A 20 49 36 99 4E 58 24>)
$$ ##END=
$$ 
$$ hash MD5
$$ DF 5E 6F 33 A1 D1 F7 19 CC CF 98 C8 B7 E0 84 A3
##$RELAX= 
##$RELAX= 
##$RELAX= 
##$RELAX= 
##$RELAX= 
##$RELAX= 
##$RELAX= 
##$RELAX= 
$$ Bruker specific parameters
$$ --------------------------
##$DU= <F:/spectra>
##$EXPNO= 1
##$NAME= <c13>
##$PROCNO= 1
##$TYPE= <nmr>
##$USER= <she>
##$AMP= (0..31)
100 100 100 100 100 100 100 100 100 100 100 100 100 100 100 100 100 100 
100 100 100 100 100 100 100 100 100 100 100 100 100 100 
##$AQSEQ= 0
##$AQ_mod= 1
##$AUNM= <au_zg>
##$AUTOPOS= <>
##$BF1= 50.322709
##$BF2= 200.13
##$BF3= 50.322709
##$BF4= 500.13
##$BF5= 500.13
##$BF6= 500.13
##$BF7= 500.13
##$BF8= 500.13
##$BYTORDA= 1
##$CFDGTYP= 0
##$CFRGTYP= 5
##$CHEMSTR= <none>
##$CNST= (0..31)
1 1 145 1 1 1 1 1 1 1 1 1 1 1 1 1 1 1 1 1 1 1 1 1 1 1 1 1 1 1 1 1 
##$CPDPRG= <waltz16>
##$CPDPRG1= <>
##$CPDPRG2= <waltz16>
##$CPDPRG3= <>
##$CPDPRG4= <mlev>
##$CPDPRG5= <mlev>
##$CPDPRG6= <mlev>
##$CPDPRG7= <mlev>
##$CPDPRG8= <mlev>
##$CPDPRGB= <>
##$CPDPRGT= <>
##$D= (0..31)
$$ [...]
##$SUBNAM4= <"">
##$SUBNAM5= <"">
##$SUBNAM6= <"">
##$SUBNAM7= <"">
##$SUBNAM8= <"">
##$SUBNAM9= <"">
##$SW= 239.972175391363
##$SWIBOX= (0..15)
0 1 3 0 0 0 0 0 0 0 0 0 0 0 0 0 
##$SW_h= 12077.2946859903
##$TD= 32768
##$TD0= 1
##$TE= 0
##$TE2= 300
##$TE3= 300
##$TEG= 300
##$TL= (0..7)
120 120 120 120 120 120 120 120 
##$TP= (0..7)
150 150 150 150 150 150 150 150 
##$TP07= 0
##$TPNAME0= <>
##$TPNAME1= <>
##$TPNAME2= <>
##$TPNAME3= <>
##$TPNAME4= <>
##$TPNAME5= <>
##$TPNAME6= <>
##$TPNAME7= <>
##$TPOAL= (0..7)
0.5 0.5 0.5 0.5 0.5 0.5 0.5 0.5 
##$TPOFFS= (0..7)
0 0 0 0 0 0 0 0 
##$TUNHIN= 0
##$TUNHOUT= 0
##$TUNXOUT= 0
##$USERA1= <user>
##$USERA2= <user>
##$USERA3= <user>
##$USERA4= <user>
##$USERA5= <user>
##$V9= 5
##$VALIST= <valist>
##$VCLIST= <CCCCCCCCCCCCCCC>
##$VD= 0
##$VDLIST= <DDDDDDDDDDDDDDD>
##$VPLIST= <PPPPPPPPPPPPPPP>
##$VTLIST= <TTTTTTTTTTTTTTT>
##$WBST= 1024
##$WBSW= 4
##$XGAIN= (0..3)
0 0 0 0 
##$XL= 0
##$YL= 0
##$YMAX_a= 146022407
##$YMIN_a= -55580062
##$ZGOPTNS= <>
##$ZL1= 120
##$ZL2= 120
##$ZL3= 120
##$ZL4= 120
##$ABSF1= 222.6606
##$ABSF2= -17.33621
##$ABSG= 5
##$ABSL= 3
##$ALPHA= 0
##$AQORDER= 0
##$ASSFAC= 0
##$ASSFACI= 0
##$ASSFACX= 0
##$ASSWID= 0
##$AUNMP= <proc_1d>
##$AZFE= 0.1
##$AZFW= 0.5
##$BCFW= 0
##$BC_mod= 2
##$BYTORDP= 0
##$COROFFS= 0
##$CY= -3
##$DATMOD= 1
##$DC= 0
##$DFILT= <>
##$DTYPP= 0
##$F1P= 0
##$F2P= 0
##$FCOR= 0.5
##$FTSIZE= 32768
##$FT_mod= 6
##$GAMMA= 0
##$GB= 0
##$INTBC= 1
##$INTSCL= 4.134877e-10
##$ISEN= 128
##$LB= 1
##$LEV0= 0
##$LPBIN= 0
##$MAXI= 10000
##$MC2= 0
##$MEAN= 0
##$ME_mod= 0
##$MI= 0.1934396
##$NCOEF= 0
##$NC_proc= 2
##$NLEV= 6
##$NOISF1= 120.0001
##$NOISF2= 80.00006
##$NSP= 0
##$NTH_PI= 0
##$NZP= 0
##$OFFSET= 222.6606
##$PC= 1.4
##$PHC0= -278.0625
##$PHC1= 32.76242
##$PH_mod= 1
##$PKNL= yes
##$PPARMOD= 0
##$PSCAL= 0
##$PSIGN= 0
##$REVERSE= no
##$SF= 50.322729756361
##$SI= 32768
##$SIGF1= 140
##$SIGF2= 120
##$SINO= 11.81781
##$SIOLD= 32768
##$SREGLST= <13C.CDCl3>
##$SSB= 0
##$STSI= 32768
##$STSR= 0
##$SW_p= 12077.2946859903
##$SYMM= 0
##$S_DEV= 0
##$TDeff= 32768
##$TDoff= 0
##$TI= <>
##$TILT= no
##$TM1= 0
##$TM2= 0
##$TOPLEV= 0
##$USERP1= <user>
##$USERP2= <user>
##$USERP3= <user>
##$USERP4= <user>
##$USERP5= <user>
##$WDW= 1
##$XDIM= 32768
##$YMAX_p= 372795507
##$YMIN_p= -2630246
$$ End of Bruker specific parameters
$$ ---------------------------------
##NTUPLES= NMR SPECTRUM
##VAR_NAME=  FREQUENCY,     SPECTRUM/REAL,   SPECTRUM/IMAG
##SYMBOL=    X,             R,               I
##VAR_TYPE=  INDEPENDENT,   DEPENDENT,       DEPENDENT
##VAR_FORM=  AFFN,          ASDF,            ASDF
##VAR_DIM=   32768,         32768,           32768
##UNITS=     HZ,            ARBITRARY UNITS, ARBITRARY UNITS
##FACTOR=    0.368581032318806, 1,           1
##FIRST=     11204.8891385315, 0,            0
##LAST=      -872.405547458802, 0,           0
##MIN=       -872.405547458802, -2630246,    0
##MAX=       11204.8891385315, 372795507,    0
$$ Real data points
##PAGE= N=1
##DATA TABLE= (X++(R..R)), XYDATA
$$ [...]
14227 -559998 -444824 -680331 -662765 -692866 -716797 -779435 -611226 -395917 -254006 -118463
14217 -118463 -20101 -130959 -203119 -252560 -363537 -535357 -616127 -369382 -395831 -766618
14207 -766618 -736817 -75851 -22708 -115097 117536 553859 1045180 1053839 878911 527643
14197 527643 119806 -280991 -339014 -640520 -855822 -976923 -700743 -556038 -648477 -878529
14187 -878529 -877908 -465805 -186105 -72775 -79764 -59996 -276942 -722979 -883248 -404836 -47488
14176 -47488 -125023 -107355 -60861 -180637 -408820 -617715 -509576 -359330 -250884 -115699
14166 -115699 2211 106730 241311 107941 -12554 85546 538379 869774 444755 47990
14156 47990 -157598 -99238 315752 -203235 -1197867 -1522126 -1651683 -1205546 -98976 429604
14146 429604 -44107 -517456 -605732 -909570 -1132141 -1246262 -1118794 -742038 -187592 181022
14136 181022 259787 -26109 -441134 -633442 -512456 -572163 -1016143 -689596 -523027 -919763
14126 -919763 -1010324 -782824 -375356 191944 437265 32584 -548226 -953663 -1107049 -1069254
14116 -1069254 -786062 -277993 176305 88378 -231782 -499117 -761779 -878033 -672077 12840
14106 12840 578240 1128374 1500590 952806 40483 -825360 -1374574 -1401060 -1039560 -423823
14096 -423823 60157 170899 -276632 -415631 -442581 -543061 -717449 -362536 181623 46738
14086 46738 -279895 -200960 -66902 -8803 -58587 -351325 -374743 -176798 54073 187430
14076 187430 566299 586183 61618 -340479 -435498 -378793 -350965 -596222 -707382 -798246
14066 -798246 -1165347 -1232060 -791858 27568 298687 107371 126976 318998 446460 262963
14056 262963 -3335 -70070 -340479 -614975 -374900 -235920 -300102 -533933 -1200496 -1821143
14046 -1821143 -1778132 -1525554 -1322374 -1187267 -811341 -132681 262536 590128 618877 353390
14036 353390 84526 -126697 -475916 -758344 -901602 -800786 -582025 -580469 -564422 -607733
14026 -607733 -228587 -67140 -372651 -616993 -606156 -376215 -30917 403259 258367 55344
14016 55344 192392 133644 -92914 -222573 -352972 -665108 -436514 213341 588488 361343
14006 361343 -544626 -1282588 -1446652 -1538669 -1389278 -883896 -585449 -331726 -226226 -187063
13996 -187063 -550594 -1010500 -1210330 -1466101 -1261924 -782230 -570438 -624929 -550826 -298327
13986 -298327 -193328 119709 436797 689908 844449 622227 -322139 -1117514 -896626 -509659
13976 -509659 -424549 -142584 154034 33755 -97549 -438377 -779951 -744225 -692481 -831554
13966 -831554 -945103 -923821 -853889 -677328 -222686 145263 -74315 -243172 -102579 -423859
13956 -423859 -818812 -933071 -1002258 -1346857 -1320531 -778690 -136837 26985 42531 219850
13946 219850 385193 288818 40792 -397400 -691775 -921587 -1052843 -1038961 -1029954 -946025
13936 -946025 -560587 -253044 57691 446127 365137 284840 186278 32018 356820 545627
13926 545627 384864 631565 673018 415187 340208 148776 -159702 -200852 -234336 -530128
13916 -530128 -463636 -73350 136003 67425 -71904 -96144 142086 197254 253346 241207 68809
13905 68809 38738 -10305 -255567 -151452 -111971 -202016 55188 176298 257853 289913 125167
13894 125167 -270151 -377069 -619466 -912353 -637198 -408498 -342681 -75931 142199 186594
13884 186594 279387 49827 16622 324205 135142 -328245 -766998 -1253785 -1712757 -1752923
13874 -1752923 -1040541 -241992 -3650 194942 41678 -634223 -732323 -189644 298385 593337
13864 593337 640171 562875 481822 629568 587530 106262 -318146 -241686 149334 250050
13854 250050 216795 202368 76747 -288130 -569682 -626151 -638071 -414673 -248760 -378914
13844 -378914 -486478 -504369 -388476 -62656 346934 310737 362356 488400 734598 856477
13834 856477 340420 107276 104310 48617 -108177 -498599 -617805 -475423 -290198 -149521
13824 -149521 167464 601530 649714 528854 330673 -176167 -392698 -375932 -700291 -584813
13814 -584813 -614487 -1092932 -1484217 -1414256 -898216 -586438 -739810 -845362 -328477 635283
13804 635283 1165443 1173702 898651 330428 -356971 -441427 -157722 -96473 -351458 -846843
13794 -846843 -1217724 -1561354 -1667014 -1416057 -776293 160957 699899 875096 800331 421501
13784 421501 256713 463431 330703 269761 81488 250865 550983 613221 127033 -352744
13774 -352744 -598242 -502743 -239706 -132358 -92666 -215159 -185503 88526 246203 32200
13764 32200 -70196 -42207 143665 249605 249165 131868 286454 620716 463873 -87112
13754 -87112 -500770 -1026993 -1211800 -1123061 -713030 -151317 45874 296053 536624 418461
13744 418461 84154 -75569 -136213 -152047 -524508 -1017479 -741886 -3176 214704 -87147
13734 -87147 -437473 -886065 -1041173 -779480 -554345 -195330 434508 958221 990545 630797
13724 630797 217098 328635 577374 609066 397509 269626 534172 587050 597304 471205
13714 471205 -51969 -188983 -66508 -154334 -257548 -411630 -516611 -951296 -1209728 -1106909
13704 -1106909 -737489 -290583 -198161 -279858 -252439 -59433 342907 509410 620096 971062
13694 971062 1215677 1037548 879563 767922 508698 572038 794403 862421 697115 323672
13684 323672 270248 349798 337771 105959 -236819 -47224 340471 440160 212650 510761
13674 510761 795914 395695 150680 -107211 -228372 -5156 395320 602275 530206 348036
13664 348036 174815 155727 302100 372197 205624 104607 52829 -3312 178664 592147
13654 592147 485754 521079 700991 810031 647519 -142929 -700744 -845218 -919678 -769562
13644 -769562 -599700 -505669 76054 529602 315810 -282187 -452552 -324647 -290665 -92945
13634 -92945 306673 389843 156695 -76987 -290822 -340054 -255459 -415780 -345508 -66390
13624 -66390 245314 600023 686354 722357 638355 530126 594662 854975 742921 209713
13614 209713 -146348 -318143 -632065 -622098 -675180 -493914 -255256 -110382 -195186 -244752
13604 -244752 -347790 -543450 -486479 -652242 -564549 -490085 -480365 -150553 237299 194622 -29335
13593 -29335 25988 -128099 -304688 -427336 -887471 -1140491 -948649 -871257 -463947 -141990
13583 -141990 -370540 -622378 -417439 -458676 -1068625 -1249585 -993582 -571238 -216505 -765035
13573 -765035 -1495264 -1675197 -1400421 -979070 -865848 -929487 -968106 -621648 -250882 -341359
13563 -341359 -361483 91645 645187 1008746 661594 328641 157217 127493 531494 441037
13553 441037 -85943 -415685 -149764 146640 38978 -104521 -63723 -115558 57998 431843
13543 431843 684720 575194 284539 478539 285406 -249774 -115091 243848 213317 29155
13533 29155 -142492 20012 13924 -431473 -341395 329883 344663 169616 483507 847900
13523 847900 880528 541194 198558 17378 -156529 -283348 -385038 -312274 -658897 -845899
13513 -845899 -542538 -209957 -40913 142467 224021 121188 319942 426837 73739 -418151
13503 -418151 -357805 388626 710934 373319 366348 148509 -152565 51422 204427 638765
13493 638765 870310 437809 -55281 -15051 425378 667611 706258 388712 -250085 -458702
13483 -458702 -230215 119408 338019 348773 362845 921944 1476437 1609856 1513384 1170060
13473 1170060 1087683 993006 931492 956309 1111612 1041833 667042 830798 1136216 1600080
13463 1600080 1941468 1649097 1056720 684864 305185 203541 5161 -49064 -215236 -152314
13453 -152314 276849 375635 39993 -106157 466947 624510 695733 681548 572780 607521
13443 607521 842851 618130 350957 69543 -182407 -265968 -88049 -87105 -116033 265108
13433 265108 355565 -4221 -265270 -227659 188431 564024 948963 1116012 962076 313303
13423 313303 -98340 -65506 449359 1213987 1407896 1290555 896209 506559 49959 -298369
13413 -298369 -418743 -303559 -526413 -631472 -503738 -462073 -486569 -770033 -1010103 -896792
13403 -896792 -672723 -525297 -604072 -457128 -4049 220106 173266 219144 313265 360020
13393 360020 257323 410096 829552 1258490 1158357 1237957 1464202 1704786 2075180 1916134
13383 1916134 1431746 1008137 842776 963497 1264024 1325443 952014 262060 -367391 -961889
13373 -961889 -1594866 -1554698 -1042070 -857204 -807914 -766590 -795610 -1093092 -1246415 -1115069
13363 -1115069 -527301 48022 -222745 -715307 -955225 -956178 -732902 -460913 8365 495018
13353 495018 830415 979001 1084068 899134 1223688 1701281 1815798 1610042 1266064 684330
13343 684330 -140452 -592378 -744482 -444719 -126396 -169479 41980 153987 138399 92910
13333 92910 -201545 29082 608883 529353 161615 208748 593815 1015952 1228345 1261680
13323 1261680 807186 743492 767911 832893 487290 59411 -72461 -84002 -113351 93915
13313 93915 292052 489156 745934 564733 420521 69088 -494490 -148080 429903 459875
13303 459875 525987 812502 828002 685712 1023607 1083195 632766 510874 594373 766529
13293 766529 1130355 1231356 1308093 1049633 746091 473385 219978 -114805 -296011 -131024
13283 -131024 -197597 -227610 -273552 -387463 -446779 -472316 -629992 -464480 -42530 241069
13273 241069 433886 727542 1185725 1312974 1091927 661922 550556 553800 755211 1194433
13263 1194433 1379804 1540836 1533980 1035993 560004 296894 172523 196515 292343 -27530
13253 -27530 -142923 314178 874881 973340 843570 665113 436118 644527 1066279 1454375
13243 1454375 1737557 1888728 2014198 1956273 1681397 1289324 1336366 1265900 754859 385008
13233 385008 550867 671146 970602 1227645 1351692 1415703 1037597 230117 -316074 -362116
13223 -362116 -283866 -254058 52201 769028 1419835 1833187 2065095 1959350 1823040 1364739
13213 1364739 844418 743667 835273 778262 179446 -93200 171556 325372 373432 397123
13203 397123 423214 352951 9256 -69564 149924 206374 251739 443925 273595 85257
13193 85257 193509 516352 726322 992220 849056 833152 1186444 1387947 1414011 1463265
13183 1463265 1440411 1299155 1420560 1449020 1115565 659592 531242 582916 685889 877855
13173 877855 968325 1195727 1181881 1149221 873782 851428 1051146 842954 777229 882394
13163 882394 559011 926811 1721382 1920199 1856555 1680029 1238336 876219 827715 771853
13153 771853 549439 164038 -5919 198934 413303 543091 928176 1376461 1592048 1121574
13143 1121574 525076 354651 721901 1404431 1752936 1966905 1904218 1789340 2071465 1986824
13133 1986824 1431972 1489000 1735943 1942177 2610808 2750299 2142390 1807595 1963150 2063766
13123 2063766 1978130 1983511 2388102 2849665 2954043 2829785 2288319 1785723 2046609 2332267
13113 2332267 2083993 1560331 1453295 1725816 2455542 2934784 3129709 3264241 3392963
13104 3392963 3010383 2370112 1988012 1889496 1723084 1843513 2141832 2470304 2602142 3052597
13094 3052597 3573038 3804613 3819925 3600496 3142658 2652548 2382310 2674110 2895155 2728860
13084 2728860 2784473 2937926 3073352 3091791 2709348 2202344 1629246 1425150 1709887 1730798
13074 1730798 1638916 1914379 2371224 2300177 2132945 2422296 2992837 3194885 3152125 2872900
13064 2872900 3126345 3354759 3152685 2914844 2848624 2877578 2951537 2973468 3218905 3386576
13054 3386576 3510890 3337958 2883827 3028967 3441526 4057485 4698391 4547637 4101878
13045 4101878 3928674 4188396 4252548 3978383 4027452 4511211 4916277 5505352 5951622 5941764
13035 5941764 5886883 6249451 6746648 7172799 7341521 7179480 7355361 7742239 7985605 8121080
13025 8121080 8325617 8657026 9503252 9883824 9993511 10507743 10949650 11687907 12718727
13016 12718727 13534032 14089604 14942145 16301693 18041422 19816764 21638567 23738579
13008 23738579 26090879 28163254 30555702 33466073 36882283 41113673 45969175 51657423
13000 51657423 58252982 65305103 73554549 83696036 96128098 111427871 130629911
12993 130629911 155245767 187439696 228321645 275379652 319006616 341963454 331036215
12986 331036215 290573428 238706898 190695558 152316665 123182979 101138668 84554800
12979 84554800 71726621 61426345 53285455 46877935 41773644 37566662 34137826 30659030
12971 30659030 27633079 24987312 22429052 20490601 18786900 17129119 15260168 13700188
12963 13700188 12868867 12512941 11956016 11528721 10992196 10725337 10857297 10954352 10656936
12954 10656936 10315909 10355982 10155639 9548112 9224147 9195596 9253840 9030379 8708101 8874342
12944 8874342 9654772 10184818 10809682 11248641 11701233 12587321 13599655 14109009 14132417
12935 14132417 14591462 15465845 16762612 18785375 21701887 24438942 26498010 27044524
12927 27044524 26376163 25346862 24710263 25111361 26116863 26944746 28282499 30349670 32891786
12918 32891786 35261526 38263882 42177570 46804271 52298687 58789777 66142158 74643657
12910 74643657 84907337 97370727 113098453 133396195 159475751 193249676 236124084
12903 236124084 285364247 329817240 350699117 334902890 289246746 234270837 185517477
12896 185517477 147510646 119183743 97902379 81728277 69695286 60500482 52888038
12889 52888038 46694562 41539737 37011791 32898845 29276832 25933865 22869721 20426195
12881 20426195 18596261 17185722 16423251 15892817 14891038 13670188 12697631 12071150 11653841
12872 11653841 11091491 10769983 10575697 10094278 9703883 9347790 8885984 8492811 8130449
12863 8130449 7758356 7683537 8058651 8161636 7883021 7916188 8247028 8101582 8337125 8587311
12853 8587311 8643345 8458973 8687840 9425380 9569916 9661485 10084588 10533938 11448889 12507890
12843 12507890 13020841 13657611 14375267 15320046 16599399 17738047 19174160 21383838 23356984
12834 23356984 24887123 26686899 28775869 31850753 35682659 40257056 45493636 51199156
12826 51199156 57732946 65207357 73953804 84301333 97353887 113579480 133822523
12819 133822523 160307062 194602842 237029152 284158179 324957374 341668842 323386416
12812 323386416 278171428 225388727 179204337 143184948 115527110 94669423 78941729
12805 78941729 66676439 57126148 49297613 43035275 37494331 33036104 29335139 26331513
12797 26331513 23439222 20518842 18130731 16331986 14665881 13488963 12543331 11293989
12789 11293989 9972583 8978721 8204287 7707241 7429381 6963027 6567141 6204634 5685595
12780 5685595 5129322 4618743 4491485 4455663 4278841 3746270 3138957 2228111 1382125 1042438
12770 1042438 927555 757445 767155 1101362 1496451 1858697 1933718 2061131 2141888 2022257
12760 2022257 1967677 1566699 841722 405172 455626 979720 1754138 2313195 2437904 2179871
12750 2179871 1881749 1723694 1197578 942207 772787 254494 -20629 466749 724056
12741 724056 473033 162 -183179 -272321 -477768 -530885 -621675 -382349 -206663 -408583
12731 -408583 -621167 -492146 -152904 302876 765505 1119410 966796 371028 -161991 -633528
12721 -633528 -743280 -521422 -543116 -752748 -643212 -76636 217520 170546 -4631 -81855
12711 -81855 -986 7373 330905 556696 577687 590395 25142 -288156 -148215 -241776 -234273
12700 -234273 -108156 3492 219543 158244 -120268 -44590 227477 548673 734912 744149
12690 744149 761469 709322 387824 -63005 -384565 -553903 -596495 -361761 -264247 -424639
12680 -424639 -259169 -87563 -261991 -331727 -348932 -620686 -962591 -801514 -1058813 -1333959
12670 -1333959 -1020123 -747855 -967555 -1184533 -1053026 -651921 -362490 -72621 -335936
12661 -335936 -1075231 -1295793 -1101140 -845483 -646120 -441922 -708097 -717332 -334808 -60776
12651 -60776 97229 226456 159703 70995 186636 619821 1111099 1178281 1133438 693495
12641 693495 454864 262125 -295612 -565705 -682352 -929002 -1016009 -713796 -103179 385122
12631 385122 615989 322900 153554 237554 -59931 -244806 -453571 -567712 -858254 -915578
12621 -915578 -957868 -941491 -686544 -620196 -519871 -333633 -601248 -669372 -506532 -298161
12611 -298161 -136626 -123640 17437 -210266 -516085 -472381 -461742 -674090 -895436 -996336
12601 -996336 -851999 -426565 -93964 35252 2916 223143 301615 -392364 -1096091 -1158935
12591 -1158935 -592549 -317474 -260076 -215793 -78602 297428 580453 566166 249780 -232076
12581 -232076 -887065 -1168496 -1262703 -1272053 -1084403 -886431 -1279348 -1318110 -867509 -442614
12571 -442614 83472 -70176 4157 400830 37070 -391521 -561553 -781314 -1107559 -1171249
12561 -1171249 -1192190 -867196 -35153 263875 -5169 -183622 -72958 123045 92991 -170819
12551 -170819 -391417 -407509 -277382 -482594 -539174 -307152 -326121 -485730 -403643 -349022
12541 -349022 -355730 -261751 -15391 73366 -16351 -154798 -333356 -894830 -1465639 -1442950 -1075325
12530 -1075325 -1010609 -1058429 -884289 -465215 -200749 114247 434274 766475 748947 434783
12520 434783 227114 360692 475212 320952 415891 694209 1049711 918044 773726 960782
12510 960782 1455225 1813967 2045403 1903851 1343351 726319 481039 753744 797515 227238
12500 227238 -534763 -1014098 -1129710 -1105559 -1017910 -463613 -190940 -106579 111027 44341
12490 44341 44294 264922 146309 143301 50694 -168542 -193526 -99867 -219880 -165198 -128505 -135113
12478 -135113 -417581 -595313 -609052 -856264 -873372 -713170 -204922 -100027 -533881 -1041024
12468 -1041024 -1225403 -741919 -458601 -476162 -713680 -952704 -1059179 -1171018 -1298975 -1008318
12458 -1008318 -429313 -567763 -856106 -1025604 -910113 -722184 -701660 -1061115 -1158865 -1256868
12448 -1256868 -1277072 -1024090 -205751 327300 209166 -124972 -325910 -192767 183773 380411
12438 380411 -31623 -711900 -1093773 -629443 -116188 -123546 -510701 -736349 -647406 -793040
12428 -793040 -1193823 -1337644 -1282367 -1023504 -688833 -522524 -995487 -1485812 -1706711 -1709226
12418 -1709226 -1584342 -1289250 -722547 -469337 -289974 -293281 -565810 -305882 347651 814099
12408 814099 1225870 1348831 832346 272093 -384793 -708877 -217166 290063 736069 944374
12398 944374 756267 434982 72740 -356330 -152113 -40749 -295292 -230641 -175404 -138362
12388 -138362 -273404 -589861 -858018 -768119 -503175 -343626 -499792 -708207 -859153 -589453
12378 -589453 -501662 -527322 -482213 -868753 -1392762 -1407207 -1052213 -778916 -561578 -332285
12368 -332285 -347598 -196641 -314570 -370657 -265967 -558049 -793732 -1249396 -1391100 -1115752
12358 -1115752 -718775 -483491 -276634 -133990 -86635 -453622 -717919 -472163 -323573 -258927
12348 -258927 14349 -55585 -663328 -1148009 -1391510 -1353906 -1296765 -1225692 -1084801 -1049837
12338 -1049837 -897613 -641820 -527645 -918842 -1050166 -1286618 -1313019 -1044080 -831399 -840287
12328 -840287 -955820 -983695 -959819 -863682 -519876 -463020 -734865 -733208 -582031 -413283 -311333
12317 -311333 -248958 -110360 68312 433136 463957 434147 148017 -141562 -487991 -628796
12307 -628796 -356485 114452 499026 306281 47264 -257531 -558333 -849040 -1099968 -1327422
12297 -1327422 -1303776 -950063 -225484 618260 715326 400444 75803 111722 262053 374291
12287 374291 302513 393079 878712 1451736 1605665 1450110 1042908 390770 156588 -57333
12277 -57333 206504 813688 922637 352824 -336493 -596849 -289911 -101302 -80358 481251
12267 481251 876093 448420 -4401 170512 390586 307574 147463 75463 -274767 -275419
12257 -275419 49641 343193 299308 -265089 -573924 -465139 -710917 -1158512 -1300929 -1235798
12247 -1235798 -559423 -114181 -63878 -329519 -178211 -59928 -174705 -7331 -16681 62416
12237 62416 339006 313298 48471 -273443 -611823 -843252 -608125 -556191 -700884 -636233
12227 -636233 -491328 -267881 -430643 -882293 -1214103 -1088234 -454079 -310060 -376312 -558734
12217 -558734 -537351 -643711 -617571 220102 268561 -205640 -291486 -171650 241732 684192
12207 684192 926173 608504 -274 -91259 173205 40360 13421 117497 -24318 -415294
12197 -415294 -439368 -62514 -148172 -691964 -1193382 -1090463 -827837 -1088006 -1268856 -1144283
12187 -1144283 -935385 -668391 -670066 -659831 -562993 -489482 -506211 -504379 -382183 -95159 10011
12176 10011 -193750 -481993 -620385 -270323 -233953 -275391 -207779 -176385 -362402 -607644
12166 -607644 -859000 -707754 -486886 -104415 231231 -210177 -700539 -711425 -314973 -253756
12156 -253756 -525744 -466839 -178013 272266 357118 -211583 -447729 -650326 -917454 -1219891
12146 -1219891 -1524762 -1454882 -1136833 -781806 -786560 -930557 -615261 -454663 -533653 -240625
12136 -240625 237128 220934 -229864 -229795 -3160 40575 -83867 500708 1080047 716530 -308454
12125 -308454 -729505 -786131 -1262418 -954710 -285949 152295 235226 165725 334390 621225
12115 621225 232845 -48715 307149 413384 99859 139360 342916 331974 380736 143190
12105 143190 -57149 94867 375024 519281 175227 -403846 -679676 -294797 26126 -49498
12095 -49498 -129886 -277679 -306340 -124307 2282 185582 151532 -107696 -322624 -362780
12085 -362780 -566085 -719037 -157125 179522 -413920 -826157 -959133 -1215366 -1551914 -1527708
12075 -1527708 -1454974 -1507110 -1437261 -1271105 -1267528 -1096030 -750659 -743392 -989971 -1037452 -744850
12064 -744850 -432196 -236171 -365351 -604921 -892806 -948851 -769794 -501140 -375844 -311230
12054 -311230 -302776 -316077 -181369 -67338 -7849 -127699 -527310 -824111 -841578 -853848 -1051186
12043 -1051186 -1136798 -1219016 -1072605 -602844 -145616 303466 628972 645189 290637 -435617
12033 -435617 -635502 -598132 -841578 -890306 -528275 -348074 -468489 -283108 -37695 -77077
12023 -77077 -228617 -628642 -626105 -593925 -380830 -130226 -120567 -382288 -975805 -1228964 -930262
12012 -930262 -622825 -501897 -524097 -442282 -129845 -273202 -16653 403158 480584 561261
12002 561261 535120 372422 69817 -22428 -189476 -222039 -172424 -211384 -312611 -381174 -352208
11991 -352208 -820110 -1233858 -1029491 -1128983 -1468208 -1816318 -2255736 -2098769 -1545784 -1383179
11981 -1383179 -1834638 -1922921 -1359663 -984702 -898677 -886298 -967564 -657567 -238103 522843
11971 522843 759351 -200131 -1137126 -1075853 -685576 -409339 -461668 -684980 -915939 -835882
11961 -835882 -556400 -561478 -610550 -165051 355569 213234 -182325 -103642 296251 136543
11951 136543 -157411 -322105 -696319 -1056102 -769859 -262241 232234 472520 698412 934969
11941 934969 1312950 1376164 963352 875780 660465 601921 760464 906356 1021497 1118630
11931 1118630 918183 372334 -109274 -353732 127779 737405 555165 322796 507958
11922 507958 616255 864450 809074 154152 -441997 -841747 -1137471 -837670 -383732 -86426
11912 -86426 -118697 -275319 -396504 -166074 212124 102207 -6480 -121782 176828 502216
11902 502216 306994 86978 234424 160027 499506 625332 423922 34190 -190917 -312126
11892 -312126 -330446 -126771 -162286 -435637 -172551 246108 237383 -381390 -762606 -537350
11882 -537350 -303628 -189639 -112647 34706 361219 468934 421627 209640 114800 -116462
11872 -116462 -260144 -148872 43513 508667 691827 352460 39434 -30257 15696 -165091
11862 -165091 -432536 -121649 163950 641842 1139157 1250041 1203422 1317696 1229720 821230
11852 821230 230547 138460 272312 -100418 -348030 -290151 -330141 -214182 77647 -81213
11842 -81213 -306460 -785421 -728018 -292831 285252 718080 809390 770949 653739 449199
11832 449199 264980 159371 311655 397284 206080 -100228 -421226 -333997 -56293 130983
11822 130983 -118015 -410575 -261027 163002 247946 -262363 -875770 -718814 -521256 -539178
11812 -539178 -534648 -487131 -509396 -573706 -664386 -801920 -821219 -389748 -19393 95693 -19237
11801 -19237 198628 771366 1069958 589108 -449718 -1291587 -1401254 -1075974 -445392 -56707
11791 -56707 -58219 -229326 -459587 -267578 252210 1209545 1341974 500768 64215 309691
11781 309691 779299 393782 98823 -34157 -181493 -245767 91636 677186 672406 907756
11771 907756 1354978 1583030 1591430 1310379 1279965 961729 685123 790598 941673 1132275
11761 1132275 1196597 1096557 1161395 1435222 1301551 861674 761138 727884 339624 -139448
11751 -139448 -233907 -109688 -155620 -123671 -46378 -270677 -33636 355432 465303 609041
11741 609041 809716 752987 644153 842819 1653375 2058520 1011118 56783 -961423
11732 -961423 -1529602 -884289 -173009 -180433 -557323 -757193 -716008 -581982 -928240 -1074225
11722 -1074225 -845704 -832868 -915285 -1139374 -1422929 -1611571 -1350335 -1007028 -491165 -341399
11712 -341399 -511730 -445871 -186714 109044 -40806 -231104 -143112 79172 200081 -56266
11702 -56266 -391317 -347719 -328877 99592 409718 500154 1023679 1024406 420845 -192483 -304422
11691 -304422 -182153 -57009 317852 325666 -246627 -383469 57644 367485 54177 -561065
11681 -561065 -1006759 -916057 -550969 -28384 386959 281970 -173980 -340286 -124232 -134745
11671 -134745 -279776 -299316 18671 116982 193054 458915 338844 427338 831046 673327
11661 673327 63776 -317285 -190386 -105940 -237079 -143891 -81351 -416523 -1045686 -1019749
11651 -1019749 -814607 -833440 -724646 -625439 -821226 -1167010 -939466 -831390 -1108647 -915988
11641 -915988 -436131 -242618 223158 87348 -474425 -407749 24676 127290 -294037 -868312
11631 -868312 -1090038 -1108664 -1131461 -877772 -294088 402395 624979 349567 341728 499269
11621 499269 453813 329324 127850 -247692 -618589 -721422 -317566 -22099 336029 710934
11611 710934 974332 823407 355553 33885 -340551 -609585 -497214 96495 214910 -109613
11601 -109613 -471794 -471635 -70335 132954 -31690 -103966 -436295 -501779 -265441 -23559
11591 -23559 133513 -86615 -546621 -683762 -611953 -429035 -446746 -397189 -418783 -658223
11581 -658223 -671147 -405896 -4666 366430 360516 236387 212777 265192 461769 661391
11571 661391 717903 341461 -234443 -206609 62993 156620 271086 46954 -47416 -37214
11561 -37214 222787 96820 -103420 47669 -210445 -740848 -1345105 -1575355 -1393536 -1437277
11551 -1437277 -1670114 -1818323 -1644868 -1176655 -738182 -524303 -81985 122471 84121 108573
11541 108573 426489 648981 501497 233710 54682 151689 320757 477359 441740 585684
11531 585684 463286 37468 -142345 -536135 -533659 -342185 -417181 -459043 -538303 -664977
11521 -664977 -32783 872565 700596 -161593 -978823 -1252670 -816929 -394840 -519713 -1177419
11511 -1177419 -1529262 -1300361 -867652 -647642 -381821 -100943 -37609 75139 72262 180375
11501 180375 202955 106747 -30771 34252 25283 -1209 -31831 -410059 -1077865 -1168256 -761524
11490 -761524 -230262 -560489 -1140983 -1396636 -1566497 -1009580 -405655 -355314 -474653 -503457
11480 -503457 -349602 -340418 -636322 -1101610 -1116341 -596460 -12951 271540 65441 40178
11470 40178 -23265 -25085 -265953 -492645 -475903 -432802 -60594 -46457 -257004 -95597 292556
11459 292556 311029 -128891 -635209 -843443 -742389 -725975 -746838 -583359 -670946 -955684
11449 -955684 -692551 -556734 -379567 -190746 -62534 -76161 38520 -13950 -190012 -32652
11439 -32652 -184562 -443458 96566 499306 -175603 -328114 -227050 -257658 -454707 -92614
11429 -92614 275775 260865 384850 267341 -321065 -947355 -1343259 -1368474 -1237852 -1165008
11419 -1165008 -1233616 -1377525 -1262785 -713094 -471819 -373567 -206391 -174184 -242542 3300
11409 3300 305483 -159522 -705746 -758670 -648016 -500862 -356220 -569073 -451756 -159540
11399 -159540 -86523 -140365 -88734 -201895 -552148 -1025701 -1233744 -1037908 -829236 -391825
11389 -391825 -370505 -770088 -827355 -766841 -799549 -910045 -1116578 -1213862 -1145861 -931739 -608744
11378 -608744 -288489 44928 15685 -95468 -432995 -558227 -593489 -624437 -418464 -197911
11368 -197911 31949 -23076 -62197 -296580 -174173 89460 148599 439829 927583 1106253
11358 1106253 841562 763014 978696 1209196 1297272 944962 386269 114427 -405147 -1224977
11348 -1224977 -1501849 -1203225 -917689 -693011 -396039 -262052 -249322 -248562 -35024 294573
11338 294573 494748 470692 206060 -146584 -326461 -435560 -667157 -700541 -716616 -625584
11328 -625584 -493858 -587291 -441834 -54419 203962 124761 30929 508162 1051913 1136899
11318 1136899 842762 657118 520876 49987 189971 696609 664632 618354 681755 270690
11308 270690 -425595 -531319 -522503 -504291 -358438 -61659 192120 117722 -150613 -842773
11298 -842773 -1088455 -607180 -478534 -580758 -484094 -342011 -203960 -243044 -478230 -386994
11288 -386994 -361013 -600834 -592964 -96763 -154272 -587021 -419647 -162641 269371 730185
11278 730185 624464 204310 267033 735312 792772 300328 -28748 -148802 135218 283963
11268 283963 333426 516641 261932 90349 338570 422405 523031 738449 814997 503375
11258 503375 -91640 -467533 -266180 -45753 -102626 -191110 -493629 -706251 -1027056 -1451805
11248 -1451805 -1621571 -1846403 -1733462 -1566177 -1465341 -1266176 -1257095 -1288405 -1139246 -765920
11238 -765920 -571334 -663257 -700128 -751771 -800503 -580853 -533428 -689303 -648964 -511157 -567383
11227 -567383 -793154 -978719 -836487 -592595 -723587 -925088 -934408 -777317 -739407 -808514
11217 -808514 -697521 -824595 -990312 -1039019 -795946 -629551 -517918 -519444 -376479 -366944
11207 -366944 -728057 -767147 -607342 -738828 -1148886 -1369783 -1196511 -732137 -562250 -322930
11197 -322930 -207514 219761 893242 1185374 898332 184508 93350 693902 757014 437431
11187 437431 -32821 -456689 -666102 -676815 -425673 -706416 -1068418 -902408 -973994 -1641268
11177 -1641268 -2173231 -2039344 -2096417 -1999652 -1256191 -856607 -633583 -765326 -1084248 -1235452
11167 -1235452 -708386 118646 589005 706693 499027 281530 359949 208847 -374783 -677870
11157 -677870 -503129 -251094 -324983 -708683 -614271 -394558 -323831 -341602 -375636 -446064 -856586
11146 -856586 -913659 -463455 244296 1006407 1134045 971287 736619 588279 444351 130880
11136 130880 -118755 18027 -49409 -151973 -466294 -732121 -414524 448757 937650 665507
11126 665507 544164 493938 307740 103518 37123 51608 86761 312883 866587 1158245
11116 1158245 965883 603761 241030 320010 845371 978158 831735 1057984 1213886 1053964
11106 1053964 799638 368656 497366 605210 393381 265695 520095 397049 188243
11097 188243 265498 390077 470465 395693 227940 162094 342354 458134 240079 -133186
11087 -133186 -642866 -1299441 -1200031 -367152 154139 390103 390710 616764 312795 -247570
11077 -247570 -52399 67464 -63703 -22888 46402 -35470 166408 217708 -261223 -650238
11067 -650238 -762594 -631601 -406552 -376880 -124646 87494 222744 13025 -95804 203638
11057 203638 573488 914273 1095757 973570 820475 451287 90187 -195145 -531573 -671174
11047 -671174 -578111 -275983 53485 67491 -24805 78626 260196 346424 168627 -107461
11037 -107461 175899 164963 -19124 57394 216850 237744 225789 -45978 -242131 -506830
11027 -506830 -557086 -487657 -520294 -1033843 -1057564 -573701 -261514 108650 170635 592406
11017 592406 781684 495925 -501628 -1007486 -899008 -782756 -545568 -609722 -510275 -51961
11007 -51961 -212832 -727968 -898228 -824262 -487066 94256 454202 390300 -193065 -590331
10997 -590331 -630313 -316228 113148 162431 380713 92211 -378760 -895678 -937656 -919045
10987 -919045 -693944 -257053 -336274 -208109 -109662 191407 292468 43296 -232851 -293469
10977 -293469 -87369 381392 663178 740195 535845 393858 120301 -296815 -351985 161024
10967 161024 373143 134317 -6124 -52362 -69605 -31720 15370 25490 -34417 237980 383504
10956 383504 494113 328044 330484 469740 286464 324746 457343 421788 639994 412449
10946 412449 56855 210510 629997 1084851 1115918 774470 617119 723897 930876 764343
10936 764343 496788 61661 -572448 -963405 -891299 -380511 -473737 -495479 -150041 -213006
10926 -213006 -249579 -141147 -487514 -317241 334832 385910 -69705 -679341 -1144915 -1274115
10916 -1274115 -1239671 -897914 -139748 106962 15907 120267 226619 270152 262641 269921 398693
10905 398693 173607 39101 482145 858467 755762 641448 670488 341381 282176 645341
10895 645341 784882 678751 331122 53526 336544 474930 634771 522454 32229 -385874
10885 -385874 -297236 119680 236380 226546 729625 1247805 1499321 1141805 783647 756678
10875 756678 1089323 1583553 1607300 1120015 837338 1133942 1374045 1234818 1135689 634530
10865 634530 -167525 -471207 -410907 -329816 92884 486661 684291 708924 666149 845624
10855 845624 1233809 1326806 1290531 1673239 1699080 1365434 1055985 796199 1008962 1441758
10845 1441758 2085686 2851140 3335308 3147475 2683363 2624643 2645663 2782217 2804179 2761650
10835 2761650 2992267 3016792 2658390 2620143 3021002 3507625 3842516 4259206 4393619 4767157
10825 4767157 5200365 5723817 6361783 7313587 8132524 9161211 10562791 11657275 13060559
10816 13060559 15040640 17931907 21281853 25098257 29562955 34755287 41642423 50700242
10808 50700242 61937707 76589626 95774900 120151349 149139879 175887158 183993314
10801 183993314 165049641 132993162 102872831 79899792 63589107 51435698 42247251
10794 42247251 35057231 29484792 25324846 21535318 18018721 15552400 13366204 11640485
10786 11640485 10623081 9421496 8285061 7657759 6714631 5663947 5058468 4583800 4000202
10777 4000202 3801922 3743136 3358110 2998977 2903646 2601281 2172738 2126148 2154530 1835201
10767 1835201 1580824 1692232 1983480 2152068 2135941 1983160 1577762 1209200 1001905 873448
10757 873448 743844 805792 588371 313197 487176 415874 -51422 -252950 -92230 68667
10747 68667 29058 149068 289327 271235 64455 125822 525954 559697 203520 617167
10737 617167 1222143 1220642 524283 555 449590 1066798 1242176 1588283 2154924 2626183
10727 2626183 2529554 1735865 666416 -318197 -1098373 -1096819 -449500 130148 604057 864773
10717 864773 840964 699675 447550 432845 571668 788592 393913 -338107 -813895 -682189
10707 -682189 -459774 -446142 -419220 -131757 497236 1010156 1403910 1532567 1753276 1619856
10697 1619856 1315503 1133207 784720 574708 562182 705760 833395 715877 506963 272537
10687 272537 131881 120211 217490 385501 692876 793361 329243 -148005 -203562 -770302
10677 -770302 -1095919 -1049170 -1257956 -1300784 -1434523 -1524270 -1590245 -1967001 -1745804 -1380323
10667 -1380323 -920877 -420773 28918 306885 227779 90431 -256034 -558930 -898321 -1094003
10657 -1094003 -976283 -754546 -236789 -16485 -380856 -624875 -357355 -6225 326100
10648 326100 432918 80444 -367944 -424889 -487368 -355374 195537 513608 591301 573749
10638 573749 567827 499607 246297 88090 -71895 -502111 -707008 -468938 -128299 -3954
10628 -3954 -117028 196383 38941 -774078 -902639 -777726 -759950 -348977 170063 254750
10618 254750 313648 685445 615661 491616 458579 -41251 -538926 -537035 -524308 -371012 -247134
10607 -247134 -82878 344203 499859 426938 448524 561275 503321 300678 262687 105521
10597 105521 -49142 242208 560520 484504 230893 176022 225983 170082 227594 659802
10587 659802 984875 939987 704441 607079 253829 -590946 -1236207 -1487474 -1143828 -937806
10577 -937806 -958551 -635112 -272017 -227027 -378818 -187554 8884 -325341 -753944 -761582
10567 -761582 -626915 -664007 -782234 -1026892 -1129120 -1365653 -1303312 -884332 -767324 -604191
10557 -604191 -516400 -625416 -768107 -842250 -769973 -634761 -127502 454482 424879 258365
10547 258365 -18581 -76326 75266 150402 137458 -70637 -323810 -649807 -818524 -617030
10537 -617030 -284202 -157625 125566 -3447 -254435 -312281 -290129 -55110 274534 329652
10527 329652 321568 86202 -175328 -373028 -14403 332508 179598 61259 101896 332754
10517 332754 531969 156660 -401552 -357431 426474 732177 384337 448500 634502 703437
10507 703437 654959 631320 647348 369002 -73965 70489 387629 371530 -6188 -395244
10497 -395244 -523537 -649865 -549406 -333636 -75479 91295 75333 -193088 -496051 -398008
10487 -398008 73751 268774 141676 104931 135434 385715 384665 -106561 -531072 -708159
10477 -708159 -543408 -152558 392937 564678 446164 372562 186374 -38519 -250695 -320770
10467 -320770 -463783 -407544 62943 238297 165283 522639 197401 -564596 -1172785 -1099691
10457 -1099691 -812076 -398128 -282829 -623254 -792279 -1048887 -905477 -405927 101613
10448 101613 381374 458259 342966 -126043 -436198 -32586 60654 -237926 -389589 -763488
10438 -763488 -1161290 -1045605 -659886 -501071 -478312 -580393 -468755 -396784 -379153 -161352
10428 -161352 -187894 232 417877 320787 -3020 -380337 -808836 -664511 -50636 192193
10418 192193 318704 -113705 -510593 -586840 -770931 -1187320 -1508824 -1682727 -1264216 -1016039
10408 -1016039 -1054697 -914280 -520164 -417020 -381316 -596986 -432716 -236978 -190993 -339387
10398 -339387 -372401 -590927 -1048425 -715610 -261104 -326961 -691403 -769245 -687619 -475783
10388 -475783 -228916 -184405 -115916 -148177 133018 459741 679187 604378 160692 -316429
10378 -316429 -632058 -406840 -3353 315346 327330 49434 -107150 -607797 -1111351 -1242591
10368 -1242591 -948804 -644122 -160073 57233 -109604 -79322 142225 83444 75716 163382
10358 163382 378283 598462 298523 415260 602492 502152 587909 709855 278058 -281082
10348 -281082 -310884 -158249 -180769 113980 201834 -2912 -8215 149949 -102892 -523307
10338 -523307 -542586 -312641 -249185 -143047 -89865 -305477 -250489 -41335 -427337 -694141
10328 -694141 -787863 -874551 -846869 -445135 -287009 -225010 -31782 -302915 -651350 -434432
10318 -434432 -156254 120647 -41416 -482598 -477716 -325556 -494899 -907329 -1345262 -1745652
10308 -1745652 -1493894 -1168926 -817386 -420528 -297948 -346107 -344694 -226395 -219026 39564
10298 39564 180203 -107322 -397035 -497930 -598641 -901891 -1207657 -948830 -320086 24026
10288 24026 172209 258019 281597 363041 568860 591973 115685 16046 339112 700107 883048
10277 883048 866229 785729 494774 2652 -279594 -564658 -761442 -824997 -615928 -160999
10267 -160999 -67121 162495 233490 -242502 -536266 -360073 135847 432484 202936 -368498
10257 -368498 -725719 -558539 -126705 248205 120265 -371512 -647541 -655094 -1040429 -1123357
10247 -1123357 -1146519 -1268748 -927199 -691058 -511042 -295699 -100735 45100 -214598 -417326
10237 -417326 -42538 -160747 -376175 -105823 80078 178158 198346 232817 -118411 -210146
10227 -210146 364720 756834 581262 653087 599775 305254 227755 208053 194402 50683
10217 50683 -373756 -921587 -1126054 -974883 -710838 -463615 -38519 445216 775752 711780
10207 711780 619939 290257 -73911 -461085 -826246 -534015 -274777 -293455 -145480 -591367
10197 -591367 -869723 -166444 136625 299280 688575 942513 863488 695007 508166 50742
10187 50742 -65386 11940 -82918 -368486 -577756 -583372 -408133 -143705 109998 55376 -181906
10176 -181906 -395918 -331933 -178443 -390661 -495810 -79547 403215 631040 175874 -3865
10166 -3865 140201 -32643 -308367 -788626 -1213641 -1555044 -1571180 -1489512 -1680360 -1632756
10156 -1632756 -1363957 -1018545 -753201 -238925 -18960 -59298 -169930 -146703 -172698 -110201
10146 -110201 -84271 -303824 -177617 -59134 192920 720585 827350 505447 -351556 -1123947
10136 -1123947 -1090885 -918031 -651967 -328709 -242909 -22339 324792 497820 431514 413363
10126 413363 621034 773324 562068 357180 448020 433456 28559 -275048 -229853 -308951
10116 -308951 -788016 -564380 -428479 -839839 -955040 -711990 -643544 -725437 -327435 -63462
10106 -63462 -118199 -256019 -520790 -535909 -488150 -791938 -752116 -433482 9365 -2247 -462731
10095 -462731 -703109 -628239 -511229 -508808 -671380 -597027 -620740 -600606 -370533 -843039 -1515782
10084 -1515782 -1626199 -1392254 -1645507 -1731181 -1225294 -1252742 -1839353 -1933814 -1650501 -1478552
10074 -1478552 -1416718 -1176621 -942579 -779461 -746441 -648694 -340470 -356719 -222643 81662
10064 81662 152379 -306841 -927542 -652737 177871 731476 953526 610187 449391 416382
10054 416382 59979 -353986 -402134 -276140 -681577 -1087892 -905379 -638466 -794188 -868333
10044 -868333 -375525 -231050 -688830 -1173891 -1149435 -784816 -374668 -226034 -396461 -814307
10034 -814307 -1066144 -1315356 -1344794 -1316519 -1411607 -1041584 -671599 -425543 161632 710723
10024 710723 732417 469205 211483 150515 -70856 -327171 -204531 100295 578132 757978
10014 757978 931290 908590 579746 138112 31053 -25614 45901 149203 206515 236083
10004 236083 54056 287515 601330 549537 314754 332262 -49404 -370163 331947 807188
9994 807188 378423 105069 41476 -8733 -60252 -130476 -179196 -429642 -408118 -211524 103290
9983 103290 139615 -115291 -319067 -284264 -229883 -330266 -316283 -527658 -855022 -571142
9973 -571142 -417556 -537141 -424955 -226920 -227995 -102468 214806 325682 -121509 -443737
9963 -443737 -310115 -263298 -691204 -1107331 -1103235 -1027201 -567995 -39226 122161 186429 425345
9952 425345 692582 672858 412471 392749 366352 161780 178092 472068 868494 1064379
9942 1064379 918366 755608 420200 405205 1026602 1657100 1428843 605623 25559 -23308
9932 -23308 441893 641663 372963 30008 -254098 46059 579827 814679 656570 421725
9922 421725 364943 499269 287802 -20319 -382603 -395132 -226930 -402146 -693265 -706262
9912 -706262 -563036 -532636 -746799 -633015 -320769 -219217 -302393 -544337 -507098 -558053
9902 -558053 -767851 -669083 -360903 -147253 135116 146178 -116544 -307402 -431643 -398685
9892 -398685 -64370 -27854 -233434 -35186 486953 399964 305935 479624 652496 895555
9882 895555 1139751 1268755 1147550 773817 532600 268709 -147465 -224917 -59384 -47556
9872 -47556 48902 -50148 -197124 -124095 -131375 -607986 -852765 -592906 -462737 -536097 -348302
9861 -348302 -42745 -107161 -815438 -1600228 -1586294 -1244573 -1198260 -1210520 -478209 191736
9851 191736 279690 -273202 -1121831 -1622118 -1604065 -1393257 -1221160 -1106031 -926311 -513026
9841 -513026 -43170 385985 506525 431127 356860 373808 354474 217653 210145 298291 214945
9830 214945 -21535 -165563 -207211 -295416 -304895 187591 564783 861586 874488 623963 692467
9819 692467 823299 754180 444362 -6643 -137306 -114732 -299596 -422695 -369531 -148689
9809 -148689 -400057 -977494 -1132781 -665670 -178050 225512 303129 -69323 -444944 -490128
9799 -490128 -523727 -589674 -491740 -110998 342267 557165 885113 1474458 1474320 1176082 992833
9788 992833 479470 44127 -51342 301670 372940 278461 470735 346146 -45871 -338867
9778 -338867 -493822 -591626 -592333 -452345 -479388 -299628 -175560 -417860 -486342 -94759 82348
9767 82348 122508 219935 241452 220981 272113 374090 316556 349113 536443 723998 1013748
9756 1013748 991378 1074448 1346520 1492788 1578287 1404499 1243824 1320631 1234388 1224917 1428887
9745 1428887 1510970 1329730 1185855 1508740 1853204 1557129 1270671 1536163 1848343 1923546
9735 1923546 1699685 1889374 2532784 2737152 2627281 2782791 2635849 2373608 2953208 3434729
9725 3434729 3733843 4015533 4247593 3999649 4184472 4480141 4235176 4303983 4109344 3330676
9715 3330676 3013816 3380489 3468625 3662210 4093607 4536488 4478404 4327931 4548517 4687327
9705 4687327 4862885 5203212 5358076 5653998 6416130 7283040 7806317 8248508 8634076 9527575
9695 9527575 10537980 11057487 11933256 13415080 15079622 16861940 18604939 21066146 24331419
9686 24331419 28065382 32047043 36811748 42807956 49967614 58483688 69198492 83000856
9678 83000856 100643879 123835072 154555574 194295455 244883669 304329571 357871313
9671 357871313 372795507 333376235 267648219 206919698 160526835 126398111 100745601
9664 100745601 81139413 66326392 55398765 46751987 39884113 34449384 30149953 26601362
9656 26601362 23539454 20710841 18556794 16640715 14775726 13123797 11722960 10499081
9648 10499081 9249304 8090141 7388360 6935946 6551509 6145333 5959553 5945042 5511061
9639 5511061 4643025 4117461 3863966 3444265 2759393 2476262 2708875 2320884 1974425 1879291
9629 1879291 1830612 1938879 1948567 2154224 2248533 2124934 2116145 2025357 2205492 2226104 1889006
9618 1889006 1078027 601928 467426 639948 884736 1070478 1194521 1244633 1227791 1026334
9608 1026334 1016074 988048 720763 450510 -145250 -251462 -102358 8111 -289851 -231389
9598 -231389 169509 204249 239580 494144 624617 751564 1128862 1281097 728526 -59130
9588 -59130 -226835 -78814 -391020 -796539 -1030201 -639567 -88820 183730 46443 -66701
9578 -66701 7996 513386 887801 663017 543187 377237 12009 -363139 -852742 -1117735
9568 -1117735 -805774 -473882 -196076 156451 479493 420845 45630 -175396 -161088 20384
9558 20384 210861 518514 374323 -80859 -15962 -32081 -15804 222852 320559 -330 -329422
9547 -329422 -454594 -676950 -766094 -708387 -657009 -628924 -721970 -950916 -1364087 -1697899 -1393154
9536 -1393154 -767411 -327353 238595 547780 128709 -236998 72282 548626 821129 767573
9526 767573 560634 576661 741897 729379 599233 832895 809076 763532 715623 185095 -108632
9515 -108632 -63234 147497 114591 352340 467342 -142988 -681750 -467114 -159541 -148229
9505 -148229 -600883 -879268 -750536 -652629 -830390 -604224 -32172 -94823 -256671 -414381
9495 -414381 -455448 -434178 -449431 -334116 -132494 255679 380508 86571 -13283 -50174 -712413
9484 -712413 -1162115 -844502 -401352 -352592 -539002 -344559 220621 754283 732026 991462
9474 991462 1769077 2173078 2059844 1738774 1342983 855196 698786 721932 373235 254951
9464 254951 158404 -245685 -363730 -217321 -106368 -35736 300956 409629 -96319 -789522
9454 -789522 -1204795 -1188441 -609629 -298151 -453714 -334304 -20466 13890 25980 191354
9444 191354 285553 700544 967549 663573 465624 286394 -96287 -300098 -398318 -457084
9434 -457084 -229502 112217 166323 176909 661101 1301068 1699888 2259956 2949502 2896025
9424 2896025 2857819 3092401 4055241 5304300 6412965 7132425 8470508 10960795 14048062
9415 14048062 17537071 20940260 23483764 24051048 21541427 17357710 13529206 10631383
9407 10631383 8633309 6769341 4997346 4463409 4007275 3209680 2256950 1518798 1225379
9398 1225379 1530276 1815318 1868659 1760644 1649666 1406019 1360721 1679108 1493492 896520
9388 896520 534250 707323 923749 974588 592843 332702 364149 196043 173370 618340
9378 618340 790195 913289 910815 420439 -144878 -10097 245147 611485 1039886 1166549
9368 1166549 1230566 1645599 2165427 2924518 3719626 3808009 3383631 2506840 1622496 1359306
9358 1359306 1321831 1273424 1260966 1103797 995702 932549 825559 1044941 1048932 934159 922372
9347 922372 871084 551620 218350 191238 372792 508702 750556 860908 762383 250216
9337 250216 -211703 -241674 -234030 2724 487199 1194175 1060921 422788 89639 -306320
9327 -306320 -181931 316983 606798 746801 1081267 930468 782800 876072 915500 750805
9317 750805 213624 -226066 -70770 30599 -157833 -265408 -13105 154334 450439 942726
9307 942726 1130915 1017443 591746 311597 156421 -281209 -669390 -833144 -690334 -408807
9297 -408807 128755 598239 721273 795593 381222 109909 -133470 -641803 -1138221 -1179382
9287 -1179382 -993485 -583090 -471750 -685003 -898379 -774401 -548178 -370402 -368133 -248241
9277 -248241 -274357 -209174 -72239 189867 547300 1001531 1142519 796275 774434 921638
9267 921638 1183638 1327325 1611281 1647471 1266034 900431 773888 402757 -296839 -952896
9257 -952896 -1271127 -753988 215097 488368 332138 -4507 -387131 -394585 -149418 374401
9247 374401 721881 810974 836704 1037976 844069 457278 359286 379716 351955 363749 295073
9236 295073 -60434 -731298 -1052176 -1208364 -1348137 -1391399 -1279138 -854899 -428772 -147168
9226 -147168 -23946 536323 919451 603063 438773 854622 1121852 1498512 1828294 1951758
9216 1951758 1487485 760070 817960 1258546 1293274 942642 721707 309282 1951 198949
9206 198949 529584 805354 917087 1013810 768320 352040 494461 1102670 1597504 1585497
9196 1585497 1183644 933434 1301278 1858480 2195764 3083191 4336004 5420342 6528299
9187 6528299 7369532 7141784 5717935 4392371 3678131 3524751 3597374 2933666 2716218
9178 2716218 3211283 3867410 4243005 4872636 5934616 6696990 7957912 9843496 12498574
9169 12498574 15843985 21100040 28588399 34759498 33498099 25745443 18405662 13344304
9161 13344304 10040979 7828424 6350351 5052727 4189526 3702256 3095849 2555698 2422401
9152 2422401 2149416 1860495 1789552 1562274 1048002 977582 1211354 1153318 1097579 1129561
9142 1129561 1421820 1402100 1228249 1398557 1382780 1507886 1790390 1563791 1531579 1336685
9132 1336685 1104798 1599402 2022764 2193295 2192997 2216697 2070879 2087808 2190771 2523828
9122 2523828 3017431 3501135 3795987 3632100 3508646 3430450 3346915 3231864 2960321 2470934
9112 2470934 2217389 1984312 1938529 2372702 3310920 4062304 4218933 3695504 3127295 2787460
9102 2787460 2924208 3171137 3499510 3835310 4288082 5056753 5103641 5384811 5583001 5061322
9092 5061322 4224289 3871534 3619029 4009317 4574208 4596368 4676184 4991674 5350015 5580213
9082 5580213 5955843 6644593 7477364 7977301 8192280 8438262 8708190 8993904 9983516 11275826
9072 11275826 12000379 12934174 14677542 16749741 18661724 21006526 23694845 26893639
9064 26893639 30648037 35613362 41612615 48341332 56830699 67747372 81101908 97827909
9056 97827909 119356297 147340541 183856008 230934369 287996001 343767449 367997228
9049 367997228 338823406 277716107 217252940 169663113 134700783 109135832 89879706
9042 89879706 75387031 65364015 57914999 50329746 42524400 36095831 31512103 28240914
9034 28240914 25306799 22354334 19875549 17791531 16305545 15423211 14617046 13602148
9026 13602148 12715713 12187913 12372404 13083841 13172903 12566878 12009958 11488235 10962632 10667504
9016 10667504 10730007 10379287 9664017 9095320 8569674 8704267 9495564 10115345 10137918 9724051
9006 9724051 9485355 8913528 8518794 8766756 9602002 10446436 11242630 12487109 14239652
8997 14239652 15842623 16213347 15272664 13643733 11553326 9532957 8022540 6970488
8989 6970488 5932229 5088610 4818834 4686961 4458096 4222540 3892019 3697146 3463646
8980 3463646 3204749 3012700 2816886 2699701 2556340 2260412 2255978 2270806 2100256 2042071
8970 2042071 2129895 2183138 2128156 1813424 1406571 1079717 900904 1107472 1484555 1757979
8960 1757979 1827665 1677592 1837877 2256867 2110047 1482888 1217640 1201906 1246327 1230967
8950 1230967 868843 519300 476339 746999 596328 341490 562902 1063590 1189403 1065776
8940 1065776 870508 307716 -140781 -254036 -626330 -842605 -891614 -493770 107152 421084
8930 421084 512458 599746 876332 821011 448475 412938 506701 545408 132872 -220478 -190834
8919 -190834 -102378 187575 363785 522694 595982 469194 20895 -340601 -547480 -952093
8909 -952093 -1330639 -1308619 -1085248 -922211 -380322 293742 695842 821581 739943 899263
8899 899263 1312254 1539638 1369783 1097466 950790 562548 140958 -72913 198037 401769
8889 401769 -213351 -751859 -837539 -508078 -87939 341476 722022 750007 693023 1146735
8879 1146735 1257558 983999 927800 820787 726710 392095 217323 550869 577529 251668
8869 251668 488917 904760 986089 774995 675640 507042 304843 -30102 -446420 -467738
8859 -467738 -185507 94140 172649 128126 877721 1706204 2239016 2264201 1677855 1015252
8849 1015252 566784 363811 569106 1152074 1418011 1188183 1059540 1615065 1734006 1614829
8839 1614829 1166215 917553 1058631 1080095 898644 660196 1019913 1567153 1520116 1244017
8829 1244017 1428215 1418574 895864 540435 572285 324568 255793 -60275 -297772 -323210
8819 -323210 -362026 -458291 -692929 -659964 -190279 357726 766721 1297747 1463443 1342424
8809 1342424 1130683 1201993 1262703 1201503 1092007 1242181 1167578 1065977 884449 376838
8799 376838 261217 303198 17216 -510473 -948277 -1006370 -770026 -513673 -406705 -301165
8789 -301165 -382086 -293242 -192767 -172162 72893 842973 975223 692099 481645 572793
8779 572793 740700 565636 289891 46993 -138825 -115959 510123 559213 112843 -62783
8769 -62783 -74537 -58822 40305 330724 391961 255345 381905 177402 -3748 265664 433088
8758 433088 196124 -35827 -206617 -288331 135294 617713 715253 614012 520542 444550
8748 444550 158201 -63196 -332625 -765932 -976330 -1158840 -935947 -379748 -620609 -1092433
8738 -1092433 -1109098 -818914 -759606 -683729 -591465 -174344 297946 646742 568495 130063
8728 130063 252164 572757 833265 957403 1173511 1341169 1392028 1196009 1140364 827570
8718 827570 489627 438129 577435 349702 -62051 67111 154203 4820 -187698 -333075
8708 -333075 -307953 -201055 45478 624765 847321 603497 658545 748353 758900 814839 821935
8697 821935 456872 551989 270595 -418805 -354925 -53506 345360 318724 94178 143710
8687 143710 369563 640171 495062 40894 223610 728815 1021790 466215 216793 488934
8677 488934 613517 749938 637171 499888 663695 755867 999354 904246 857512 497698
8667 497698 196842 227204 661920 924514 1172003 1568041 1462014 1383406 1725706 1869942
8657 1869942 1711295 1861336 2079478 2232992 2108421 2434750 3009913 3870671 4898115
8648 4898115 6049225 7435485 9062952 10960948 13464121 16885667 22064694 28990695
8640 28990695 35095043 33989959 26310141 19148191 14415482 11192595 8792046 7383988
8632 7383988 6084738 4949834 4096746 3232272 2163863 1385191 1425326 1608777 1495572
8623 1495572 1373567 1199305 1272996 1458943 1227764 874571 803332 737928 616186 321092
8613 321092 144208 -46157 -522367 -722789 -546823 -69214 347843 721727 819870 315570
8603 315570 53698 170017 467405 779981 526877 499056 755893 693207 364662 460230
8593 460230 856593 1009610 895851 958210 740126 156797 -178193 -458435 -281939 -11104
8583 -11104 286046 352773 157950 -152712 -566396 -239347 -52055 -10757 -825 158528 359587
8572 359587 275931 -217854 -258442 153958 -52858 -454312 -103474 229184 278273 628002
8562 628002 446930 802559 1465433 1702291 1632639 1404236 1305123 1227605 1748563 2735216
8552 2735216 3985546 5710399 6895376 6562939 5371107 4278741 3500186 2855750 2270774
8543 2270774 1770759 1246310 818623 383042 -60072 -464693 -710545 -785095 -465282 194378
8533 194378 588939 372004 343904 256208 -46843 -243935 360387 685213 575758 531933
8523 531933 471702 464975 389342 454455 652563 626766 788155 1025291 1463752 2024241 2015837
8512 2015837 1796716 1452522 1778029 2366354 2817976 3154617 2750916 2598285 2628072 1889610
8502 1889610 1164379 500606 -54732 -518365 -764535 -744889 -784890 -831842 -576914 -19944
8492 -19944 210062 110253 374232 641971 559785 391503 118621 -106308 -95277 -189466 -66259
8481 -66259 30612 -102684 -89751 -193385 -512796 -169082 287745 550072 544246 340956 461992
8470 461992 423019 -57581 -221295 325852 687912 594625 820586 954013 563213 69903
8460 69903 -130045 -191982 -319417 -410232 -537767 -885626 -1192569 -1063919 -633111 -117710
8450 -117710 171993 213395 -399861 -944951 -1363567 -1203579 -767542 -400435 240106 815982
8440 815982 1267898 1177401 1165961 1190444 862635 402119 423655 324378 -89610 -674339 -997713
8429 -997713 -1101321 -920609 -526289 -174455 -199490 -818730 -1181672 -960920 -276827 60934
8419 60934 209007 588529 873226 1177005 1438785 1069236 653380 552233 132941 -320944
8409 -320944 -171152 -9268 -235570 -556982 -712863 -520467 -75385 19832 -146545 -53324
8399 -53324 101983 73504 -205265 -572194 -499157 -152286 293680 331383 273355 456062 880346
8388 880346 1066547 1027839 757755 388328 406940 401393 277529 191511 94035 97991 -43807
8377 -43807 63647 128418 441445 933125 585420 57738 -522538 -476413 -276714 -395209
8367 -395209 -478416 -26271 86575 75296 144710 250262 162123 -117642 1535 265354
8357 265354 54132 -165731 376714 994885 1249206 998883 1038402 1336678 1312388 1140382
8347 1140382 1005513 831609 860338 1143983 1335543 1407176 1541186 2003380 2860468 4199896
8337 4199896 5555606 6251959 6861665 8280082 9758982 10321688 9887674 8345625 6193986
8328 6193986 4775081 3934577 3119592 2228813 1457486 1099572 1164746 1069688 831242 742112
8318 742112 871980 859734 959603 792478 268828 -203009 95145 648563 870601 831930
8308 831930 789005 602013 659125 792632 923773 1010876 1012160 924525 786218 869855 902734
8297 902734 979143 967174 738607 608394 726845 674812 383741 264619 940312 1511711
8287 1511711 1514517 1742202 1704727 1365155 1280703 1196260 1231879 1316980 1448581 1313824 1082741
8276 1082741 869619 1119330 1179876 1332281 1520334 1734451 1936253 1872290 1597846 1175161
8266 1175161 1296607 1564441 1801309 2079125 2200243 2095669 2008422 1825037 1956299 2505036
8256 2505036 2897950 3072264 2999967 3130572 3431607 3339412 2983079 2263582 1607961 1252034
8246 1252034 1150211 1138629 959060 768011 1259497 1473388 1452927 1398184 940894 449190
8236 449190 49668 -142130 -59804 103252 41119 -354752 -643558 -656235 -700932 -535197
8226 -535197 -39689 326518 297354 132215 -60089 -93148 139924 341661 481162 563533
8216 563533 463958 363524 174642 276092 154088 -72369 -299184 -283597 102103 736344
8206 736344 960418 986507 715349 478889 711095 1095265 1194397 1101468 1098063 1025494 795944
8195 795944 468937 147741 -147099 -246889 -127027 280581 501879 604333 749244 862224
8185 862224 785473 444008 392626 -76969 -575719 -777961 -763542 -594538 -461685 -364043
8175 -364043 -234691 65763 42993 53942 278811 770212 858142 691475 657054 601442 567913
8164 567913 256722 -511359 -1220383 -1252585 -765392 -201459 -163627 -174003 -50459 45713
8154 45713 197285 300246 403845 329661 23656 -41238 12656 731 -248057 -533616 -621505
8143 -621505 -316951 388961 595188 558871 263297 -358667 -911943 -1169678 -606924 -53180
8133 -53180 563865 918469 723212 229768 49653 -81992 -392436 -460259 -451839 -673848
8123 -673848 -514609 -425687 -584534 -690180 -699918 -702196 -775687 -740765 -915301 -852051 -842736
8112 -842736 -841314 -716318 -864070 -1050059 -1224693 -873856 -486862 -666137 -1054594 -1179812
8102 -1179812 -998690 -730135 -259120 -210960 -366406 -271176 -400949 -401937 -152943 -284483
8092 -284483 -349458 -188322 -127071 -373309 -535722 -366236 -68301 149315 45501 54240
8082 54240 66308 343472 910665 1041209 846266 545330 547072 535778 85448 -301502 -631884
8071 -631884 -768721 -524785 -419221 -762456 -1170951 -1387717 -1105432 -1092051 -1390894 -1425250
8061 -1425250 -1073901 -591440 -422432 -149038 -214504 -259306 -181076 -108263 -34807 -227006
8051 -227006 -438712 -604859 -714647 -260367 269695 510050 356381 68030 172 37878
8041 37878 -284145 -421704 -563389 -531996 -518356 -615114 -363489 -365262 -568938 -205318 443970
8030 443970 522130 401984 440849 184929 -342965 -470580 -615859 -903849 -1171922 -1444374
8020 -1444374 -1696835 -1523300 -1174926 -1184691 -1287824 -920427 -4543 679840 770493 -26297
8010 -26297 -622305 -496198 -89009 227108 369425 396324 540581 320840 177203 729334
8000 729334 930965 695319 647720 373196 199831 134597 -156183 -302265 -804822 -1305597
7990 -1305597 -1484628 -1263856 -510909 -317226 -385847 -418595 -281674 -518498 -1108181 -1278515
7980 -1278515 -1256586 -1128234 -1210961 -1294126 -1059681 -608575 -255549 -242905 -454657 -810855
7970 -810855 -976462 -999167 -1057011 -407828 -90951 -83070 -385035 -796355 -815632 -625281 -371840
7959 -371840 -262393 -214651 -46931 40754 148600 482768 428236 36945 128494 450284
7949 450284 418219 423352 497461 686892 634217 467976 462891 312130 445182 515467 405722
7938 405722 344877 346247 390312 624244 933294 1046640 1021900 1004568 648785 234104 -154606
7927 -154606 -138221 249725 414769 583699 320405 -116440 28258 492482 786198 1130741
7917 1130741 872566 306370 -188748 -545394 -454390 -168427 344321 518780 57399 -628174
7907 -628174 -1223635 -1441759 -1494287 -1441594 -1321960 -1325238 -1132841 -998223 -858432 -628195
7897 -628195 -612581 -706040 -814271 -499392 -405391 -307212 -364757 -404470 -353553 -179755 -80958
7886 -80958 132935 420456 310683 86755 110718 316296 263722 186570 -79299 -724107
7876 -724107 -1182938 -933542 -739401 -624900 -483529 -56757 262916 -55334 -346353 -421659
7866 -421659 -398476 -383594 -461067 -696172 -614667 -368977 -461289 -587897 -464549 -327923 -455227
7855 -455227 -635612 -552464 -349833 -367891 -52609 232504 311607 169888 -398512 -638855
7845 -638855 -722600 -802075 -1011922 -1066873 -1005525 -974982 -1072159 -719719 -281890 -266992 -696687
7834 -696687 -1094009 -1288486 -1449879 -1316807 -793062 -614211 -387178 -65698 -9061 1531
7824 1531 -237920 -139777 213458 337842 195015 -84658 -405442 -432961 -244625 -30029
7814 -30029 124255 204104 458632 679420 1167028 1668109 1766275 1587950 806186 445675
7804 445675 592012 867149 697314 1112606 2117202 3223139 5101209 6861102 7520865
7795 7520865 6587360 5215943 3967389 2486604 1551120 1417924 1428716 1625097 1578082
7786 1578082 1149529 825761 654954 688827 695463 577336 259983 18467 92457 52000
7776 52000 -384194 -421453 -320630 -224364 69183 -54242 -384782 -839499 -1377201 -1498162
7766 -1498162 -1102511 -695996 -411052 -299760 -12501 84875 -43844 -562262 -924446 -848895
7756 -848895 -726411 -407287 -267694 -321490 -92433 263573 320503 547219 902327 647787
7746 647787 -77273 -474970 -1002485 -1316089 -1146157 -1026484 -924172 -637690 -284162 48449
7736 48449 -127721 -293501 -432396 -587421 -612306 -785609 -1162607 -1093971 -1083642 -921232
7726 -921232 -528845 -460694 -357705 -23417 384557 619350 63397 -239703 236103 197447
7716 197447 -240248 -551284 -604495 -382595 -172139 -175532 -5076 121368 -334098 -696826
7706 -696826 -634502 -503037 -358830 -166211 -11348 -257855 -619147 -535197 -498906 -577431
7696 -577431 -268968 -28271 119049 30138 -285639 -267858 -35684 37101 -48993 -77013 -348642
7685 -348642 -677892 -813052 -669673 -303500 20663 8090 -38419 -180699 -219649 90254
7675 90254 404041 142738 -537668 -869730 -686990 -375438 -129259 108842 68889 -263089
7665 -263089 -448970 -232854 -113123 -89641 -21634 75854 123769 -248745 -473225 -467558 -481870
7654 -481870 -400046 -667166 -1007482 -1083279 -786066 -233075 -353044 -660879 -582371 -709589
7644 -709589 -441269 -2799 169520 -67390 -660979 -698712 -464940 -358304 -395743 -352686
7634 -352686 -283843 -229694 -185018 27717 152072 105463 -268852 -726790 -772355 -896589 -848247
7623 -848247 -682298 -666825 -412126 -154494 -393702 -738135 -1120532 -1217068 -1245906 -1076427
7613 -1076427 -1191546 -1433733 -953785 -338049 20249 -333183 -515938 -583197 -906044 -902637
7603 -902637 -515256 26705 238091 -14002 -287605 -473320 -459581 -419656 -1183494 -1982334
7593 -1982334 -1825959 -1393184 -800364 -454660 -73554 290329 -8107 -372917 -716806 -1011468
7583 -1011468 -1268431 -970672 -716735 -1051071 -1207206 -983070 -938595 -1015334 -1564826 -1857313
7573 -1857313 -1900626 -1646565 -1669811 -1731565 -1529402 -1235309 -842293 -473148 -163845 -213574
7563 -213574 -436551 -735083 -853076 -717655 -742912 -907930 -770723 -411169 20496 -124563
7553 -124563 -229936 92044 475385 882247 831420 568416 226236 -175666 -52804 342590
7543 342590 476653 17277 -405803 -342223 -363613 -421713 -287691 -184009 -549451 -1009076
7533 -1009076 -1156608 -1198368 -1433665 -2045707 -2403060 -2630246 -2568943 -2002405 -1612020 -1232826
7523 -1232826 -1292756 -1431885 -1544298 -1384322 -1157041 -1140101 -1020461 -933626 -900525 -689606
7513 -689606 -542478 -376400 -267493 -180755 47405 331417 270830 -372638 -879737 -888204
7503 -888204 -465880 -227224 -413291 -601945 -525406 -475190 -789200 -845710 -873853 -1094815
7493 -1094815 -868526 -643850 -201705 604483 1033017 805459 560247 286004 -44809 -291717
7483 -291717 -126768 558134 803432 581386 307178 -250347 -449912 -90896 309220 405881
7473 405881 666599 776648 1090658 1818409 1955750 1449076 1029366 557021 296214 191433
7463 191433 45386 -229945 -302509 -480535 -468707 -365240 -301268 -104148 -375015 -381065 40852
7452 40852 588499 881117 665363 255563 165602 358476 669393 519753 107425 -330687
7442 -330687 -799600 -596088 -303312 -324122 -649006 -1091665 -1208104 -1097207 -1175705 -1095002
7432 -1095002 -732751 -620501 -285432 110450 119406 3864 282034 380222 181118 -72106
7422 -72106 -13344 -366633 -639909 -474340 -273756 1238 166375 481039 367049 74517
7412 74517 -36809 161218 89791 -167561 -451801 -976251 -1565849 -1999747 -1966747 -1655753
7402 -1655753 -1272695 -620858 -452961 -367687 -213809 -639873 -1037178 -1036945 -1167948 -1516294
7392 -1516294 -1880085 -1715709 -1152035 -494935 -53153 143248 150554 213697 129456 368718
7382 368718 935332 882346 618057 335474 -348003 -454492 306290 880491 741285 333664
7372 333664 365417 69238 -197042 -152371 -135035 -398038 -615353 -667882 -480904 -207124
7362 -207124 255369 322633 -62811 -252273 -90847 -185223 -29955 -35310 125705 202093 -159683
7351 -159683 -484308 -463045 -400202 -302486 -46478 356148 938565 1431741 1414236 1071579
7341 1071579 506619 -304156 -438517 -247301 -182029 -15994 -9182 -10570 -88589 -315654 -408841
7330 -408841 -651506 -1085944 -982621 -423892 -4471 60993 -122120 -106451 -50938 -46967 -362630
7319 -362630 -414841 -328483 -761461 -1166457 -593872 -43104 -347737 -546798 -96570 366176
7309 366176 325683 111059 -77149 -237345 -496550 -503814 -253228 134754 223146 323461
7299 323461 514523 355778 212342 557534 792698 963541 1261106 996261 365327 -26551
7289 -26551 -213099 -64564 94925 -6445 -352374 -496233 -513416 -638095 -650534 -882291
7279 -882291 -1108536 -1558860 -1771508 -1512622 -1159787 -1213087 -1319869 -986487 -503605 318469
7269 318469 876538 952298 1057050 625403 257534 -92251 -461250 -305813 -138496 60491
7259 60491 750296 1277749 1293389 1303075 1353861 810143 322651 35209 -306028 -457778 -511254
7248 -511254 -293185 -295997 -595140 -857594 -919908 -380127 102883 508307 520282 -298199
7238 -298199 -706357 -1105540 -1277527 -796112 -410644 -408018 -338302 -354485 -478095 -441818 -491547
7227 -491547 -276742 -171842 8685 415592 589812 -176785 -513785 116779 624555 729708
7217 729708 808548 600240 441037 427099 517222 400444 113936 -34497 -108066 -330727
7207 -330727 -192624 174121 670063 399497 120718 196128 -217407 -451573 -286852 -44355
7197 -44355 -219105 -429768 -332094 24956 196514 58108 29163 27467 -582603 -966069 -427144
7186 -427144 -70331 -204543 -524760 -505587 113798 551261 621798 681728 551895 469061
7176 469061 846810 832691 524350 126177 122597 529722 891796 963175 744007 402629
7166 402629 50576 -223964 -421541 -505697 -414296 -250488 -212923 68577 290903 386383
7156 386383 328729 -82385 -395284 -291193 197684 471232 537836 712593 1010281 991816
7146 991816 931551 997641 1023450 1390717 1930584 1959024 1472764 794683 471218 712884
7136 712884 730898 356003 -178899 -513056 -289899 424438 1065978 908763 614140 451579
7126 451579 342739 1007062 1948221 2408038 2595465 2484858 2249962 1822862 1727195 2117236
7116 2117236 2264462 2407650 3057659 3322922 3306957 3417635 3058427 2726707 2724634 2725879
7106 2725879 2793183 3270856 4050398 4769122 4999448 5138797 5641059 6274113 7111721 8329316
7096 8329316 9805041 11244389 12761049 14579643 16208150 17990062 20445585 23140165
7088 23140165 25917674 29590752 34249679 40006808 46906100 55565681 66956276 82204232
7080 82204232 102831893 129799337 161843829 189041288 192441863 167500674 132598744
7073 132598744 102537234 80306921 64274341 52803565 44255846 37668978 32801392
7066 32801392 29486910 27055770 25110202 23804160 23399129 23666681 24624479 26366792 28788228
7057 28788228 31801260 33436700 32097035 28234410 23513318 19021560 15606466 13449891
7049 13449891 12178997 11188914 10479675 9589616 8187871 6994455 6168943 5887056 6013076
7040 6013076 6171655 5927665 5551015 5219084 4991989 5070094 4916193 4527646 4475606 4559387
7030 4559387 4761849 4675491 4759285 4588054 4040847 3301662 2642887 2155454 1937303 1891071
7020 1891071 1995956 2031675 1928408 1740775 1441862 1779527 2571066 3112679 3450876 3749409
7010 3749409 3749190 3062947 2651936 2591954 2546152 2659137 2406551 1904088 1281125 1073496
7000 1073496 1407524 1421820 846656 399329 505168 708743 989765 1206697 1100779 762704
6990 762704 884817 1333580 1520642 1720672 1688371 1431611 1306509 1140712 846520 1306798
6980 1306798 1873738 1623833 1535958 1547352 1033348 490323 272805 215822 302624 462759
6970 462759 409450 111736 14320 341127 821082 1210267 1461776 1285038 1023013 665543
6960 665543 316867 345518 712552 1060957 1106791 1027335 659450 361051 -115480 -466015
6950 -466015 -711617 -801560 -671942 -794622 -599038 84107 478803 687729 786294 766155
6940 766155 376386 -6016 -322626 -539150 -325875 -169312 -142793 64820 286722 869697
6930 869697 1456379 1510339 986363 544203 125125 80129 591720 879321 1084243 1042551
6920 1042551 936398 967803 888099 491834 139068 154784 148879 381838 692654 958455
6910 958455 941147 559436 403873 610938 546032 523301 365178 -4469 -563263 -349177
6900 -349177 465617 826340 896410 941731 771177 513489 543572 797230 1249826 1447787
6890 1447787 1578556 1682071 1879170 2180815 2195307 1844912 1727536 2132408 2571475 2682671
6880 2682671 2806300 2913612 2853682 2597386 1952753 1615784 1596833 2068613 2751186 3055448
6870 3055448 2737003 2388350 2599808 2847525 2852723 2951847 3204529 3558391 3864242 4326409
6860 4326409 5214110 6145058 6951573 7600739 7950490 8581710 9679090 10854943 12262728
6851 12262728 13847474 15990666 18228322 20435950 23845048 28442253 33348640 38866356
6843 38866356 45406814 53521205 64221338 78471275 97051570 120827676 150316210
6836 150316210 181866805 200427749 190134341 159523343 128010786 103818744 87271717
6829 87271717 76557408 69830869 64214914 57597720 49711071 41686433 34676975 29131760
6821 29131760 24657533 21130809 18486580 16297152 14082455 12449306 11338526 10176814
6813 10176814 9171531 8320472 7314731 6700571 6471321 6440588 6373236 6015299 5537513
6804 5537513 4842433 4125283 3437291 3305552 3380471 3291305 3518125 3863121 3929777 3595094
6794 3595094 3441257 3664593 3768951 3394387 2824248 2524318 2437832 2370122 1976439 1975451
6784 1975451 2047159 1827312 1791295 1788938 1734618 1645320 1582230 1340094 1089204 807060 947102
6773 947102 1234935 1329683 1609040 1853419 1695624 1391605 935999 814980 914952 903682
6763 903682 1111493 1339829 1372156 1600486 1579674 1108882 875422 841851 903944 880492 448460
6752 448460 61146 214494 706342 1043496 1336192 1677304 1562754 1027203 556881 475813
6742 475813 395982 395174 369069 389234 222859 107570 307614 664845 816004 713052 519685
6731 519685 668408 1065872 1456471 1624726 1886837 2543197 2951651 3637044 4386659 4660215
6721 4660215 4823942 4700970 3771181 2707702 2581046 2639281 2120831 1788040 1782817 1894028
6711 1894028 1622456 1037574 302040 232616 645132 676068 332027 84820 70211 270362
6701 270362 719553 1016563 1174868 1121957 911625 746025 647546 294495 83783 -155649
6691 -155649 -243870 -191009 -68669 681404 1494979 1372337 639332 393580 380667 628914
6681 628914 486790 -60835 -401058 -435342 -530440 -505689 -687614 -730016 -100060 354965
6671 354965 233493 125561 213457 449671 743737 1020097 1017803 897553 739963 467383
6661 467383 198504 177568 413395 409737 665790 830278 1000950 1235043 1269632 1155429
6651 1155429 1177624 1120205 804775 442061 165983 -248341 -568038 -438711 -31788 361370
6641 361370 740345 844634 960564 1297514 1205612 815482 585258 340144 115995 197245
6631 197245 352243 382388 602746 871058 907376 700811 18040 -1007008 -1579434 -1626839
6621 -1626839 -1289160 -310952 441114 479311 185125 -106440 -356599 -247321 255267 424910
6611 424910 426585 930395 1359795 1533737 1064858 627739 117514 92362 194427 411264
6601 411264 896774 1257503 1425370 1525985 1261414 441712 451877 1177826 1712866 2300235
6591 2300235 2588555 2568002 2557423 2923538 3164767 3656387 4151499 4103239 3690342 2990147
6581 2990147 2213677 2094115 2291589 2426050 2430756 2012621 1799499 1411161 1019174 718003
6571 718003 728394 908600 962392 819496 684390 1089817 1723685 2131771 1995158 1585398
6561 1585398 1328424 1105612 1316982 1617438 1451275 893573 671650 841054 1177052 1458393
6551 1458393 1681527 1908556 1983185 1974350 1800223 1518349 1342979 1288813 1171092 1376415
6541 1376415 1886139 2203214 2484627 2277476 2099292 2352894 2509199 2546106 2522683 2402866
6531 2402866 2570616 2579436 2281903 1954637 1615030 1357762 1467920 1375022 1091786 1148718
6521 1148718 1617779 2123190 2623740 3406205 4105045 4588553 5105124 5383059 5621900 6044643
6511 6044643 6659319 7542771 8803817 10151355 11381372 12696490 14339350 16320012 19278017
6502 19278017 22691469 26613719 31175362 36638387 43583546 52854137 65222578 82393610
6494 82393610 105599065 134483822 166312678 188700806 183648342 153804824 119144102
6487 119144102 90868438 70105852 55560997 45400301 37781274 32119579 27659231
6480 27659231 23751654 20368423 17471767 15430116 13641547 12022379 11169398 10777931
6472 10777931 10216679 9411382 8520055 7527376 6826578 6464410 6178153 5622431 5034121
6463 5034121 4762693 4725319 4751658 4616098 4278679 4018224 3939106 3498894 3059548 3316506
6453 3316506 3930855 4330774 4373847 3823151 3296477 3373267 3843420 3910815 3675611 3229746
6443 3229746 2823560 2748552 3005615 3324939 3423367 3264588 3467214 4040673 4767861 5057677
6433 5057677 5408726 6584617 7566681 7901353 7787197 7763689 7973367 8012564 8367102 9685297
6423 9685297 11419477 13386388 15871516 17321534 17046182 15839264 14766700 14050946 13268784
6414 13268784 12424191 11236744 9985427 8778360 7978581 7115387 6282495 5784671 5524507
6405 5524507 5082786 4382891 4363217 4747682 4720794 4450137 4328092 4550406 4747328 4853510
6395 4853510 4586896 4301341 4066087 4050480 3997952 3401992 2796113 2579379 2470975 2650410
6385 2650410 2786927 3264107 3727824 3955595 3860117 3674625 3618659 3617087 3492947 3900586
6375 3900586 4918058 6232858 6980588 6737649 6218139 5856950 5993699 6327038 6757364
6366 6757364 6966522 6938143 6868372 7164357 6766720 5959525 5147613 4256567 3496417 3181207
6356 3181207 3461221 3399575 3031796 2719867 2802618 3349889 4065644 4385169 3860998 3346847
6346 3346847 2845029 2568625 2482801 2952877 3491335 3877256 4474480 4727110 4476091 3964307
6336 3964307 4098936 4167080 3790402 3614291 3383014 3252679 2951782 2396189 2097896 1903144
6326 1903144 1438969 968867 436202 385714 1265869 1581681 1141150 785843 819955 976335
6316 976335 937616 592807 497430 616526 990730 1369808 1458763 1456682 1306369 1084545 740853
6305 740853 553684 470995 557702 1477821 1903809 1755026 1342529 867379 976752 1690567
6295 1690567 2135645 1889973 1282530 913142 563496 305859 690513 1329033 1320162 1347092
6285 1347092 1578366 1480452 1044202 713118 806503 1319642 1918730 2847503 3787261 4429831
6275 4429831 5135549 5804413 7214406 9575357 12277939 15175000 17502262 18159138 17863382
6266 17863382 17920492 18311634 18135058 16099856 13301908 10765301 8721655 7178136 6247273
6257 6247273 5546180 4985964 4546069 4069960 3596486 2976126 2336094 1719202 1383012 1218285
6247 1218285 1105412 843209 656967 539130 543530 771969 959465 886288 1120171 1371216
6237 1371216 1122617 820130 555282 233676 191151 306761 672913 1362358 1484003 1131806
6227 1131806 1029600 1191816 936616 436225 243613 514664 745983 670055 414708 744793
6217 744793 967232 504836 -51696 -69538 289729 769088 866443 714666 229426 -343735
6207 -343735 -638458 -489037 -86999 604089 1306085 1211448 951826 741919 328968 -266391
6197 -266391 -173442 -114069 -227473 -165708 -302987 -523100 -252708 -137688 -204521 -354532
6187 -354532 -427663 -434573 -511313 -490632 -465433 -408836 -40651 159424 -80446 -213202 -45209
6176 -45209 16545 -134675 -297178 -516407 -356178 -21995 -57395 61713 246349 448007
6166 448007 332501 -239052 -287266 -295659 -449307 -664529 -276490 155964 371170 643592
6156 643592 900230 882647 755934 817240 785122 905350 709660 542740 360537 205576
6146 205576 736829 1331190 1425414 1306193 1164534 1067529 1144214 836411 235232 198442
6136 198442 75699 162819 349208 590560 740855 488652 247946 334610 -112750 -686478
6126 -686478 -748399 -208271 -122282 -397393 -247671 23878 303581 566900 668380 378859
6116 378859 -49094 -273983 -136886 -321860 -590509 -625247 -544806 -231656 372132 802778
6106 802778 644665 616441 706074 853120 910634 668335 423480 481080 611722 894826
6096 894826 751130 804515 910526 778308 663127 868132 1386364 1438836 1605826 2162075
6086 2162075 2259504 2197740 2206487 2355506 2891200 3332626 3348803 3094553 2853405 2590110
6076 2590110 1898601 1598582 1228878 719720 800292 1007022 913350 665809 594616 539761
6066 539761 527756 748355 642438 334512 -334435 -317123 -23502 -122303 -46347 -20280 -52890
6055 -52890 -14131 448745 743879 572267 542508 705843 704991 657760 846661 813194 235277
6044 235277 -74170 176757 648355 480995 442155 571732 290805 101180 145195 271701
6034 271701 74702 -38428 -149739 -249013 -475822 71353 643121 344835 -210836 -345820
6024 -345820 -267251 -267760 -147492 -167126 -126976 -242207 -419029 -532149 -753558 -886724 -582561
6013 -582561 -174946 -101095 -378210 -713776 -264323 361115 -30084 -1042011 -1592994 -1104076
6003 -1104076 -166357 234202 -16312 -260865 -481602 -860609 -1425701 -1487356 -1057011 -629336
5993 -629336 -256239 -169500 -534129 -839376 -651892 -540991 -440814 -160886 104386 414203
5983 414203 730553 594900 -70607 -540103 -457184 -131716 -260824 -239022 -297749 -113646
5973 -113646 421455 810341 728432 213632 55238 283004 163366 -51995 -103690 289269
5963 289269 754042 816906 584061 547200 303374 36963 -86317 161518 224193 40259
5953 40259 -333 86400 257007 209633 -259750 -404921 -196627 418918 1113474 994520
5943 994520 469859 275667 118787 -143260 -459427 -233477 -19354 -406192 -597421 -688695
5933 -688695 -636621 -309778 241729 208226 180199 582270 838034 986877 1204394 1349037
5923 1349037 1288847 915605 287134 -73539 40714 -165043 -313595 48670 456223 1060135
5913 1060135 1200293 709414 496028 591340 404461 -317752 -1199562 -1085449 -362947 70670
5903 70670 -5175 -173191 -127143 144156 88366 -144793 -415466 -409508 -607232 -714739 -599117
5892 -599117 -372648 345784 862377 469490 -138280 -149882 -27283 167439 350131 640089
5882 640089 740854 526379 633582 1221286 1529714 854833 -173717 -993127 -1258366 -821936
5872 -821936 -416032 -224668 -22911 -52578 -454048 -833009 -765229 -544693 -231508 -117689
5862 -117689 -65428 -158513 -256132 -361627 -238734 158608 322778 485559 554811 623046 531004
5851 531004 398128 476496 735885 942212 734364 161375 -189189 -328704 -249362 -73556
5841 -73556 413013 1014849 1192074 924212 1094285 1271576 1337294 1217554 1258521 1610282
5831 1610282 1505111 999864 771171 862836 690680 369555 633083 1011774 753389 444775
5821 444775 83676 -324604 -241904 222942 730080 884782 719632 1031747 1762593 1902547
5811 1902547 1556112 922438 563300 213252 -205214 -155929 -747438 -1188617 -962361 -502044
5801 -502044 301491 634193 834974 1265513 1722441 1334861 622960 315759 703041 954347
5791 954347 813726 757617 1011752 1382014 1399605 1197355 677444 579904 758398 1182714
5781 1182714 1742092 1898700 1878649 1867131 1920995 1941822 2372711 2950306 3037818 2948257 2905661
5770 2905661 2580178 2595209 2762052 2857998 3001384 2769548 2738894 3219969 3555604 3505329
5760 3505329 3384872 3247032 3086187 2940928 3053658 3240993 3787049 4552279 4657047 4363133
5750 4363133 4241416 4302569 4234304 4145512 4367168 4652271 4732206 4828310 5147585 5819385
5740 5819385 6489854 6594137 6622179 6735811 7403429 8797825 10296644 11129201 12329635
5731 12329635 13626482 14832911 16964151 19624129 22558290 26339821 31107031 36757756
5723 36757756 43358176 52084318 63751048 79486838 100119874 126893885 157680057
5716 157680057 182744653 185552185 162489188 130252918 101313079 78895786 62223483
5709 62223483 50141619 41266674 34437727 29616624 25743215 22668753 20187418 18054754
5701 18054754 16752034 15718219 14634702 13709963 13118495 12707240 12234581 11566456 11252001
5692 11252001 11429987 11391485 10995919 11113995 11934440 12948925 14048154 15542750 17792585
5683 17792585 20601751 23954860 27528625 29510434 27991678 24310406 20396390 16752085
5675 16752085 13776991 10943635 8772549 7617435 6890622 6142115 5298077 4470811 3896148
5666 3896148 3500545 3107810 2797134 2692729 2433000 2083830 2236815 2347736 2580012 3074260
5656 3074260 3292594 3122356 2570874 1961142 1362132 1168857 1172694 1002526 1155528 1298761
5646 1298761 928920 556598 544105 989355 1263563 1075768 765433 561538 520478 779955
5636 779955 1170958 1304152 1460768 1471950 1560966 1692458 1479393 1043221 1016737 1450588
5626 1450588 1598198 1741230 2027876 1817170 1637909 1470638 1236116 979994 599145 886277
5616 886277 1310784 1248398 1068952 1163134 1090912 874188 834773 1061103 1155537 717865 242871
5605 242871 437590 430863 817971 1693685 1965939 1582348 1372372 1038229 792215 769764
5595 769764 537962 586034 674032 563706 339675 263697 151841 250948 508577 492620 154066
5584 154066 -247674 -273075 543398 978149 1181135 1344052 1134576 635187 206746 412121
5574 412121 538196 910812 1108883 833942 674967 1056795 1551439 1400449 1136774 1092340
5564 1092340 1287959 1538815 1725903 1999174 2360757 2815912 3215928 3119871 3278977 3411342
5554 3411342 3449940 3581850 3617631 4024459 4178631 3653219 3390096 3367311 3449582 3356743
5544 3356743 2846332 2515127 2984466 3669225 4317172 5075621 5441594 5635403 6387481 7433818
5534 7433818 8463030 9019817 9517658 10277267 10924929 11013682 11114553 11659608 12550891 13590149
5524 13590149 14985839 17211219 20047586 23083026 26697978 30974626 36165723 42782126
5516 42782126 51474273 62864563 77986101 98268368 125334169 159696695 195225438
5509 195225438 210301876 189012794 149908397 114785157 88984843 70752824 57745520
5502 57745520 48252726 41171342 36059929 32163835 28841973 26443597 24438212 23266393
5494 23266393 22906794 22388398 21776664 21807384 22420764 22612617 22736025 23915792 26134066
5485 26134066 28935688 31892093 35540010 40633901 46796478 54434528 63631130 74243062
5477 74243062 87903568 105657157 126478158 149967541 178349480 212382902 242255340
5470 242255340 245209235 217368570 183341163 158966592 145473537 140405246 139938449 139910435
5462 139910435 141216950 147970009 163335137 188698609 219026804 235255016 216324358
5455 216324358 174941969 135715083 106322015 85740772 70634696 59131268 50335398
5448 50335398 43743067 38690924 34526741 30280543 26342173 23324727 21310110 19878233
5440 19878233 18597524 17021970 15505836 14388220 13454350 12824010 12217877 11352544 10374498
5431 10374498 10164639 10469932 10461462 10874296 11064354 11383635 11849884 12471538 13473125 14901402
5421 14901402 17099133 20044924 23730604 27349994 29135293 28878975 27030829 23446156
5413 23446156 19414618 15875987 12987155 10747413 9022637 7938890 7290719 6784592
5405 6784592 6561722 6523976 6449760 6001762 5158093 4719888 4767784 4600539 4046492 3743832
5395 3743832 3804876 3492668 3238738 2782476 2125324 2033539 2329824 2237514 1724301 1610500
5385 1610500 1707573 1541020 1194932 1161393 1817025 2187766 2122391 1674090 939528 721201
5375 721201 1023585 1361487 1392006 1565612 2307876 2415782 2163432 1413335 322855 -48009
5365 -48009 170764 601397 1028629 1329008 1022900 413802 96162 -79425 -247051 -146904
5355 -146904 645 -11732 -346241 -587356 -877511 -1076716 -796339 55350 924791 1225939
5345 1225939 990625 935756 1157349 1218166 1523898 1676154 1496843 1394762 1056535 687394
5335 687394 443631 389969 661961 634435 610560 513437 380232 661371 579702 442017 507111
5324 507111 648346 537190 149628 65795 -106927 -475476 -320327 181370 581786 359310
5314 359310 -284401 -276445 356458 657663 449269 247147 201240 165960 555252 985458
5304 985458 1025363 875151 1091139 1683732 2343660 2755160 3710460 4939801 5934961 6108562
5294 6108562 5157531 3884263 2560796 1466441 989563 658042 354711 55072 66600
5285 66600 223862 194163 100677 295523 515495 447061 435970 361883 -192953 -919292 -621495
5274 -621495 -63744 7492 -437859 -778943 -581867 -150085 108864 -128688 -790274 -1011557
5264 -1011557 -885485 -1032918 -832091 -555796 -336111 -69636 330328 371553 417225 780887
5254 780887 819172 683120 831937 755493 450608 170528 -370482 -574768 -578604 -312625
5244 -312625 -120029 -1527 -211991 -499930 -378134 95309 589052 715671 896936 1328760
5234 1328760 1431619 1450736 1393759 1209724 1338158 1151255 845511 420768 187656 245365
5224 245365 357965 242482 -28532 170418 258266 251067 349442 431799 91926 -41970 72119
5213 72119 56232 40012 -129545 -193618 -182433 126050 218832 205730 468786 828631 987904
5202 987904 675217 380575 672801 424031 35111 -51576 37913 304378 423564 516473
5192 516473 557030 565356 609367 824448 678695 228598 223439 567702 479457 117688 71871
5181 71871 153260 181268 179580 -7784 201528 393340 366335 284071 13342 -47707 117670
5170 117670 400043 693734 612975 497872 644332 733680 555037 546828 680568 786279
5160 786279 422572 438259 421407 -21742 -151450 -52715 212193 290046 60637 -171094
5150 -171094 -112976 -80280 -19467 318478 608695 357248 -67640 163765 139403 158020 206279
5139 206279 113577 174503 258080 482391 784378 1041344 1219059 904484 274871 -326595
5129 -326595 -569355 -625913 -437961 -126893 180106 399317 424666 199536 -150894 -151608 135158
5118 135158 370413 573111 433068 338042 326625 477060 418230 187870 -270909 -243084
5108 -243084 333004 792659 630533 93078 42661 19620 -5341 -322884 -742801 -689346
5098 -689346 -245394 -90762 -51986 53662 65977 -40466 -81367 -69984 -103644 -107022 -259795
5087 -259795 -261386 16538 400044 578020 347207 186170 70520 -235530 -815780 -1157481
5077 -1157481 -1105912 -453555 64882 281872 147233 -99279 -150234 -216879 -448122 -47973
5067 -47973 402145 600556 471302 701550 676579 255125 107416 30902 -142556 -333464
5057 -333464 -390756 -404086 -474383 -306954 43996 170865 66444 -199005 -218754 -425589
5047 -425589 -596955 -269968 -311899 -316529 345105 624672 577212 741627 898162 1059917
5037 1059917 1145832 840094 664750 567796 163835 -393781 -534180 -352938 -120761 96230
5027 96230 155523 64369 -251989 -726268 -971417 -751547 -215330 -2615 6973 -224126 -230069
5016 -230069 199255 160031 -45480 -41965 -257035 -412920 -348936 -174232 -362896 -510698
5006 -510698 -503814 -627634 -592285 -614196 -944732 -954326 -812881 -721604 -394859 -130633 -124149
4995 -124149 12786 446741 585250 28276 -327532 -366729 -511637 -841569 -858789 -849774
4985 -849774 -1097304 -910288 -609273 -368691 -369350 -1077524 -1261239 -753183 -374799 -107982
4975 -107982 12105 -186870 -327443 -330435 -495422 -488546 -494701 -482955 -500452 -432851 -280365
4964 -280365 752 475915 596016 504574 -137436 -944130 -1315781 -1011487 -469190 -28883
4954 -28883 231868 174979 222707 230012 271945 443075 442778 57276 -134534 -84457 -6447 283804
4942 283804 640698 809499 935993 793371 391731 152841 264195 271138 94549 -22601
4932 -22601 -358441 -642265 -380742 -136963 -166826 -672381 -715575 -641632 -344820 95095
4922 95095 -38065 -162618 -198419 -613494 -1084390 -1251209 -812601 -588755 -711812 -592452
4912 -592452 -307065 -94818 80547 129880 -11967 -64719 157271 37852 74372 417296
4902 417296 556074 218124 176958 396698 411978 265045 -182656 -628888 -643890 -431512
4892 -431512 -155527 268748 488413 295192 -128699 -226175 199110 209885 95694 -66652
4882 -66652 -247473 -236407 -421972 -486402 71047 728958 413202 -291960 -839997 -1092402
4872 -1092402 -1253685 -1226714 -792108 -432323 -242488 -279864 14450 566215 508950 278708
4862 278708 106390 276911 566362 689778 732153 862550 1080563 942055 994230 830299
4852 830299 -58464 -719972 -859486 -661769 -590711 -643546 -624734 -527635 -475101 -478326 -307296
4841 -307296 -152147 70875 33444 -180539 127935 -34059 -415037 -234987 219283 473510
4831 473510 511396 72086 -387372 -660468 -630897 -562276 -463513 -500993 -597000 -942620 -1504940
4820 -1504940 -1735502 -1459800 -895054 -654908 -575340 -364051 5511 454963 761084 697661
4810 697661 623067 476984 87605 12709 28099 117715 295298 313928 241593 208571 109248
4799 109248 -556066 -802977 -346464 448549 887613 711367 472656 309180 314509 182616
4789 182616 171944 308301 160616 -87114 -163258 -271678 -482673 -715665 -808579 -652953
4779 -652953 -601602 -135120 120896 251716 341440 251658 -60086 -187454 -110319 38983
4769 38983 -164485 -984083 -1214170 -833778 -413955 -480103 -713927 -636662 -301747 -298950 -385563
4758 -385563 -364795 97958 726168 647027 489615 533914 204438 -105823 -144029 136986
4748 136986 416327 675174 602598 301101 -157354 -1064582 -1658355 -1308178 -879612 -763900
4738 -763900 -682335 -619668 -767861 -1324350 -1519941 -975646 -144147 69354 -303015 -431027
4728 -431027 -1038122 -1123130 -770962 -709887 -604413 -135732 485342 748892 838509 734969
4718 734969 499857 79874 -312985 -415750 67390 494119 547672 -250376 -649431 -389768
4708 -389768 -578827 -959811 -1096293 -738759 -867022 -860499 -983549 -949488 -500392 136661
4698 136661 199895 97224 144259 399763 1038243 1467148 1332754 659695 21362 -21311
4688 -21311 187385 156369 -41197 109249 290397 -199263 -605974 -750181 -851280 -729427
4678 -729427 -348243 -182591 -486284 -807229 -704525 -522505 -568206 -971958 -1184629 -1176122
4668 -1176122 -874129 -244263 379254 579286 326158 112916 -43929 -496908 -643597 -1008089
4658 -1008089 -998133 -492761 -299895 -139313 -102027 -94566 -266108 -262316 -32951 51221 136284
4647 136284 139200 231968 514545 696311 566000 347260 106565 37026 -30234 -274342 -347163
4636 -347163 35031 344278 126187 41063 -146924 -411225 -931186 -1351043 -1352826 -1433864
4626 -1433864 -1176664 -555447 -182233 -191319 -161630 60311 319269 313277 204206 146861 32114
4615 32114 -276401 -585157 -834067 -991498 -951299 -942605 -1126879 -996254 -429983 76001
4605 76001 280561 586748 588665 383987 362289 473186 542995 317965 -11062 -166109 -163671
4594 -163671 -152668 19753 284223 315350 257986 374038 354503 -210134 -724007 -798811 -854375
4583 -854375 -843903 -672703 -757895 -733756 -641208 -784307 -1409718 -1846089 -2005868 -1752048
4573 -1752048 -1679417 -1581620 -900619 -681068 -942426 -860082 -531708 -58474 448714 715877
4563 715877 677997 243442 -98197 -311259 -375973 -277836 -361662 -529703 -322981 10149
4553 10149 94036 122754 134042 476922 1082107 1035361 162657 -683339 -942852 -1406738 -1766106
4542 -1766106 -1409580 -901216 -780455 -642010 -454975 -548303 -695725 -797722 -488891 -423223
4532 -423223 -877845 -885072 -651692 -432903 -329566 -453811 -730245 -856664 -716595 -506792
4522 -506792 -466742 -689503 -891924 -457296 -250139 -858948 -1018584 -1035917 -1136113 -1185307
4512 -1185307 -1428194 -1637870 -1530640 -1114161 -478567 -18253 -102138 -367131 -297477 277065
4502 277065 270310 -70936 -363241 -527346 -805775 -758855 -369252 -292094 -315579 -247252 147408
4491 147408 481829 646964 804678 575219 -189745 -743793 -634411 10390 342994 294254
4481 294254 491891 484467 387551 253833 -48778 -497626 -656690 -347311 175455 187555
4471 187555 -172217 -660870 -740866 -915504 -1145110 -931481 -525966 -613568 -425400 46389
4461 46389 425299 187195 -436127 -865492 -657123 -93382 -21934 -169758 -165824 -220546 -366124
4450 -366124 -489010 -680692 -680218 -625295 -470703 -150112 94264 93238 -51337 -225281 84402
4439 84402 508431 512836 441927 352295 -113798 -379169 -68312 53496 -97647 -193642 85250
4428 85250 476757 183647 -202329 -319800 -353960 -199659 127523 530816 651239 660799
4418 660799 507109 358005 225624 -55193 118453 474454 528765 299761 38660 -280262
4408 -280262 -293144 -197934 220520 225635 -40636 38886 367668 119931 -391106 -669431 -976764
4397 -976764 -1464332 -1715804 -1085704 -438565 -228623 95938 83035 -307165 -716563 -498204
4387 -498204 123035 237240 -470325 -1088202 -1293836 -1033113 -503723 150787 304053 262971
4377 262971 490086 561014 527876 414938 343195 -63255 -458412 -794539 -1139002 -1198736
4367 -1198736 -639978 -419457 -368332 -410866 -467510 -468887 -503616 -320033 -795110 -1093659 -861813
4356 -861813 -465935 -493352 -904891 -1153394 -941256 -746087 -627116 -584297 -556293 -443583
4346 -443583 -46114 452397 510484 751809 1179665 1079269 973677 825085 550030 285604
4336 285604 -411211 -962985 -837022 -704629 -795819 -638487 -262498 132615 343831 270164
4326 270164 131434 190622 116047 301864 504516 541589 611441 882537 918241 599533 110247
4315 110247 -301505 -366078 -23255 588041 792439 399482 185192 -35805 -696149 -804240
4305 -804240 -661458 -769741 -612722 377219 832988 837992 999995 1323419 2131177 3458397
4295 3458397 4830516 5334258 4630539 3424722 2391954 1569293 1300160 1167424 922433
4286 922433 675470 730887 930494 1119832 1144826 724554 -164044 -555679 -222953 137846
4276 137846 168652 144196 -125097 -364070 -64082 116510 141332 171038 153608 513505 1160547
4265 1160547 1036615 719464 455899 144651 38646 250372 641214 700982 385055 414504
4255 414504 424819 257807 322663 288543 260371 348529 792798 910846 612852 405783 245875
4244 245875 -351500 -675432 -437870 -133420 235980 559227 403144 130177 83049 467537
4234 467537 614702 418536 98398 -182215 -297844 -178591 32711 77884 -278191 -427156
4224 -427156 -74161 244894 334273 271844 212119 -139543 -532091 -813964 -1173560 -1365045
4214 -1365045 -1288413 -997500 -772871 -581253 -837054 -597424 -87445 -9248 -203814 2568
4204 2568 512201 342412 93041 322230 466388 314523 38039 -267553 -301743 -289242
4194 -289242 -643585 -1112406 -1113158 -1038046 -1051247 -835465 -398961 -226046 -322381 -318874 -301749
4183 -301749 -170006 -173775 -110947 -398677 -970928 -950863 -592121 -914607 -1520903 -1472768 -1073203
4172 -1073203 -826599 -958760 -1034856 -861026 -560454 -163443 263347 226430 -65183 -871580
4162 -871580 -1511273 -1577638 -1560328 -1501595 -1032378 -652366 -664814 -737670 -654375 -632888 -559949
4151 -559949 -59773 80563 -348138 -424871 -240214 84048 612746 1224983 1265189 831110
4141 831110 316647 -42569 -316420 -553793 -374122 -232373 -337418 -393180 -296997 -283197
4131 -283197 -261920 -139591 -84013 -201260 -685117 -1161944 -1784421 -1924068 -1433355 -906163
4121 -906163 -709733 -594402 -478990 -319581 -205485 -517765 -772939 -639442 -241148 -92280
4111 -92280 -353676 -279652 -3984 -146852 -414064 -623502 -480805 -174470 -4493 69092
4101 69092 133160 -55318 -453547 -925414 -902387 -1023440 -1227104 -1030070 -877059 -1033421
4091 -1033421 -1027352 -838030 -877281 -1055531 -1297736 -1039361 -543596 -585511 -699112 -535253
4081 -535253 -670708 -1145133 -1248772 -1232996 -949557 -418435 -7013 510649 908069 613218
4071 613218 345233 441569 587471 567412 797592 870309 707258 374912 -170101 -147137
4061 -147137 426740 770036 443177 80492 181553 405473 214731 -460783 -982764 -1055688
4051 -1055688 -687235 -336800 -514229 -665677 -518827 -447123 -405480 -235574 -310107 -660953
4041 -660953 -1087831 -1297629 -1088584 -867687 -649735 -195067 81091 57551 -167412 -494663
4031 -494663 -617787 -424939 -497202 -783384 -965722 -928797 -682823 -264206 -405805 -1031669
4021 -1031669 -1204132 -1006532 -664736 -211971 -131945 -417961 -532234 -170531 -352681 -535551
4011 -535551 -196939 -64818 -44465 344465 592231 748942 805127 483301 233726 298164
4001 298164 146796 -297108 -612246 -741914 -878704 -1073777 -1292778 -1483518 -1523391 -1370474
3991 -1370474 -1047379 -860771 -1099113 -1048781 -537731 -24018 45866 97531 396157 483227
3981 483227 263581 -113453 -102484 106433 317809 387916 54414 -36711 -74772 -153888 159483
3970 159483 259082 136705 -232562 -411606 72754 298088 105055 -116428 -395689 -912556
3960 -912556 -1192323 -1118402 -1345743 -1760426 -1947154 -1753168 -1181318 -639903 -118678 -98010
3950 -98010 -281914 -267234 -464192 -777148 -665863 -907727 -861984 -386511 -148404 -60821
3940 -60821 -208574 -658497 -1200715 -1246812 -648951 -326793 -618421 -890936 -1214596 -1179212
3930 -1179212 -1026419 -825642 -547125 -399006 -244295 -206250 -117412 -237002 -664426 -774004
3920 -774004 -649482 -664130 -777947 -809373 -705456 -488798 -205527 75751 340877 168967
3910 168967 -308871 -327851 -481440 -725752 -1012294 -1467439 -1485376 -1353893 -879474 -598361
3900 -598361 -580592 -535833 -566098 -335006 178654 227009 -9928 -270652 -644886 -644571 -68240
3889 -68240 247593 377435 520669 627699 833889 577670 328720 192706 182314 198747
3879 198747 265121 309596 388399 225621 141579 417326 715935 605038 260055 -183903
3869 -183903 -581765 -855927 -699561 -576079 -519633 -606757 -942302 -1387925 -1691543 -1431577
3859 -1431577 -975540 -667303 -381015 -251361 -199172 -168673 -186356 -504098 -475897 9797
3849 9797 516005 707677 538646 -170525 -667111 -697752 -475020 -388999 -685896 -961501
3839 -961501 -994055 -600981 -149185 -148382 -248823 -337906 -411797 -614309 -351209 76693 -24933
$$ [...]
##END NTUPLES=NMR SPECTRUM
##END=
