##TITLE=C13_Pr 4687
 CDCl3, 4800 sc

 25.12.2020
##JCAMPDX= 6.0         $$ Bruker NMR JCAMP-DX V2.0
##DATA TYPE= NMR SPECTRUM
##DATA CLASS= NTUPLES
##ORIGIN= UXNMR, Bruker Analytische Messtechnik GmbH
##OWNER= root
$$ XWIN-NMR		Version 3.5
$$ Fri Dec 25 16:37:13 2020 Russian Standard Time (UT+4h)  she@DPX200
##.OBSERVE FREQUENCY= 50.327896
##.OBSERVE NUCLEUS= ^13C
##.ACQUISITION MODE= SIMULTANEOUS
##.ACQUISITION SCHEME= undefined
##.AVERAGES= 4800
##.DIGITISER RES= 17
##SPECTROMETER/DATA SYSTEM= spect
##.PULSE SEQUENCE= zgpg30
##.SOLVENT NAME= CDCl3
##.SHIFT REFERENCE= (INTERNAL, CDCl3, 0, 222.675)
##AUDIT TRAIL= $$ (NUMBER, WHEN, WHO, WHERE, WHAT)
$$ ##TITLE= Audit trail, XWIN-NMR		Version 3.5
$$ ##JCAMPDX= 5.01
$$ ##ORIGIN= Bruker BioSpin GmbH
$$ ##OWNER= she
$$ F:/spectra/data/she/nmr/c13/1/pdata/1/auditp.txt
$$ ##AUDIT TRAIL=  $$ (NUMBER, WHEN, WHO, WHERE, WHAT)
(   1,<2020-12-25 16:34:57.53 +0400>,<she>,<DPX200>,
      <created by zg, POWCHK disabled, PULCHK disabled
       terminated by command 'halt'
       configuration hash MD5:
       00 E9 B6 7A A2 85 ED C7 34 08 36 98 17 FE 4E 26
       data hash MD5: 32K
       15 E9 A8 B5 B8 E9 CB 0A 41 8B 8C F8 F6 3A C5 44>)
(   2,<2020-12-25 16:34:59.89 +0400>,<she>,<DPX200>,
      <Start of raw data processing
       efp BC_mod = 2 LB = 1 FT_mod = 6 PKNL = 1 PHC0 = -258.9064 PHC1 = 23.16242 SI = 32K 
       data hash MD5: 32K
       81 D9 D8 C0 E6 41 E1 B2 37 D1 4D 1C 22 E1 16 63>)
(   3,<2020-12-25 16:35:02.46 +0400>,<she>,<DPX200>,
      <abs ABSG = 5 
       data hash MD5: 32K
       0D B1 30 3D AE A1 E7 25 C4 C0 11 29 05 75 CC 38>)
(   4,<2020-12-25 16:36:16.71 +0400>,<she>,<DPX200>,
      <pk PHC0 = 0.9960948 PHC1 = 0.8000038 
       data hash MD5: 32K
       8E 98 9B 0E 83 83 51 07 CB 0A D9 BF 70 15 13 5A>)
(   5,<2020-12-25 16:36:19.31 +0400>,<she>,<DPX200>,
      <abs ABSG = 5 
       data hash MD5: 32K
       42 AE 96 B3 6A CD 3D 9E 75 AC 58 0F A3 D6 55 F5>)
$$ ##END=
$$ 
$$ hash MD5
$$ 24 62 73 7B 1D 1F F1 2B AA 33 FB 6A 92 3F 70 20
##$RELAX= 
##$RELAX= 
##$RELAX= 
##$RELAX= 
##$RELAX= 
##$RELAX= 
##$RELAX= 
##$RELAX= 
$$ Bruker specific parameters
$$ --------------------------
##$DU= <F:/spectra>
##$EXPNO= 1
##$NAME= <c13>
##$PROCNO= 1
##$TYPE= <nmr>
##$USER= <she>
##$AMP= (0..31)
100 100 100 100 100 100 100 100 100 100 100 100 100 100 100 100 100 100 
100 100 100 100 100 100 100 100 100 100 100 100 100 100 
##$AQSEQ= 0
##$AQ_mod= 1
##$AUNM= <au_zg>
##$AUTOPOS= <>
##$BF1= 50.322709
##$BF2= 200.13
##$BF3= 50.322709
##$BF4= 500.13
##$BF5= 500.13
##$BF6= 500.13
##$BF7= 500.13
##$BF8= 500.13
##$BYTORDA= 1
##$CFDGTYP= 0
##$CFRGTYP= 5
##$CHEMSTR= <none>
##$CNST= (0..31)
1 1 145 1 1 1 1 1 1 1 1 1 1 1 1 1 1 1 1 1 1 1 1 1 1 1 1 1 1 1 1 1 
##$CPDPRG= <waltz16>
##$CPDPRG1= <>
##$CPDPRG2= <waltz16>
##$CPDPRG3= <>
##$CPDPRG4= <mlev>
##$CPDPRG5= <mlev>
##$CPDPRG6= <mlev>
##$CPDPRG7= <mlev>
##$CPDPRG8= <mlev>
##$CPDPRGB= <>
##$CPDPRGT= <>
##$D= (0..31)
$$ [...]
##$SUBNAM4= <"">
##$SUBNAM5= <"">
##$SUBNAM6= <"">
##$SUBNAM7= <"">
##$SUBNAM8= <"">
##$SUBNAM9= <"">
##$SW= 239.972175391363
##$SWIBOX= (0..15)
0 1 3 0 0 0 0 0 0 0 0 0 0 0 0 0 
##$SW_h= 12077.2946859903
##$TD= 32768
##$TD0= 1
##$TE= 0
##$TE2= 300
##$TE3= 300
##$TEG= 300
##$TL= (0..7)
120 120 120 120 120 120 120 120 
##$TP= (0..7)
150 150 150 150 150 150 150 150 
##$TP07= 0
##$TPNAME0= <>
##$TPNAME1= <>
##$TPNAME2= <>
##$TPNAME3= <>
##$TPNAME4= <>
##$TPNAME5= <>
##$TPNAME6= <>
##$TPNAME7= <>
##$TPOAL= (0..7)
0.5 0.5 0.5 0.5 0.5 0.5 0.5 0.5 
##$TPOFFS= (0..7)
0 0 0 0 0 0 0 0 
##$TUNHIN= 0
##$TUNHOUT= 0
##$TUNXOUT= 0
##$USERA1= <user>
##$USERA2= <user>
##$USERA3= <user>
##$USERA4= <user>
##$USERA5= <user>
##$V9= 5
##$VALIST= <valist>
##$VCLIST= <CCCCCCCCCCCCCCC>
##$VD= 0
##$VDLIST= <DDDDDDDDDDDDDDD>
##$VPLIST= <PPPPPPPPPPPPPPP>
##$VTLIST= <TTTTTTTTTTTTTTT>
##$WBST= 1024
##$WBSW= 4
##$XGAIN= (0..3)
0 0 0 0 
##$XL= 0
##$YL= 0
##$YMAX_a= 30201632
##$YMIN_a= -24459799
##$ZGOPTNS= <>
##$ZL1= 120
##$ZL2= 120
##$ZL3= 120
##$ZL4= 120
##$ABSF1= 222.6753
##$ABSF2= -17.32152
##$ABSG= 5
##$ABSL= 3
##$ALPHA= 0
##$AQORDER= 0
##$ASSFAC= 0
##$ASSFACI= 0
##$ASSFACX= 0
##$ASSWID= 0
##$AUNMP= <proc_1d>
##$AZFE= 0.1
##$AZFW= 0.5
##$BCFW= 0
##$BC_mod= 2
##$BYTORDP= 0
##$COROFFS= 0
##$CY= -3
##$DATMOD= 1
##$DC= 0
##$DFILT= <>
##$DTYPP= 0
##$F1P= 0
##$F2P= 0
##$FCOR= 0.5
##$FTSIZE= 32768
##$FT_mod= 6
##$GAMMA= 0
##$GB= 0
##$INTBC= 1
##$INTSCL= 4.134877e-10
##$ISEN= 128
##$LB= 1
##$LEV0= 0
##$LPBIN= 0
##$MAXI= 10000
##$MC2= 0
##$MEAN= 0
##$ME_mod= 0
##$MI= 0.1934396
##$NCOEF= 0
##$NC_proc= 0
##$NLEV= 6
##$NOISF1= 120.0001
##$NOISF2= 80.00006
##$NSP= 0
##$NTH_PI= 0
##$NZP= 0
##$OFFSET= 222.6753
##$PC= 1.4
##$PHC0= -257.9103
##$PHC1= 23.96242
##$PH_mod= 1
##$PKNL= yes
##$PPARMOD= 0
##$PSCAL= 0
##$PSIGN= 0
##$REVERSE= no
##$SF= 50.322729019225
##$SI= 32768
##$SIGF1= 140
##$SIGF2= 120
##$SINO= 11.81781
##$SIOLD= 32768
##$SREGLST= <13C.CDCl3>
##$SSB= 0
##$STSI= 32768
##$STSR= 0
##$SW_p= 12077.2946859903
##$SYMM= 0
##$S_DEV= 0
##$TDeff= 32768
##$TDoff= 0
##$TI= <>
##$TILT= no
##$TM1= 0
##$TM2= 0
##$TOPLEV= 0
##$USERP1= <user>
##$USERP2= <user>
##$USERP3= <user>
##$USERP4= <user>
##$USERP5= <user>
##$WDW= 1
##$XDIM= 32768
##$YMAX_p= 431624565
##$YMIN_p= -4511883
$$ End of Bruker specific parameters
$$ ---------------------------------
##NTUPLES= NMR SPECTRUM
##VAR_NAME=  FREQUENCY,     SPECTRUM/REAL,   SPECTRUM/IMAG
##SYMBOL=    X,             R,               I
##VAR_TYPE=  INDEPENDENT,   DEPENDENT,       DEPENDENT
##VAR_FORM=  AFFN,          ASDF,            ASDF
##VAR_DIM=   32768,         32768,           32768
##UNITS=     HZ,            ARBITRARY UNITS, ARBITRARY UNITS
##FACTOR=    0.368581032318806, 1,           1
##FIRST=     11205.6284273429, 0,            0
##LAST=      -871.666258647356, 0,           0
##MIN=       -871.666258647356, -4511883,    0
##MAX=       11205.6284273429, 431624565,    0
$$ Real data points
##PAGE= N=1
##DATA TABLE= (X++(R..R)), XYDATA
$$ [...]
18055 -141928 78861 89884 86008 352859 413437 488685 1108725 1343926 1240243 1616630
18045 1616630 2309722 2393106 1887943 1043718 413017 42936 -311653 -776085 -768329 -535942
18035 -535942 51967 722071 624852 548807 -296292 -1105466 -1860723 -2069221 -1026709 -458878
18025 -458878 -265811 15748 49578 817549 1795097 1825484 1601998 1907629 2020007 1641626
18015 1641626 1281797 1507223 1544129 1011013 438711 311526 3781 -568466 -602968 -883493
18005 -883493 -687916 162726 678015 494011 -143391 10461 265678 -388536 -267748 384913
17995 384913 -81824 -1239838 -1914100 -1956948 -1743048 -1425387 -1341011 -1009058 -358310 -1165
17985 -1165 80852 -272523 -904327 -918728 -981849 -1793575 -1858547 -896566 132469 273992
17975 273992 643439 1033937 543428 49271 -184805 -298097 -669725 -394546 561616 874279
17965 874279 708511 385550 547054 774035 1635564 2457398 2383771 2095554 2596461 3046567
17955 3046567 2939682 2729792 3013095 2446195 1535924 1068785 1320704 1497960 996780
17946 996780 681469 29261 -698651 -754432 -632504 -292807 457524 600461 76079 290114
17936 290114 654272 1151346 1547029 1571661 1323559 688829 651019 840201 289344 -42405
17926 -42405 -97080 -216430 -404326 -624719 -853270 -1257187 -636724 578832 1752773 2315282
17916 2315282 1974039 1015478 -293977 -552175 317893 1768613 2464358 1387444 378265
17907 378265 63102 2587 121072 -301884 -856167 290340 1110282 897253 168532 -909066
17897 -909066 -1322225 -955382 -840110 -1104062 -981171 -527066 -757674 -1443371 -2133286 -2166846
17887 -2166846 -1644320 -1527548 -1395613 -951633 -1178630 -2126602 -2895184 -2343947 -709164
17878 -709164 240084 -66596 -425986 -1130583 -1142376 -1220071 -1278762 -795972 -92517 705970
17868 705970 904259 868319 1149035 933553 200070 -204592 -472611 -214139 200995 -126528
17858 -126528 -1093744 -2026571 -2115053 -1045233 -222994 -371864 -747580 -952089 -578470 -14085
17848 -14085 -351552 -174273 -187857 -463096 -1664187 -2493785 -2151044 -1471295 -119275 753768
17838 753768 794150 247745 -783512 -1303936 -1411261 -1010953 -869359 -765921 -638362 -571910
17828 -571910 -268578 -211229 -544621 -1029484 -1081159 -578808 4874 -202361 15139 466190
17818 466190 607450 415899 191115 -232078 -322957 -153521 62097 -236791 -824206 -1756078
17808 -1756078 -2000338 -1328985 -620395 -591319 287770 1369049 1066840 -355150 -1325715
17799 -1325715 -1306149 -1326648 -1243749 -1090134 -1417228 -1686932 -1374883 -965825 -712521 -577220
17789 -577220 -38991 475476 818088 792376 670781 835531 755475 675811 1043594 1115603
17779 1115603 641755 740822 1501786 1568773 1630064 1280632 1032927 1204795 1196887 477293
17769 477293 184208 254818 -81609 -186288 706640 1071741 978135 431059 -646590 -684592
17759 -684592 -323155 100733 178357 -217899 -733096 -883101 -574310 -466816 -349139 396758
17749 396758 983350 1193881 1761392 2002680 1620503 1169011 1359130 1485741 1147003 1033554
17739 1033554 917938 88344 -999140 -1099985 -570299 -86045 -156962 -92612 813701 1604437
17729 1604437 1358216 1096960 475971 -1096109 -1505425 -630494 -228709 -698136 -895287
17720 -895287 -629268 -141782 -32608 -17526 -367392 -359073 -254928 345104 999386 843128
17710 843128 215597 -143690 -265729 -896960 -1192840 -944141 -1203693 -1557706 -1264366 -1071808
17700 -1071808 -1027100 -1412182 -1514288 -795534 257785 1270771 1514164 749324 831516
17691 831516 1729435 1702911 1233311 1123754 994988 473564 -63260 38601 280098 908569
17681 908569 1299708 1028309 1032621 1188289 799227 108204 -168528 -224204 -97291 -723423
17671 -723423 -2057853 -2100201 -1102710 -597422 -244411 -344630 -865255 -553673 209638 303392
17661 303392 500876 755613 1054865 1118561 1106414 1751494 2340785 2492307 2307456 2472222
17651 2472222 2508364 2250713 2021813 1165907 125957 -336195 -932461 -763089 -483745
17642 -483745 -509861 -259983 261372 740819 1358873 1163204 259404 198332 79203 -209364
17632 -209364 -584251 -1008753 -1040472 -894814 -151630 1309638 1449623 683022 17268 -267540
17622 -267540 3812 171158 -685799 -1125490 -682987 1695 136488 -553054 -918173 -1337894
17612 -1337894 -1402404 -1193395 -550355 -261886 -608947 -585178 -237600 94820 153541 325788
17602 325788 764171 1038114 1331108 1644055 1752021 1450357 1217545 479033 -329475 -446476
17592 -446476 31051 381625 395554 723353 584346 328985 496125 78680 -498305 -644224
17582 -644224 -480828 -648599 -403643 -82149 -246488 -378735 -99167 242543 666224 818880
17572 818880 735381 361204 -418296 -650688 -939447 -1223077 -960963 -200036 -131782 -501943
17562 -501943 -161892 -412800 -1512726 -1866014 -1782507 -2005095 -1840944 -891020 -482068 -297441
17552 -297441 -323483 -794798 -95833 1162798 991216 357126 -108944 -165279 114651 703537
17542 703537 490344 -5144 290256 971332 1486388 1470469 1805668 2026848 1436366 671086
17532 671086 250726 -200345 80446 75925 63684 512888 730510 499507 -314431 -635602
17522 -635602 418626 1504757 1905747 1131373 -387760 -727792 -605422 -607122 -1024367
17513 -1024367 -1742857 -2237262 -2693141 -2351464 -1652409 -1452192 -1513022 -902684 591471
17504 591471 1092753 988136 704829 113946 -227876 -624711 -843793 -696118 -491375 -377212
17494 -377212 -194997 -53779 -383953 -1006311 -1985844 -2733009 -1614632 -545284 -100517
17485 -100517 328070 -42886 -668725 -549610 -541065 -652503 -444594 -338561 -489293 -358806
17475 -358806 -405659 -268583 -65649 -310649 189304 844621 1497766 1617513 1420748 1189930
17465 1189930 572844 283211 689346 763386 364379 701875 775763 310344 -154703 -288578
17455 -288578 360008 1202997 1233332 1372103 1437361 950453 595404 1023674 1950192 2149383
17445 2149383 1667131 995866 500971 462846 366358 -395502 -1117954 -865111 -251748 -31720
17435 -31720 -304797 -376301 -133299 419883 1292079 1636312 1665072 956329 781074 1081864
17425 1081864 1133780 395257 -335836 -571411 -600853 -354664 -623599 -458771 -40830 407587
17415 407587 732883 -164363 -1189093 -1586487 -1743751 -2066801 -2391459 -2711237 -2371443
17406 -2371443 -1162650 -76553 470836 633904 934044 740487 -8252 -453008 -1186234
17397 -1186234 -1467599 -953453 -466078 -349769 -676180 -922466 -950898 -845859 -985006 -513887
17387 -513887 711715 1093990 832467 -157997 -929884 -1426580 -1247142 -1150937 -1633898 -1348064
17377 -1348064 -831788 -1426408 -1979697 -1676586 -1051984 -222048 -313486 -316389 89944 322327
17367 322327 -70802 -6749 -192323 -208326 -131691 -384241 -73670 557071 426586 -8716
17357 -8716 -72378 -836724 -1592458 -1656716 -1884779 -2114449 -1761109 -678932 294707 67901
17347 67901 -793671 -1322787 -909670 -607844 26051 4849 -60289 641491 946625 276340
17337 276340 -748035 -992526 -383931 -399834 -163858 -331033 -845692 -1248075 -948956 -217534
17327 -217534 -409843 -574220 -528691 -533231 -63172 1067635 965727 -173948 35367 1403507
17317 1403507 1643006 932834 419364 274838 435743 132767 -681268 -670603 349101
17308 349101 1091149 1390103 790327 335030 889982 1561666 1704073 1640018 1604837 1046694
17298 1046694 223139 149479 1124302 1444257 1478451 1597047 1751070 1252492 1255968 1640185
17288 1640185 1478384 1957294 2763063 2759315 2682766 2264438 999846 -656564 -1529931 -1369937
17278 -1369937 -1166573 -645501 129109 38665 -952275 -871055 -862503 -621998 471694 821400
17268 821400 559757 902874 776969 -28400 -585171 -1258458 -1147679 -713236 -827145 -975574
17258 -975574 -587211 -1265943 -1927439 -1254006 -194111 336489 594555 759871 935126
17249 935126 732300 888140 844900 541949 172376 158974 -86094 -939930 -920827 -502596
17239 -502596 -363652 967 103959 725550 932397 497413 -483780 -909588 -574389 -841164
17229 -841164 -1216032 -831248 427712 1049872 1286074 891217 404308 247365 -7721
17220 -7721 117836 514104 1195874 1667461 1111123 410972 267502 953020 1040408 801211
17210 801211 -23786 -1101129 -1401224 -1501218 -1430450 -1212077 -1482238 -1444912 -1082864 -735856
17200 -735856 -572611 -664644 -167094 -510847 -1067930 -644610 158550 784514 472757 460947
17190 460947 543448 -120288 259093 1059392 652549 -158311 179107 526411 413090 -471512
17180 -471512 -1060983 -574792 110477 342991 -40255 -719463 -979402 -1071458 -1117365 -490323
17170 -490323 558326 1059662 1371840 1678125 1092728 -52486 -1074559 -1199849 -1139514
17161 -1139514 -1022713 -896919 -368488 604678 1284456 1488309 1598529 1408940 1256358
17152 1256358 1164559 1165397 404244 -13896 -569745 -1205697 -1440175 -707291 520308 1294682
17142 1294682 1324280 1033768 17691 -205176 496226 559365 -402423 -1234646 -1409503 -914200
17132 -914200 251029 1077306 1794683 2521152 3288703 3452049 2725915 2519709 2127525
17123 2127525 1836389 2335239 2048895 1392761 865697 135024 -268214 509015 1203238
17114 1203238 1094385 623004 226460 -215591 -691622 -1230157 -1201453 -1547530 -2348546 -2347191
17104 -2347191 -1947373 -1175300 -782802 -792263 -710707 -748028 -1304061 -1173133 -897265 -683548
17094 -683548 -375808 -522362 -609331 -768145 -622796 258918 1194614 1449451 1485323 1765221
17084 1765221 2438772 2703229 2216748 1676022 1579849 1831899 1946897 1233687 339814 -115088
17074 -115088 -643364 -800924 -561875 -71460 -59126 -1000871 -1373737 -654241 77930 410759
17064 410759 901436 891884 990453 980591 684443 283041 -438491 -1460609 -1879967 -1776123
17054 -1776123 -1446680 -966454 -282546 366768 1519164 1834819 1630918 1514949 744428
17045 744428 -317264 -859954 -924671 -445495 211834 721697 585723 282558 505576 909583
17035 909583 1277334 1001902 989725 875516 454162 273072 -42025 -786049 -1130032 -316289
17025 -316289 148618 309336 242191 -271847 -885073 -1359853 -1630153 -1822904 -1155919 -775102
17015 -775102 -1512598 -1691436 -1057939 -883083 -1635345 -2033323 -2141630 -2767780 -2490846 -1563401
17005 -1563401 -1225394 -798642 -1047971 -1388478 -555798 434689 900523 493031 -741801
16996 -741801 -1420031 -404099 559916 97251 -855087 -1388215 -1750094 -1280075 -1024079
16987 -1024079 -1679812 -1824898 -1315159 -590618 -724614 -1124359 -1444514 -1325116 -831053
16978 -831053 -919235 -718797 -874392 -440762 497344 670665 -99835 -846676 -810457 -59170
16968 -59170 425128 694335 1096149 1037436 668015 381535 105809 128654 404838 346220
16958 346220 536739 688735 -236269 46361 942294 1360059 1292978 405852 275999 691588
16948 691588 1791542 2625715 2117476 1333918 466114 -227938 -223062 286670 527177 452677
16938 452677 332791 -41990 145893 502439 -611836 -586136 333619 581013 1278090 1678732
16928 1678732 1725127 1844942 1584127 939093 421190 304131 242758 -342316 -1094550 -1840219
16918 -1840219 -1712653 -1216422 -1215038 -2060108 -2433976 -1683761 -497527 93830 -648281 -1574845
16908 -1574845 -2452362 -2758714 -2284482 -1766047 -1654791 -1492595 -1273579 -482760 62536
16899 62536 233237 1064501 1315735 866047 -277590 -909446 -396999 3595 -390571 -610301
16889 -610301 -455317 422144 1109029 301593 -661511 -819021 -1161665 -1077200 -243858 781840
16879 781840 710432 7993 132766 915948 765245 362500 -544690 -1292243 -712518 -604237
16869 -604237 -1015004 -935821 -546542 -843129 -1230004 -837011 110158 1046366 2011132 2382543
16859 2382543 2158120 1400507 1199222 791160 -443955 -484907 -242690 -812745 -1407505
16850 -1407505 -882695 16355 505927 1229372 1389426 1314516 909396 310974 56022 -81443
16840 -81443 199690 682937 810785 301699 -207383 -420506 -784978 -230888 243936 -112617
16830 -112617 -962673 -1113101 -820054 -1080227 -1376543 -876370 -835877 -548929 -118383 117644
16820 117644 52284 329097 866764 608624 73067 225805 604140 128371 -349535 -757906
16810 -757906 -1126657 -1173892 -669365 -184208 -438817 -344122 -123059 -243565 646116 1745129
16800 1745129 1955747 1580013 1078185 61252 -1079681 -1971823 -2276252 -1973329 -1803534
16791 -1803534 -2278967 -2273003 -1387156 -638826 -333325 -391213 -337752 -898078 -1128259 -826223
16781 -826223 -1049913 -880565 -196794 194796 -60403 -496983 -920321 -1208156 -1302752 -669124
16771 -669124 272523 1002975 906907 106598 -215745 -51459 -262690 -500374 -340121 -800496
16761 -800496 -1087941 -163588 1004863 1345542 1062270 538885 56455 -684626 -881689
16752 -881689 -612098 -515540 47125 604961 232703 -604415 -304014 -48719 -98946 140527
16742 140527 650506 1149676 1094158 5069 -1626829 -2549037 -2649081 -1905524 -1229603
16733 -1229603 -1438145 -1316630 -604117 -163987 -238901 649032 1540078 768616 -223987 -907930
16723 -907930 -1239702 -1493412 -1957340 -1656174 -986 1755630 2386837 1869404 861828
16714 861828 284187 366398 113107 -447945 -477905 -228189 -210227 -718493 -654259 19651
16704 19651 779466 798213 1059130 818934 -89421 -655185 -1101173 -583813 114568 100932
16694 100932 -640602 -1261726 -685448 -390036 -1078844 -1301477 -1176954 -2290963 -3445737
16685 -3445737 -3746664 -3517796 -3243574 -2787007 -2147980 -2190282 -1938952 -2346105 -2453509 -1640300
16675 -1640300 -1288561 -577218 498503 1675895 1680893 707135 10845 -120221 -291079
16666 -291079 -811949 -993469 -996079 -968504 -1629338 -1744622 -1158178 -295162 567665 529659
16656 529659 476057 610861 643635 161903 60105 41508 -802593 -1303272 -1015802 -769138
16646 -769138 -833479 -449020 254490 468659 333647 563282 486460 -323746 -592882 -551196
16636 -551196 -192680 47343 92902 487125 723449 607754 249104 -197902 -160553 325062
16626 325062 252662 -74415 2114 281083 402450 31586 72186 463682 -360943 -2061780
16616 -2061780 -3012964 -2348791 -1369686 -574707 -355040 -236814 740333 1629201 2199439
16607 2199439 2618096 1751837 933199 932009 781047 397924 216310 74666 -110192 174018
16597 174018 387331 128025 -513013 -480251 25861 -501515 -618800 310808 934032 361823
16587 361823 -306388 -531007 100115 591842 411219 128772 518882 1101185 905482 353979
16577 353979 325785 593822 1220053 1573827 1557935 1423065 221625 -555690 -898812 -1051545
16567 -1051545 -615503 -988275 -1925460 -2163648 -1724226 -854837 -184355 -454586 -666326
16558 -666326 -732427 -477614 357904 1064132 1188849 1105384 1102615 1443380 1631170 1930523
16548 1930523 1997260 1355319 1471029 2034364 2188822 1544565 361045 -852216 -1249699
16539 -1249699 -1031286 -841436 -730930 -686708 -120880 -53578 -765761 -1141902 -1739776 -2062560
16529 -2062560 -1268056 -751840 -1042692 -1250396 -1449240 -1618671 -1880395 -1181427 -601415
16520 -601415 -652677 -92548 -11392 -217102 -153182 -22208 127461 393472 888322 1359274
16510 1359274 1565764 703159 139140 -646096 -1471652 -1488279 -578334 527609 1084360
16501 1084360 1301298 1227822 956310 1254543 1521185 1037944 194182 -550085 -741969 -498662
16491 -498662 -434675 -613787 -346719 101834 -338877 -970467 -516490 662992 820327 11826
16481 11826 444966 2206730 3353969 3191375 2683903 2596580 2254617 1540486 1591246 1526960
16471 1526960 650160 -348879 -522704 -385714 -100553 -331936 -1179137 -2153993 -2323127
16462 -2323127 -1850227 -1313031 -113955 1001676 1023317 1118573 935455 609558 413652
16453 413652 71865 -501362 -934767 -995397 -292159 -47218 -824111 -1038009 -977869 -977958 -1196537
16442 -1196537 -678617 -373320 -840213 -1349562 -1265842 -724606 -179295 39398 125398 -9120
16432 -9120 -306441 -116965 -356329 93309 472172 726187 784737 510557 261676 776838
16422 776838 1337161 1352415 1457768 610302 -515447 -674479 -877689 -902544 -835615 -650679
16412 -650679 -35633 181481 338388 137586 -751652 -1744600 -1552317 -647799 -251745 151101
16402 151101 617198 1307470 1755018 1479644 1423841 1937165 1831811 874924 616187 -75989
16392 -75989 -410960 34420 -154791 -1232703 -1298243 -138297 791494 1271564 1142837 677081
16382 677081 106641 -535934 -780730 -353655 -15149 608695 485932 -502115 -655726 -604551
16372 -604551 88147 976196 1853772 2041741 1654206 1442015 1866620 2231710 2344436 1973379
16362 1973379 1463150 792010 -197231 -277428 533401 55702 -1276976 -2011139 -2284569
16353 -2284569 -2168055 -1189109 -145131 296100 433510 976394 1185238 1453686 1164364
16344 1164364 160394 -353513 -1071178 -1927563 -2322025 -1356058 -196686 552648 782566
16335 782566 -61331 -1124803 -945697 -96632 354621 -624364 -1635326 -1175377 -534964
16326 -534964 -180264 462913 1163886 1050489 666773 599214 -5713 -1143513 -1931660 -2123689
16316 -2123689 -1863502 -1551248 -1659904 -1517731 -1418529 -1780335 -1715952 -1259371 -1109824 -1472970
16306 -1472970 -1885798 -2369786 -2094402 -1530056 -1612615 -1901222 -1916400 -1516572 -635991 -538749
16296 -538749 -58541 653001 59700 -445002 146326 328200 -92619 -882768 -1819172 -1944121
16286 -1944121 -1423943 -406384 282939 168736 58040 -365746 -403436 553925 600645 -68716
16276 -68716 -1070589 -1618442 -1863500 -2364010 -2379709 -1611199 -572514 29564 25325 87345
16266 87345 31810 461166 736973 278995 566793 1899471 2480231 3169671 3776457 2889795
16256 2889795 1324586 786213 1153876 1829821 1616190 1262159 1003648 114645 -320127
16247 -320127 -613445 -597907 -1183100 -2208955 -2152647 -2009146 -1990638 -1242744 -610190 -691993
16237 -691993 -1106207 -1639231 -2231316 -2644740 -2454348 -1585453 -796775 -605660 -774014 -297588
16227 -297588 -86397 -108544 520291 736229 415268 -951216 -2489508 -2557959 -2387881 -2515312
16217 -2515312 -2134252 -1897378 -1892500 -1772332 -1021091 -764083 -1002245 -1297242 -1089607 -1219539
16207 -1219539 -1609364 -1293248 -830444 -1231056 -1346674 -1047834 -791923 -886718 -539234 -621279
16197 -621279 -1786573 -2004148 -1579739 -1147612 -1583803 -2360333 -1578504 -345479 196445
16188 196445 264628 -325018 -595569 130814 901220 571240 368056 353693 698284 1083325
16178 1083325 986340 793988 650779 69752 -1024878 -1479977 -1307851 -883985 -399599
16169 -399599 16382 327604 1027003 1874414 2455402 2212079 1582032 744747 166552 521111
16159 521111 1241672 1434414 1007762 1635360 2222763 1688099 1436151 1628992 2230226 1941584
16149 1941584 1184422 734203 530919 990841 1432915 1428030 1077087 723484 403050 383404
16139 383404 319936 106428 -538757 -561832 -688214 -797622 -896611 -793542 -449897 555259
16129 555259 1569365 1088370 -244414 -888436 -1096729 -1427613 -922836 -408884 -522104
16120 -522104 -616607 -429738 -370318 -423017 -502720 -40100 599540 488780 -17567 -786192
16110 -786192 -1507137 -1557026 -421055 587511 1109938 1264036 529022 307896 1267087
16101 1267087 1331402 527763 -117278 -497267 -924496 -1114967 -292173 933408 1665483
16092 1665483 1434959 1233834 739749 390962 224626 -569427 -1033890 -863883 -109207
16083 -109207 51804 -440953 -167476 148330 260673 -141336 -538634 -51014 449731 -352410
16073 -352410 -1125776 -1397134 -1568768 -1072190 99094 -526410 -1258739 -924330 -923247 -1174438
16063 -1174438 -1288489 -1387800 -1540752 -1271942 -895381 -163008 935823 1538417 1678398
16054 1678398 1574914 655341 126825 476082 895881 460514 50801 -313751 -620419
16045 -620419 -1235473 -1759440 -1788237 -1437216 -487958 525163 628978 426851 -82574 -38078
16035 -38078 -56451 -9227 314186 19042 -666149 -529150 116313 431593 699584 1152866
16025 1152866 1307245 936039 514009 94381 -593223 -1043009 -919805 -758510 -349772
16016 -349772 -223613 33971 234882 435111 987604 1167503 1014271 851333 872639 245131
16006 245131 136798 331656 84242 -383576 -216517 342152 704376 719212 645954 708038
15996 708038 1021258 2099874 2657187 2063911 1267293 1076762 1041930 763364 168460 -276378
15986 -276378 392546 1182337 1797191 1476228 588107 756492 846681 402021 77565 441824
15976 441824 1207932 961717 -75975 -204728 535953 238422 -148451 504941 1020849
15967 1020849 743336 536453 591693 251637 -115881 -471892 -583361 -762702 -710733 -152067
15957 -152067 -36585 -503895 -165824 368300 333318 67597 -352063 -1430815 -1519692 -531382
15947 -531382 353410 3306 -858609 -1724750 -1990059 -2057123 -1221364 -151603 -462417 -828607
15937 -828607 -465105 -286676 83740 379312 237118 -367544 -1080671 -1433073 -806870 362471
15927 362471 1228773 1243250 461724 444972 1127838 1028215 264801 -100363 508238 1056464
15917 1056464 -109927 -1580330 -1990233 -1852121 -1115477 -346411 1079806 2541943 2662555
15908 2662555 2019826 1005260 184212 44482 -330960 -673917 -712245 -621434 -151430 655378
15898 655378 1129269 1734032 1975507 1183761 484047 394767 445125 84931 107357 552712
15888 552712 562469 582807 446663 351184 532015 591820 288120 -366618 133517 988526
15878 988526 693861 106814 -279017 -1108085 -831204 -275001 493415 1268344 859706 -31466
15868 -31466 -431014 -257686 29823 717398 1639923 2230449 2184467 1460962 1020475 1003637
15858 1003637 66665 -626252 -480396 -404150 -791758 -1266457 -938436 -1133882 -1708847 -1380855
15848 -1380855 -411516 540743 977201 1225386 1348904 1520204 1344655 1099342 1082361 228043
15838 228043 -196155 -227325 61141 147805 498880 702217 479205 569828 678017 506318
15828 506318 506372 526351 -20172 50200 46259 -712678 -607637 8952 16602 -244006 336388
15817 336388 1080555 1375385 1368388 1322946 1604690 2036575 2084812 744531 -545119 -1117871
15807 -1117871 -1005324 -695467 -634345 -226159 199594 401225 -104524 -553802 -336158 457978
15797 457978 791359 1150135 1473123 1239819 921906 743971 1106477 1254461 1827362 2205437
15787 2205437 1875687 1483270 1027955 101611 -697963 -587101 -470713 -1010156 -723772
15778 -723772 -654971 -985401 -1153193 -1451883 -1782023 -2233370 -2553655 -2754818 -2190524 -1855608
15768 -1855608 -2174940 -2225438 -895021 91402 235683 293586 -210799 -792627 -727510 124922
15758 124922 827022 586007 62512 -290859 -1304619 -1376597 -690879 -398015 129958 1254677
15748 1254677 1189997 1035181 1385371 1224160 1446945 1513417 1064226 413083 661217 1122378
15738 1122378 855013 568999 688844 1095143 1519796 806520 288183 65351 -184854
15729 -184854 -322893 -672804 -1146487 -1536268 -1005750 -59814 515455 1370853 2042094 1714244
15719 1714244 1357308 1104990 727207 718228 530856 150110 765476 1243229 679250 149069
15709 149069 -148632 -507317 -921453 -295758 309221 320736 623090 463773 346569 6600
15699 6600 -1022633 -1554267 -1891482 -2123617 -1815631 -1567287 -1550512 -1699972 -1209477 -608938
15689 -608938 -308430 -87967 210311 654239 404691 -44633 30178 58093 -561843 -323787
15679 -323787 927110 1299609 1028781 818604 530389 547217 655207 914719 667118 594910
15669 594910 121380 -515794 -713226 -293334 38911 -697604 -1453313 -1442378 -1068398 -588436
15659 -588436 109375 602498 1236139 1589996 1842334 1984649 1354059 546570 -92876 -479010
15649 -479010 -740169 -728605 -385066 200413 445113 335571 -180213 -37523 1458226 2301948
15639 2301948 2685457 2465296 2110498 2083396 1796378 1099739 537163 401577 478801 355869
15629 355869 270914 186800 -20736 -124343 167644 858515 1419013 1438723 1210023 613905
15619 613905 302251 -216984 -219508 469239 -90352 -1098617 -877276 -754051 -912843 -1363071
15609 -1363071 -1802180 -1653386 -910834 -365979 -68997 -141594 -465158 -657390 -899374 -683984
15599 -683984 -431696 -985623 -853417 227735 680689 718047 446468 -107515 -620225 -389772
15589 -389772 -42954 -291004 52287 206933 25600 867122 2044469 2350425 2163045
15580 2163045 2164480 2485690 2734719 2233962 1393045 771990 591539 571587 829252 1009885
15570 1009885 863692 1041007 1539380 1520440 1317585 1682991 1415245 768613 661642 -86357
15560 -86357 -724482 -209233 205187 316741 515559 433640 802017 443657 -1025858 -1826324
15550 -1826324 -2112234 -1599336 -1007692 -495858 297493 818666 1025514 575292 215822
15541 215822 277751 332741 2108 -435272 -714805 -162044 1502343 2490344 2213004 2114543
15531 2114543 2261523 1637642 1291136 927466 307244 -42264 -513651 -221298 -1041071
15522 -1041071 -2260842 -2167622 -1733623 -809831 780661 1751094 2612505 2930332 2265946
15513 2265946 1906138 2218072 1980067 576184 -485826 -561318 -371125 -368858 -504162 -718057
15503 -718057 -1061017 -1835955 -2192272 -1844676 -557848 565160 1139934 320081 -706068
15494 -706068 -657721 -1059588 -1688285 -1676013 -1198889 -632860 151318 687511 1157977 1456368
15484 1456368 1577464 2106923 2103448 1295270 769888 864991 1244408 1889383 2042899 1201570
15474 1201570 -350471 -1062125 -189063 553981 206008 -563982 -313178 862472 2048354
15465 2048354 2419834 2013405 2407297 2070956 848758 -49403 -152501 -260638 -630853
15456 -630853 -835305 -763737 -947279 -1055995 -346576 154818 692911 1022264 420165 332934
15446 332934 537987 -53581 -600782 -358384 99334 -554032 -1388683 -1600924 -2015777 -2201953
15436 -2201953 -1643125 -1567144 -2058717 -1495412 -457073 -970180 -1630597 -1959738 -2031406 -1485543
15426 -1485543 -610396 479897 845207 561748 60435 136226 168313 -55045 -411655 -637197
15416 -637197 -27937 1063096 741715 -701481 -1232902 -1619653 -1832132 -1973410 -2431494
15407 -2431494 -2746084 -2437873 -1996686 -1845464 -1611553 -2354196 -1832467 -1047530 -1529935
15398 -1529935 -992487 1038939 2361289 2093354 1721801 1073772 701696 369104 -414257
15389 -414257 -976929 -1209199 -1949638 -1899405 -769140 129484 141307 33998 341973 -384773
15379 -384773 -1808367 -1942109 -1615838 -646298 75624 -152159 -495549 -644235 -1779977
15370 -1779977 -2374985 -1889383 -1252416 -1140411 -654137 176384 401071 -682807 -859805
15361 -859805 -317545 41198 577345 1173925 1722837 1535866 1329671 1043211 460405 386817
15351 386817 668783 773851 571601 256022 -270919 -1059692 -1291597 -609669 53476 414273
15341 414273 141982 -829180 -443073 -249945 -1054194 -1185700 -884962 -1066487 -1660916 -1377682
15331 -1377682 -517895 493280 1095889 660079 344242 -61696 -706157 -690577 350045
15322 350045 1717972 2349271 1452908 22654 468266 1625998 1463589 910948 665985
15313 665985 511714 335277 765579 717182 -892383 -2516432 -2955581 -1791361 -78035
15304 -78035 304163 157205 -19142 -30762 498983 961062 1396166 1334584 238723 -771235
15294 -771235 -652884 -66495 -133169 152793 788883 1075541 391583 406276 1239278 1809679
15284 1809679 1917983 1854125 1430290 1244672 861783 373862 666237 1031037 1254655 1847761
15274 1847761 1735635 1002916 641488 107778 -238265 55682 -45730 -872867 -1175656
15265 -1175656 -1016200 -1136779 -1486765 -1325016 -1048347 -1122697 -426849 756205 672852 459943
15255 459943 964699 1837786 2664115 1820842 968651 1487744 1756065 987804 338628 617639
15245 617639 926243 272357 -175772 362570 634720 313743 -549231 -952861 -62411 1203791
15235 1203791 1747262 1246769 685203 1104571 752140 94768 -660338 -1044083 -1388627
15226 -1388627 -2239250 -2010517 -1538399 -1227494 -1384450 -1068951 -611852 -646581 -329221 -454186
15216 -454186 8991 1439482 1601656 63320 -1465064 -2323621 -2834514 -2602544 -1824258
15207 -1824258 -485766 776930 1315661 1476709 1217531 540012 -282113 -460212 41514
15198 41514 633332 127990 -1577985 -2123761 -1716500 -590734 474981 631813 29099
15189 29099 -809357 -1160901 -1566459 -2007163 -2573660 -1736075 -342029 828459 1436700
15180 1436700 1140049 543694 748204 1156650 944160 1178884 1539532 935957 -108719
15171 -108719 -153157 379436 474515 660232 623307 516264 448376 792578 1263698 439148
15161 439148 -437788 -630580 -1483203 -1732571 -1885324 -1987924 -1203950 -114920 442409
15152 442409 690706 476775 -34333 -300773 -140949 261857 314963 163489 -155865 -425159
15142 -425159 -395899 -939071 -1409028 -1565832 -967001 199705 401104 77070 -243461 -751150
15132 -751150 -1154539 -776177 69240 932879 1155617 1092057 824078 871458 1451083 1793570
15122 1793570 1680968 1750133 1620624 1174366 450395 -459890 -1016305 -726155 -455318 -214371
15112 -214371 111296 543763 818698 904554 452303 -370778 -736186 -609974 -514357 -96295
15102 -96295 97571 -653062 -2085291 -2299700 -1113273 -952249 -1680421 -1289935 148525
15093 148525 949144 689988 60226 -456039 -613513 -270551 -178060 -624635 -815792 -1096830
15083 -1096830 -1427364 -1311968 -1218862 -847134 -87041 156129 472630 330883 -370825 -932454
15073 -932454 -351088 -259236 -39781 351844 416830 815905 1072644 1404008 2466018 2528575
15063 2528575 2314458 2907826 3557312 3192208 1690210 543970 739420 445493 423768
15054 423768 826509 263675 -422706 -868558 -955132 -839931 -1269 794265 1145112 426916
15044 426916 -323993 -186742 -151258 663289 1177624 1652263 2398059 3080048 2679059 1701683
15034 1701683 1364232 1045228 733082 60738 -342628 -277662 -455103 -984470 -1562022 -1631705
15024 -1631705 -1058179 -355880 44724 272760 593243 763600 926184 423496 427592 992880
15014 992880 1592280 1145402 115624 591348 1416382 1179063 108006 -447727 253179
15005 253179 724793 688200 1128221 1243312 1057369 1050482 764719 263516 -17457 -134771
14995 -134771 -344662 -347848 -620878 -1409205 -1751147 -1906950 -2068706 -1522700 -1156657 -1172168
14985 -1172168 -545394 -14081 -172932 -663556 -1572225 -1760532 -2065562 -2184777 -2311356
14976 -2311356 -2037783 -1186784 -838925 -700554 -381230 -1425967 -1327507 31295 267913
14967 267913 -275659 -552118 -595142 -851876 -1904709 -2942057 -3020033 -2172621 -1203837 -1390604
14957 -1390604 -1882021 -1963516 -1328425 -176431 262683 -23931 -426498 -233773 -1347
14948 -1347 -557985 -1015044 -1276848 -1610507 -1350928 -946694 -331270 258275 539253 570185
14938 570185 849900 877691 420195 427295 683483 776990 805277 1109336 643278 -535947
14928 -535947 -1891480 -3649388 -4129920 -3019241 -1499241 -264435 614278 408637 -223859
14919 -223859 -275992 165961 -227006 -1143289 -1325319 -1038531 -620875 -415249 -409399 -892373
14909 -892373 -1596449 -1799708 -1706350 -1565160 -1395511 -1102945 -505060 266082 525692 735526
14899 735526 1648611 2540995 2611809 1682324 791041 225235 -200337 -612841 -497951 273262
14889 273262 977541 552969 637358 1151441 779897 114251 -520273 -1049731 -1388847 -1265526
14879 -1265526 -1572171 -1724978 -1378977 -360889 355730 334774 -148333 -665287 -1307146
14870 -1307146 -1945997 -1933183 -1211389 -1170402 -1085124 -631578 -289009 305121 390526 281554
14860 281554 191734 250260 -59770 -653475 -863415 -1064497 -1327830 -1600716 -1728455 -2050585
14850 -2050585 -2390324 -2712636 -2614281 -683027 401274 -404044 -1319666 -1329239 -1600736 -1847405
14840 -1847405 -2029311 -2318809 -1581354 -183866 419186 82171 -81322 314210 684312
14831 684312 912784 960733 446493 198732 378612 593398 -8368 -138529 -689447 -675131
14821 -675131 -319000 -362009 -304107 86103 803002 1007897 1582743 1157695 -558084 -1937359
14811 -1937359 -2152272 -1600253 -1724829 -1910222 -2085372 -2050581 -1538410 -1341852 -1379292 -1167761
14801 -1167761 -227496 198646 329319 306279 430651 429434 588063 982299 901597 -35535
14791 -35535 -988791 -1360458 -860914 -435106 -274964 437512 1278871 1531740 1087141 387021
14781 387021 -393979 -1741999 -2986901 -2798841 -2327312 -1772239 -1030005 -697269 -159322
14772 -159322 785235 1638484 1458434 655471 340402 426782 292873 627050 936461 1180949
14762 1180949 626494 -396459 -1048051 -1824098 -2355049 -1758877 -727770 -358821 -807349
14753 -807349 -821322 -636663 -965070 -1378057 -1486641 -1057371 -511656 -418694 -462496 -1001564
14743 -1001564 -1363348 -1047785 -582195 -696390 -57182 599695 -12881 -775330 -1312027
14734 -1312027 -1299409 -8064 1192021 1332104 776912 5755 -584473 -208359 -639116
14725 -639116 -695659 528455 873459 678334 493895 276602 194660 579417 542018 -239164
14715 -239164 -1322381 -2376885 -2406289 -1248252 -64613 151693 -208702 -775732 -1435471
14706 -1435471 -1248964 -923928 -707027 -764400 -751098 -1061680 -1804361 -1751141 -883166 -1027330
14696 -1027330 -1606773 -1153424 -1112689 -1765237 -2332810 -2452677 -2219804 -1999072 -2031085 -1399845
14686 -1399845 -582718 -23995 281800 122127 155148 585404 1317528 1478793 1156510 968412
14676 968412 609725 575049 1031426 762596 804547 269545 -561357 -20003 1053848 1411652
14666 1411652 1199464 629804 145268 -50838 129471 -298998 -969844 -1097412 -1118968 -771102
14656 -771102 -178565 -129707 -454026 -1069232 -1583395 -1705953 -1349622 -242054 927823
14647 927823 1052342 550440 205599 -510488 -1544406 -1648659 -1732557 -1301405 -684219 -33923
14637 -33923 51643 -682063 -1285143 -986332 -401866 -133705 -315896 -372784 337412 849614
14627 849614 1541938 2990952 3644866 2550052 1834279 2085855 2009126 1492405 808260
14618 808260 476027 513039 -18396 -84929 391531 368277 110699 194044 -44154 -321625
14608 -321625 -466389 -717644 -579464 -1181762 -1788129 -1084379 -957976 -381209 286453 382817
14598 382817 -11838 -471146 -725202 -905708 -575990 -201826 -709292 -491519 -19363 -322093
14588 -322093 -349294 -169487 -418261 -1309960 -2001999 -1979503 -1555747 -947276 -522798 -166762
14578 -166762 482084 1002124 1165466 761116 -144522 -1383152 -1412217 -964098 -436798 -585351
14568 -585351 -1505332 -1338493 -1150219 -226505 288788 597806 681345 114574 -709338 -1419568
14558 -1419568 -1180418 -421477 230436 790563 624585 481840 521585 466123 -59097 -169245
14548 -169245 454401 799761 1962281 2405213 1991633 525846 -1410739 -2133122 -1962370
14539 -1962370 -1778567 -1420631 -1337430 -863524 -623801 -611006 -27342 148806 554066 1094328
14529 1094328 701128 40080 -16231 -188320 -623013 -1253574 -1221483 -254856 217422 1519779
14519 1519779 1841581 1553581 850168 84467 -135272 457312 1256649 1718885 2145008
14510 2145008 1923158 1314603 1448113 1638298 687076 -628698 -996680 -329574 -468166
14501 -468166 -750963 -315059 -309748 -394852 -358086 -518160 -1032800 -587372 70667 238446
14491 238446 -142016 -754928 -711636 -269716 -141517 -813871 -1185541 -1426067 -1658901 -1075265
14481 -1075265 514584 943697 -209 -247575 52587 80044 864786 1301343 1981590
14472 1981590 2251734 1669634 1232891 1083798 1138823 473461 -277638 -572721 -191684 196913
14462 196913 287299 879511 905106 -276866 -865709 89298 239334 -375816 -185688 557108
14452 557108 905593 -36714 -447091 30150 553225 800694 1069126 772887 -23540 103010
14442 103010 498909 987381 1395680 2277680 2410416 1183814 658529 401355 983768
14433 983768 1248957 1624420 2292405 1596745 170593 -925761 -1031495 -842188 112664
14424 112664 1755771 2416993 1662964 788112 99286 59076 556792 626545 1435956 2118486
14414 2118486 2280390 2524636 2179877 1428828 1225610 1712465 2054237 1754222 1070606
14405 1070606 652373 170779 212770 260055 -92882 -67344 272554 340580 62670 -564784
14395 -564784 -1308509 -1531817 -1756453 -1867941 -1429378 -1071334 -1658507 -2010867 -1916015 -2084986
14385 -2084986 -2115101 -2386479 -2211560 -1582118 -1114981 -925474 -865547 -1317972 -1702588 -1891064
14375 -1891064 -1481710 -1221277 -953524 -524740 111733 1029521 1542812 1693065 2032082
14366 2032082 2619431 2840851 2307897 1596370 1343208 2097319 2240380 1425834 1088872
14357 1088872 1766771 1840997 1247405 587284 761580 1402943 2050399 2282011 1301468 -173881
14347 -173881 -74249 855462 960759 488971 307003 719316 955302 1422224 1529327 1140764
14337 1140764 895413 445177 6356 -493310 -987175 -833809 -328072 51853 -441193
14328 -441193 -1384025 -1608297 -650253 -174025 -184463 -419501 -1013940 -2114885 -1736548 -412076
14318 -412076 -39988 -139305 -909753 -1283358 -723883 -720582 -1075831 -1217501 -1420641 -1254974
14308 -1254974 -767797 -583738 -250432 87747 556110 397239 234109 417588 -133940
14299 -133940 -787761 -43810 1085314 1043053 133250 -197738 -598366 -689628 -934428 -746663
14289 -746663 -758776 -1003536 -1207812 -1285693 -1297933 -929917 -840768 -1073800 -602466 -366414
14279 -366414 -956123 -1480511 -1173683 -1335558 -2042780 -2204655 -1423580 -1150179 -1029499 -270080
14269 -270080 314731 77667 -344257 -161500 410386 701150 90334 -219605 321963 952980
14259 952980 1253949 973851 -303853 -1431200 -1477704 -959358 -849329 -515787 630778
14250 630778 964769 897914 919753 595149 -426021 -766994 -702565 -494824 -419616 -843218
14240 -843218 -465766 -503057 -833388 -943388 -651992 -30417 233489 237435 83442 592416
14230 592416 1587718 1904395 1052486 402943 1152078 1962750 1215655 629739 876744 1052454
14220 1052454 482558 -129569 -1242353 -1509534 -874918 -466758 -369473 -607027 -555953 23425
14210 23425 668651 901656 230937 -173071 -891131 -1513584 -1191538 -963018 -1250866 -1377351
14200 -1377351 -1186517 -1598543 -2304949 -1898216 -447293 -66213 -840806 -1224642 -1951924
14191 -1951924 -2613478 -2308348 -1808734 -763790 702761 1323268 1624611 1510632 1415451
14182 1415451 859869 457711 89566 -348172 -545559 -803076 -839867 -718402 -204952 30636
14172 30636 445296 1043619 1557866 1678645 1131275 121390 -509813 -588627 -797030 -827436
14162 -827436 -511074 18183 1347093 2087718 1201067 583078 248060 180589 416039 331492
14152 331492 590034 1197388 974937 94504 149706 517548 421768 -304297 -510167 -941521
14142 -941521 -742946 -199180 485968 1080087 768322 518232 181715 94808 -473824 -1301144
14132 -1301144 -1552670 -1540738 -1711479 -1251926 -1123074 -1112135 -614287 -239191 110086 743399
14122 743399 850551 437744 93416 -167227 430119 913954 1221841 320213 -315510 -299386
14112 -299386 -553244 -590416 -32889 350199 -223907 -285025 273506 604866 1078183 1913435
14102 1913435 1749262 1338037 1259680 767011 282744 -120416 -280056 -866955 -925826 -332394
14092 -332394 -637483 -1341729 -1506880 -1046709 -476665 -167670 -268646 -593903 -789554 -592804
14082 -592804 -271890 -311782 -57013 72006 362291 1557088 2250500 1757401 1713395 1888550
14072 1888550 1496056 783591 308257 -173730 66618 774294 1212618 996146 250901
14063 250901 -299210 229297 566022 147519 -434383 -553942 -443335 -199341 -217971 -246756
14053 -246756 -413374 -651518 -787647 -494840 402594 965692 1080145 1026375 1368516 1271973
14043 1271973 446900 -201649 206001 179588 902016 2121752 2310979 2225780 1950208 490220
14033 490220 -203247 7816 -107306 -863904 -1591376 -2181188 -1981647 -1997384 -2102586 -2732423
14023 -2732423 -3173421 -3628129 -3891452 -3244577 -2174785 -1638962 -719408 640428 912614
14014 912614 1055164 826282 545846 1012297 1043935 -122390 -1211897 -1603995 -1363177
14005 -1363177 -1173246 -1374142 -1359549 -1111183 -1096216 -1164939 -2193556 -2594953 -2160593 -1618551
13995 -1618551 -671084 109408 746649 1045179 1018282 929514 443332 175469 -228032 -550149
13985 -550149 -795995 -1443800 -2003082 -1923952 -1297421 -907021 -551320 -5543 855874 2261672
13975 2261672 3304291 3684750 3464403 3098409 2284211 1428125 524815 387136 -47206
13966 -47206 -819177 -294928 803355 892440 266795 -354723 -1308196 -2099834 -2077774 -1371796
13956 -1371796 -1014292 -1145054 -1535217 -2133965 -2544126 -2454155 -1360478 -222572 532512
13947 532512 706563 980418 1101620 295870 123417 597256 816810 663290 1030736 832494
13937 832494 44727 -649432 -1246361 -1338827 -1318079 -586662 689082 711442 -226073 -709110
13927 -709110 -563702 124907 208005 415430 486464 252242 192040 -450766 -646427 -970561
13917 -970561 -539753 424488 522652 282278 -120835 -990577 -1823636 -1690408 -1432595 -1178548
13907 -1178548 -353042 -328787 116075 936620 1279119 1549418 2016183 2331089 2136354 2051417
13897 2051417 2432091 2667288 2144759 1319211 706226 202848 -255977 -32692 343225
13888 343225 182642 536979 769546 313381 72165 858250 1957256 2281115 2940870
13879 2940870 3321868 2540838 2055253 2351150 2403441 2391182 1983395 1481008 1686851 1444282
13869 1444282 712599 403562 135846 -40590 189506 931364 1211196 745899 726414 1006726
13859 1006726 970237 561391 717716 844258 858632 1375369 1535062 1263671 1542681 2114601
13849 2114601 2654328 3520143 4584850 4995953 4902804 3948941 2547216 1791393 1602691
13840 1602691 1771201 2280082 2175557 1483314 1608194 1590255 939369 292051 176382 312487
13830 312487 286040 36359 30798 615202 421126 -110896 -395370 -202231 437687 441125
13820 441125 -206059 -958746 -1066650 -1040608 -1177430 -1037431 -855078 -1192091 -969572 -327452
13810 -327452 -281930 -481084 -744180 -697245 -768936 -643610 -72786 -701397 -2327195 -3439837
13800 -3439837 -3487164 -2447028 -908635 161365 -295250 -993829 -1364364 -696309 -60761
13791 -60761 3705 313845 421078 284643 -10876 -507566 -968327 -649835 -517904 -358504
13781 -358504 -151887 -531008 -701302 -475748 -183049 92350 210459 224119 -264755 -695681
13771 -695681 -1327573 -1930084 -1513377 -1346801 -1621746 -1860291 -2371757 -2474866 -2350544 -1982319
13761 -1982319 -1669682 -1266595 -772648 -949605 -1414963 -1161963 -1267509 -1128870 -980721
13752 -980721 -1197369 -1629264 -2063797 -1601459 -784893 -717881 -1387758 -1339720 -748083 -252079
13742 -252079 93210 507777 245349 -997164 -1347597 -891513 -1265894 -1640806 -1999246
13733 -1999246 -2241843 -1646454 -711575 373653 1117794 772355 105015 -586656 -799291
13724 -799291 -1004687 -1282830 -1227350 -577953 -280711 -958554 -1379953 -1272920 -551634 -242818
13714 -242818 -694334 -829828 -630787 -413616 -282892 -662480 -821757 -453305 338893 1190196
13704 1190196 969337 292786 425696 767551 1016109 527384 -785509 -1826085 -2047204
13695 -2047204 -2042116 -1782955 -1679165 -2024139 -1925087 -1113220 -938830 -1210489 -1351391 -650050
13685 -650050 -384190 -1124557 -1048699 -68086 413574 -410643 -1214270 -767718 -134854 -240476
13675 -240476 -770087 -1019524 -1116769 -1553913 -1759843 -1188575 -656567 -269047 -119710 -73486
13665 -73486 345106 875415 1048459 838299 685784 16631 -774222 -1220329 -625156 328990
13655 328990 284454 -748093 -1135837 -608550 -90866 129089 -355300 -550530 140827 109719
13645 109719 -681060 -839668 -703743 -862811 -466134 36672 -232590 -595352 -731181 -670013
13635 -670013 -710049 -548058 -474029 -490647 -166770 -546794 -1174256 -1725653 -1747511 -1654967
13625 -1654967 -1868038 -1734487 -1266533 -1553891 -1832302 -2203340 -2112986 -2354611 -2970322 -3166979
13615 -3166979 -2478827 -1524199 -923575 -941287 -653427 -683590 -1065912 -1151703 -1192046 -878389
13605 -878389 -483385 53808 1035416 1540289 1377818 645173 -430482 -122491 213405
13596 213405 641211 936850 965447 733353 22763 26400 498917 789225 1017308 1673811
13586 1673811 1570792 1834506 2511049 2598902 2087149 1552281 1459189 1097030 1696282 1648855
13576 1648855 -185239 -1284592 -148892 793999 735310 725354 986540 908421 925822 733715
13566 733715 652641 482966 426927 312390 -259262 -367990 -14113 568094 708715 58745
13556 58745 -478105 -265565 -253195 -468816 25150 145875 -242014 -514637 -464103 -806772
13546 -806772 -1302163 -874434 -159251 -166809 -820311 -1550559 -1413150 -523484 -258357 -365109
13536 -365109 -420195 35783 539596 17056 -95172 -285583 -570465 -538651 13998 624154
13526 624154 457096 777395 861257 773891 861882 641689 -80345 -666096 -894564 -976710
13516 -976710 -395774 -121607 -736875 -1053309 -1004426 -645778 544449 1347067 1152019 304598
13506 304598 266558 791498 1574420 2091624 2031649 1411787 553687 153643 -127069 -306362
13496 -306362 -837139 -865074 -378081 -70871 -405423 -929266 -1278493 -1293091 -1077498 -1436050
13486 -1436050 -2085348 -1895297 -1026950 -546045 -282628 98213 -5425 254212 179539 163344
13476 163344 -17760 -538160 -926675 -1285411 -992774 -573928 -392905 -597397 -871981 -1048697
13466 -1048697 -904937 -1270715 -1229506 -456844 -206110 -512573 -1135705 -1602181 -1911990 -1835388
13456 -1835388 -2371067 -3418190 -3231206 -2127058 -1461971 -1032100 -1151346 -1389404 -1639587
13447 -1639587 -1884023 -2054942 -2355307 -2560698 -2351349 -2092625 -2041818 -1819448 -1130840 -837202
13437 -837202 -1160484 -834975 -123576 -944929 -1850913 -2158250 -1944650 -1350898 -915414 -421372
13427 -421372 80282 568380 246859 220525 351593 269706 705083 1027064 892489 824784
13417 824784 488966 -165181 -248050 336054 448724 14933 -259595 -431507 -553470 -751005
13407 -751005 -971863 -1340668 -1395257 -617682 -520900 -1347608 -1227353 -281491 -136994 -405779
13397 -405779 -682121 -651370 -677746 -1149327 -2043477 -2199494 -1527722 -921516 -250791 477043
13387 477043 1195270 1663297 1783806 2163828 2408769 2039338 1444962 400887 251168
13378 251168 426535 -253534 -789043 -503791 -385162 -1030344 -1172709 -909257 6379 1470264
13368 1470264 1960333 2345873 2724355 1969070 1046008 980395 948158 338646 395151 1314782
13358 1314782 1836630 1380686 801742 681244 386277 -207824 -616296 -307512 43840
13349 43840 -355306 -865476 -1145163 -651740 111090 777779 992968 858275 414491 581177
13339 581177 847712 354670 120165 99101 14233 -31672 132335 146334 -206929 273494
13329 273494 113267 -748639 -1102230 -1415288 -1631388 -1122213 -959612 -1147818 -1009705 -310594
13319 -310594 696652 1407370 973549 238052 395272 1212884 1032901 722144 575895
13310 575895 165991 -456063 -941608 -1490517 -1932877 -1343851 -252030 506124 -45473
13301 -45473 -105607 138694 482707 143188 -595135 -33371 410531 -56378 -817572 -1946039
13291 -1946039 -1908554 -833129 609049 1638891 1598632 1504839 1053807 728663 698736 257080
13281 257080 -40343 85440 423770 569216 885722 1183834 990960 1447257 1404478 1119706
13271 1119706 1249982 1462878 1181613 752260 794311 73688 -1255694 -1123110 -258668
13262 -258668 215388 410816 18639 -412847 -160944 520760 691183 918405 1037592 1392204
13252 1392204 1699964 1974477 2095796 2169810 1586967 1124556 1052197 1727021 1995178 1567518
13242 1567518 1187829 1381218 2063138 1888482 669151 -969878 -1245038 -302010 629702
13233 629702 551655 114580 207312 564924 -195638 -573557 227335 530834 312348 -9406
13223 -9406 634931 463260 -555947 -975263 -1235129 -1102208 -407876 70869 384488 59049
13213 59049 -159689 101873 -86743 -854756 -1335358 -1272967 -743711 229793 1178237 1682724
13203 1682724 1675595 1069461 519583 322539 187515 277510 1199435 1694397 1309382 1031463
13193 1031463 945361 854603 1334540 1803209 1514257 1685700 2104067 1713242 1290209 858996
13183 858996 719594 1273893 1389758 1235295 1212604 570582 -499809 -636068 -282293 50001
13173 50001 153570 31479 477322 1167497 1289783 595386 94926 -146334 137099 582174
13163 582174 884600 842495 1164689 1445695 1091821 565876 1023166 1688106 2289375 2960674
13153 2960674 2320814 2085288 2294184 2020559 841404 23135 -66548 -252633 -903564
13144 -903564 -531248 -306260 -553222 -97668 217737 914471 1797788 2723271 3332535 3139960
13134 3139960 2833985 3341301 2766159 1545832 960194 1006783 1419158 1824015 2318206
13125 2318206 2362919 2079596 1072119 214613 730082 1551810 1555263 1612354 1932282 2875112
13115 2875112 3528449 3336055 2948843 3011507 3276373 3118846 3103491 2958201 2540452 2244150
13105 2244150 2130984 2279567 2379154 1970449 2143227 3278942 3785572 3552966 2495768
13096 2495768 1934562 2101784 2328382 2129822 1530447 1468695 2285036 2026159 2002621 2241519
13086 2241519 2307914 2466732 2290930 2258039 2337593 2140795 1683360 1160283 1219664 1151405
13076 1151405 1014588 1388888 2142075 2459573 2136094 1749548 1758466 2141288 2299087 2206565
13066 2206565 1937046 2517793 2441353 2305930 2282131 1869978 2238390 2460909 2449967 2354518
13056 2354518 2124362 1742600 698119 210623 425581 887315 1370765 1694284 1820617
13047 1820617 1947630 1928561 1793004 1271806 1766296 2794027 2993083 3201090 3136163 3044775
13037 3044775 3161968 3241907 3525986 4007584 3653008 2969921 2547763 2495861 2430782 2338167
13027 2338167 2709795 3084265 3276506 3706432 4053098 4255106 4231830 3735507 3427874 3895730
13017 3895730 3212739 2421524 3236375 4111571 4739877 5338199 5652878 5834927 6256719
13008 6256719 6686734 7540101 8317901 8384775 8589676 8945016 9212015 10297825 12268138
12999 12268138 13075407 13558739 14533274 15915605 18120871 20254390 22153763 25196577
12991 25196577 29139352 33701626 39965285 47279675 56302771 67264019 80577686 97670435
12983 97670435 120418395 150471940 189831357 241559674 307041381 376001555 420248503
12976 420248503 411479896 357647640 290060069 230185501 183842116 148522542 121358717
12969 121358717 100515405 85203217 73404620 63452805 54579164 47195984 41660160
12962 41660160 37568976 33615241 30369879 27812958 25314461 22719705 19715226 17301534
12954 17301534 15879402 15214753 15416629 15328538 14320008 13697399 13047481 11823139 10689073
12945 10689073 11009260 11089047 10715314 10923521 10334241 9365334 8435506 8192273 8638316
12936 8638316 9444524 10638955 11284428 11341420 10849143 9600246 8861660 9154014 9694226
12927 9694226 9837114 10212088 11143613 12331703 13727943 15516071 17373720 18857125 21410443
12918 21410443 22919046 22848107 22147218 20415210 18810987 17975934 17762667 18160023 18653763
12909 18653763 19536405 20883391 22994883 25791959 29389547 33093796 37105615 42205715
12901 42205715 48900818 58021959 69915764 85236843 104607934 128505135 159411932
12894 159411932 201591821 258010101 327978425 396777427 431624565 409549620 346946473
12887 346946473 275969899 215663622 170288201 137269707 112733559 94208466 80334710
12880 80334710 69190768 59546558 51721734 45242979 39937016 34944676 30939863 28393519
12872 28393519 26259653 23509953 21166036 19830016 18757700 18653613 18398575 17358500
12864 17358500 16102499 14690594 13169707 12448705 12004368 11720405 12540049 13242498 12641086
12855 12641086 11846099 11390674 11210514 11088301 10730916 10293573 10258200 10390408 9967521
12846 9967521 9627851 8972181 8396103 8423400 8177310 8178035 8035263 8052816 8311812 7886119
12836 7886119 8121668 8324691 8692479 9387268 10069279 10644848 11490649 12825137 14157760
12827 14157760 15373051 15776365 16489299 17776803 18309318 19060418 20441572 22249471 24968657
12818 24968657 28478609 32913024 38316702 44911860 52661757 62316463 74856390 90481079
12810 90481079 109677892 134943216 169017959 214040318 272208437 341420129 402424737
12803 402424737 423511097 390726895 326140398 259167248 203472049 161843381 131316447
12796 131316447 107936416 89495390 75053406 63962328 54862771 48183341 42459303
12789 42459303 37421480 33501479 29999184 26513476 22678175 19959915 18501851 17209330
12781 17209330 16111859 15255314 14348652 13277108 12122477 11362672 10455794 9513385 9084468
12772 9084468 8986949 8271975 7802629 8242610 8763890 8795306 8420806 7170145 6040551
12763 6040551 5693049 5528742 5090841 4287709 3552645 3353260 3223740 4092064 5131407
12754 5131407 5929723 4943370 3691958 3528076 3123192 2566184 2528379 2485849 2163231 2309638
12744 2309638 2133407 1225152 290680 99675 596851 473661 186350 900045 1311122
12735 1311122 1126013 1423510 2031725 1873997 1784550 1579871 1599225 1271980 467127 39679
12725 39679 -104726 72610 455939 1249926 1378958 1285987 2022116 1641945 925478 743806
12715 743806 866711 1149074 925403 441461 893104 1857348 2066129 1064408 236287
12706 236287 107578 99763 -5940 -98185 -35191 -201662 -528969 -123381 -162192 -754190
12696 -754190 -748935 -830594 -391858 585918 1655130 2066488 1734160 1261525 622965 677863
12686 677863 959760 431934 -403335 -376114 701233 1490352 940962 -135397 -407358
12677 -407358 -460367 -413984 -276051 -77816 96735 257915 213548 1024601 1658651 1482930
12667 1482930 1788431 2355660 2118324 1575972 1422386 847257 108002 -452760 -683934
12658 -683934 -151450 1035911 2028032 1982228 1615998 1107794 896306 1754788 2858415
12649 2858415 3095423 1976748 1587234 1637602 1163577 1014493 1334359 1201127 1703370
12640 1703370 2405145 2500123 1541974 1091045 840722 408599 198000 -154621 -256931 -681749
12630 -681749 -621761 -405480 350848 1577532 2692657 2986138 2617308 1520970 577470
12621 577470 477729 578209 877180 794819 777764 779576 907170 536245 -751283 -1525386
12611 -1525386 -1387522 -1157905 -1223938 -1036810 -269992 617108 891670 1129145 1517287 1191269
12601 1191269 1183887 1841175 1484276 895405 -300263 -1143118 -429579 -115316 -642749 -1355136
12591 -1355136 -1325795 -678079 246423 581362 758963 512816 155056 92165 -70652 24782
12581 24782 584508 595083 297066 148589 -55077 449056 790287 671425 753382 1271133
12571 1271133 1522260 2015589 2791787 3379769 3220766 2532335 1391337 1090512 1165721
12562 1165721 657096 529283 748270 1450619 1547918 1377200 1013783 -263930 -1439271
12553 -1439271 -1945572 -857718 83419 329306 59683 -496703 -690473 -549311 -258478
12544 -258478 -955413 -2194274 -2269480 -2519511 -2685650 -1999588 -1611556 -1517018 -1051208 -561346
12534 -561346 -770887 -281126 141425 -286860 -610419 -566664 -275465 164924 528575 716487
12524 716487 981895 1206990 762450 803194 1290846 1547804 1331972 800343 778470 961308
12514 961308 565665 238454 1104795 2011393 1357725 531110 1193298 1722966 1335332 744742
12504 744742 840205 1330155 926548 662886 640522 600025 750228 540818 -281690 -271947
12494 -271947 295323 641978 1079949 1820209 2366538 2584749 1859538 1099979 1038176 877365
12484 877365 406189 857108 1798502 1366889 629667 495083 171244 -157669 -175042 -770956
12474 -770956 -904605 -432260 -66542 -35783 -67501 454885 1256176 1795552 2203662 2425047
12464 2425047 2113074 1877078 1976517 2275612 2150249 2028961 1967249 1785726 1913810 1127732
12454 1127732 -116714 -792354 -1514409 -1885317 -1624110 -1096549 -41684 1050966 807913
12445 807913 -64973 -885532 -1609960 -1704244 -1371928 -1238168 -915174 -242551 243545 161037
12435 161037 -78897 -695941 -1576300 -1213883 -566560 39412 312916 -129480 -956379 -1852192
12425 -1852192 -1890475 -1074869 -216849 -98660 -132780 -420211 -68651 658988 1160920 867841
12415 867841 -162645 -1030194 -1723811 -1648629 -1227413 -658420 225469 780373 623270 497920
12405 497920 164829 196308 752425 739374 195347 -79594 -241953 -528902 -257257 162205
12395 162205 258685 481367 547729 884325 759366 298075 221764 237416 -42154 -171966
12385 -171966 -217908 -162837 30428 338560 548621 911200 1508924 2175117 2515035 2289343
12375 2289343 2010802 1907672 1476072 1084331 1079173 610237 123188 573108 710014 495612
12365 495612 790214 1467920 1046483 684024 951861 1251119 1810199 1919467 1906685 1613196
12355 1613196 754835 354524 1196690 1730883 1298166 576789 -369105 -682426 333507
12346 333507 1856587 2472711 2213971 1963830 1714058 965809 -732487 -2401873 -2160122
12337 -2160122 -1118581 -1038012 -1055302 -1247957 -1889263 -2153879 -1422281 -850617 -869930 -669913
12327 -669913 -50612 1064173 2186752 2889280 3446906 3142475 2006661 1137072 995595
12318 995595 795035 881630 913692 1226593 1531988 1368381 1109174 472032 -335427 -567229
12308 -567229 -689109 -970689 -819740 -649884 -860053 -1595132 -1850891 -1906464 -1990348 -2286831
12298 -2286831 -1805220 -1318287 -1404802 -2068379 -2328182 -1876413 -1296775 -861440 -406139 102569
12288 102569 723805 756554 -91410 -145758 -348234 -661501 104307 755359 709104 -354586
12278 -354586 -1333716 -1839968 -2138979 -1335093 -440502 -367867 -776019 -1317841 -1861331 -2712516
12268 -2712516 -2732767 -1829447 -729326 759002 1074693 761555 1052264 1549150 1886363
12259 1886363 1475643 544167 54542 177790 51237 269309 397552 -422211 -1368152
12250 -1368152 -2629833 -3009945 -1952092 -1226616 -716864 -284557 -335016 -840892 -719088
12241 -719088 -183533 -711156 -1258027 -1147355 -1317546 -1854114 -1705057 -1005143 -196878 180600
12231 180600 140016 215071 -20463 -518282 -342443 -93852 99889 400789 468673 544320
12221 544320 1195692 1736677 1717068 1281276 1133053 521686 14546 79725 356186 143373
12211 143373 -497076 304026 1175955 1367527 1733153 936943 -209875 -363330 -79419
12202 -79419 -287386 -1297599 -1711513 -1544193 -1970626 -1603439 -1470418 -1755942 -1224517 -404336
12192 -404336 78018 91739 112969 22629 -516310 -1093288 -1360560 -985721 -167145 379429
12182 379429 553457 959099 955297 461930 132618 -310260 -746501 -1111990 -1009058 -363347
12172 -363347 392362 1250945 1085134 650163 649997 1574787 2218503 2088898 1618377 1520879
12162 1520879 1498676 1358209 1739352 1403050 748281 391684 -580503 -1434490 -1755039 -1445171
12152 -1445171 -1055230 -509681 -216486 131177 211843 243899 356183 853443 1217689 367636
12142 367636 -608233 -1470564 -1261252 257540 871438 1014233 1507650 864173 -99925
12133 -99925 -906078 -930955 276161 1481313 1794146 1233077 272642 174868 -60360 -514245
12123 -514245 -629664 -593660 -1043922 -744447 190736 453865 -809 -506982 -590475 -855876
12113 -855876 -1299969 -1026888 -608166 -778114 -1267077 -1007967 -1019828 -1306940 -640077 21724
12103 21724 -255053 -548512 -433595 -358339 -506448 -998870 -1300158 -479356 -40493 -224868
12093 -224868 -594296 -829703 -446873 -293946 53504 -304893 -1102239 -717784 254500 913344
12083 913344 1195430 662648 199414 434918 544696 1069333 1930943 2157068 1550722 760638
12073 760638 641702 886374 672217 10779 226578 885448 912297 954134 869122 671792
12063 671792 798953 60655 -942598 -1225551 -1621280 -1579617 -2033021 -1982393 -851866 340657
12053 340657 1150682 942833 545498 814777 877418 1292892 1214642 612108 -486601 -1434398
12043 -1434398 -1332340 -1377585 -1373323 -1369109 -997259 -689468 -636725 -175946 534454 587401 416115
12032 416115 132982 -40200 -237879 -835009 -840355 -335231 -655762 -856712 -520543 738
12022 738 -179408 -549559 -283869 -27910 -165988 -256967 -269587 -27366 616463 414892
12012 414892 741263 1444262 1292426 722555 304376 405568 352776 -92324 186207 546767
12002 546767 803200 981533 1169393 1081880 713681 498847 -273638 -1260098 -2024410 -2161946
11992 -2161946 -1988729 -2162626 -2529577 -1894087 -184292 882450 1164573 1236100 622706
11983 622706 -39630 76355 810711 1388652 1265413 1760959 1823200 398005 -507380 -475147
11973 -475147 231242 700888 137966 -675704 -989776 -1519831 -1905821 -2187992 -2121140 -1615421
11963 -1615421 -1510892 -2182999 -2574614 -2164122 -1326873 -1127074 -1851485 -2679382 -2859028
11954 -2859028 -2012768 -1695339 -1040345 -139247 904854 1961306 2873288 2930102 2589628
11945 2589628 2117860 1280740 722664 -87738 -278935 -412307 -830435 -983025 -795507
11936 -795507 -458407 -206447 -24280 -958176 -1421618 -1015981 -869291 -203393 244713 260997
11926 260997 163737 330333 103503 -428308 -223739 -161929 -247959 -236771 -816510 -959640
11916 -959640 -289718 61173 719157 1558664 1769953 1399135 838875 372094 -10533 -416165
11906 -416165 -586238 -632742 -624864 -1248849 -1517155 -1040110 -819845 -908078 -1413679 -1397275
11896 -1397275 -510316 -149375 -399173 -466899 86800 813245 796957 -8996 -647338 -434081
11886 -434081 -85966 -703692 -1260670 -1336838 -879637 -613057 -223382 498516 628311 375708
11876 375708 29855 -372060 -1015003 -925265 162404 726048 534156 665 -348881 -784057
11866 -784057 -1008455 -990787 -339943 707018 932388 238160 386598 578946 -334009 -1022668
11856 -1022668 -586516 -236497 -581128 -9500 283289 817673 1680106 1452901 777678
11847 777678 595475 1213390 972095 139256 -175556 -427688 -800988 -725518 -294585 19680
11837 19680 349615 -23921 -394846 -670642 -849374 -1129481 -797808 -161253 220846 -488717
11827 -488717 -1057460 -392875 -106931 -403470 -297830 -16871 549019 774955 144925 -408041
11817 -408041 -570134 -650151 -19337 847024 1012281 190456 -810192 -1123459 -1192794 -1074935
11807 -1074935 -794829 374325 379820 -281857 -1126185 -1948969 -1770309 -1035479 -203620 -274035
11797 -274035 -840497 -589644 7063 -405017 -1232631 -1321584 -1453423 -1857121 -1581273 -1089616
11787 -1089616 -803811 -806793 -865529 -1257751 -1923880 -1806384 -1677103 -1160817 -468622 -254360
11777 -254360 -123790 -329989 -85053 417029 221941 -579209 -593584 164338 419176 246432
11767 246432 163226 -275918 -302498 -495443 -682833 -315931 -180163 -239416 -499067 -836539
11757 -836539 -784659 -569385 -811343 -1173487 -878955 -424744 -242745 -563605 -925654 -1000359
11747 -1000359 -1563411 -1529449 -78627 221667 -251111 -1471367 -2188287 -1400053 -975213
11738 -975213 -788023 -115571 592444 1823726 2914961 6358559 6944876 3784445 2689847
11729 2689847 2443735 1735415 1044608 1297148 1733583 913384 -62666 -90288 -142630 243667
11719 243667 612958 1036700 1015952 1025599 842630 572825 -305170 -1005143 -828787 -485706
11709 -485706 267399 1360510 1221655 135616 -1168573 -1187724 -432858 -180961 -760112
11700 -760112 -1659807 -1969303 -1559887 -458637 -409080 -685579 -744477 -406006 -431744 -893598
11690 -893598 -897789 -537347 -101459 356993 549091 856310 1612406 1331339 596300 117406
11680 117406 -356597 -473359 -371738 -238111 -109746 101898 358611 641923 182933 -258600
11670 -258600 -526335 -1124692 -1793640 -1292634 -1299848 -1770641 -2073380 -2314988 -1843921 -1042486
11660 -1042486 -493372 -294057 -37764 381006 56594 -1018864 -1597260 -1157640 -815473
11651 -815473 -371139 290176 532784 437460 179751 -311678 -1002896 -1275174 -1179273 -1350976
11641 -1350976 -1747976 -2803052 -3396867 -3125364 -2489411 -1141479 -575928 -604241 -824166
11632 -824166 -1324340 -973023 532537 890873 511130 425388 807468 1576167 1588353 674562
11622 674562 92914 -181749 73276 435873 245499 329171 329546 -111322 630093 889821
11612 889821 -187969 -575390 232545 505667 594366 243976 -472162 -22220 1411023
11603 1411023 2109548 2273122 1740074 1045863 1219938 1367789 759562 -158525 26114
11594 26114 1008490 754369 -193230 -1145823 -1972727 -1997690 -1658137 -1596412 -1998635 -2306772
11584 -2306772 -2177015 -1429091 -514319 -80798 -510315 -199115 471858 882218 1138972
11575 1138972 1743602 2286138 1641634 852166 1215212 1883531 1525445 1040373 576908
11566 576908 -756795 -1611870 -1689592 -1228440 293676 1785131 1974963 1534305 1046315
11557 1046315 450326 3226 638325 1474079 1329886 1237641 547621 -325685 -320664 769523
11547 769523 1509944 1276770 726826 460800 305691 57171 -39169 126727 620550 290709
11537 290709 -227183 719302 1558125 1301151 1070042 922420 980437 723187 972923 888557
11527 888557 575332 322681 124201 -382894 -679582 -716750 -1212819 -1682971 -1673469 -464946
11517 -464946 344567 198322 9249 -883218 -1920673 -1559649 -1186301 -1369039 -2182128
11508 -2182128 -2891941 -2573576 -2229897 -2537994 -2112905 -1341321 -1227545 -1257771 -1110601 -646837
11498 -646837 -96660 634487 1473994 592099 -1423304 -2469217 -3130419 -3506243 -3930521
11489 -3930521 -3201211 -1370952 -255989 577337 939456 488447 16605 -327644 -1442675
11480 -1442675 -2398793 -2225271 -1797576 -1946495 -1865707 -1999443 -2044251 -1620943 -1537773 -1598752
11470 -1598752 -1341615 -1083298 -1608400 -2761715 -3129670 -3360277 -3715549 -3392659 -2949774
11461 -2949774 -2481521 -1823080 -1927715 -2486149 -2593592 -1563342 -204120 492271 569098
11452 569098 290382 -713193 -1218414 -1176559 -1086874 -533745 -300644 -651833 -728181 -364644
11442 -364644 366354 701668 700437 209852 -469479 -642074 486704 2533381 3589671
11433 3589671 2482264 2388823 2926217 2467073 1245844 570387 1284830 1538831 678488
11424 678488 -130636 432161 1168223 1555331 1721703 1278544 1103063 1152228 1048828 1858415
11414 1858415 2368151 2018424 1815100 2069846 2567841 2863411 2259102 1561498 1198535
11405 1198535 786171 615116 491484 162278 666472 981095 1070826 1523084 1055555 -40761
11395 -40761 -435740 -609622 167938 1673148 2463571 1874355 233014 -959687 -1723078
11386 -1723078 -2548010 -2286800 -1091465 -554552 268216 1115703 1240589 707957 135964
11377 135964 206503 313622 14237 -1045958 -1019667 -47586 141642 341136 590924 43139
11367 43139 -99570 -519708 -783332 -832327 -1150300 -1236356 -712321 -243481 -424722 -419523
11357 -419523 -354690 -80543 -186852 -350034 -661118 -878660 -355326 384718 762995 -288732
11347 -288732 -1129880 -1022664 -563647 -128594 514348 622777 91142 -869171 -1656345 -1564536
11337 -1564536 -1388451 -631802 813104 1781121 1097319 1121214 1165153 1052600 847092 978632
11327 978632 1226059 575039 41 -814552 -558847 -251246 183180 381528 18723 155496
11317 155496 304265 -168508 -468802 133315 517285 -57791 -620008 -541374 -85550 658653
11307 658653 506847 -317921 -678934 -996249 -456626 305751 537732 1034563 1013039 64005
11297 64005 -779445 -1238439 -2088635 -3128105 -3408742 -2726927 -2060786 -1331886 -672660 -737280
11287 -737280 -721602 -897687 -1974563 -1814384 -1104288 -1035217 -564539 111707 176509 -95380
11277 -95380 -331136 -187951 36123 -284638 -932484 -785129 7934 203957 1085156 1705740
11267 1705740 1688824 1328595 342302 -458920 -726753 -493832 -361752 -295701 191267 779550
11257 779550 1446689 1857435 2070637 1951670 1535078 493261 -100647 227096 1501098
11248 1501098 2624924 2707953 2493342 1416760 -491749 -1819361 -2157470 -1796589 -1035106
11239 -1035106 118459 614199 584308 753899 1212018 1108325 649980 -193547 -901596
11230 -901596 -889768 198664 1138159 1323561 804564 316169 195685 69398 -479970 -679984
11220 -679984 -530764 -392613 -418935 -1002396 -1724319 -2036231 -1799974 -1892511 -2034030 -1474460
11210 -1474460 -1227396 -2411738 -3188203 -2903131 -2259921 -1346504 -581206 -170885 -429216
11201 -429216 -521265 -35251 -112961 -813746 -1097195 -543172 -407838 -1382580 -1978326 -1323977
11191 -1323977 -191475 -293552 -1134233 -1487374 -1130056 -413147 -213882 -105065 -372243
11182 -372243 -429301 -313983 -930022 -1401947 -1703280 -1609536 -308608 1028264 1284059 866410
11172 866410 590817 266502 -217533 -1001039 -1129802 -1052989 -1215678 -1767213 -1404605 -244856
11162 -244856 843086 1518759 1122059 176751 -1185898 -2015407 -1336296 327902 1942455
11153 1942455 2107200 1249151 592351 669601 1190336 1440689 314599 -464008 50216
11144 50216 -99639 -475234 459619 904262 223898 -668657 -889275 -314356 -521995 -1367020
11134 -1367020 -1050384 -249751 718654 1263809 1014801 821402 1445276 1773366 990709
11125 990709 532465 52035 -1280410 -1978991 -2035422 -2135112 -1066450 569232 879484
11116 879484 304737 94848 684906 629951 98719 -282311 -880322 -1315508 -1213611 -732462
11106 -732462 343318 1749855 2253302 2554633 2577865 1861102 717013 462209 -209677
11097 -209677 -744458 -105761 432847 282036 261072 524148 583342 -1010 -659622 -564511
11087 -564511 -145884 -467939 -1235645 -1137066 -950822 -77906 172261 -980696 -1957953 -1777399
11077 -1777399 -714246 -123682 464511 1990988 2919946 2671006 1695739 1077736 1304114
11068 1304114 1342789 1531202 1261968 509358 202717 490023 373826 -215678 -519397 183293
11058 183293 -109256 -1669695 -2410092 -2048255 -1607890 -1951949 -2239264 -1981751 -1325963
11049 -1325963 -1175115 -884627 -540696 -692685 -256912 1030742 1619085 1034281 389543
11040 389543 546720 424658 -83257 -271982 -27217 215289 -92490 -739568 -1250483 -1516120
11030 -1516120 -1747937 -1077296 -222236 430289 1404479 2234486 2788739 3138417 2372626
11021 2372626 1459903 801069 383805 535683 835098 1189652 1551883 1862753 1602791
11012 1602791 702314 203070 647413 389853 -445911 -894063 -1240021 -1099803 -1044918 -562857
11002 -562857 -24738 -132989 -171386 -191496 117363 400626 762196 1417034 1340633 137506
10992 137506 -1189725 -1706758 -1128852 -348934 8839 286149 748078 731969 145079 -432624
10982 -432624 -392089 -529474 -1551369 -2686695 -2825605 -2338184 -2196918 -2286056 -1831632 -1485835
10972 -1485835 -918638 574793 1535911 1419152 1140731 970096 782884 454944 87467
10963 87467 -201067 -166733 -320002 -320789 352113 802890 836004 572009 886484 615700 -205383
10952 -205383 -238626 284436 464370 831939 1431738 1323743 726146 261024 421016 443035
10942 443035 112638 -179081 12850 358493 641878 -71067 -1080619 -1051124 349663
10933 349663 1582336 2134511 2020845 1216596 452991 76657 -243819 151838 246557 -9101
10923 -9101 182369 -748867 -1807262 -1408960 -240724 311334 -32521 -869485 -1858438 -2307137
10913 -2307137 -1350280 48755 655997 741088 631247 -177845 -753546 -417283 -95810
10904 -95810 282503 530880 1130306 1986499 1431507 959286 685491 221907 394183 747634
10894 747634 1233665 1342847 780664 544605 689641 1424897 1106409 -91243 -730737
10885 -730737 -1009354 -1564943 -1798854 -716679 283182 1301123 1849752 1824812 1667877
10876 1667877 1052400 718285 956153 1375169 1253645 285859 -269251 -406391 -424756 -179904
10866 -179904 405845 1058899 1056120 952879 1149709 1328581 1068188 799499 463337 -107602
10856 -107602 267995 547366 176646 194186 360520 208548 636398 716002 -276057 -1119448
10846 -1119448 -1452364 -1328785 -250750 461956 -356599 -1234351 -1501070 -1726691 -2096169
10837 -2096169 -1861060 -1434265 -1129888 -406581 257615 771820 1590907 1706741 1771566 1755534
10827 1755534 1284427 519331 -9774 -421251 -363754 953421 1589082 1395996 597849
10818 597849 -246816 -275683 -127004 -1312398 -2401357 -1618983 -396815 95980 -149356
10809 -149356 -713293 -1527637 -1211857 -852255 -1480045 -1927894 -2013958 -2548662 -2326406 -917991
10799 -917991 -639262 -593149 -13301 -705999 -1857470 -2109775 -2036402 -1616974 -630238 245441
10789 245441 680628 1495326 2617974 2720585 2205170 982483 -656266 -1860120 -1763408
10780 -1763408 -1073561 -1328591 -1936008 -2238123 -2641966 -2087016 -2154109 -2422091 -1858214 -499994
10770 -499994 703688 1061417 431216 -150348 -520236 -757480 -418204 198625 1014586
10761 1014586 1294606 1318747 577292 -489299 -707523 -667239 -630269 -829753 -871912 -1241199
10751 -1241199 -1457990 -1147982 -520226 551908 1093095 1081865 949245 703933 284066
10742 284066 -973446 -2110754 -2324405 -2488442 -2428551 -2403626 -2504806 -2767848 -3021597 -3241656
10732 -3241656 -2794687 -1796521 490821 1892422 1945160 1789469 1157102 637752 -172733
10723 -172733 -587530 -10792 480478 701979 357086 -231172 -784037 -1124754 -1062143 -1107311
10713 -1107311 -595754 -580963 -1212298 -1903014 -2274980 -1521047 -746416 -749054 -885165 -944670
10703 -944670 -418522 673076 733522 1007085 1313250 791938 719106 683027 109190 -487082
10693 -487082 -395132 1050756 2065879 1483789 775496 178895 -69543 -1028935 -1468848
10684 -1468848 -1084072 -1209263 -1806383 -971134 15733 -268789 -1000056 -1445232 -985730
10675 -985730 -1260909 -1905707 -1941942 -1441282 -884070 -589411 -87654 -30751 -573228 -1816319
10665 -1816319 -2323990 -1862838 -1641697 -901971 -450749 -598408 -337038 182051 489407
10656 489407 558184 -185414 -872207 -1238042 -1082195 -1205955 -1520264 -1475535 -1286257 -1629196
10646 -1629196 -1636493 -144491 1237654 1761931 2109210 1536265 517681 377057 262101
10637 262101 -12604 -409779 -888723 -1417702 -2103902 -2350455 -1837643 -2323036 -2490106 -1566314
10627 -1566314 -993605 -547762 -754134 -1074307 -864473 -661988 -410660 -222179 220900
10618 220900 550919 834719 662133 593106 1083232 1322532 1829262 2192787 1837801 1194829
10608 1194829 993483 848482 1345041 1505155 1558059 1113392 792865 943917 672518 440128
10598 440128 352217 697321 893421 476490 92257 501929 887329 281269 -37197 1008286
10588 1008286 1314600 335863 -263370 -492149 -414471 -323310 -685900 -853013 -1000587 -564210
10578 -564210 264297 1123995 930831 -240103 -439222 -560466 -1681599 -2374135 -1587946
10569 -1587946 -690948 -366078 -588769 -521801 -375820 -353224 -193422 -305046 -505517 -811829
10559 -811829 -1145072 -1303412 -1176744 -1165262 -1936521 -2455005 -2018663 -1715606 -1691043 -1462203
10549 -1462203 -935293 -133284 356492 -35312 -430983 -461863 -457020 -1169712 -1429798 -737404
10539 -737404 -1162095 -2147935 -1705296 -535687 -358001 -251666 -476212 -598048 -1306632
10530 -1306632 -2567637 -2814897 -2374849 -1724584 -1043057 -1225367 -1617168 -1658438 -1236892
10521 -1236892 -903703 -1046292 -1251417 -240764 806882 1185731 1736760 1727430 104854
10512 104854 -773132 -552494 -633277 -136741 96797 -178824 -84378 -72205 476768 1114586
10502 1114586 726077 320060 -223015 -950562 -1914851 -2340342 -2316396 -1794733 -1414809 -1240172
10492 -1240172 -1118414 -728257 -602931 -479754 -734268 -1319184 -1739464 -2175613 -2663279
10483 -2663279 -1801797 -630559 -599217 -974358 -1332372 -1492861 -1435703 -1076422 -1595425 -1371442
10473 -1371442 -188035 274834 232596 71604 263187 668979 1047435 1758072 1581996
10464 1581996 618167 -217850 -265452 303588 536703 187793 152713 -407770 -840992 -870904
10454 -870904 -397318 -233205 -308918 41778 155455 424853 744637 557267 45536 -24626
10444 -24626 -95659 -377146 -5024 -733906 -1859209 -1709388 -1590026 -1542302 -845853 169083
10434 169083 362654 261770 572176 1066985 696327 648467 -37966 -242768 260683 924779
10424 924779 1016098 848942 204542 -1148020 -1471026 -1196181 -1232648 -1827361 -1632439 -1408968
10414 -1408968 -1117955 -386639 -179411 -297843 19656 655419 516460 -45901 -233390
10405 -233390 26835 1444745 1783395 680473 20771 -31257 293678 273394 2181 -216351
10395 -216351 -305376 -188268 70196 1115237 2209078 2575100 3291554 3163104 1657122
10386 1657122 745919 375830 -206323 -549399 -532449 -279509 -131291 -285588 -593967 -945949
10376 -945949 -773354 -667585 -919678 -1176106 -1369234 -1380733 -1081630 -1129034 -762170 -17381
10366 -17381 297278 -67644 -494045 -388406 -307882 -270335 -142669 -158479 -143616 116177
10356 116177 77831 -467417 197244 962542 908203 1052721 1341996 1473039 1535925 1306860
10346 1306860 1162315 1277087 1333025 979262 455617 111675 -430093 -869473 -926700 -525826
10336 -525826 -680895 -662765 -103472 158802 -298781 -536808 -605626 -772439 -624622 -997396
10326 -997396 -1484639 -1352786 -940034 -709298 -717593 -1104971 -1310068 -949840 264138 1168747
10316 1168747 31758 -1145770 -2045764 -2269160 -2360503 -2514669 -1635247 -511861 705105
10307 705105 1301369 808654 462162 640388 684069 206763 -396186 27544 549385 641064
10297 641064 1155636 1072728 362659 -698409 -1337486 -1545197 -2449300 -1856965 -314683
10288 -314683 102271 -547256 -1560555 -1617344 -1605662 -1428282 -1370005 -1067426 -801748 -1113815
10278 -1113815 -983173 -93321 159566 -55845 -541121 -1318582 -2422478 -3298438 -3121668
10269 -3121668 -2575056 -1818881 -1236607 -1023199 -426442 367058 -162136 -939998 -1555643
10260 -1555643 -1100973 263976 1069743 1602321 1287687 437631 117185 -594021 -806457
10251 -806457 -41083 394403 305899 -491370 -1069112 -1376239 -924072 -214734 -387410 -968852
10241 -968852 -1687120 -1620139 -1087515 -1242896 -1166225 -873086 -942158 -1223417 -1620686 -1963024
10231 -1963024 -1540211 -1037418 -808179 53583 729198 668876 598529 507406 1090597 1166451
10221 1166451 170291 -943338 -1051581 -841033 -612285 -613688 -408180 525662 1058525 226361
10211 226361 -158559 376948 704851 -152128 -1366736 -1518428 -373229 283785 -194898
10202 -194898 -275108 -89030 626715 1079318 417808 -126550 466154 1215777 918343 640238
10192 640238 1102032 2289662 2821991 2639161 1197731 -426559 -655502 -476691 -242095
10183 -242095 87189 171857 -201168 259972 634661 -6153 -101189 -39230 -347186 -321343
10173 -321343 -477530 -570673 -397486 -284872 -510678 -377184 197326 -52897 -325705 -115075
10163 -115075 -288020 -841395 -1470646 -754792 524997 907506 105479 -735456 -821608 -863646
10153 -863646 -873004 -53998 1214138 1644797 1249603 936251 855622 927080 1366529 1335138
10143 1335138 1275753 1421736 1597316 1479197 178078 -493439 -95390 232160 770759
10134 770759 849228 425341 176404 422044 544969 -16675 -250297 -17404 534774 739223
10124 739223 247529 -490471 -432174 185400 769306 771261 193416 -78311 -326658 -462233
10114 -462233 501473 1148290 934691 824301 835490 508299 167942 277328 693432 430725
10104 430725 196640 294294 123394 -355349 -726628 -15984 792541 480545 457489 493938
10094 493938 669717 900188 638993 698370 685703 -232523 -1165794 -1585946 -1454835 -1316289
10084 -1316289 -1074432 -1038582 -2025354 -2665645 -1849564 -359197 637972 495313 -31913
10075 -31913 -109375 -41303 7128 194703 32039 62736 428507 750178 327104 322754 568616
10064 568616 15639 -864473 -1052369 -849544 -584495 -271810 -872853 -846579 -606502 -160945
10054 -160945 721225 720655 705653 366723 -569023 -806737 -54595 14858 -502612 -438077 69730
10043 69730 652450 496539 293386 -154529 -1179494 -751650 508330 1271022 841533
10034 841533 386611 550018 309084 -125978 3715 -156157 -1126807 -2141354 -2032505
10025 -2032505 -1096255 -520507 -280142 678875 647016 65210 73250 -44171 125805 47717
10015 47717 -349483 -371578 -288824 -469783 135365 49407 -383568 -936084 -1079023 -899732
10005 -899732 -665431 -312636 -146458 -98577 41738 -196992 -406808 -14681 -813077 -1218783
9995 -1218783 -763740 -822130 -652765 -532746 -525006 -383738 370700 988624 668072 500849
9985 500849 310344 -3144 -50844 -747522 -1408585 -1282863 -850865 -227091 -64479 27018
9975 27018 -507152 -1458848 -1220156 -444051 48539 16145 309861 968742 902560 887712
9965 887712 893517 398712 -45566 -317093 -38691 364860 346053 -25993 -726829 -1184638
9955 -1184638 -795615 -246207 -316406 -562854 -863180 -605298 -875217 -1768927 -2482053 -2263088
9945 -2263088 -1114361 -77761 242457 120346 -131977 -98963 563035 156230 -247469
9936 -247469 -38772 24574 -161279 -207074 -421687 -848840 -1346359 -1663323 -1269244 -694290
9926 -694290 -20433 18045 -304775 -218255 -143484 -302685 -171064 -345570 -350988 -636881 -791090
9915 -791090 -16007 1037887 1707370 1132553 989406 1263353 1752785 1746507 945950 464849
9905 464849 -20661 -431654 -258319 -479376 -1038759 -1535360 -1988435 -1700033 -1114985 -389134
9895 -389134 224173 2850 -505019 -685880 46937 303028 172061 -157043 -809038 -683478
9885 -683478 -231774 -952067 -2414116 -2434865 -1244970 -215769 17388 -233048 -1177155
9876 -1177155 -1835250 -1545451 -649862 -103123 369572 1410173 2031623 1592715 1285377
9867 1285377 1269288 841715 43710 -367577 -371131 -494345 -186583 209047 -220967 -916712
9857 -916712 -614432 -492393 -863711 -1346441 -1495248 -409361 165056 -658053 -1225219 -1275678
9847 -1275678 -430541 -157418 -949608 -1594480 -1223123 301216 1191195 988574 321703
9838 321703 -397790 -429354 -680530 -545002 -212517 -426509 -359453 427168 472632 -425857
9828 -425857 -716774 -1094293 -1402519 -797880 -207904 -195988 33170 487059 858909 1031722
9818 1031722 1674428 1930285 1196129 888004 976340 1241723 365489 -184057 210539 482065
9808 482065 405350 129051 -67979 -336089 -642289 -526702 -386013 -682602 -895129 -1146447
9798 -1146447 -490186 858347 1295718 714196 -81890 -534039 -1335722 -1426193 -433157 218268
9788 218268 946242 1128688 165611 -738052 -1195260 -713059 -259548 -346024 -1111964 -1582537
9778 -1582537 -1319412 -1550025 -1562960 -1001549 -332157 -51035 -260579 -174757 522287 1349847
9768 1349847 1296083 278523 -263708 -169645 177405 174640 504200 1283457 1164639 981913
9758 981913 1653807 2278681 1904671 1371631 557423 -547354 -746038 402809 1867424
9749 1867424 1847947 697618 -788139 -2150645 -2284739 -1954297 -1739551 -1670174 -1131683
9740 -1131683 81193 1116142 719347 -729773 -1731722 -2288323 -2376966 -2268592 -1033437
9731 -1033437 -43921 -798257 -1678344 -1272684 -564163 -531956 -502568 -459958 -413421 488306
9721 488306 653314 281247 2750 -521818 -262679 636749 1186330 805380 609701 949076
9711 949076 764838 -55412 790600 2540157 2703954 2619266 2511688 2191434 1895070 812799
9701 812799 -310910 -295243 -105380 -126058 -314392 -568736 -372484 -229670 -783969 -1110672
9691 -1110672 -1131695 -437047 53129 -585877 -614567 -581422 -465728 -294238 -355831 -10163
9681 -10163 558076 729650 182755 707684 1354494 1085287 124258 -341413 -230770 0
9671 0 43557 -651304 -1864735 -2036676 -1202262 -559796 -202774 -95593 693772 1531091 1744879
9660 1744879 1365262 939302 628850 319522 303636 -61186 -436497 -351059 -131479 -464393
9650 -464393 -733990 -707461 -393484 436886 760215 216322 -14338 514533 727904 1087034
9640 1087034 1467409 1319449 455122 -294819 -106906 518372 621667 515027 681452 518658
9630 518658 97502 -523423 -1126014 -1279435 -1472130 -1592134 -1083848 -1251576 -1790072 -1406835
9620 -1406835 -1587311 -1341833 -558240 -972304 -1312009 -844799 -47219 95525 -126213 -310057
9610 -310057 -694472 -1734974 -2161183 -2513571 -2781823 -2216196 -2725342 -3132668 -3197449 -2980304
9600 -2980304 -2057611 -1246509 -874036 -693184 -1116464 -1607554 -2195169 -1968299 -1253594 -497894
9590 -497894 54374 -269168 -680924 -825769 -970830 -614280 -439568 -564842 -584596 -851581
9580 -851581 -1746569 -2488792 -2524911 -2268627 -1613752 -629847 -316683 -1075465 -2081285 -1910899
9570 -1910899 -1269775 -549573 -66655 82810 521957 273167 -620645 -828523 -20672 -60597
9560 -60597 158822 -321824 -77033 649228 343052 -765838 -958563 -509013 -795975 -817086
9550 -817086 -735427 -986625 -1386027 -1808273 -1744629 -1288238 -50787 751160 284115 -419177
9540 -419177 90097 1075924 1177107 502730 42627 -125257 -521859 -184624 329258 285113
9530 285113 -424518 -717435 -754017 -856972 -1246115 -1715335 -2236043 -2365263 -1923383 -1158792
9520 -1158792 -996428 -1486285 -1623839 -1550881 -1335739 -893950 -1455001 -1812135 -1292793 -945839
9510 -945839 -949540 -708870 -313097 79785 758717 1148533 974913 597038 767019 635956
9500 635956 -81532 414173 658302 513362 130458 -942240 -1078775 -1347899 -1690730 -1414239
9490 -1414239 -971396 -54739 131274 -359006 -787857 -1170774 -1328675 -1096664 -678778 -430199
9480 -430199 -213114 -17843 -386718 -1167769 -1485695 -1067961 -679644 -1267688 -1835926 -1820546
9470 -1820546 -2024054 -2702940 -2047367 -1069597 -1015179 -658269 -985920 -1875114 -2216046 -2630614
9460 -2630614 -2705919 -2140529 -2388384 -2121312 -1299713 -464128 418344 487294 144067 -694079
9450 -694079 -829624 -406152 -328557 268283 759831 302680 -762498 -852980 15444 348573
9440 348573 680636 708870 720659 697046 706047 1333117 1357400 726548 850111 729531 -160190
9429 -160190 -480862 101570 760369 1069122 758778 983467 1578630 1266011 412531 -500758
9419 -500758 -882109 -384276 49113 301619 378170 679252 784485 1182848 1674799 1877455
9409 1877455 1038113 -71974 152668 370161 501939 702204 127534 -377069 -308499 -405113
9399 -405113 -879133 -1081046 -794152 -214567 -24145 -455764 -1301924 -2185930 -2263589 -1701687
9389 -1701687 -1522360 -1469860 -1442018 -1887322 -1971731 -1792469 -1605845 -623920 144715 661672
9379 661672 584090 266034 267610 -581429 -768399 -875152 -931971 365320 1157180 239486
9369 239486 -669515 -1291969 -1458714 -774380 156070 719834 670497 235674 -447180 -1395881
9359 -1395881 -2085657 -1718014 -1211389 -1224586 -829965 200023 1110165 1214121 1059156 710132
9349 710132 56128 -47601 216208 166260 637515 1052888 1008930 838999 282397 612960
9339 612960 636951 -169398 -1089089 -1896182 -2087381 -1941248 -1588583 -935576 -464875 -381355
9329 -381355 -1062023 -1524194 -1227588 -1538637 -1884709 -1891514 -1596856 -1760760 -1883915 -1961538
9319 -1961538 -1821811 -968431 131265 283218 229957 -91815 -303233 -404737 -271045 -342617
9309 -342617 -980413 -1157810 -602692 -130168 -18001 142041 271519 732408 951056 1061645
9299 1061645 546357 -500778 -189649 914925 1802339 1647642 1232541 912721 165741
9290 165741 -901439 -1145351 -856441 -909374 -1113428 -1234606 -992673 -156591 291827 225187
9280 225187 327388 45063 -332385 -365432 -277078 -145271 343272 606048 279155 -296056
9270 -296056 211002 729734 566955 375981 12179 -593912 -1102976 -1114466 -1023092 -1146900
9260 -1146900 -1230947 -608006 -52251 -437964 -214722 224514 -47676 -921321 -1134613 -659787
9250 -659787 -739703 -1011245 -654783 215540 181327 -283651 -605792 -1071415 -728787 -779593
9240 -779593 -1922263 -2811714 -2350346 -1194543 -448331 -69538 273864 455811 561362
9231 561362 644665 231091 285243 344649 25127 23494 553068 950284 951160 534203 248173
9220 248173 -647901 -1266168 -985657 -341663 329345 817376 1787387 1888743 616753 -834545
9210 -834545 -1678199 -2320992 -2492008 -1693870 -1115685 -1285881 -1289339 -608525 -503678 -265703
9200 -265703 343482 539078 1122482 990722 443011 374090 584749 -70490 -757657 -724086
9190 -724086 53839 559050 921360 1622978 2211155 2250398 1086968 -494127 -499688 777013
9180 777013 1113091 825485 390166 -253674 -275687 34906 174227 253146 -65245 -754300
9170 -754300 -837200 -539929 44418 503120 371128 -103651 -153933 132092 -200737 -889164
9160 -889164 -1147350 -971269 -943056 -942581 -351159 598103 1033172 766733 15411 -51228 652991
9149 652991 1324048 1359235 991248 542647 135933 263036 501559 428304 459274 581292
9139 581292 998627 1369897 1134840 957904 828166 1370356 2016877 1461606 1236825 1075922
9129 1075922 769995 633579 -415852 -1856903 -1939347 -1905261 -1784370 -1141563 -432023 -117268
9119 -117268 -796768 -1903147 -2611882 -2752658 -2293690 -2084880 -1771609 -907793 -395889 -111152
9109 -111152 -409977 -376417 -167349 -296131 -712433 -1754909 -2444970 -1950386 -485345 813855
9099 813855 1183251 982763 929670 319678 -443218 -529699 -432656 -404053 -591097 -829931
9089 -829931 -935963 -1062459 -713659 -342883 34633 -994749 -2354171 -2922208 -3354891
9080 -3354891 -3052187 -1936880 -1158796 -684340 -10419 337128 1192319 2275941 1894897
9071 1894897 691087 161648 -91866 -424653 -431623 -179639 127195 687361 701309 383242
9061 383242 -130060 47392 789088 1182341 1373511 1852550 1423219 545458 -95448 -804408
9051 -804408 -1383440 -999574 -328173 -273095 -924712 -1089690 -848023 -495707 -354837 -613466
9041 -613466 -983375 -1482954 -1574010 -919113 221786 999329 1676646 1608498 1338172 847276
9031 847276 567761 470033 816351 610024 -41639 -245277 380584 573958 287557 -489131
9021 -489131 -1600864 -1893559 -1535890 -1239201 -1172985 -848689 -378875 775736 1531670 1796744
9011 1796744 1803878 1330765 1086185 672451 329775 734432 295263 401813 699916 438094
9001 438094 -663204 -1326645 -1212476 -1120121 -863312 -598312 -105412 -105266 -714535 -1162156
8991 -1162156 -831979 -323737 -30248 180846 -162969 -742692 -788064 -120821 778286 1530639
8981 1530639 1225703 604728 448491 178216 328627 864062 931869 632881 422368 758587
8971 758587 987728 900604 46322 -219523 634143 557952 445384 463788 228653 -368587
8961 -368587 -368411 -146646 -189689 -457661 -742545 -559326 -501456 -1051998 -1789504 -1919988 -2071701
8950 -2071701 -1681536 -1226272 -583284 -142517 -184587 -581095 -916502 -1325128 -1335481 -347652
8940 -347652 -21242 -80154 80034 943428 1662783 994683 745984 488635 189365 -107661
8930 -107661 -939830 -1890532 -1334128 -670338 -1364056 -1399531 -928230 -924538 -944992 -612018
8920 -612018 -482919 -153773 998662 965789 -152856 -1325748 -1675602 -1129810 -680501
8911 -680501 -260351 -530348 -589541 82807 1320585 1538940 329176 -658144 -622418 -679897
8901 -679897 -631835 -920709 -1431894 -1143735 -756249 -207737 382117 313443 78869 -144258
8891 -144258 -644637 -1114376 -842361 -103622 185474 50802 -158464 -562828 -1326568 -1141859
8881 -1141859 -63016 868495 997755 929017 1279157 1289657 200669 -111838 80938 -151343
8871 -151343 -20091 -249386 -625615 -1100369 -742705 606292 1354089 876351 532319 631891
8861 631891 519301 604244 -71128 -674745 -336999 -702141 -1536822 -1659395 -1153841 -945602
8851 -945602 -1025835 -645651 -369343 -464471 -558280 -440945 -741877 -1239056 -997701 -792447
8841 -792447 -661730 -791790 -831367 -1358935 -709699 611459 1016280 1003399 1592969 1661366
8831 1661366 1324549 1065591 1121541 1277494 1354993 1593120 1672377 1238672 819912 361911
8821 361911 290323 520211 748004 707812 719779 330551 12335 -12171 -315474 -355721 -410625
8810 -410625 183827 766372 502625 -260362 -822298 -235073 48902 -435181 -764513 -497015
8800 -497015 -581197 -464271 587102 917287 584378 92251 319211 433005 853165 1107993
8790 1107993 627782 227519 204395 -172755 -649069 -151267 607740 538886 652192 715688
8780 715688 -50317 -702584 -958114 -1271683 -1283517 -775534 -156067 -633564 -1684586 -2281531
8770 -2281531 -2963386 -3117990 -2669722 -1998471 -1502527 -984324 -730315 -100210 768875 993264
8760 993264 1391439 1730167 1744949 1451959 1241487 1129515 1205245 1161584 1318770 1786233
8750 1786233 1432096 723069 392727 -55918 -486006 -1466061 -2467145 -1955570 -1430224
8741 -1430224 -1288552 -1533081 -2218868 -2612621 -3213217 -3378682 -3018714 -2837155 -2069473 -938743
8731 -938743 -626807 -650746 -1193285 -1826599 -1746639 -1689974 -1307234 -1131078 -586393 258163
8721 258163 -53086 -222842 -995312 -1347842 -1134374 -1164450 -879658 -167290 126597 72717
8711 72717 439282 1423437 1401092 211405 -642041 -1011436 -487562 -58104 -708249 -1167312
8701 -1167312 -1802500 -2148933 -1252793 -771352 -1018496 -363665 96012 -183059 -665502 -1471610
8691 -1471610 -2112248 -1540756 659850 2266932 2309473 1813857 1840701 2760290 3214995 2375094
8681 2375094 1525456 1293280 744719 495614 179225 -162564 -106188 -48630 -63222 236675
8671 236675 817824 835197 1155823 1260306 503872 3196 -78749 673127 1877481 1482896
8661 1482896 660445 124041 -374315 -483767 -383569 195956 885238 543553 10341 -618987
8651 -618987 -440542 438285 837868 974872 826764 543181 646291 742963 608238 449601
8641 449601 -65010 -305177 -957228 -1352511 -1141561 -1120505 -1128326 -1110509 -948345 -1411117
8631 -1411117 -1841341 -1493216 -758433 778045 1660461 1583857 1360633 930391 1309060 1079920
8621 1079920 560984 478994 420592 -256107 -1423778 -1475817 -1149153 -2008215 -2442588 -2206640
8611 -2206640 -1587248 -986150 -98396 549808 502620 551508 680854 854172 482475 51972
8601 51972 37711 103149 107286 -189023 -505980 -1066413 -1722111 -1704958 -1064707 -140300 -157952
8590 -157952 86057 978894 834088 409538 -295616 -739758 -656223 -264894 -594136 -122435
8580 -122435 613386 750203 690102 447394 435306 24697 -520827 32798 438814 135464
8570 135464 21499 -179460 -551721 -268590 77456 143814 16151 -41422 170552 143780
8560 143780 -155555 -1010724 -1726868 -1580161 -599855 471217 537730 -125171 -556045 -676040
8550 -676040 -325768 -766737 -635928 -282624 -948690 -1479712 -1576093 -1535501 -977919 99167
8540 99167 1147187 1634912 1530844 686761 -181384 -449919 -149092 -777757 -1693270 -1880933
8530 -1880933 -1561467 -474634 336839 -360791 -1304418 -898669 754027 1803507 1554003
8521 1554003 730212 223649 698600 1763444 1994973 1149975 311623 4399 522199
8512 522199 1860155 2439436 1485584 467871 -376463 -371456 67741 1114890 2402344
8503 2402344 2545281 1731859 1195325 875269 1271277 1935576 2653797 3485454 2888842 1570613
8493 1570613 161098 -305568 -149561 376550 858387 1173201 1197548 27875 -973338
8484 -973338 -1540149 -1835875 -1182405 -920259 -1991317 -2944422 -2305233 -1304139 -1076017
8475 -1076017 -1163726 -752756 -545957 -559454 -700600 -467711 -483644 -1604419 -2271408 -2325641
8465 -2325641 -2322649 -1572833 -1005995 -1055538 -1050362 -175469 767478 974391 725946 -254524
8455 -254524 -866744 -829365 86625 570936 -224006 -324343 761113 1137152 737394 815502
8445 815502 1281760 1062894 584256 1037498 1532865 1516918 1944682 2139995 2002812 1586711
8435 1586711 579467 -176410 39920 556505 508840 -58678 -470611 -903776 -1324192 -1176517
8425 -1176517 -1481451 -1385134 -899062 -1383275 -1624839 -1390671 -1157432 -464007 -241150 -600474
8415 -600474 -735955 -800739 -992203 -699839 -1027742 -1390992 -1032797 -1028557 -890804 -661356
8405 -661356 -924880 -1482851 -1417371 -46825 710446 802387 882459 601160 88381 226157
8395 226157 592358 976678 547897 -422161 -1436715 -1567288 -914879 533652 1615812
8386 1615812 1701005 1522704 1323974 1120137 845659 642894 670253 951265 1433963 2058466
8376 2058466 1768764 794775 -433155 -927589 -683070 -472250 -153428 193536 1069027
8367 1069027 1297162 789107 -70364 -961254 -759455 -855206 -1160078 -1211863 -322643 803860
8357 803860 1310662 1803640 1837643 1210964 541737 -707695 -1608764 -1760066 -1988080 -1776558
8347 -1776558 -1443153 -1498498 -1276593 -577586 -225384 435400 1408259 1406389 1065252 359615
8337 359615 15104 -361475 -768047 -608054 -392438 -146122 -10925 171672 440061 344728
8327 344728 122473 -359740 -434520 102328 -74844 -1084168 -1549223 -1998090 -2183109 -2755261
8317 -2755261 -2704430 -2176915 -1222613 -345288 -620371 -1178641 -314530 433014 164562 520757
8307 520757 672912 427493 4365 -385733 -719717 -701277 -697251 -618079 -1155234 -1428988
8297 -1428988 -603973 275064 783467 947893 832814 -16157 -609050 -46662 922735 1425516
8287 1425516 1707735 2132638 2162288 2057451 1805399 758788 600809 1185519 1161700 741253
8277 741253 -72760 -1114851 -1707127 -1854479 -1305114 -910492 92128 1371349 1672987
8268 1672987 1531152 2004248 2350550 2000619 1512505 1345781 1382188 999057 353413 203863
8258 203863 268368 381872 107356 51777 301795 -199799 -67219 526376 906804 324361
8248 324361 -23617 -469097 -804030 -230785 241215 237656 -357713 -794363 -712073 -267120
8238 -267120 656127 1958517 2060208 1366029 1195289 1207153 1310822 1277612 1850461 2384670
8228 2384670 3311413 5329865 7423693 9082985 10626575 12217138 14652246 17609878
8220 17609878 20596287 24333803 29852453 37876694 51012022 69865031 94395579 122141279
8212 122141279 139393247 129696055 103371178 77423430 57777587 44181205 34461355
8205 34461355 27707265 23027108 19476444 16318835 14385565 12754650 10442849 8252782
8197 8252782 6651500 6285188 5988792 5289838 4447568 4231993 4554884 4228185 3733550
8188 3733550 3515697 4017677 3956873 3377072 3054447 3063247 2870459 2225809 1924306 2172884
8178 2172884 2127344 1449289 1307263 1586098 1804286 1635118 1300234 1343183 999947 498498
8168 498498 70808 331181 441048 1069115 1206464 333178 -204998 514272 1450024 1186380
8158 1186380 1080680 1558359 1126821 993346 591968 301457 224398 720794 1592783 2423302
8148 2423302 2946995 2590703 1761974 1481620 2046166 2714532 3013665 2730963 1463740
8139 1463740 528392 156085 509602 1201030 600477 133254 -354528 -535693 -64335 1092423
8129 1092423 1166043 901780 1459377 1524311 1642823 1896108 2112976 2232652 1498426 656639
8119 656639 1257963 1835027 969177 137723 -605275 -1001559 -1121035 -926013 -217507 -203609
8109 -203609 -563997 -751326 89744 1139717 1876431 2152262 2197788 1444226 722029 14064
8099 14064 -1404150 -1587730 -776958 -1525366 -2975371 -3469865 -2682616 -768255 860191
8090 860191 1626473 1097647 168187 -820865 -1650042 -1210440 -171739 868005 1683634
8081 1683634 1711900 1356869 941318 360763 166723 50254 -457644 -957839 -1753456 -1407985
8071 -1407985 -579832 -987836 -1024780 -471670 -288527 -113261 194183 -808748 -1815033
8062 -1815033 -2194753 -2514954 -2825466 -1962662 -811477 -550339 -1431119 -1903719 -1544741
8053 -1544741 -949958 -805700 -1238968 -436407 930489 1341492 567743 -492 36122 202321
8043 202321 142451 203756 434045 1006662 1428946 1919339 1780427 1317121 441365 -397131
8033 -397131 -593061 -745173 -786318 -1056674 -1014990 -1051867 -705867 -1122923 -1523254 -1350344
8023 -1350344 -757560 -301771 -119989 71371 28069 -334036 -706390 -824419 49573 585369
8013 585369 -69577 -383953 273173 819092 1068577 2019642 2991684 3005772 2731832 3258144
8003 3258144 3037563 2321807 2022500 1667738 773930 256063 35128 261485 -20037 -712924
7993 -712924 -1967749 -2030976 -1016513 -757204 -493194 -220281 -857399 -1271148 -1422870 -1384344
7983 -1384344 -1052240 -262064 268891 146944 -894379 -1442008 -1502839 -1450139 -690613 303191
7973 303191 987528 696694 913267 1290867 1612657 2545845 2898353 3182859 3487517 3137156
7963 3137156 2467553 1798583 1533526 1592728 2058296 1887896 1432894 1338267 1524452 1201669
7953 1201669 333299 -670710 -1544247 -1684103 -1106357 -329788 695023 605945 -50249
7944 -50249 -407415 -726530 -768576 -191175 352467 1186627 2052351 2637160 2437639 1995203
7934 1995203 1923474 1775748 1369623 957477 646873 529660 439108 614058 1180786 1539129
7924 1539129 1664932 1097995 757997 583486 559681 770733 610488 189125 -527171 -772051
$$ [...]
##END NTUPLES=NMR SPECTRUM
##END=
