##TITLE=C13_EL-2
 CDCl3+CCl4, 22300sc

 21.1.2025
##JCAMPDX= 6.0         $$ Bruker NMR JCAMP-DX V2.0
##DATA TYPE= NMR SPECTRUM
##DATA CLASS= NTUPLES
##ORIGIN= UXNMR, Bruker Analytische Messtechnik GmbH
##OWNER= root
$$ XWIN-NMR		Version 3.5
$$ Wed Jan 22 13:41:00 2025 Russian Standard Time (UT+4h)  she@DPX200
##.OBSERVE FREQUENCY= 50.327896
##.OBSERVE NUCLEUS= ^13C
##.ACQUISITION MODE= SIMULTANEOUS
##.ACQUISITION SCHEME= undefined
##.AVERAGES= 20240
##.DIGITISER RES= 17
##SPECTROMETER/DATA SYSTEM= spect
##.PULSE SEQUENCE= zgpg30
##.SOLVENT NAME= CDCl3
##.SHIFT REFERENCE= (INTERNAL, CDCl3, 0, 222.646)
##AUDIT TRAIL= $$ (NUMBER, WHEN, WHO, WHERE, WHAT)
$$ ##TITLE= Audit trail, XWIN-NMR		Version 3.5
$$ ##JCAMPDX= 5.01
$$ ##ORIGIN= Bruker BioSpin GmbH
$$ ##OWNER= she
$$ F:/spectra/data/she/nmr/c13/1/pdata/1/auditp.txt
$$ ##AUDIT TRAIL=  $$ (NUMBER, WHEN, WHO, WHERE, WHAT)
(   1,<2025-01-21 18:23:02.73 +0400>,<she>,<DPX200>,
      <acquisition in progress>)
(   2,<2025-01-22 13:40:21.06 +0400>,<she>,<DPX200>,
      <Start of raw data processing
       efp BC_mod = 2 LB = 2 FT_mod = 6 PKNL = 1 PHC0 = -405.3149 PHC1 = 35.08833 SI = 32K 
       data hash MD5: 32K
       C1 94 94 F7 1E 92 AE 5E 7D D6 4E D4 71 FD D7 93>)
(   3,<2025-01-22 13:40:27.89 +0400>,<she>,<DPX200>,
      <abs ABSG = 5 
       data hash MD5: 32K
       CE A2 38 27 8E 73 32 34 6F 37 9B 31 F3 FA 63 FC>)
$$ ##END=
$$ 
$$ hash MD5
$$ 56 92 9B 0B CB C4 86 16 8D 35 82 1A 7F A4 97 F4
##$RELAX= 
##$RELAX= 
##$RELAX= 
##$RELAX= 
##$RELAX= 
##$RELAX= 
##$RELAX= 
##$RELAX= 
$$ Bruker specific parameters
$$ --------------------------
##$DU= <F:/spectra>
##$EXPNO= 1
##$NAME= <c13>
##$PROCNO= 1
##$TYPE= <nmr>
##$USER= <she>
##$AMP= (0..31)
100 100 100 100 100 100 100 100 100 100 100 100 100 100 100 100 100 100 
100 100 100 100 100 100 100 100 100 100 100 100 100 100 
##$AQSEQ= 0
##$AQ_mod= 1
##$AUNM= <au_zg>
##$AUTOPOS= <>
##$BF1= 50.322709
##$BF2= 200.13
##$BF3= 50.322709
##$BF4= 500.13
##$BF5= 500.13
##$BF6= 500.13
##$BF7= 500.13
##$BF8= 500.13
##$BYTORDA= 1
##$CFDGTYP= 0
##$CFRGTYP= 5
##$CHEMSTR= <none>
##$CNST= (0..31)
1 1 145 1 1 1 1 1 1 1 1 1 1 1 1 1 1 1 1 1 1 1 1 1 1 1 1 1 1 1 1 1 
##$CPDPRG= <waltz16>
##$CPDPRG1= <>
##$CPDPRG2= <waltz16>
##$CPDPRG3= <>
##$CPDPRG4= <mlev>
##$CPDPRG5= <mlev>
##$CPDPRG6= <mlev>
##$CPDPRG7= <mlev>
##$CPDPRG8= <mlev>
##$CPDPRGB= <>
##$CPDPRGT= <>
##$D= (0..31)
0 2 0.00345 0 0 0 0 0 0 0 0 0.03 2e-05 3e-06 0 0 0 0 0 0 0 0 0 0 0 0 0 
0 0 0 0 0 
##$DATE= 1737469520
##$DBL= (0..7)
120 120 120 120 120 120 120 120 
##$DBP= (0..7)
150 150 150 150 150 150 150 150 
##$DBP07= 0
##$DBPNAM0= <>
##$DBPNAM1= <>
##$DBPNAM2= <>
##$DBPNAM3= <>
##$DBPNAM4= <>
##$DBPNAM5= <>
##$DBPNAM6= <>
##$DBPNAM7= <>
##$DBPOAL= (0..7)
0.5 0.5 0.5 0.5 0.5 0.5 0.5 0.5 
##$DBPOFFS= (0..7)
0 0 0 0 0 0 0 0 
##$DE= 6
##$DECBNUC= <off>
##$DECIM= 12
##$DECNUC= <off>
##$DECSTAT= 4
##$DIGMOD= 1
##$DIGTYP= 9
##$DL= (0..7)
120 120 120 120 120 120 120 120 
##$DP= (0..7)
150 150 150 150 150 150 150 150 
$$ [...]
##$SUBNAM3= <"">
##$SUBNAM4= <"">
##$SUBNAM5= <"">
##$SUBNAM6= <"">
##$SUBNAM7= <"">
##$SUBNAM8= <"">
##$SUBNAM9= <"">
##$SW= 239.972175391363
##$SWIBOX= (0..15)
0 1 3 0 0 0 0 0 0 0 0 0 0 0 0 0 
##$SW_h= 12077.2946859903
##$TD= 32768
##$TD0= 1
##$TE= 0
##$TE2= 300
##$TE3= 300
##$TEG= 300
##$TL= (0..7)
120 120 120 120 120 120 120 120 
##$TP= (0..7)
150 150 150 150 150 150 150 150 
##$TP07= 0
##$TPNAME0= <>
##$TPNAME1= <>
##$TPNAME2= <>
##$TPNAME3= <>
##$TPNAME4= <>
##$TPNAME5= <>
##$TPNAME6= <>
##$TPNAME7= <>
##$TPOAL= (0..7)
0.5 0.5 0.5 0.5 0.5 0.5 0.5 0.5 
##$TPOFFS= (0..7)
0 0 0 0 0 0 0 0 
##$TUNHIN= 0
##$TUNHOUT= 0
##$TUNXOUT= 0
##$USERA1= <user>
##$USERA2= <user>
##$USERA3= <user>
##$USERA4= <user>
##$USERA5= <user>
##$V9= 5
##$VALIST= <valist>
##$VCLIST= <CCCCCCCCCCCCCCC>
##$VD= 0
##$VDLIST= <DDDDDDDDDDDDDDD>
##$VPLIST= <PPPPPPPPPPPPPPP>
##$VTLIST= <TTTTTTTTTTTTTTT>
##$WBST= 1024
##$WBSW= 4
##$XGAIN= (0..3)
0 0 0 0 
##$XL= 0
##$YL= 0
##$YMAX_a= 0
##$YMIN_a= 0
##$ZGOPTNS= <>
##$ZL1= 120
##$ZL2= 120
##$ZL3= 120
##$ZL4= 120
##$ABSF1= 222.646
##$ABSF2= -17.35081
##$ABSG= 5
##$ABSL= 3
##$ALPHA= 0
##$AQORDER= 0
##$ASSFAC= 0
##$ASSFACI= 0
##$ASSFACX= 0
##$ASSWID= 0
##$AUNMP= <proc_1d>
##$AZFE= 0.1
##$AZFW= 0.5
##$BCFW= 0
##$BC_mod= 2
##$BYTORDP= 0
##$COROFFS= 0
##$CY= -3
##$DATMOD= 1
##$DC= 0
##$DFILT= <>
##$DTYPP= 0
##$F1P= 0
##$F2P= 0
##$FCOR= 0.5
##$FTSIZE= 32768
##$FT_mod= 6
##$GAMMA= 0
##$GB= 0
##$INTBC= 1
##$INTSCL= 4.134877e-10
##$ISEN= 128
##$LB= 2
##$LEV0= 0
##$LPBIN= 0
##$MAXI= 10000
##$MC2= 0
##$MEAN= 0
##$ME_mod= 0
##$MI= 0.1934396
##$NCOEF= 0
##$NC_proc= 1
##$NLEV= 6
##$NOISF1= 120.0001
##$NOISF2= 80.00006
##$NSP= 0
##$NTH_PI= 0
##$NZP= 0
##$OFFSET= 222.646
##$PC= 1.4
##$PHC0= -405.3149
##$PHC1= 35.08833
##$PH_mod= 1
##$PKNL= yes
##$PPARMOD= 0
##$PSCAL= 0
##$PSIGN= 0
##$REVERSE= no
##$SF= 50.3227304950709
##$SI= 32768
##$SIGF1= 140
##$SIGF2= 120
##$SINO= 11.81781
##$SIOLD= 32768
##$SREGLST= <13C.CDCl3>
##$SSB= 0
##$STSI= 32768
##$STSR= 0
##$SW_p= 12077.2946859903
##$SYMM= 0
##$S_DEV= 0
##$TDeff= 32768
##$TDoff= 0
##$TI= <>
##$TILT= no
##$TM1= 0
##$TM2= 0
##$TOPLEV= 0
##$USERP1= <user>
##$USERP2= <user>
##$USERP3= <user>
##$USERP4= <user>
##$USERP5= <user>
##$WDW= 1
##$XDIM= 32768
##$YMAX_p= 493281516
##$YMIN_p= -3329713
$$ End of Bruker specific parameters
$$ ---------------------------------
##NTUPLES= NMR SPECTRUM
##VAR_NAME=  FREQUENCY,     SPECTRUM/REAL,   SPECTRUM/IMAG
##SYMBOL=    X,             R,               I
##VAR_TYPE=  INDEPENDENT,   DEPENDENT,       DEPENDENT
##VAR_FORM=  AFFN,          ASDF,            ASDF
##VAR_DIM=   32768,         32768,           32768
##UNITS=     HZ,            ARBITRARY UNITS, ARBITRARY UNITS
##FACTOR=    0.368581032318806, 1,           1
##FIRST=     11204.1544572324, 0,            0
##LAST=      -873.140228757911, 0,           0
##MIN=       -873.140228757911, -3329713,    0
##MAX=       11204.1544572324, 493281516,    0
$$ Real data points
##PAGE= N=1
##DATA TABLE= (X++(R..R)), XYDATA
$$ [...]
15906I84309m31073k74117j57203j43522r7095M9096J51895J71655J60880K8398
15896D43223j29438r6975K2634L0464j26558k80372j96891P9483K69375J35558
15886A50503k15701m33813m00255j79667J07609L28675L92334M06088L98676K98969
15876H53418J66972P3009N1508L0186j1811r4700k41468m31938n63133m83975
15866f51932k52439j32808j48865p0470K01543M72503N43561M33174J32570j96482
15856C30355l19714k41835j48260j93035k74061k10943k3762O8487N5285M7727
15846i09756M7352j3143j09649j90059k09717j55907j21501m9677N9748Q3051
15836a569258J4467L4204J47277K55455L30493M05652M13907K07192p1449j66293
$$ y = [984309, 553236, 279119, 121916, -21606, -118701, -69605, 82290, 253945, 414825, 443223, 313785, 216810, 239444, 269908, 143350, -137022, -333913, -254430, 14945, 150503, -65198, -499011, -899266, -1078933, -971324, -642649, -250315, 155773, 554449, 853418, 1020390, 1093399, 1144907, 1175093, 1163282, 1068582, 827114, 395176, -167957, -651932, -904371, -1037179, -1186044, -1256514, -1054971, -582468, -38907, 394267, 526837, 330355, 10641, -231194, -379454, -572489, -846550, -1057493, -1081255, -1012768, -957483, -909756, -862404, -875547, -985196, -1175255, -1384972, -1540879, -1662380, -1712057, -1652309, -1569258, -1554791, -1520587, -1373310, -1117855, -787362, -381710, 32197, 239389, 167940, 1647]
15826A647J5942K27269K54338J37262J0012k4565k487k1012j13780k14768j78729
15815I1129j9262k143r3567p3390P7413K55786L82361M03482K24654j00168l18982
15804H27313l37089l06512k68733j72162p0906j2521J862p5671k54069m24370
15794a092858l99515j83798j4582J07774K95222M76058N02550M01059K21409Q7132
15784D00451J14965J55318J20427J68571K13928Q9167p3886j70514k01977k09605
15774F06845j80421j86994j71704j00427M110Q6662l2648j87507j40127J21853
15764a80358K86641J23493o5584q5303p97J27852J20242k0593j34159j51645j24107
15753a04318j28381j59029j48744m6958Q7273K03241K74484K28830J13696J2651
$$ y = [1647, 17589, 244858, 499196, 636458, 646470, 621905, 619418, 598406, 484626, 269858, 91129, 71867, 69724, -23843, -97233, -19820, 235966, 618327, 1021809, 1246463, 1146295, 827313, 490224, 183712, -85021, -257183, -328089, -340610, -338748, -414419, -668488, -1092858, -1492373, -1676171, -1690753, -1582979, -1287757, -811699, -309149, 91910, 313319, 400451, 515416, 670734, 791161, 959732, 1173660, 1262827, 1188941, 1018427, 816450, 606845, 426424, 239430, 67726, -32701, -28591, 58071, 25423, -162084, -302211, -180358, 106283, 229776, 164192, 78889, 78092, 205944, 326186, 305593, 171434, 19789, -104318, -232699, -391728, -540472, -587430, -500157, -296916, -22432, 206398, 320094, 332745]
15743C32745j17678j97801k16672l13704l94982k92907r4157N8002N0475L7340
15733a149339J92670K83893K19183K21251L48117M35052L91669K52586P9933K4252
15723A299267P9728M1146r4436k34314l47916l56320k74030j73138K4360J97875
15713A62222J64910N8221P4972J05184J20338J34827K7637j69501l91455n21211
15703b33856n32098m20634k11342J4301J57797K00703K34815M08880O13947O28216
15693H60729M51076K04838o2305k51358k26892j61556k24646k47774k03914j56698
15683a8500o5360M2608N4789N3520Q5666K3582j24346q3405J55844L71210L74573
15672H70181O4190k36551l45473l89362m71860n35941m54525j47687J34486K15264
$$ y = [332745, 215067, 17266, -199406, -513110, -908092, -1200999, -1295156, -1237154, -1186679, -1149339, -956669, -672776, -453593, -232342, 115775, 550827, 942496, 1195082, 1275015, 1299267, 1378995, 1420141, 1325705, 1091391, 743475, 387155, 113125, -60013, -35653, 162222, 327132, 385353, 460325, 565509, 685847, 820674, 848311, 678810, 287355, -233856, -765954, -1186588, -1397930, -1383629, -1225832, -1025129, -790314, -381434, 232513, 860729, 1311805, 1516643, 1454338, 1202980, 976088, 814532, 589886, 342112, 138198, -18500, -83860, -41252, 13537, 67057, 152723, 176305, 51959, -31446, 124398, 495608, 870181, 934371, 697820, 352347, -37015, -508875, -1044816, -1499341, -1647028, -1512542, -1297278]
15662a297278K04595J79719K02412K75940L91610M35465K83592M7901j37245k66328
15652C20383k86262j63505j0990L0600j0533j2756M533M3982N2754P115p558m9513
15640h1750o9134L5802J47010P9814p168Q0574K48217K50519P8787j18400k67130
15629C77141l13540k40502o4958J60324L66630M68402L62477J6283l64899n43461
15619B23897m30811j92490j26888j14807J09496L66160L09096P5713j2590L6022
15609B42798R7703J30703J85113K82921L29484K05221O7374J13025J21319n5644
15599A720017k37767k32258m1089J13114P8486p5659r9804M0910J00928K8772
15589A395650m8019j06293k51228l36102k50365j91091j65281l2950Q8486J03119
$$ y = [-1297278, -1092683, -912964, -710552, -434612, -43002, 392463, 676055, 723956, 586711, 320383, 34121, -129384, -140374, -109774, -120307, -133063, -128530, -84548, -31794, -24679, -32237, -81750, -150884, -115082, 31928, 111742, 104574, 185148, 433365, 683884, 762671, 644271, 377141, 63601, -176901, -241859, -81535, 285095, 753497, 1115974, 1132257, 767358, 223897, -206914, -399404, -526292, -641099, -531603, -165443, 143653, 219366, 206776, 242798, 340501, 471204, 656317, 939238, 1268722, 1473943, 1541317, 1654342, 1775661, 1720017, 1482250, 1249992, 1208903, 1322017, 1400503, 1324844, 1225040, 1265950, 1366878, 1395650, 1347631, 1241338, 990110, 654008, 403643, 212552, 47271, 14321, 102807, 205926]
15579B05926J33932K01511J23400l3320n6651K8982J36853K61016M07380M25099
15569A834128K25395m6421k52600l56828l98604l96535l00062r3651J40540K53212
15559F08574K43585K09323R9740j35846k70214j26453J07722K24666K48390J86835
15549A396322J27898K35464M12857M69175L50578J37435m336l4701j1592p7248
15539C001852j80463j14510J40210L54480L84399K69650J20864L5574o2661j85108
15529C764287j75536k5799J58768K35747K58641K57694L17217M70138N35907N40708
15519F337772M78623L97056M52715N74012M95574L32667L63511O35556R71802
15510A1039288J146428J164880J248631J483955J818160K158414K358763K504653
$$ y = [205926, 339858, 541369, 664769, 631449, 574798, 603780, 740633, 1001649, 1409029, 1834128, 2059523, 2013102, 1760502, 1403674, 1005070, 608535, 308473, 214822, 355362, 608574, 852159, 1061482, 1161222, 1025376, 755162, 628709, 736431, 961097, 1209487, 1396322, 1524220, 1759684, 2172541, 2641716, 2992294, 3129729, 3125393, 3090692, 3079100, 3001852, 2821389, 2706879, 2847089, 3201569, 3585968, 3855618, 3976482, 4012056, 3949395, 3764287, 3588751, 3562952, 3721720, 3957467, 4216108, 4473802, 4791019, 5261157, 5797064, 6337772, 6816395, 7213451, 7666166, 8240178, 8735752, 9068419, 9431930, 10067486, 11039288, 12185716, 13350596, 14599227, 16083182, 17901342, 20059756, 22418519, 24923172]
15502B4923172K814195L307372L854142M478906N120552N660812O009362N841429
15494F2009942M619273K219595r84412m206530o461539p335231p121156o326351
15486C6413591n335017m306356l390787k824499k607976k441952k034684j548744
15478A1923576j279815j103472q09307n81553n86074n97070m74404l64484m46658
15469E680739o57062p22198n44476l52393l02549l03960k45079j96187j49464
15460B207371q2503j10674j73698k06416j81186j00443m6359J4227J09534J76852
15450A606705K33315K97203J79432j56436n31330p09909o63760n50178m14211
15441g09169j92482L9215J74220J54784L9818q9627j75163r4720J4420K0078L8246
$$ y = [24923172, 27737367, 31044739, 34898881, 39377787, 44498339, 50159151, 56168513, 62009942, 66629215, 68848810, 67864398, 63657868, 57196329, 49861098, 42739942, 36413591, 31078574, 26772218, 23381431, 20556932, 17948956, 15507004, 13472320, 11923576, 10643761, 9540289, 8730982, 8149429, 7563355, 6966285, 6491881, 6127397, 5680739, 5023677, 4301479, 3757003, 3404610, 3102061, 2798101, 2553022, 2356835, 2207371, 2124868, 2014194, 1840496, 1634080, 1452894, 1352451, 1306092, 1320319, 1429853, 1606705, 1840020, 2137223, 2316655, 2160219, 1628889, 918980, 255220, -294958, -709169, -901651, -862436, -688216, -533432, -493614, -583241, -758404, -853124, -838704, -818626, -780380]
15430g80380J36874J78646J65132J99140L16274N06491O33868M80558J95700j7035
15420B015268j78676k58698k32550p1988J26165J93031J15178K4861l6001j53905
15410A542685l68892n60694o16622m31485m7238K13641J87064p156q3120o6737
15400b38554r0093k835K77776N00882N26115L94890J41433r9904j15014n2452
15390A242244j54436k47772j34170Q3579K10321K26047K43641K00666Q5846M04
15380A756370n2370R346J64440J67285j47034n44425o79488m86578j65637J27282
15370A49191K28865O1443j55412l14285k93642p9166O3636P9905R4973J38926
15360b5566R7307m2955j19153n3782J03163J49027N2925m0351p7585o645R8047
$$ y = [-780380, -643506, -464860, -299728, -100588, 215686, 722177, 1356045, 1836603, 2032303, 2015268, 1836592, 1577894, 1345344, 1273356, 1399521, 1592552, 1707730, 1732591, 1696590, 1542685, 1173793, 613099, -3523, -435008, -482246, -268605, -81541, -88697, -171817, -238554, -328647, -331482, -53706, 447176, 973291, 1368181, 1509614, 1409710, 1294696, 1242244, 1087808, 840036, 705866, 789445, 999766, 1225813, 1469454, 1670120, 1755966, 1756370, 1704000, 1713346, 1877786, 2045071, 1898037, 1353612, 674124, 187546, 21909, 149191, 378056, 439499, 284087, -30198, -323840, -403006, -339370, -259465, -164492, -25566, 71741, 28786, -90367, -144149, -40986, 108041, 160966, 120615, 43030, 36385, 134432]
15349A34432K00150K92292K74461J13624q0872j82110j14930r723j5829j08152
15339E03343j00900K2365N2942q9830k41405k34503l6851J06675L9257N6139K93703
15328C70935M83746L93739R0359j54106j49362j3760Q2835J38706J86580J40495
15318A570167L3445q5981l43368n75841n25812k87118q9056J6077M1530k5235
15308b71192q3375j22022k03719k34874q8070J04068K37361K73504K28727J79607
15298B0015J58094K16946K77564K40939J24947q9013k32103k48950k93898l43377
15288a68836l41434l27889k45462N640K11514J78533M2058N7478J55705J63474
15278b69219P1305j7224k1388n027J1247O108l4635l7283m1760r6465j31755k12836
$$ y = [134432, 334582, 626874, 901335, 1014959, 934087, 751977, 637047, 627324, 611495, 503343, 402443, 424808, 477750, 387920, 146515, -87988, -124839, -18164, 21093, 77232, 370935, 854681, 1248420, 1338779, 1184673, 1035311, 1021551, 1104386, 1243092, 1429672, 1570167, 1603612, 1517631, 1174263, 598422, 72610, -214508, -303564, -287487, -245957, -271192, -354567, -476589, -680308, -915182, -1003252, -899184, -661823, -388319, -159592, 20015, 178109, 395055, 672619, 913558, 1038505, 949492, 717389, 468439, 174541, -168836, -510270, -838159, -1083621, -1077981, -866467, -687934, -645876, -588398, -432693, -269219, -197914, -215138, -236526, -241553, -230306, -224198, -258833, -296116, -337876, -434341, -566096, -778932]
15266g78932k27276o6209J04180O1399j16837j08913J08881K95918L02070K34890
15256a90829K32573K01349O591j81575k93145m74387n37876k61398J86385N04475
15246h07837N19567L94981K98560K43833L04798M07554L90403J62662j99746n08117
15236A206658n67624m04560j56840Q5158K45905K47379R3325l9539N335J36973
15226H52170J62891J8575j84619k98806k10401n476M0723q1638k49844m24461
15216c80886n26008m92117k73270j0063J16801P0284L6134L8631p3722j68613
15206a662829n1794K07569L05694K02106K08861L08288L35967L18340K66150K04731
15196F43083R2849q0472j57552n2854J21688K40479K64833K48246J56385j4903
$$ y = [-778932, -1006208, -1072417, -968237, -906838, -1023675, -1132588, -1023707, -727789, -425719, -190829, 41744, 243093, 249684, 68109, -225036, -699423, -1237299, -1498697, -1312312, -807837, -288270, 106711, 405271, 649104, 953902, 1361456, 1751859, 1914521, 1714775, 1206658, 639034, 234474, 77634, 162792, 408697, 656076, 749401, 709862, 715197, 852170, 1015061, 1033636, 849017, 550211, 339810, 334334, 375057, 293419, 43575, -380886, -906894, -1399011, -1672281, -1682344, -1565543, -1495259, -1459125, -1420494, -1494216, -1662829, -1714623, -1507054, -1201360, -999254, -790393, -482105, -146138, 172202, 438352, 643083, 735932, 655460, 497908, 445054, 566742, 807221, 1072054, 1320300, 1476685, 1461782]
15186A461782k28127n00325o57232o01248l52560m3718K45014M24583K66456P68
15176A5393q1460l5464Q2542K25904K87952K59773K46458K69295K25994R9837
15166A596224m7552j18526j74093l46048m58135k38154J18989K56938J89750J38903
15156I18296O3235q2438j50029j61635j60124k13637l02646l33684l29691k48701
15146a001054l4654J12615M3548m6934K559R7133J25557J71918K07308J63933
15136a58071M6533j03962k14416k95695k82156k29340k93345k81848j6882L32153
15126a497029N24106M51838J99485P6282J91242L39580L05032K07413K30001K70777
15116A298727J38127j40079l16091l45836m24600n51614n71731m98181l84528
$$ y = [1461782, 1233655, 733330, 76098, -525150, -877710, -921428, -676414, -251831, 14625, 15393, -66067, -101531, -18989, 206915, 494867, 754640, 1001098, 1270393, 1496387, 1596224, 1548672, 1430146, 1256053, 910005, 451870, 213716, 332705, 589643, 779393, 918296, 981531, 899093, 749064, 587429, 427305, 213668, -88978, -422662, -752353, -1001054, -1035708, -923093, -879545, -926479, -923920, -826787, -701230, -529312, -322004, -158071, -111538, -215500, -429916, -725611, -1007767, -1237107, -1530452, -1812300, -1829182, -1497029, -972923, -521085, -321600, -245318, -54076, 285504, 590536, 797949, 1027950, 1298727, 1436854, 1296775, 980684, 634848, 210248, -341366, -913097, -1411278, -1795806]
15107a795806k26625p9371p912Q6998J87224J49594J6347p8656p3046j1270N6659
15096a775864J00132R6330K4953o9463R93J70782K90834L37185L23831K68855
15086b31432K02736Q5234o2971j35960n1729J06362P7252n1090r7014j44155k35737
15075e38504k41352r3607J15020K11090J26763P521N9850K16665J95959j1512
15065D7893k42029l48231k12039p7488q8120q0314J44246M07881M56067L73775
15055C81641K29434O3977o1147j60859j83247n0406J68291K39709J32700J773
15045G61866l7599N3122J31650Q0578n2720q5615R9382J94003q52k16654k78092
15034F49069k10888j25469n4296K5851J32998J67446m6888l10388l62331k73407
$$ y = [-1795806, -2022431, -2101802, -2109714, -2022716, -1835492, -1685898, -1669551, -1748207, -1821253, -1832523, -1775864, -1675732, -1579402, -1554449, -1623912, -1622919, -1452137, -1161303, -824118, -500287, -231432, -28696, 56538, -6433, -142393, -194122, -87760, -10508, -61598, -158612, -302767, -538504, -779856, -873463, -758443, -547353, -420590, -413069, -353219, -136554, 59405, 47893, -194136, -542367, -754406, -831894, -920014, -1000328, -856082, -448201, 7866, 381641, 611075, 675052, 613905, 453046, 269799, 219393, 387684, 627393, 760093, 761866, 724267, 777389, 909039, 989617, 936897, 851282, 950664, 1144667, 1143815, 927161, 649069, 438181, 312712, 258416, 284267, 417265, 584711, 537823, 227435, -134896, -408303]
15024d08303k10057j17505N4687J66580J59514J76563J96210J63507O474k82839
15014i5169m05458k00298M2668N1912k9091q4324j17378n6334m5710j84292k68472
15003a391946j74504P2867K27633J57290P7105O1011N8793N2091Q9769J66415
14993f03476J59802L2824j00617j54716j19555N8510K28371K34754L5316k26745
14983d55532m16908l78783j06981J60281K10265J97743L63996N36850N08849L71461
14973I91241K88968K91452K94109K29169J18525O913j41975k43195k37067k09684
14963A388456k29738k47233k30835k30245j53760j5972K1075J672K9507L2789
14953C65716k0015n8570p0528j29713k51316j98473R3349L25946L12403J51436
$$ y = [-408303, -618360, -735865, -681178, -514598, -355084, -178521, 17689, 181196, 187670, -95169, -500627, -700925, -658257, -606345, -635436, -719760, -837138, -893472, -939182, -1123474, -1391946, -1566450, -1493583, -1265950, -1108660, -1031555, -970544, -911751, -859660, -769891, -603476, -443674, -410850, -511467, -666183, -785738, -727228, -498857, -264103, -228787, -455532, -872440, -1251223, -1358204, -1197923, -987658, -789915, -425919, 110931, 619780, 991241, 1280209, 1571661, 1865770, 2094939, 2213464, 2220377, 2078402, 1835207, 1598140, 1388456, 1158718, 911485, 680650, 450405, 296645, 280673, 301748, 303420, 332927, 365716, 345701, 287131, 216603, 86890, -164426, -362899, -269550, 56396, 368799, 520235]
14943E20235R567o3923j10953j95279k61870j55527J43189L57051L71398K99577
14933I13465K35923J58367Q1083N2334M1252o7055l58860n80065n40443m08352
14923d72351k97859k40047j68816N0644J54745j9833j63047m2647Q8319K3517
14913a087375J2317J78186L12108K83822K22265J64299r399k08132k22401j7507
14903c71817J78818J97516K376l12691m47122k73891K1650J96071J79940J26411
14893e02739J57125J80663M5330j99015l63301k25840j6094m795m9256n5186k4193
14882a057301L4662N5290K5268O1929J07410N0120K4842J50071K77700K00936
14872f9073n0162j56835n7002j9663l0458L0891N8517K5794Q775Q1744Q7949m175
$$ y = [520235, 529802, 465879, 354926, 159647, -102223, -257750, -114561, 242490, 613888, 913465, 1149388, 1307755, 1388838, 1441172, 1482424, 1415369, 1056509, 476444, -63999, -472351, -770210, -1010257, -1179073, -1128429, -973684, -993517, -1156564, -1199211, -1110892, -1087375, -1075058, -896872, -584764, -300942, -78677, 85622, 76223, -131909, -354310, -371817, -192999, 4517, 6893, -305798, -752920, -1026811, -1005161, -809090, -629150, -502739, -345614, -164951, -119621, -318636, -681937, -907777, -923871, -928666, -977922, -1033108, -1057301, -1022639, -967349, -942081, -880152, -772742, -722622, -697780, -547709, -270009, -69073, -119235, -276070, -333072, -352735, -383193, -352302, -293785, -267991, -259216, -177472, -89523, -93698]
14860i3698k9593l4980j33628k45637k46133j95314L3423M54138O81444N85144
14850G75166K92019o9941l30479l70654k77333k48480j47439J35726L27615K23694
14840C09894j0242n9480M0208N6976p6946k75663m71526n86597n22215l15504
14830a911095m8978K13786M19484M86232M30540L88586L37102J52346j64674m23654
14820a20325l99665j32873J10916J73761P2833n8200j13734j56641p4264J98029
14810e00163L36163K31850J25564J07426J11748J71447J17610j52456l78262m07355
14800b36428l27443j54225J351K7064M387l8883r3669j17926j15238o2718m981
14789a118709j774J10241K88259K94417J73992M3749m4148m6306O225K0985l6035
$$ y = [-93698, -123291, -158271, -291899, -537536, -783669, -978983, -945560, -491422, 190022, 775166, 1067185, 997244, 666765, 296111, 18778, -229702, -377141, -241415, 86200, 309894, 299652, 240172, 280380, 337356, 260410, -15253, -486779, -1073376, -1595591, -1911095, -1960073, -1746287, -1326803, -840571, -410031, -21445, 315657, 468003, 303329, -120325, -519990, -652863, -541947, -368186, -295353, -353553, -467287, -623928, -698192, -500163, -164000, 67850, 193414, 300840, 412588, 584035, 701645, 549189, 170927, -236428, -563871, -718096, -716745, -689681, -685294, -724177, -817846, -935772, -1051010, -1113728, -1118709, -1120483, -1010242, -721983, -427566, -253574, -209825, -253973, -300279, -294054, -273069, -309104]
14778c09104j26962k73960k75423k8037J49192Q2210q0628j82908j63059l9877
14768a248556J13119K06964J73599J28565J62801J42351Q4141Q4253M4551K2528
14758h5684J06261J11823R266J4084J06240J09912n782j88119j85679n1167r8486
14747a57331k18668k34959k32533j77536r492J30477J92778J96651R0846p9133
14737d98900k90580m94952m75623j76317K02547K90427J00885N2736K95718M67573
14727e26486M36051L74504K48647K2786q8159L6035J47108J58518O3461k02240
14717F70225n07291o70203n29879k07961m5472l0019J07182L06643L26962K99674
14707b80139L56776L25096J35369J333P6333K34654K47818J28968Q5881Q9500
$$ y = [-309104, -436066, -710026, -985449, -1013486, -864294, -782084, -862712, -1045620, -1208679, -1248556, -1135437, -928473, -754874, -626309, -463508, -321157, -237016, -152763, -108212, -85684, 20577, 132400, 141666, 155750, 261990, 371902, 366120, 178001, -7678, -58845, -157331, -375999, -610958, -843491, -1021027, -1030519, -900042, -707264, -510613, -419767, -498900, -789480, -1284432, -1760055, -1936372, -1733825, -1443398, -1342513, -1289777, -994059, -526486, -90435, 284069, 532716, 555502, 467343, 503378, 650486, 809004, 872465, 670225, 162934, -507269, -1037148, -1245109, -1290581, -1320600, -1213418, -906775, -579813, -280139, 76637, 401733, 537102, 538435, 614768, 849422, 1097240, 1226208, 1312089, 1401589]
14697A401589n1494l46520o01682n67020l10133q9566L5719R1319J4404j53709
14687e77093k72826k44127l2657J54743K58321L49174K55008L3433j33055k60023
14677d69102l07147k77592j58777l162N0098K04518L69494L47002K47218K24854
14667B27404K92266K83778J75403M1992j35238l09057l88515l70074l07823j97554
14657f87418k3629J53857L29854M82902M85724K60944j01179m05197n77735n34983
14647f16860k48043P3905K21036J23077j9363m3269l5780n4766l9013o5819o1076
14636g65971J2047n042q5509o1030K6677N3574R3287J55508J38956O2870P4769
14625b99864P6945l9421k30113l28411k16231J7202J69915R8047n5451q4500J37999
$$ y = [1401589, 1350095, 1003575, 401893, -165127, -475260, -564826, -529107, -437788, -423384, -577093, -849919, -1094046, -1126703, -971960, -713639, -364465, -109457, -76024, -209079, -469102, -776249, -1053841, -1212618, -1215780, -1165682, -961164, -591670, -244668, 2550, 227404, 519670, 803448, 978851, 1020843, 885605, 576548, 188033, -182041, -489864, -687418, -711047, -557190, -227336, 255566, 741290, 1002234, 901055, 495858, -81877, -616860, -864903, -790998, -569962, -446885, -466248, -509517, -545297, -600063, -639076, -704895, -765971, -753924, -758966, -844475, -905505, -878828, -825254, -731967, -576459, -437503, -374633, -299864, -222919, -262340, -492453, -820864, -1037095, -1019893, -849978, -751931, -807382, -891882, -753883]
14614g53883M49863M85123L03175J30810R174K7973J04021J1275j42822j55492
14604D69217p9540J299Q2251J68762K00360J85572J11437m7994j55013j01606
14594H34745J5103O4755K2039o5762k17109l53106l96800l54470j81061J13454
14584e18212L07683K56022J30960P0857K3959n269N8435J66497R3428j22388j25573
14573C36399J5281N6759L0652q80L577N6723J52655K04689R7240q2940k02930
14562F67225k77170l04075k09850q7216k6612r749k1195k7602r3246j97504k22867
14551h09861j12705P7602K28750K69496K79307L03731L05114J76928P7136J72924
14541I68422K78373L01683K61595M8714k89766n32413n43892m04431k33826p3618
$$ y = [-753883, -304020, 181103, 484278, 615088, 624262, 652235, 756256, 767531, 624709, 469217, 389677, 390976, 473227, 641989, 842349, 1027921, 1139358, 1091364, 936351, 834745, 849848, 914603, 936642, 870880, 653771, 300665, -96135, -450605, -631666, -518212, -210529, 45493, 176453, 247310, 271269, 266000, 324435, 490932, 584360, 461972, 336399, 351680, 408439, 439091, 438211, 441788, 498511, 651166, 855855, 953095, 870155, 667225, 390055, 85980, -123870, -211086, -237698, -247447, -268642, -296244, -389490, -586994, -809861, -922566, -844964, -616214, -346718, -67411, 236320, 541434, 718362, 795498, 968422, 1246795, 1548478, 1810073, 1858787, 1569021, 1036608, 492716, 88285, -145541, -219159]
14531b19159k0458j7856L8526J65366K44761J25271j31885k36261j12578Q6891
14521g7382K72509L47559K98470J71679o2049k61063k88498k07665m9762J99818
14511C43616L27106K17948J25130K62442M20026M46490L81485K59743J79487J17232
14501C080705Q2787P1873m0708k78303m81522n92364n23175l47402k82291k96313
14491C93287k70332j57090L1130R5630n3172j17573R5118K62388J86054P7276
14481E42716P1292P4322P8122J18402R4700j5553j33718j43181j03690j69729
14471D13683l09382l09411j82586j38251k15885k42141r8988J40816L20891L84366
14461b36888M20496M51619K87900n8576l37284m28436m72113n46116n97753n19276
$$ y = [-219159, -239617, -257473, -218947, -53581, 191180, 316451, 184566, -51695, -164273, -77382, 195127, 542686, 841156, 1012835, 950786, 689723, 401225, 193560, 143798, 343616, 670722, 888670, 1013800, 1276242, 1696268, 2142758, 2524243, 2783986, 2963473, 3080705, 3163492, 3235365, 3194657, 2916354, 2434832, 1842468, 1319293, 971891, 689600, 393287, 122955, -34135, -3005, 92625, 39453, -78120, 16998, 279386, 465440, 542716, 614008, 688330, 766452, 884854, 979554, 964001, 830283, 687102, 583412, 413683, 104301, -205110, -387696, -525947, -741832, -983973, -1082961, -942145, -621254, -236888, 183608, 635227, 923127, 864551, 527267, 98831, -373282, -919398, -1517151, -2036427]
14451b036427k18743J65099L18577K21616J69640K86808M02142L76252K30243
14442h4793j3784k56212l09567p4023K28224L19181K76722K45352J86875R9736
14432F17711o0337k59251l24854j17025J22217J82755J83076K08560K50442J08141
14422I11435k38098n16210n65884l51715n2764L4129j6141M0706K28895L46594
14412a79053K62415O2772j03203o4429J72642L12255K03617j5869j44404j86111
14402C20632k66138l18082k99483k06478m1796J31352K75530L27421L45814M23212
14392F91984L69791k887m39147o11945m59766j69729K4812P0329K2470l5435j16976
14381f56499j91014j91464j89430k19157p9730K76958M95842M05086K28102J79610
$$ y = [-2036427, -2255170, -2090071, -1771494, -1549878, -1380238, -1093430, -691288, -315036, -84793, -98577, -354789, -664356, -738379, -510155, -190974, 85748, 331100, 517975, 617711, 557374, 298123, -26731, -143756, -21539, 161216, 344292, 552852, 803294, 911435, 673337, 157127, -408757, -760472, -813236, -779107, -795248, -754542, -525647, -179053, 83362, 146134, 42931, -21498, 151144, 463399, 667016, 651147, 506743, 320632, 54494, -263588, -563071, -769549, -811345, -679993, -404463, -77042, 268772, 691984, 1061775, 1058888, 619741, 7796, -451970, -621699, -596887, -526558, -504088, -539523, -656499, -847513, -1038977, -1228407, -1447564, -1527294, -1250336, -754494, -349408, -121306, 58304]
14371E8304J99564J76342N5634k5434k6978m7293r150J56911L21756L85759K89729
14360A535144O7817j81213l39877l46221k25027l105J23050p086l17276n36670
14350b30464m34075q7497J64584R6228j25612k15673j78316o2378J42614K45738
14340f84851J42680L2114L8972O2697M9712J3655n3175j45262j66287j44425k12088
14329a066258l53021m41328l93402k04317J34530M05005L82790O9360k71321l32797
14319b070759j06343J33293K43667K57463K15180J85409J87014N9062j27246j35163
14309a158423m4155K3708K961n0202o0618n7231J07837L52279K76487j04511m67550
14298a179418n80423l99487r8787J93853L65257L64026L20910K56272J86532J71867
$$ y = [58304, 257868, 434210, 489844, 464410, 437432, 390139, 380989, 537900, 859656, 1245415, 1535144, 1602961, 1421748, 1081871, 735650, 510623, 507518, 630568, 623482, 306206, -230464, -664539, -752036, -587452, -491224, -616836, -832509, -1010825, -1073203, -930589, -684851, -542171, -510057, -471085, -408388, -358676, -345021, -398196, -543458, -709745, -854170, -1066258, -1419279, -1860607, -2254009, -2458326, -2323796, -1918791, -1536001, -1466641, -1737962, -2070759, -2177102, -2043809, -1800142, -1542679, -1327499, -1142090, -955076, -896014, -1023260, -1158423, -1202578, -1178870, -1175909, -1226111, -1286729, -1343960, -1236123, -883844, -607357, -711868, -1179418, -1759841, -2159328, -2258115, -2064262, -1699005, -1334979, -1014069, -757797, -571265, -399398]
14288c99398J26669J5931r6296j85367l18500l71793k17841m7872k456j4447k9395
14277a540765j66438k85640k34357n5434K07704L52681L03176J89467J38891J83718
14267i06997K13751J03560k8284q491Q3668Q5536n20r6709k04870k37446r9489
14256a096291J05325J56893P9211K7572M0687J75375L92237M20798J54529k84155
14246A72181n88441n05856k20468N817M0246k4636j6567P0571J58908J71566K16125
14235e20554K63885J83028Q0069M6098P3637P5611M988o4907j06827j76780j71791
14224c13543l7828Q2258J21840J38250Q8550J7384O3330L8795j39170l09443l98713
14213f48290l37843j78542K8713J57260Q8519k1676l6852m5834l1197P9007K13364
$$ y = [-399398, -272729, -256798, -353094, -538461, -856961, -1228754, -1446595, -1494467, -1496923, -1511370, -1540765, -1707203, -1992843, -2227200, -2282634, -2074930, -1722249, -1419073, -1229606, -1090715, -906997, -693246, -589686, -617970, -626461, -542793, -457257, -457777, -554486, -759356, -996802, -1096291, -990966, -834073, -754862, -727290, -686603, -511228, -118991, 301807, 456336, 172181, -416260, -922116, -1142584, -1136767, -1096521, -1121157, -1137724, -1067153, -908245, -736679, -520554, -256669, -73641, 6428, 52526, 126163, 201774, 206762, 141855, 35028, -141752, -313543, -351371, -269113, -147273, -9023, 79527, 96911, 160241, 199036, 59866, -249577, -648290, -986133, -1164675, -1135962, -978702, -890183, -911859, -948711, -994545, -1025742, -946735, -733371]
14202g33371L29660L61012K74598K02213K77080M07395L44531R4545j36987k01437
14192A219239j47469j19512j02791m6444o780n0817j53261k29526k11764j04373
14182D6502K6821N5961j5383n4871o397J0706j17574k47755k09847k3213J74893
14171c60157K78474L56865L23835J51861L6686n7363j35431q0453R9623K67136
14161H81076K47816O8293m3578m6807q6185j27039q5167k4736m3077j61113l11540
14150B67943l33477k19484j75261k34765k21235r5861M2484J29531J92545K78790
14140c68790L36114L17581K09306R0677K7402o1018j47026j30026j63913k54370
14130a44063k23951j18257o6444K8053J96074K33856J37356P3256L7811L4959
$$ y = [-733371, -403711, -42699, 231899, 434112, 711192, 1118587, 1463118, 1557663, 1420676, 1219239, 1071770, 952258, 849467, 803023, 796243, 745426, 592165, 362639, 150875, 46502, 73323, 129284, 113901, 59030, 52633, 63339, -54235, -301990, -511837, -535050, -360157, -81683, 275182, 599017, 750878, 787564, 730201, 594770, 514317, 613940, 881076, 1128892, 1197185, 1153607, 1106800, 1020615, 893576, 808409, 783673, 740596, 579483, 267943, -65534, -285018, -460279, -695044, -916279, -1012140, -969656, -840125, -647580, -368790, -32676, 284905, 494211, 584888, 612290, 551272, 404246, 274220, 110307, -144063, -368014, -486271, -552715, -524662, -328588, -94732, 42624, 115880, 153691, 188650]
14120A88650O5150Q6913R6417O1471K8019j8812q7263j61829k53182l37297l09980
14109f41743k02383j21372p4799L819J42540K26665K55078K08870J22352J35670
14099E4697J37748r086j45880j61031j14189q7249j40615j61508k6570J58679
14089d95004K39532K41068K43853J71523P127m135J61101K72884K46587J31098
14079A215634k0716k08954l29439l32899l29999k82101j49644l1775L4699o09
14069d35803p4733p7738j6117J1338q7140j32287M811J44611J34309Q9510J38100
14058c01139J53615L6330j49800j77997q3931j47033k45487j43817K4060J32385
14048i02814K42113L49847K66849P1324k0371K3166J83728K82056J18564j93421
$$ y = [188650, 253800, 340713, 437130, 498601, 526620, 507808, 420545, 258716, 5534, -331763, -641743, -844126, -965498, -1040297, -1036478, -893938, -667273, -412195, -203325, -80973, 54697, 192445, 183359, 37479, -123552, -237741, -324990, -465605, -627113, -653683, -495004, -255472, -14404, 229449, 400972, 408099, 403964, 565065, 837949, 1084536, 1215634, 1194918, 985964, 656525, 323626, -6373, -288474, -438118, -469893, -435194, -435803, -510536, -588274, -604391, -593053, -680193, -812480, -807669, -663058, -528749, -439239, -301139, -147524, -111194, -260994, -438991, -522922, -669955, -915442, -1059259, -1035199, -902814, -660701, -310854, -44005, 27319, 6948, 30114, 213842, 495898, 614462, 421041]
14038D21041l41728l29306j93384J2409J55530J80747J63821J86935J70485N9181
14028D85731k1928p2214k02860l93937m51723k91079m1874J96125M08054M53975
14018F8270K69021k4322k55290l36708k65799j15575N238O0831j5910j92493k36829
14007a039566j63479j7667K36587L47890K35532J01326J3020J8620M8622J04459
13997a14656K20111K77733J79931n4641j72992j62546k11505k95140k24597R922
13987e48380L43229N30112K96092k0003j17320j59714l16558l82998r6786K62563
13977b09763L53390K27931O0166l9956m5420Q9063J89112J06174r68K0945J85498
13966I36172L46749L41084K25235J02062m2947j84976l18533l44230k78404j81457
$$ y = [421041, 79313, -249993, -443377, -430968, -275438, -94691, 69130, 256065, 426550, 485731, 463803, 391589, 188729, -205208, -656931, -948010, -989884, -793759, -385705, 68270, 337291, 312969, 57679, -279029, -544828, -660403, -655165, -594334, -610244, -802737, -1039566, -1203045, -1220712, -984125, -636235, -400703, -299377, -286357, -267737, -219115, -114656, 105455, 383188, 563119, 508478, 335486, 172940, -38565, -333705, -558302, -548380, -205151, 324961, 621053, 601050, 483730, 324016, 7458, -375540, -472326, -209763, 143627, 371558, 431724, 391768, 346348, 435411, 624523, 730697, 729729, 750674, 936172, 1282921, 1624005, 1849240, 1951302, 1908355, 1723379, 1404846, 1060616, 782212, 600755]
13956F00755K9014K20854K05577M1338j58265l14483l07757j57014j04404j39958
13946h4343k11836k73846j66968Q120J02276J25545J48160J88483J64139P2180
13936G1910o1616k05058k28968j00982j0038k0711r200O7527R6094N7137P8805
13925b65100J57666J94412J23136J2847k1682N201J09352K38251K13035R7291
13915H64409L5523m2352o8671o9582k04031l46145l10603j62229J1704K13253
13905g8724L85519M22105K69411O8345p2832p4101R7112K44280K64071K33859
13895A759045J72910O3160j05705k96595m70716n38965m58666k90437j66731j98135
13885e30835l23526l23451k14306q3167J02444K54270K49489J85045J60234K09563
$$ y = [600755, 629769, 850623, 1056200, 1097538, 939273, 624790, 317033, 160019, 55615, -84343, -296179, -570025, -736993, -728873, -626597, -501052, -352892, -164409, -270, 71910, 10294, -194764, -423732, -524714, -534752, -555463, -564663, -497136, -401042, -343905, -265100, -107434, 86978, 210114, 222961, 201279, 206480, 315832, 554083, 767118, 864409, 899932, 857580, 788909, 719327, 515296, 169151, -141452, -303681, -291977, -78724, 306795, 728900, 998311, 1066656, 993824, 919723, 1016835, 1261115, 1525186, 1759045, 1931955, 1995115, 1889410, 1592815, 1122099, 583134, 124468, -165969, -332700, -530835, -854361, -1177812, -1392118, -1475285, -1372841, -1118571, -869082, -684037, -523803, -314240]
13875c14240K53636K08316P0804j35297l37696n49125o31879m58997j48157L6432
13865b006203L397q9211j92590j69300Q4895L92975N25808M08777K82816K48361
13855e10275K75991L67080L72925K17062P1137L6205N2786L6799K5293M494o7621
13844H81876k38030m86764o84702q03105p11189k98064J37697K84519K43827J49777
13834a524158J8328n1029j9150J44311M14223N47674L65520P9330p4652j09397
13824b09000q2065k005J55044K47246K52377K47137K05267J31475L814j69369
13814G79921k80391k00669o1143p4599j43375j60048k11311l55302m17146k35171
13804a359234O979J64781K85293K44151Q877j80348j67971K3546K23797L93496
$$ y = [-314240, -60604, 147712, 218516, 83219, -254477, -803602, -1435481, -1894478, -2042635, -2006203, -2002806, -2092017, -2284607, -2453907, -2369012, -1976037, -1450229, -1041452, -758636, -510275, -234284, 132796, 505721, 722783, 793920, 830125, 882911, 919710, 945003, 949497, 881876, 643846, 157082, -527620, -1330725, -2041914, -2339978, -2202281, -1917762, -1673935, -1524158, -1505830, -1556859, -1576009, -1431698, -1017475, -469801, -104281, -24951, -99603, -209000, -291065, -293070, -138026, 109220, 361597, 608734, 814001, 945476, 949290, 779921, 499530, 298861, 237718, 163119, 19744, -140304, -351615, -706917, -1124063, -1359234, -1352255, -1187474, -902181, -658030, -649153, -829501, -997472, -973926, -750129, -356633]
13794c56633N34036M11537N4507k37866l36834l45718k67498J6243K59208K07934
13784f1084N3255P6422K91968M38352K92625m6635l75133m85920k99358r4530
13774b10038j3261N5084N8557o1188j79789k02164j67549q6153R3216L12929M54758
13763E4402M67356K84650N2170j16290k29019j83342p0944J8509J7650r3594j25375
13752G6173m5536O8357J87039K71669K02852M826j44542k19256k45406j11380
13742D4796R6632J71717J61552O7733j19378k68264k91844k59130k00091j39821
13732g36098r9131q1844o7719N3450J69876Q6525q9029j67755q4367k9607j34115
13721a179814k27026k18105j27685p3085j7926O5962J19039J14392j5840j21193
$$ y = [-356633, 177403, 588940, 643447, 405581, 68747, -276971, -544469, -528226, -269018, -61084, -7829, 68593, 360561, 798913, 1091538, 1044903, 669770, 183850, -115508, -210038, -223299, -168215, -109658, -170846, -350635, -552799, -720348, -806501, -713285, -400356, 54402, 521758, 806408, 858578, 742288, 513269, 329927, 258983, 277492, 295142, 201548, 76173, 30637, 98994, 286033, 557702, 760554, 765380, 620838, 401582, 156176, 44796, 141428, 313145, 474697, 542430, 423052, 154788, -137056, -396186, -596277, -736098, -835229, -917073, -984792, -931342, -761466, -674941, -763970, -931725, -1016092, -1045699, -1179814, -1406840, -1624945, -1752630, -1825715, -1843641, -1777679, -1658640, -1544248, -1560088, -1681281]
13711a681281q0187l6939k9059K1481M8457j0118M2028K45650L48237L77108L99643
13700c54980K88058J35202M3503j84N5537k7083k63721k72166q51K04055J90147
13689b483R1195j1997r1131j02802j02984q6139l1371q4454k25342k53478j43168
13678a044154j5872L7227P7374J55173K26702K51661K20580J70836J1431k28431
13668a37473l20838j75624O0850J56536J01104L3933J4538M449k7073l8665q3307
13657d11570j11245M116J30346J52217R1412M4388R3174J40495J20305O9753n8267
13646B65124j88114j71808o2291R125m5636q3928J53217L77484L51239K11792
13636H16204J03247J2508j45946k53701k50599r4696J15830J48482O0711J2889
$$ y = [-1681281, -1761468, -1798407, -1827466, -1805985, -1757528, -1767646, -1725618, -1479968, -1131731, -754623, -354980, -66922, 68280, 111783, 111599, 167136, 140053, -123668, -395834, -396685, -192630, -2483, 88712, 76715, -14416, -117218, -220202, -306341, -337712, -422166, -647508, -900986, -1044154, -1060026, -1022799, -945425, -790252, -563550, -311889, -91309, 79527, 90958, -137473, -458311, -633935, -573085, -416549, -315445, -281512, -266974, -262525, -289598, -328263, -411570, -522815, -518699, -388353, -236136, -144724, -100336, -7162, 133333, 253638, 323391, 265124, 77010, -94798, -157089, -147964, -193600, -277528, -124311, 253173, 604412, 816204, 919451, 931959, 786013, 532312, 281713, 187017, 302847, 451329, 512040, 524929]
13626E24929n2386j56833k62988k17304N7254K36183J42910K8482l7068j50334
13616A12845j99461r5446M1100L7036j23360k82600l75340l92055k55138l8729
13606a571148J35513K80599K99915J04554n9519q211J35273K45989K28586O4700
13596a43749j01504j11872O16J14778J37144O4609m1580j14510j43303j57231
13586d96602j62391j45284r7623j08416p6447M2885J54813K00915J27420K3162
13576e37568r9257k50050k52227q0365J07193J69768Q6071k2818j03226j14442
13566a096921m6964P5054K45174K35098j6051k35565k28465j67855k42677j96314
13556a675486L6309J81313J18375p7981k29141k14352J4375K27261J89816O7931
$$ y = [524929, 472543, 315710, 52722, -164582, -107328, 128855, 271765, 300247, 263179, 112845, -86616, -182062, -140962, -103926, -227286, -509886, -885226, -1277281, -1532419, -1571148, -1435635, -1155036, -855121, -750567, -810086, -818297, -683024, -437035, -208449, -143749, -245253, -357125, -356509, -241731, -104587, -39978, -81558, -196068, -339371, -496602, -658993, -804277, -901900, -1010316, -1086763, -1043878, -889065, -688150, -560730, -537568, -636825, -886875, -1139102, -1219467, -1112274, -942506, -856435, -879253, -982479, -1096921, -1143885, -1068831, -823657, -588559, -604610, -840175, -1068640, -1236495, -1479172, -1675486, -1639177, -1457864, -1339489, -1417470, -1646611, -1860963, -1846588, -1619327, -1429511, -1361580]
13546a361580J18562K12853J18386l9871p9994l8865l8288p8022j90348l41569
13536a718736l44994j19363J26428J98594J29455L9030p3281j96138j68675o4422
13526b192102q7625j75198k25631k22845j46663o4427r026L9906R4309J88674
13516b800628K62259K87610K91537K58680K63294L73401M37395L14521J08264
13507b03667N6717J53144K13087K20244J50238l8254j20650r32J60758K11579
13497H02264Q4114j43702k56670j71477P7119L34171L65150K40876J50335P8875
13487A561055j54846n11876o47148m25752q1413J12733P4889q6805j73683j10952
13477d43798r2223k24577l98616m16198j83213P3181J40568J87396K70717K17931
$$ y = [-1361580, -1243018, -1030165, -911779, -951650, -1031644, -1070509, -1108797, -1186819, -1377167, -1718736, -2063730, -2183093, -2056665, -1858071, -1728616, -1689586, -1762867, -1959005, -2127680, -2192102, -2279727, -2454925, -2680556, -2903401, -3050064, -3114491, -3123517, -3083611, -2989302, -2800628, -2538369, -2250759, -1959222, -1700542, -1437248, -1063847, -626452, -311931, -203667, -146950, 6194, 219281, 439525, 589763, 551509, 430859, 429927, 590685, 802264, 886378, 742676, 486006, 314529, 391648, 725819, 1090969, 1331845, 1482180, 1561055, 1406209, 894333, 247185, -178567, -259980, -147247, -72358, -159163, -332846, -443798, -536021, -760598, -1159214, -1575412, -1758625, -1685444, -1544876, -1357480, -1086763, -868832]
13467h68832J20154J59824J48390j0134n1462l2739j69422k85963k40148p8598
13457a308930J31243L09697L53994K70090K24678J79079J52691K07196L14844
13448H34582L30974J33936j3190M4414J33727L098k41862k58751j13215j9537
13438H34176j0988n7037j45856k20711j24576L2820J3832j42323k56926j93188
13428b70777K446J01927J13887N2799l6511p8448j23540j21598q5588j39860j95101
13417g80364j27979J5540J55830J74344J22683J34874J43384P0933l3081p9391
13407b03227p462M5627k2626k32251m20256l76024j85580M7797J46200J6213j24057
13396a315646j52961j17961k4161N4160Q9779J60631L37256N36681N38394L58795
$$ y = [-868832, -748678, -588854, -440464, -450598, -502060, -534799, -704221, -990184, -1230332, -1308930, -1177687, -867990, -513996, -243906, -19228, 159851, 312542, 519738, 834582, 1165556, 1299492, 1286302, 1330716, 1464443, 1467541, 1225679, 966928, 853713, 834176, 823188, 766151, 620295, 399584, 275008, 307828, 321660, 179337, -77589, -270777, -268331, -166404, -52517, 282, -36229, -114677, -238217, -359815, -445403, -585263, -780364, -908343, -892803, -736973, -562629, -439946, -305072, -161688, -90755, -123836, -203227, -210689, -165062, -187688, -419939, -840195, -1216219, -1401799, -1354002, -1207802, -1191589, -1315646, -1468607, -1586568, -1610729, -1556569, -1466790, -1306159, -968903, -432222, 106172, 464967]
13386D64967J16139o4827k4130J99248L64002L00451l1073l46786l83889k66360
13376C27742k19897k36224k56178k13175K951L29172N58404M86103J19991k51083
13366F47806l59799k59924j66168o3920Q9559J45225K5700p2878k8998K8400j9298
13355c4295k06586k98813j99369m9848K1867p263k7888l1929M736K43571M60574
13344a25243L70658J45101M8120J33481K35603K07987J09045j053j15258j84050
13334H24391j76212o9456q155j05315j36554n6208q7084j29555k6263P2549J07268
13323B09406J61027K25009K39154J21231L5745O3459O7969m2540k17443l52702
13313E10315k63659J4758K15818K61372K08577O6909o724N5433J03976Q6063j1897
$$ y = [464967, 581106, 516279, 492149, 691397, 1055399, 1355850, 1324777, 977991, 594102, 327742, 107845, -128379, -384557, -597732, -594781, -265609, 292795, 778898, 898889, 647806, 288007, 28083, -138085, -202005, -112446, 32779, 58479, -14399, -43397, -14997, -34295, -240881, -539694, -739063, -788911, -767044, -774307, -802195, -834124, -829388, -585817, -125243, 245415, 390516, 438636, 572117, 807720, 1015707, 1124752, 1123699, 1008441, 824391, 648179, 578723, 570568, 465253, 328699, 272491, 185407, 55852, 29589, 102138, 209406, 370433, 595442, 834596, 955827, 991572, 1055031, 1123000, 1080460, 863017, 510315, 246656, 261414, 477232, 738604, 947181, 1014090, 1007366, 1062799, 1166775, 1252838, 1240941]
13302A240941p7598M608J17980J34810J0914p4644l5308M2636N5075q0644j83782
13291A154988j16833K304L8102N9349J54122J82100N2415k7415P5172K21197K54408
13280B049909R4307k25696m59137m70571l12942j25102Q9652L76021N15900M03779
13270A936120K06329K7441p0050j06608m2339J32966L79664N21677L40394n2453
13260C273141l76322m35694k76926r0121P3115K75663M25402K99188O224k20113
13250B953557l85727m46312l28266j20225R6924K08754J73526K5492k09872l70407
13240A597444k86168j3479K23332J92793j68986m57665l40813j3261K20125K73199
13230A226521K19605J54733K21066K85703J89115J17224J06437N4232O0022J77050
$$ y = [1240941, 1163343, 1167951, 1285931, 1420741, 1431655, 1357011, 1321703, 1364339, 1419414, 1338770, 1154988, 1038155, 1040459, 1078561, 1137910, 1292032, 1474132, 1526547, 1499132, 1574304, 1795501, 2049909, 2144216, 1918520, 1459383, 988812, 675870, 550768, 640420, 1016441, 1532341, 1936120, 2142449, 2169890, 2099840, 1993232, 1950893, 2083859, 2463523, 2985200, 3325594, 3273141, 2896819, 2461125, 2184199, 2094078, 2167193, 2442856, 2868258, 3167446, 3173670, 2953557, 2567830, 2121518, 1793252, 1673027, 1769951, 1978705, 2152231, 2177723, 1967851, 1597444, 1311276, 1297797, 1521129, 1713922, 1544936, 1087271, 746458, 733197, 953322, 1226521, 1446126, 1600859, 1821925, 2107628, 2296743, 2413967, 2520404, 2574636, 2634658, 2811708]
13220B811708K19352J59225J35978J48571J09792R8169Q3696o5133k45306l92121
13210C063931o02439p19334n45947k18806k1880k1613j05446j33085J3659K50786
13200I59826M25660L46845J10025K7638M7207l2551j38378j59866j61422j35641
13190A289343p1033n5796r5084k9460O6566J13913K26712K28625P5661n7813j17228
13179A574406q9630M3036K16990L36009L18584K00807P7758k6714j30226j87992
13169B333028j57394j15479m9314J12147K05506J57310O5574O34n7564r0559m7402
13158B356487K391K3794Q6412K53165M03497L43138J16113k1560j8305K9319J02368
13147C676819O981k01872l53350m00750l41794k36187j19897K305J17772J28280
$$ y = [2811708, 3031060, 3190285, 3326263, 3474834, 3584626, 3682795, 3766491, 3701358, 3456052, 3063931, 2461492, 1742158, 1196211, 977405, 955525, 933912, 828466, 695381, 709040, 959826, 1385486, 1732331, 1842356, 1869994, 1917201, 1884650, 1746272, 1586406, 1424984, 1289343, 1218310, 1162514, 1067430, 1037970, 1104536, 1218449, 1445161, 1673786, 1749447, 1691634, 1574406, 1484776, 1527812, 1744802, 2080811, 2399395, 2600202, 2677960, 2651246, 2521020, 2333028, 2175634, 2060155, 2010841, 2122988, 2328494, 2485804, 2551378, 2552012, 2494448, 2403889, 2356487, 2358878, 2382672, 2469084, 2722249, 3125746, 3468884, 3584997, 3563437, 3545132, 3574451, 3676819, 3683800, 3481928, 3128578, 2727828, 2386034, 2149847, 2029950, 2032255, 2150027, 2278307]
13137B278307J20086K89197M85329M31752J49037j51662k22144j42238j77376
13128C060288k72166k13391L4838K93517L66607L10412L41619M10342K67530n3114
13118D546482l43431n39953n56165k90478K763R3430P2102N1374r28n2038N1958
13107C035116K36041L54727L08115J43890p2340j93427o1315J41808J46609j3151
13097D026073j57855j10631Q3857Q6972j28557k38964j36860r7542j36420j04789
13087C085284o8975j6587J34463J85348m7488l08748k56253o5305J1826M9582
13077B703147J83957L54399N58949P07827O52937M45420K88032J79707k4041k47704
13067E802630k56291n6705J50853K96578L05798K06500O4086n3484j27165j88318
$$ y = [2278307, 2398393, 2687590, 3172919, 3604671, 3753708, 3602046, 3379902, 3237664, 3060288, 2788122, 2574731, 2609569, 2903086, 3269693, 3580105, 3921724, 4332066, 4599596, 4546482, 4203051, 3663098, 3106933, 2816455, 2819218, 2912648, 2984750, 3036124, 3035196, 2983158, 3035116, 3271157, 3625884, 3933999, 4077889, 4005549, 3812122, 3750807, 3892615, 4039224, 4026073, 3868218, 3757587, 3841444, 3928416, 3799859, 3560895, 3424035, 3326493, 3190073, 3085284, 3016309, 2999722, 3134185, 3319533, 3272045, 2963297, 2707044, 2641739, 2653565, 2703147, 2887104, 3241503, 3800452, 4508279, 5161216, 5606636, 5894668, 6074375, 6050334, 5802630, 5546339, 5489634, 5640487, 5937065, 6242863, 6449363, 6513449, 6459965, 6332800, 6144482]
13057F144482k50042k57824k55866k25876j59420p8345L3020K16868M70537N71575
13047F209109M68357L07413K17259L11108M78185M25416J11924j40445j72323
13038H216003j36437m8751J25611K35781K61297K30000Q9181M4569J47900K86885
13028I452039M48609N29868M79715L50023K57041K35854J82932J25702J87829
13019A2249612L69405N53080N95827M68928K66706J27599J78849K98108M06767
13010A5514881O19548R15068J108382J106180J018200J112304J246739J164364
13002B3805666J025361J104024J407027J675128J882393K136924K476962K767721
12994C8281206K971445L226990L572040M053943M725627N513448O371515P326907
$$ y = [6144482, 5894440, 5636616, 5380750, 5154874, 4995454, 4917109, 4950129, 5166997, 5637534, 6209109, 6677466, 6984879, 7202138, 7513246, 7991431, 8416847, 8528771, 8388326, 8216003, 8079566, 8030815, 8156426, 8392207, 8653504, 8883504, 8972685, 9017254, 9165154, 9452039, 9900648, 10430516, 10910231, 11260254, 11517295, 11753149, 11936081, 12061783, 12249612, 12619017, 13172097, 13767924, 14236852, 14503558, 14631157, 14810006, 15108114, 15514881, 16134429, 17049497, 18157879, 19264059, 20282259, 21394563, 22641302, 23805666, 24831027, 25935051, 27342078, 29017206, 30899599, 33036523, 35513485, 38281206, 41252651, 44479641, 48051681, 52105624, 56831251, 62344699, 68716214, 76043121]
12986G6043121Q305420R223051J0303518J1851199J3913976J6371458J9282996
12979A65294739K2994765K7570697L2855702L8817274M4982661M9636584M9379968
12972D31532390L9402211J6939396j3355839m0279688n4909690n6867197n1290683
12965B71170900m3238900l5465148k8857134k3445438j9070581j5540329j2709375
12958I2843995j0452821q571015p003797n888231n104226m309361l494861l006647
12950D5013036k811480k555200k208450j960814j788099j595830j468983j391087
12942B9233093j225853r94140p71039o30136n86227n85764n83758m99306l69802
12933B2987068k82025k47288k17270l8215L15701N94759O44450O08811P34095
$$ y = [76043121, 84348541, 93571592, 103875110, 115726309, 129640285, 146011743, 165294739, 188289504, 215860201, 248715903, 287533177, 332515838, 382152422, 431532390, 470934601, 487873997, 474518158, 434238470, 379328780, 322461583, 271170900, 227932000, 192466852, 163609718, 140164280, 121093699, 105553370, 92843995, 82391174, 73820159, 66816362, 60928131, 55823905, 51514544, 48019683, 45013036, 42201556, 39646356, 37437906, 35477092, 33688993, 32093163, 30624180, 29233093, 28007240, 27013100, 26242061, 25611925, 25025698, 24439934, 23856176, 23356870, 22987068, 22705043, 22457755, 22240485, 22202270, 22517971, 23112730, 23757180, 24365991, 25100086]
12924B5100086R65590J077825J087786J146386J225131J292426J408342J551014
12916C4854586J650134J864954K204146K330120K064195J560722J085303R28175
12908D8542335J306382J957698K538721L074059L682172M357725N079248N901818
12900G6440158O822983P895819R193833J0705418J2491905J4610583J7180548
12893A55341247K0361727K4320999K9120288L4708653M0942791M7074330N0957126
12886D02827161M8359711L4314545P780099k3630874m7647403n7818370n6519016
12879C07665853m9445010m1058447l3418966k6984587k1811888j7798690j4736182
12872A02412083j2307344j0242689q535927p215209o116359n201566m557283l926941
$$ y = [25100086, 26065676, 27143501, 28231287, 29377673, 30602804, 31895230, 33303572, 34854586, 36504720, 38369674, 40573820, 42903940, 44968135, 46528857, 47614160, 48542335, 49848717, 51806415, 54345136, 57419195, 61101367, 65459092, 70538340, 76440158, 83263141, 91158960, 100352793, 111058211, 123550116, 138160699, 155341247, 175702974, 200023973, 229144261, 263852914, 304795705, 351870035, 402827161, 451186872, 485501417, 493281516, 469650642, 422003239, 364184869, 307665853, 258220843, 217162396, 183743430, 156758843, 134946955, 117148265, 102412083, 90104739, 79862050, 71326123, 64110914, 57994555, 52792989, 48235706, 44308765]
12864D4308765l192490k544560k092069j775877j535475j422118j471090j504732
12856B8770354j372098j117318r80210r74418q79732n94682l15249k12524j91844
12847B2132279j70353j52530j40797j0119J58188K49488K92031K41572K42384
12838B2842143K90101L47992M33374N20368O13548P23604P82621P65867P73170
12829B8092788Q54340J034228J182792J276267J429149J726925K154538K438055
12821D0189082K519804K649114K930955L390333L985810M771572N751325O823177
12813G3011172P922027Q964108J0098802J1543117J3341928J5550838J8275668
12806A58707660K1640306K5792087L0721391L6290857M2233649M7494157M9485649
$$ y = [44308765, 41116275, 38571715, 36479646, 34703769, 33168294, 31746176, 30275086, 28770354, 27398256, 26280938, 25300728, 24326310, 23446578, 22851896, 22536647, 22324123, 22132279, 21961926, 21809396, 21668599, 21658480, 21816668, 22066156, 22358187, 22599759, 22842143, 23132244, 23480236, 23913610, 24433978, 25047526, 25771130, 26553751, 27319618, 28092788, 28947128, 29981356, 31164148, 32440415, 33869564, 35596489, 37751027, 40189082, 42708886, 45358000, 48288955, 51679288, 55665098, 60436670, 66187995, 73011172, 80933199, 89897307, 99996109, 111539226, 124881154, 140431992, 158707660, 180347966, 206140053, 236861444, 273152301, 315385950, 362880107, 412365756]
12799D12365756M3738334K5960190k496101l1975247n1407185n7355411n3874464
12792B84955872m6399608l8271224l0970747k5041437k0387740j6711047j3776277
12785I3397792j1452820r699856q312370p105433n973158m905737l982380l323657
12777C8642381l005200k881580k664690k230976j824036j578600j490509j488116
12769B1478674j406224j218424j029402r16856q90764r75352j106172j193079
12761A2742401j112598q26457n50318m09835l49207m26636n51380n85857n92871
12752G337242n04915l97702l74099l36587k74215j53266q341m605m2508j7161
12742E223843P143n8923j40832j81627j48503j07885j80508k98204l20494k43473
$$ y = [412365756, 456104090, 482064280, 479568179, 447592932, 396185747, 338830336, 284955872, 238556264, 200285040, 169314293, 144272856, 123885116, 107174069, 93397792, 81944972, 72245116, 63932746, 56827313, 50854155, 45948418, 41966038, 38642381, 35637181, 32755601, 30090911, 27859935, 26035899, 24457299, 22966790, 21478674, 20072450, 18854026, 17824624, 16907768, 16017004, 15041652, 13935480, 12742401, 11629803, 10803346, 10253028, 9843193, 9493986, 9067350, 8515970, 7930113, 7337242, 6832327, 6434625, 6060526, 5723939, 5449724, 5296458, 5288117, 5283512, 5241004, 5223843, 5230986, 5172063, 5031231, 4849604, 4701101, 4593216, 4412708, 4114504, 3794010, 3550537]
12732C550537j02168P2867K40433L81779M97968L99957r114m90619p59623p39895
12722C042122n80540l70041j29970k6037L946K01900M45467O02289O02360L52096
12712D143592O2608l5420o7979j10928o4550n6080j76856l09640l65280k93121
12702B726346k25460k85255l04599j74635J8944J87412K65803K09640N1643p1648
12692B398191q0066j15447j08390K8889R4503J05827J49588J79232J10800j27163
12682B635964l58217k90338k7212J49973J94018J93151K16656K61876K88122K15082
12672C479075J20375K02660L76708M01569L11403J79297m0630l37158n51345o27841
12662C514113n27500k10085J35675K70281J55313m7968j62654p8228J12557K38599
$$ y = [3550537, 3448369, 3521236, 3761669, 4143448, 4641416, 5041373, 5032259, 4541640, 3782017, 3042122, 2461582, 2091541, 1961571, 1935534, 1939480, 2141380, 2586847, 3189136, 3791496, 4143592, 4206200, 4170780, 4102801, 3991873, 3927323, 3871243, 3694387, 3384747, 3019467, 2726346, 2500886, 2215631, 1911032, 1736397, 1755341, 1942753, 2208556, 2418196, 2469839, 2398191, 2318125, 2202678, 2094288, 2123177, 2217680, 2323507, 2473095, 2652327, 2763127, 2635964, 2277747, 1987409, 1960197, 2110170, 2304188, 2497339, 2713995, 2975871, 3263993, 3479075, 3599450, 3802110, 4178818, 4580387, 4891790, 5071087, 5030457, 4693299, 4141954, 3514113, 2986613, 2776528, 2912203, 3182484, 3337797, 3289829, 3127175, 3048947, 3161504, 3400103]
12652C400103L02251K48518M2343j47685j83129k5136K06474L33798K80003j6382
12642D441158k38516j25336M1053O4137L0369k7702j09092j25322L553J93167
12632D147469M20222P00613R28664R36109Q12968O26341L81909K70326L43332
12623I567953M98180O22029N94056N30120O46974Q11423R46828J109071J328190
12614A6654824J587952J839717K214068K578022K822351L037226L205734L432667
12606C7372561L494837L058452K147548Q27100q41235k419329l396856l811014
12598C6432064l918641l763356l501023l192242k809265k368969j980578j717203
12590A3180787j550340j314864r94585p73002p04645p25420p08574o35065n69706
$$ y = [3400103, 3702354, 3950872, 3993215, 3845530, 3662401, 3637265, 3843739, 4177537, 4457540, 4441158, 4202642, 4077306, 4118359, 4182496, 4212865, 4185163, 4076071, 3950749, 3954302, 4147469, 4567691, 5268304, 6196968, 7133077, 7946045, 8572386, 8954295, 9224621, 9567953, 10066133, 10688162, 11282218, 11812338, 12459312, 13270735, 14217563, 15326634, 16654824, 18242776, 20082493, 22296561, 24874583, 27696934, 30734160, 33939894, 37372561, 40867398, 43925850, 46073398, 46900498, 46059263, 43639934, 40243078, 36432064, 32513423, 28750067, 25249044, 22056802, 19247537, 16878568, 14897990, 13180787, 11630447, 10315583, 9320998, 8547996, 7843351, 7117931, 6409357, 5774292, 5204586]
12581E204586m83259l97455l87127l56755k31411j33198j61942k10866k42086
12572B600487k57671k19739k39823m56112o73567o50908m75423j95124P3769J82335
12562c11776K24248K76760K44939J37228J7857j3671J16358K58296L72025M28764
12552A751028K96304k1999k16753p9939J91484K78786J67766N0619l6397o4728
12542B316171j9980q3714l27024m99476l80920j01955j1118j12221k08021k02111
12532C69631j38767J1045K28841L38915K11339j4529r8323J0924J39887J66254
12522A225217J68524R5443n1823j16017j42669j88708k31972k72983k73937j65318
12512D5757o41J17180J69912J48542P4539L4164N3181R9956J80537K66046J79393
$$ y = [5204586, 4721327, 4323872, 3936745, 3579990, 3348579, 3215381, 3053439, 2842573, 2600487, 2342816, 2123077, 1883254, 1427142, 753575, 102667, -372756, -567880, -494111, -311776, -87528, 189232, 434171, 571399, 589256, 575585, 691943, 950239, 1322264, 1751028, 2047332, 2025333, 1808580, 1728641, 1920125, 2198911, 2366677, 2417296, 2380899, 2316171, 2296191, 2212477, 1885453, 1385977, 1005057, 903102, 891984, 779763, 571742, 369631, 230864, 241909, 470750, 809665, 1021004, 1006475, 908152, 919076, 1058963, 1225217, 1393741, 1489184, 1437361, 1321344, 1178675, 989967, 757995, 485012, 211075, 45757, 45116, 162296, 332208, 480750, 555289, 589453, 642634, 742590, 923127, 1189173, 1368566]
12501A368566l3805r2794k0336j7756o3122k5275K9848N9346M7645l1777j67263
12490A053277k52852k61358k79997j70390N1816J97746K26926J73858Q8897O5876
12480H93799N4052l1311n8950j9072o0376r0802q8201r6833m405J31905K00341
12469H30147K15838J32233m407l072J24763J64255J06085J506j62046l12207l30588
12458G62507k15594j13648o5032m3483k9096n2833p6230n9369J1416J28282J25484
12447C72404j9005j22166j11986j31209j83800j20156r878l4134j01413q9035
12437e50378k724J33414J67342J00867N8956N2853P8518J11964J43659J06321
12427D00792N2917M3913J7066n4092r2111l9369J02653L24705L97820J66387j67467
$$ y = [1368566, 1334761, 1241967, 1221631, 1203875, 1140753, 1115478, 1145326, 1204672, 1252317, 1220540, 1053277, 800425, 539067, 259070, 88680, 140496, 338242, 565168, 739026, 827923, 893799, 947851, 916540, 857590, 838518, 778142, 687340, 599139, 502306, 497901, 629806, 830147, 1045985, 1178218, 1173811, 1170739, 1295502, 1459757, 1565842, 1567348, 1405302, 1093095, 762507, 546913, 433265, 368233, 324750, 295654, 242821, 166591, 107222, 118638, 246920, 372404, 353399, 231233, 119247, -11962, -195762, -315918, -325796, -359930, -461343, -550378, -553102, -419688, -252346, -151479, -92523, -39670, 38848, 150812, 294471, 400792, 453709, 497622, 514688, 460596, 368485, 329116, 431769, 756474, 1154294, 1320681, 1153214]
12416A153214l02852k57630j60839l1961P5659J49637J31362l3263j58601j57877
12406D06849j54017j51779j54885k22934k60275j22147J43601K33015P1188j59722
12396c71106l66863l77736o8712K97097M59744M40224L05395J43928N4997P7057
12386E94025J17889L5433j79247l83215m40673l88650l49923k47283l8347K31013
12376a048978M66648N37014M03478J78515k1741j26906j76707k28372k51118k52920
12366e21087j82344K0171K24158K39497J17875M2805P8333R7548L4862Q6901J59025
12355C97744M9202j74187l30787k55372q4897K330k66p5841k08215k30582r9228
12344a010099J8313j0048j64255l61423l41206j10052R9782K18374K24540J79533
$$ y = [1153214, 850362, 592732, 431893, 399932, 475591, 625228, 756590, 723327, 564726, 406849, 252832, 101053, -53832, -276766, -537041, -659188, -515587, -282572, -211384, -371106, -737969, -1115705, -1184417, -887320, -427576, 12648, 318043, 461971, 516968, 594025, 711914, 747347, 568100, 184885, -255788, -644438, -994361, -1241644, -1279991, -1048978, -582330, -45316, 358162, 536677, 514936, 388030, 211323, -17049, -268167, -521087, -703431, -683260, -459102, -219605, -101730, -58925, 19408, 116956, 151818, 238719, 397744, 446946, 272759, -58028, -313400, -398297, -395967, -396233, -472074, -680289, -910871, -1010099, -991786, -1001834, -1166089, -1527512, -1868718, -1978770, -1878988, -1660614, -1436074, -1256541]
12334a256541J36355L0909l1088J5566L3316p057L5722K02857K71469J32836n761
12323d41417p0365j38883j26342K2429J57695J36119J42356K97964L92471L35720
12313G07747J54586r693r4936r9571J06620L78677M33440K52683O9702j4288k0230
12302A864737P6825J53425P3610n7381p0892P2362J42582k8188k74543m51731
12292A500806n39118m90119l81118k73893j19186p202n458N6653K00438K30042
12282A71845J10333N609K5934N6837r319j34601j89631r7380J7523K33048N74898
12271G65096O55963M25935K01202J21162J35277J64994R5934p6363k07410k35003
12261B046787k73789l30287l78713k95320k0315K01270J59838L4089R7781K52622
$$ y = [-1256541, -1120186, -1089277, -1120365, -1104799, -1071483, -1078540, -1042818, -839961, -568492, -435656, -441417, -511782, -650665, -777007, -754578, -596883, -460764, -318408, -20444, 372027, 707747, 862333, 852640, 757704, 658133, 764753, 1143430, 1576870, 1829553, 1899255, 1884967, 1864737, 1941562, 2094987, 2168597, 2111216, 2040324, 2112686, 2255268, 2227080, 1952537, 1500806, 961688, 471569, 90451, -183442, -302628, -309830, -315288, -258635, -58197, 171845, 282178, 287787, 313721, 370558, 361239, 226638, 37007, -60373, -42850, 190198, 765096, 1421059, 1846994, 2048196, 2169358, 2304635, 2469629, 2565563, 2489200, 2281790, 2046787, 1772998, 1442711, 1063998, 768678, 748363, 949633, 1109471, 1143560, 1241341, 1493963]
12251A493963K84926K57640K94108M23700M90649M93781N69517O44534N81077
12242E533895L79105P8641k91074n79450o22254m48484l17125k77882k29011j70491
12232C055870n8637M8842O9186N9110J42209K98906M35124M24159K37813J8026
12222D730608p458K14358N10213O92342P56922Q05593Q17644Q30242R29175J124899
12212A1404538J316824J515432J814097K139768K524504L113601L778706M493788
12204C2101258N465718O665910P810273Q537960Q211890N965176J515148l929407
12196G2343926q052776r569637r118078p916708o568483n275454m244271l391123
12188A8207396k684408k164693j807142j581586j468956j371801r59400k86063
$$ y = [1493963, 1778889, 2036529, 2330637, 2754337, 3244986, 3738767, 4308284, 4952818, 5533895, 5913000, 5991641, 5700567, 5121117, 4498863, 4050379, 3733254, 3455372, 3226361, 3055870, 2997233, 3046075, 3115261, 3174371, 3316580, 3615486, 4050610, 4474769, 4712582, 4730608, 4723150, 4937508, 5447721, 6140063, 6896985, 7702578, 8520222, 9350464, 10279639, 11404538, 12721362, 14236794, 16050891, 18190659, 20715163, 23828764, 27607470, 32101258, 37566976, 44232886, 52043159, 60581119, 68793009, 74758185, 76273333, 72343926, 64291150, 54721513, 45603435, 37686727, 31118244, 25842790, 21598519, 18207396, 15522988, 13358295, 11551153, 9969567, 8500611, 7128810, 6169410, 5883347]
12180E883347J22147J00218m3032j24709k20094m67838p58809p82575n70562l83122
12170B754971k33133n2364K628n2154q5464j28269l12685o04408p37869n02458
12160D8795p1683K88414M65840L82544J43254r3391l24117n00424m58602k20449
12150c39819M6358J86547R6802j54490k77418j90737m1602J31780J72153o7j92093
12139e62586j29577J38873K01996N6530k8489j11898l92875n13324l41841o7652
12129a750843L41884O13208M62523P7350j60881j85236j05650Q5026K28646J79088
12119b14885N3121k6058r1078j57624j72196j17684p5884j32303j49113m370J65442
12108i22632J38486M7934J38046L12674M00972L85526K52634K3498j32465r4012
$$ y = [5883347, 6005494, 6105712, 6062680, 5937971, 5717877, 5250039, 4491230, 3708655, 3138093, 2754971, 2521838, 2469474, 2472102, 2419948, 2334484, 2206215, 1893530, 1289122, 551253, 48795, -22888, 265526, 731366, 1113910, 1257164, 1163773, 839656, 339232, -119370, -339819, -293461, -106914, -10112, -164602, -442020, -632757, -674359, -542579, -370426, -370493, -562586, -692163, -553290, -351294, -294764, -323253, -435151, -828026, -1341350, -1683191, -1750843, -1408959, -795751, -333228, -255878, -416759, -601995, -707645, -622619, -393973, -214885, -161764, -187822, -278900, -436524, -608720, -726404, -802288, -934591, -1083704, -1088074, -922632, -784146, -736212, -598166, -285492, 115480, 501006, 753640, 777138, 644673, 550661]
12098E50661l6569o232P4648J42979J05175J4335j06877k59446k97370j98072
12088a6768j04324o0383m3799r357j930j24635k35230j18731R7382K32920K25145
12077a59710J64137J37679N5011k1397j7490J00378L00217L33996J59902q0676
12067I72047k59360l99167m64832l16165o5051P9324J8990o7122l6472K1738n954
12056e22024p9132p6579l3182k4384n5016J6833J93652K50383K54599K64071J71238
12045C60459N4645J2344J45282M02377M01099P1599j85779k39415k64249l47454
12035D10908l73179k08078J8766N8716m7597m8403r198k4759q4785o4138J39468
12024b32279L63876M62218M01686K63553J38063J0989j28548k06806j15651J29617
$$ y = [550661, 514092, 507860, 582508, 725487, 830662, 844997, 738120, 478674, 181304, -16768, -121092, -181475, -225274, -234631, -236561, -361196, -596426, -715157, -617775, -384855, -159710, 4427, 142106, 197117, 175720, 158230, 258608, 558825, 892821, 1052723, 972047, 712687, 313520, -151312, -467477, -532528, -453204, -434214, -501336, -537808, -516070, -522024, -601156, -677735, -710917, -735301, -790317, -773484, -579832, -329449, -74850, 189221, 360459, 415104, 427448, 572730, 975107, 1376206, 1447805, 1262026, 1022611, 758362, 410908, 37729, -170349, -151583, -92867, -140464, -188867, -198065, -222824, -307609, -371747, -232279, 131597, 593815, 995501, 1259054, 1397117, 1408106, 1279558, 1072752, 957101, 1086718]
12014A086718K68894J68896L2025J2417k4456j51729l47364n03064m68854k97714
12004b24231j83366k33277l89534m15406k44050q9145N4899K80739M61696L89940
11994e91735J58096m968l4244l33N5344L7407r3239j57753m5853J80471L52484
11983a44323L43607L30788L97958L24706m4764l94597m04174k25799j42558j26729
11973h5885q9159l4936N491n0975k02556l11971k55755r3267o10l9915m6059M9785
11961a155812J41082J73202J54368P6553m4747j37950j23311l4734N6335N0705
11951h44309q718m0812l0017J13591K79961L30075K61145R2108r5778k31822k40230
11940d14806j01487J86482M34724M41252K93618K02979J47701R276j50640k81840
$$ y = [1086718, 1355612, 1524508, 1556533, 1568950, 1544494, 1392765, 1045401, 542337, 73483, -224231, -407597, -640874, -1030408, -1445814, -1689864, -1779009, -1724110, -1443371, -981675, -591735, -433639, -438607, -472851, -473184, -417840, -380433, -473672, -631425, -677278, -496807, -144323, 199284, 530072, 928030, 1252736, 1207972, 813375, 409201, 183402, 40844, -85885, -175044, -209980, -204489, -255464, -458020, -769991, -1025746, -1119013, -1119623, -1159538, -1205597, -1155812, -1014730, -841528, -687160, -610607, -655354, -793304, -916615, -951349, -895014, -844309, -853027, -893839, -923856, -810265, -530304, -200229, 60916, 153024, 57246, -174576, -414806, -516293, -329811, 104913, 546165, 839783, 1042762, 1190463, 1199739, 1049099, 767259]
11930G67259m13854m54547m54656m50966l38958j50085P1912L00556M92788O14228
11920a6323N22105K87815J83872O9505k42152m93805m95016l43466j59685K3748
11910f63402J26274J38040Q8174L5787N7294J24418O6928r8363j35327J1567J56105
11899i2505J65074J33728J16696p6999m14721n29050k96863l8865j511n9499r5589
11888a190104j16923j34557k10085k46521j03391J82704L61167K48767j280p9973
11878a290196Q3374K83051L81690M10441K94175k405k37463l47703m62479n82835
11868a470350n39615k87130k0935J50726K08555J46086Q0807M7176j0569j27111
11858a822360j38197M7040K70472L18461J51363m9824j40414j11758j18597k07979
$$ y = [767259, 353405, -101142, -555798, -1006764, -1345722, -1495807, -1423895, -1123339, -630551, -16323, 505782, 793597, 977469, 1046974, 804822, 311017, -183999, -527465, -687150, -663402, -537128, -399088, -310914, -275127, -217833, -93415, -26487, -124850, -260177, -248610, -92505, 72569, 206297, 322993, 245994, -168727, -697777, -994640, -1033505, -1035016, -1094515, -1190104, -1307027, -1441584, -1651669, -1898190, -2001581, -1818877, -1457710, -1208943, -1210223, -1290196, -1206822, -923771, -542081, -131640, 162535, 160130, -77333, -425036, -887515, -1470350, -2009965, -2297095, -2318030, -2167304, -1958749, -1812663, -1731856, -1684680, -1695249, -1822360, -1960557, -1913517, -1643045, -1324584, -1173221, -1223045, -1363459, -1475217, -1593814, -1801793]
11848a801793k16321q0252j1466j86789m04931l77079R1233P95423J241004J222625
11838B71654Q88482N93071L35530K5340m7274K20124M63339M45896K06325q26
11828C401661j7639n7666k38242l64639l13091k41455k73105l99339n03642m81403
11818E11440l64060j67400J01961L17041L58903K29813J34764Q3238M3376n2718
11808A196358k40891l56097k66848o5476J08895K52461K79978J14649j24960k82628
11798F15441m05633m49149k70878j7066J02812K21273K69327J27904L2106N8396
11788B84533J20554J66478J25694j05946l08896l15740k12718n7338K0016J1426
11778b71937j6615j38952k44803j66479R9873L35119L92651L00970J95327J41622
$$ y = [-1801793, -2018114, -2098366, -2109832, -2296621, -2701552, -3078631, -2987398, -2191975, -950971, 271654, 1160136, 1753207, 2088737, 2114077, 2066803, 2286927, 2750266, 3196162, 3402487, 3401661, 3384022, 3326356, 3088114, 2723475, 2410384, 2168929, 1895824, 1496485, 992843, 511440, 147380, -20020, 81941, 398982, 757885, 987698, 1122462, 1205700, 1249076, 1196358, 955467, 599370, 332522, 267046, 375941, 628402, 908380, 1023029, 898069, 615441, 209808, -239341, -510219, -527285, -424473, -203200, 66127, 194031, 226137, 284533, 405087, 571565, 697259, 591313, 282417, -33323, -246041, -303379, -283363, -271937, -288552, -427504, -672307, -838786, -738913, -403794, -11143, 289827, 485154, 626776]
11768F26776N3652r5092j90800j79113o6723K3535k0474o3660K7525J15887P5448
11757C06961o105m0595j04205j84009j37198L651O5767J5730m3963p9557k9478
11746b33001R9200J03913p3590k02425k73905m25277n37143n14144l68791j00161
11736b525324J14714K11284K52634K24962J48938Q0734R2964J30782J09204L5915
11726a123193k1508m2434n9287j05185j55153j35019j369J36667K17009J82352
11716a107120J28927K80080M40101L56798J51768N3584O9337J17371J12987N4828
11706F58661N6120J00810N9848n2646j32556j89669j52528n2751M2803J46651
11696D84743K25132K30033J77060J21628R9450K1530j9039J02064J68437J87270
$$ y = [626776, 680428, 585336, 394536, 215423, 148700, 172235, 151761, 88101, 115626, 231513, 306961, 300856, 260261, 156056, -27953, -165151, -161500, -95733, -80003, -123966, -203523, -233001, -133801, -29888, -103478, -305903, -579808, -1005085, -1542228, -2056372, -2425163, -2525324, -2410610, -2199326, -1946692, -1721730, -1572792, -1492058, -1399094, -1268312, -1159108, -1123193, -1144701, -1187135, -1246422, -1351607, -1506760, -1641779, -1643148, -1506481, -1289472, -1107120, -978193, -698113, -258012, 98786, 250554, 304138, 373475, 490846, 603833, 658661, 714781, 815591, 875439, 822793, 690237, 500568, 348040, 295289, 338092, 484743, 709875, 939908, 1116968, 1238596, 1338046, 1359576, 1340537, 1442601, 1611038, 1798308]
11686A798308J89200L0906j67985j57149l0271p789j12942k07025l34858p13095
11676B87300j174709j225762p75424k68386l848P2776P5482O7230J36430K29509
11666b579402L27866M50333M37744L46558L39622K55640K3555r5265j5834P6325
11656d32858N8859m0312o3154J3289J81856L44090L57640K54276J49905J07653
11646I31244r303j42691k61571l99981m38139l79404k91519k28745k71532l29233
11636a820874k14270M2150K53782L51685L18474J93053J21265K20080L63476L37084
11626A65905J01612j61223k78685l17866l15799k73170k31213k16362k31639k41602
11616b000042j67171N1751K07169J51530M942q8471j45043j56670q7372K8246
$$ y = [1798308, 1987508, 2018414, 1850429, 1693280, 1663009, 1655220, 1542278, 1335253, 1000395, 287300, -887409, -2113171, -2888595, -3156981, -3160829, -3088053, -3012571, -2945341, -2808911, -2579402, -2251536, -1801203, -1363459, -1016901, -677279, -421639, -398084, -493349, -509183, -432858, -373999, -414311, -477465, -464176, -282320, 61770, 419410, 673686, 823591, 931244, 921941, 779250, 517679, 117698, -320441, -699845, -991364, -1220109, -1491641, -1820874, -2035144, -1992994, -1739212, -1387527, -1069053, -876000, -754735, -534655, -171179, 165905, 267517, 106294, -172391, -490257, -806056, -1079226, -1310439, -1526801, -1758440, -2000042, -2167213, -2115462, -1908293, -1756763, -1751821, -1840292, -1985335, -2142005, -2229377, -2201131]
11606b201131J89542K66651J58642L3288K0707R8527J55310J97513K44272K57713
11596e78966L08995L28199K36813R4705j0597j2377n135o0467j9755J37523J40508
11585E59446j00473l78248m31175j58122K81409N77799N87829L47689j0190l84834
11575H91130n18219l51402j81005n4734J03894J19045o3453j73984k14900l14593
11565g58221l88274l69011j55240J80450L79647L88304L09658K44242J74817m3960
11555c7588l09706l88605k98058k07407j92289m2032K29465L60848K35796j0556
11545f60132j42679j63435j17894P807J51751K33670K01174R6236Q9307J58665
11535a45530K46857K95050J81486n2416j87210j62451p5396j4968n0488p0429
$$ y = [-2201131, -2011589, -1744938, -1586296, -1553008, -1532301, -1433774, -1278464, -1080951, -836679, -578966, -269971, 58228, 295041, 389746, 379149, 366772, 361637, 301170, 281415, 418938, 559446, 458973, 80725, -350450, -508572, -227163, 350636, 938465, 1286154, 1275964, 891130, 372911, 21509, -159496, -214230, -110336, 8709, -54744, -228728, -443628, -758221, -1146495, -1515506, -1670746, -1490296, -1110649, -722345, -412687, -168445, 6372, -37588, -347294, -735899, -1033957, -1241364, -1433653, -1475685, -1246220, -885372, -649576, -660132, -802811, -966246, -1084140, -1076333, -924582, -690912, -489738, -393502, -304195, -145530, 101327, 396377, 577863, 525447, 338237, 175786, 100390, 85422, 34934, -35495]
11525c5495l7135L9825R5311q0501l84291l96711q7982J58983J29896j41533l71352
11514a110985l82150l16742k68295j16459J71864L60896L24090K31599K73900
11505h32282L03202J57593K3592j3710L7061J52735K17136J03562j21186k59872
11495b32169j74666N197R243o9707j2269J35035K40710K48575J82105J20212Q8699
11484E40965k4695j98993k40298j44941K7449J98939K47458K11989K45978L43974
11474A207825K77060R1632L6197M0013p0532j70099j76106k13266k52617k20290
11464E49817r9532K7965O134j56797j92614o8317L3195k2313j65920k50705j63024
11453e02111M1032J91877J98143R8837O916o8217o6783J0868J21422K19566J85523
$$ y = [-35495, -72630, -32805, 62506, -17995, -402286, -798997, -886979, -727996, -598100, -739633, -1110985, -1493135, -1809877, -2078172, -2194631, -2022767, -1661871, -1337781, -1106182, -832282, -529080, -371487, -347895, -361605, -324544, -171809, 45327, 148889, 27703, -232169, -406835, -401638, -392395, -462102, -474371, -339336, -98626, 149949, 332054, 452266, 540965, 516270, 317277, 76979, -67962, -40513, 158426, 405884, 617873, 863851, 1207825, 1484885, 1576517, 1612714, 1652727, 1582195, 1412096, 1235990, 1022724, 770107, 549817, 450285, 478250, 484384, 327587, 134973, 66656, 99851, 77538, -88382, -339087, -502111, -461079, -269202, -71059, 27778, 34694, -33523, -100306, -89438, 31984, 251550, 437073]
11442D37073j6503j93949j47371J0173Q7416J04266K14299L58997K97398L5047
11432A186846k37858l61819l70124l18215k13120n6808J08246J86254J62365J24887
11422B10654P7303K1009K2913K9482N5299J63800K44567J21291j35406k87959
11412E22953k77773j77953j01453j14848l2217K23249K81388o3898m40823m76443
11402f57818k89026j42177p4251l1557J2759L2325j7361J886R0664R7130Q0266
11391h97160J39135J79223J57883J61537K13243L17736L60680K59914M7494k27945
11381G11740m39239m60471k99651j22970l32J1231m7292q6987j57646l11497l75546
11370a578660j78902J72137M09053M87859N05984M11321K75246J97700J66656
$$ y = [437073, 420570, 226621, 79250, 89423, 176839, 281105, 495404, 854401, 1151799, 1186846, 948988, 587169, 217045, -101170, -314290, -371098, -262852, -76598, 85767, 210654, 287957, 308966, 331879, 361361, 416660, 580460, 825027, 946318, 810912, 522953, 245180, 67227, -34226, -149074, -181291, 41958, 323346, 259448, -181375, -657818, -946844, -1089021, -1163272, -1194829, -1182070, -1149745, -1167106, -1165220, -1074556, -977426, -897160, -758025, -578802, -420919, -259382, -46139, 271597, 632277, 892191, 939685, 711740, 272501, -187970, -487621, -610591, -610923, -599692, -646984, -733971, -891617, -1203114, -1578660, -1757562, -1585425, -1176372, -688513, -182529, 228792, 504038, 701738, 868394]
11361H68394O4382r4979j75286j67495j87006j79704q8692l0989m5390j5966o26
11350e3357j9096R0633K79570M03537L01863m9762m39799n93863m13189j34515
11340f27978j8043p6129j37728l1412J40062J67188J03748Q954q2561j44120j96320
11329h94339j80610m8231Q5701J84346K47812K32598J47844J32007K34128K38815
11319C80071J63009J78781K31952J95758L5726j42474k59891k92344l02340l05443
11309a17195j63261q520k5549j23197k11103j32735J08750K47900J63116R1360
11299a70434J77515L03188M02371L92164K33328R8313n4447k88112m57728m50355
11289A85803l33428k49617k05340j35782m1719n2054j89990k62029j23538M1002
$$ y = [868394, 932776, 837797, 662511, 495016, 308010, 128306, 39614, 8625, -36765, -52731, -53357, -72453, 18180, 297750, 701287, 1003150, 953388, 513589, -80274, -493463, -627978, -646021, -722150, -859878, -891290, -751228, -584040, -480292, -471338, -553899, -698019, -894339, -1074949, -1123180, -1037479, -853133, -605321, -372723, -224879, -92872, 141256, 380071, 543080, 721861, 953813, 1149571, 1185297, 1042823, 782932, 490588, 188248, -117195, -280456, -288976, -314525, -437722, -648825, -781560, -672810, -424910, -261794, -170434, 7081, 310269, 712640, 1104804, 1338132, 1436445, 1381998, 1093886, 636158, 185803, -147625, -397242, -602582, -738364, -780083, -832137, -1022127, -1284156, -1407694, -1366692]
11279a366692N9221l1245j29302j91139j74082r9270n277J57178K92527K92363
11269a195718J98455J10245K4206m6774M472K7583n638j7673K237J27562K72842
11258d98201J98479m0685j80716j61761j0697J19165J84826K34271K80403K47128
11248C72212P2543r5039j20960j77331k93217l48469l04620j34107N4379K21618
11238g52991L33710K96207J07583j87315m01760l26016k2297K01944J57771J35266
11228d57898K82682L34456K88509J64903J4715o8652o3351L0307R7910Q3237N4006
11217G60824j8699j79621l65286l66117k03044j48870j98433j34923O8587K65746
11207e19836L59290L64478L32449K54749J08962j48882m55520n57235m36377k81884
$$ y = [-1366692, -1307471, -1338716, -1468018, -1659157, -1833239, -1932509, -1937786, -1780608, -1488081, -1195718, -997263, -887018, -862812, -909586, -905114, -877531, -883169, -900842, -898605, -771043, -498201, -299722, -340407, -521123, -682884, -693581, -574416, -389590, -155319, 125084, 372212, 444755, 349716, 228756, 51425, -241792, -590261, -894881, -1028988, -974609, -752991, -419281, -123074, -15491, -202806, -604566, -930582, -952879, -750935, -593164, -457898, -175216, 159240, 447749, 612652, 627367, 558715, 495364, 525671, 623581, 706818, 760824, 742125, 562504, 197218, -168899, -371943, -520813, -719246, -854169, -785582, -519836, -160546, 203932, 536381, 791130, 900092, 751210, 295690, -261545, -697922, -979806]
11197i79806k58456k96566j30095J68496L66843L87974L14403J85895N1881J8438
11187a70993J42034L46897M53659M09451K20247o4168l47867n19461m93879l25791
11177c49871j17699j1980n4488q8692l4325o4256j63438o6134J44696J16640m7523
11166g37070j7684J31473J57848Q9602R5238K42168L54285K96217J86751N1264
11156H50092o9783q9672j42778k80980l04236j84193L6844L48954M85912K81352
11146I31512n6487k58839k94696k72488j62985N4564K34512L61242M46990L35502
11136A318827R7506L983M5566j1227k33198m83215o02380n11496m08222l86487
11126a170343l32671k26141j16912M7511K08345K92540K75655K15464J42214j7426
$$ y = [-979806, -1238262, -1534828, -1664923, -1496427, -1129584, -741610, -427207, -241312, -189431, -170993, -28959, 317938, 771597, 1181048, 1401295, 1337127, 989260, 469799, -24080, -349871, -467570, -479550, -534038, -622730, -657055, -721311, -884749, -950883, -806187, -689547, -737070, -754754, -623281, -465433, -375831, -280593, -38425, 315860, 612077, 798828, 850092, 780309, 690637, 547859, 266879, -37357, -221550, -184706, 164248, 650160, 931512, 875025, 616186, 321490, 49002, -113983, -59419, 175093, 536335, 983325, 1318827, 1416333, 1420316, 1465882, 1454655, 1221457, 738242, 135862, -375634, -783856, -1170343, -1503014, -1729155, -1846067, -1798556, -1590211, -1297671, -1022016, -806552, -664338, -681764]
11116f81764k0861J00256Q6311J2334j7957m144J2063J32302K68681K88206J90856
11105C66283P1342J22174K65795K54655Q2125n9021m0180J8550o5486k34543l79956
11094D01738m41675l12708k22002k04606r9104n9776j81267k55222o8779K44037
11084a199364L78579K65847P0641p0033o0223K0504M904M9471K38284M04786M20442
11073E23838L35072J75199j39545m16924m23796l10745k12248j11517j8485j2525
11063f11676o5838k8874O7302R1978O0331M5044J4676j6497k3333J2767J5134
11052d38986o1190j66216k40435k23265j38435o5260q8409k4671K23435L78161
11042h45271K91277J45432J13333J64440K36797J70769Q380k5993m7675j47810
$$ y = [-681764, -702625, -602369, -516058, -503724, -521681, -525825, -513762, -381460, -112779, 175427, 366283, 437625, 559799, 825594, 1080249, 1162374, 1103353, 1063173, 1081723, 1016237, 781694, 401738, -39937, -352645, -574647, -779253, -878357, -938133, -1119400, -1374622, -1443401, -1199364, -820785, -554938, -484297, -554330, -614553, -594049, -589145, -539674, -301390, 103396, 523838, 858910, 1034109, 894564, 477640, 53844, -256901, -469149, -580666, -599151, -611676, -677514, -706388, -639086, -547108, -486777, -441733, -427057, -443554, -466887, -454120, -438986, -500176, -666392, -906827, -1130092, -1268527, -1333787, -1422196, -1446867, -1223432, -845271, -553994, -408562, -295229, -130789, 106008, 276777, 285157, 259164, 211489, 63679]
11032F3679k61559k75991k71404k93848j81040R4059K90177L02213K76421K37872
11022a9421K12637K47183K64963R8872p2492r0288l6644M8620O9144k8996j07622
11011E85956m2411K9639K7651R1303J45770M5755j27060j55777N5926K16298j2933
11000H60117m16648o25336n63853l04314j9076J38507O9761j13064j31701k8631
10990a134238J9917J1816K4775J42082K59826K61688J68837N5117K1676M2835
10980a25669P0033N8611M2395N2874K6547m573l9861j87982k91469j59455N4652
10969e03897J60667J55907K8348j21566j33795k3618Q6359J11077J47764J59738
10959F6984O2517n3460r2297k4726J10236K22015J91452L7493j15555j39304j20075
$$ y = [63679, -197880, -473871, -745275, -1039123, -1220163, -1126104, -835927, -533714, -257293, -19421, 193216, 440399, 705362, 804234, 731742, 641454, 604810, 653430, 722574, 693578, 585956, 543545, 573184, 600835, 692138, 837908, 883663, 756603, 600826, 656752, 873050, 860117, 443469, -181867, -745720, -1050034, -1069110, -930603, -860842, -973906, -1105607, -1134238, -1114321, -1102505, -1077730, -935648, -675822, -414134, -245297, -190180, -168504, -125669, -55636, 2975, 45370, 98244, 124791, 120218, 80357, -107625, -399094, -558549, -503897, -343230, -187323, -158975, -280541, -414336, -437954, -351595, -240518, -92754, 66984, 129501, 76041, -16256, -40982, 69254, 291269, 482721, 520214, 404659, 265355, 145280]
10948A45280j89411l01499l12737k01444j1106J80833L23240L08351J32843r8258
10938b3908k17332j82418o7353J35662K29276L4576k40974l11772k02164n9564
10928i05971O7487K21255L17263K56581R4200p2307j02695m9979j13618k18854
10918e06638k10455j12382j6016J01637J90095J85305J29618J6121m0999q381
10908b72095k4048j60223k32510k09337j36679K1916J81370K29288J70147Q2439
10898c49732j184L5854J46028J92195J75789J17002M5113n9224j96127l09572
10888b03858m04251m03861k89914j32078l4689o7397n4407m041l6447j25168j57396
10877a913507q4234O8637K62179N46638P69602O91929L58712k6323j77233r4899
$$ y = [145280, -44131, -345630, -658367, -859811, -870917, -690084, -366844, -58493, 74350, -23908, -241240, -423658, -491011, -355349, -126073, -91497, -332471, -644243, -846407, -905971, -838484, -617229, -299966, -43385, 50815, -21492, -124187, -174166, -287784, -506638, -717093, -829475, -845491, -743854, -553759, -368454, -238836, -222715, -263714, -272095, -296143, -456366, -688876, -898213, -1034892, -1012976, -831606, -602318, -432171, -349732, -350916, -315062, -169034, 23161, 198950, 315952, 361065, 301841, 105714, -203858, -608109, -1011970, -1301884, -1433962, -1468651, -1536048, -1590455, -1594496, -1630943, -1756111, -1913507, -1997741, -1929104, -1666925, -1120287, -350685, 341244, 699956, 673633, 496400, 401501]
10867D01501J6278O7926P9440J04302J44767N8707j35420l41365n08384n20784
10857f33032m07200l12740j35109J45661K41950Q2545K517J97587L71846K74372
10847a71603J22975O349j09757j72981k11452k07654j43511n7468M5623J86910
10837g12569L18835M18510M54663M31870M07099K58612n4749m29494o32527m13994
10827D6256O045J70756J0572k10931k86962k24492p6912J10305J14428n7529j44154
10816e42618r7033l2220J09800L08135M40237M88231M79032L09011j17150o06434
10806G38991q30429o81707l72706j17701O6141K36061L40054K65537Q0333p0562
10796c45988j34479m1489P0503o066k30859m37665m00644l0134L03365L05730
$$ y = [401501, 417779, 485705, 565145, 669447, 814214, 872921, 737501, 396136, -112248, -633032, -1040232, -1352972, -1488081, -1342420, -1100470, -1017925, -1015408, -817821, -445975, -171603, -48628, -42279, -152036, -325017, -536469, -744123, -887634, -945102, -899479, -712569, -393734, 24776, 479439, 911309, 1318408, 1577020, 1522271, 1092777, 460250, 46256, 52301, 223057, 233629, 22698, -264264, -488756, -565668, -455363, -340935, -398464, -542618, -639651, -671871, -562071, -253936, 186301, 674532, 1153564, 1462575, 1345425, 738991, -91438, -773145, -1145851, -1263552, -1197411, -961350, -621296, -355759, -275426, -345988, -480467, -521956, -451453, -457519, -688378, -1126043, -1526687, -1556821, -1253456, -947726]
10786i47726J58362O1246o5625k14422l59497m22661k87780l1477J28185J03422
10776a877973L705K7987J73064J97579J0751j38930m1750J73421K98668L15033
10766h58445L30494L05201K01275Q8488j8722j2386J91426L27180K69836P8274
10756I02621j94949l56183k44451K2366K02249K15459J18830p802r9915j21225
10746D37000j33392j41822k5387J43221P9783j96703m03157m82307m29729k89029
10736a441522j17829J09180J89666J30902M3854j14068j65280P0952L62888M57752
10726d73505L80449K72276K07911J36571n3957k90549l03306j33670M4393J30295
10716h3092J65973K44016L24793K88177R7687j33717k46868k54263k58066k55725
$$ y = [-947726, -789364, -728118, -793743, -1008165, -1367662, -1790323, -2078103, -2109580, -1981395, -1877973, -1874268, -1846281, -1673217, -1475638, -1464887, -1603817, -1645567, -1472146, -1173478, -858445, -527951, -222750, -21475, 67013, 48291, 35905, 227331, 554511, 824347, 902621, 707672, 351489, 107038, 129404, 331653, 547112, 665942, 658140, 558225, 437000, 303608, 161786, 136399, 279620, 359403, 162700, -240457, -722764, -1152493, -1441522, -1559351, -1450171, -1260505, -1129603, -1085749, -1199817, -1365097, -1294145, -931257, -473505, -93056, 179220, 387131, 523702, 469745, 179196, -124110, -257780, -213387, -83092, 82881, 326897, 651690, 939867, 1037554, 903837, 656969, 402706, 144640, -111085]
10706a11085k55709k54776k93389l54670l29903k30046j28780J0908K37314M06892
10696a303244L99828L06893J77571N6169P9574J05241P286q8551j05820p0175
10686d35228m931K8360j17188k68935k08649n3992J39347M04501N07512L70292
10676C61089K02642L1486j92308m27281m46993k21207J3105O4827l759L5653O6675
10665e16071K4811K8205M2970k0501m9020J15747M16084N11285J77399k31015
10655D99894k68387m4708J78064L70625L73209J46212n7743p7914r3384j67427
10645H58441j06951O7811O1133o6971N100J54229R4324j16486k69393k74386j85696
10634B21155k25124l80803m09654k59980o8389J01703K67324M33470L61642O2186
$$ y = [-111085, -366794, -621570, -914959, -1269629, -1599532, -1829578, -1958358, -1947450, -1710136, -1303244, -903416, -596523, -418952, -362783, -283209, -177968, -170682, -259233, -365053, -435228, -440159, -411799, -528987, -797922, -1006571, -1060563, -921216, -516715, -9203, 361089, 563731, 595217, 402909, -24372, -471365, -692572, -679467, -614640, -618399, -582746, -516071, -491260, -463055, -420085, -440586, -489606, -373859, 42225, 553510, 730909, 499894, 231507, 186799, 364863, 735488, 1108697, 1254909, 1197166, 1119252, 1025868, 858441, 751490, 819301, 880434, 813463, 818563, 972792, 1067116, 950630, 681237, 406851, 221155, -3969, -384772, -794426, -1054406, -1122795, -1021092, -753768, -320298, 41344, 103530]
10624A03530o4202m0544l4670p0710j52924j41955q7335r1480n0560m3295j08966
10613g83111j59143j62361p9961Q6117K67447L64321L31178J93895R523r8418
10603c0513j41429r4784M3539J76143K62251L06877K46542N6574p3435o9824o0016
10592F21925o2388r8381j97591l08439l86789m08303l36751k22812q8513M4381
10582a443661L2450o7602o9615R3698L48582M73838L65579J01875j17601j54426
10572d36883p2480K834P5547J85528J32457l8354j18051j81441k13895r5347J48632
10561f11453L41604L49731J97433N51o1044J4573J26660J79289J66088K11657
10551I15089K11787J2975j28888r6633j03243j84389k99868l96569l43014j69289
$$ y = [103530, 39328, -1216, -35886, -106596, -259520, -401475, -488810, -580290, -630850, -674145, -783111, -942254, -1104615, -1184576, -1098459, -831012, -466691, -135513, 58382, 67905, -30513, -171942, -266726, -223187, -47044, 215207, 522084, 768626, 825200, 751765, 681941, 621925, 559537, 461156, 263565, -44874, -431663, -839966, -1176717, -1399529, -1488042, -1443661, -1411211, -1478813, -1548428, -1454730, -1106148, -632310, -266731, -164856, -282457, -436883, -509363, -506529, -430982, -245454, -112997, -151351, -269402, -450843, -664738, -760085, -611453, -269849, 79882, 277315, 277866, 216822, 231395, 358055, 537344, 703432, 915089, 1126876, 1139851, 1010963, 914330, 811087, 626698, 326830, -69739, -412753, -582042]
10541e82042j14614j55685q0162N2806M3897o5592q8784J6394J90845L89091M92341
10530I8495M22006J47106k29908m46584m01604k66168j30627Q188O888n3743l9407
10519h85358J76521M31076L46853J9500k10793k61317j77448o8113m3362l9335
10509g11776J1468R7524O9149r5223j89372j56513n0376N9617J00130J45005K66082
10498d54285L30794K44059O6829j54146l31164l67203j92929r491R080q348J6712
10487h50092O7173J60239K05684J62752J03266Q3861P7359M3215K1236P1445J36458
10476B82596N9380o2423n3804M0947J98426J81836j28694l56663m46392m83000
10466g67791l53296j29038O2427K13836L06274K87696J00386n8789k6384P8486
$$ y = [-582042, -696656, -852341, -932503, -879697, -835800, -901392, -990176, -973782, -782937, -393846, 98495, 520501, 667607, 437699, -8885, -410489, -676657, -807284, -799096, -792208, -845951, -885358, -708837, -277761, 69092, 88592, -122201, -383518, -560966, -629079, -672441, -711776, -700308, -602784, -533635, -628858, -818230, -974743, -1025119, -965502, -865372, -720367, -454285, -123491, 120568, 187397, 33251, -297913, -665116, -858045, -867536, -858456, -866804, -850092, -782919, -622680, -416996, -254244, -150978, -67117, 10242, 53457, 74693, 146138, 282596, 341976, 279553, 225749, 266696, 465122, 646958, 518264, 161601, -284791, -767791, -1121087, -1250125, -1187698, -973862, -667588, -379892, -279506, -338295, -364679, -286193]
10456b86193K6532r3858q4290m0846L1916J61888K63464L34185L59146K49714
10446I21658r7582m75765n67638m07340j45142N1758N8171J04233J99007J19677
10436b38963q9143k66060k93521j89261p8185k9498p8885j33453r2730L1494K15709
10425a242496K74044J75406Q5052N6653O5883J06352J55285K02772J49419Q9720
10415A18090K73631N89449O51462M20788J27930r6348j53688j07221p0037o9884
10405A684172j18314k36258l88070l87340j77662J6164K2746j06033l03751l82668
10395c77014k09152O993N0011o6404k34401l46299k71787p7165O2243N2204o5486
10384a476257l5082K42365N02747M48958R9237j79453j01585J23127J57957O2190
$$ y = [-286193, -259661, -353519, -437809, -478655, -446739, -284851, -21387, 312798, 671944, 921658, 824076, 348311, -219327, -626667, -771809, -720051, -661880, -557647, -358640, -238963, -328106, -594166, -887687, -1076948, -1155133, -1184631, -1263516, -1396969, -1489699, -1458205, -1242496, -968452, -793046, -707994, -651341, -585458, -479106, -323821, -121049, 28370, 118090, 391721, 981170, 1632632, 2053420, 2181350, 2085002, 1931314, 1824093, 1754056, 1684172, 1565858, 1329600, 941530, 554190, 376528, 392692, 415438, 309405, 5654, -377014, -586166, -579173, -529162, -595566, -829967, -1176266, -1448053, -1525218, -1462975, -1410771, -1476257, -1511339, -1268974, -766227, -317269, -218032, -397485, -499070, -375943, -217986, -155796]
10374a55796L3459J05757J17556K1213q8123j26298j48783j65601j55392l8157
10364f00165J77956L46628L26463J63461J07969J77852J48715m6193j48100o4969
10354E89617o7325k26648k66896q0756J59702K07846Q0838N2719J39948J25417
10344G14462P3938N4616j6286l3239P9607P6178j57674k79465k33397j58084j44672
10333b4016j45030o0005o0564j21601o9945M9605J83600K79995K51552K11849
10323D95440K70455K70285R3089n3959p0561J7081J41094J59339K6634j66630
10313A182267l76130n32617n26729m10714j49948R8535R3004q023M3694J84741
10303d01920K65965K34746L3047j76715j41626J55974M19307M43044K59216k510
$$ y = [-155796, -122337, -16580, 100976, 122189, 34066, -92232, -241015, -406616, -562008, -600165, -422209, -75581, 250882, 414343, 522312, 700164, 848879, 802686, 654586, 589617, 522292, 295644, 28748, -52008, 107694, 315540, 396378, 449097, 589045, 714462, 788400, 843016, 826730, 793491, 873098, 949276, 791602, 512137, 278740, 120656, -24016, -169046, -229051, -289615, -411216, -481161, -431556, -247956, 32039, 283591, 495440, 765895, 1036180, 1129269, 1075310, 1004749, 1021830, 1162924, 1322263, 1348897, 1182267, 806137, 273520, -253209, -663923, -813871, -715336, -622332, -630355, -586661, -401920, -135955, 98791, 131838, -44877, -186503, -30529, 388778, 831822, 1091038, 1088528]
10293A088528j59396j86502j85859q4556L1404p690j99721l06949j92508r3239
10283b96488j19099j62534r2515P7912L01900M42256K81627q5544l37116l62814
10273c52415j93005L3572J27309J98338K58768J85116L9411l6298l9127l7496
10263A84173p3211M5343L53854N46872L72230J1049j69717k13682l57624m99071
10253B00216m34342k60755j59029j45478m1256J61898K38799J17979j01962k65406
10243f89336j67981P3132J94346J67112J01814K7552o4012j80646l14704m00418
10233a253141l62965j63385J45696L67833L72085K21690N7223m355O3263J99374
10223c56682M16069N48959M24057J70752l1722n5077M5982R8518P6031N5772j5699
$$ y = [1088528, 929132, 742630, 556771, 472215, 503619, 495929, 296208, -10741, -203249, -296488, -415587, -578121, -670636, -592724, -290824, 151432, 433059, 347515, 10399, -352415, -545420, -511848, -384539, -186201, 72567, 257683, 297094, 260796, 221669, 184173, 110962, 156305, 510159, 1057031, 1429261, 1440310, 1270593, 1056911, 699287, 200216, -234126, -494881, -653910, -799388, -840644, -678746, -439947, -321968, -423930, -689336, -857317, -784185, -589839, -422727, -320913, -293361, -357373, -538019, -852723, -1253141, -1616106, -1779491, -1633795, -1265962, -893877, -672187, -614964, -619319, -556056, -356682, 59387, 608346, 1032403, 1203155, 1171433, 1116356, 1162338, 1260856, 1336887, 1392659, 1376960]
10212A376960j01109j06338k0776P5162J00391L6415m8178j43889k56314k62724
10202F49600j40457K3416Q4861J21493J68655J49500Q4521m5280j04977o8499
10192I22833j48150m06734n83702m92027l90713l99059l35127j37233J17123M28082
10182a424707P37017P67820M50908P8532j06737j01177M5190J84476J25863k4418
10172G32767q2204Q138J58509J18398j02734j97675l5412J31005J95194K23634
10162A149620Q4120j80159l68131l70418k55715j17559J18721L92269M98483L74139
10152A325370L9420k26744j99435j05045p1236p2967o3733n2681o8376n7554J0138
10141D57157J43955L20576M09026K83451J57337O8427j00262q0464J63350L13190
$$ y = [1376960, 1275851, 1169513, 1148737, 1223899, 1324290, 1360705, 1312527, 1168638, 912324, 649600, 509143, 532559, 617420, 738913, 907568, 1057068, 1141589, 1096309, 991332, 922833, 774683, 367949, -215753, -707780, -1098493, -1497552, -1832679, -1969912, -1852789, -1424707, -687690, 80130, 531038, 609570, 502833, 401656, 446846, 631322, 757185, 732767, 650563, 658701, 817210, 935608, 832874, 635199, 599787, 730792, 925986, 1149620, 1233740, 1053581, 685450, 315032, 59317, -58242, 60479, 452748, 951231, 1325370, 1364790, 1138046, 938611, 833566, 762330, 689363, 625630, 572949, 504573, 447019, 457157, 601112, 921688, 1330714, 1614165, 1771502, 1839929, 1739667, 1659203, 1822553, 2135743]
10131B135743L13134L16414L33009L38949L49084L58400M26220N98183P67294
10122E936430R07273J134405J410189J787663K301137K699185K912208L140255
10114B2228745L737166M871534O276862P647286R003252J0323817J0396163P095902
10106H1580727j25713p867464j1831483j1682131r684991p677943o165035m820072
10098B1725895l527670k596577k055490j651925j350101j139758j004138r20817
$$ y = [2135743, 2448877, 2765291, 3098300, 3437249, 3786333, 4144733, 4570953, 5169136, 5936430, 6843703, 7978108, 9388297, 11175960, 13477097, 16176282, 19088490, 22228745, 25965911, 30837445, 37114307, 44761593, 53764845, 64088662, 74484825, 81580727, 81455014, 73587550, 61756067, 50073936, 40388945, 32711002, 26545967, 21725895, 18198225, 15601648, 13546158, 11894233, 10544132, 9404374, 8400236, 7479419]
$$ [...]
##END NTUPLES=NMR SPECTRUM
##END=
