##TITLE=31Pdec_SR128_rm1
 , 124 sc
 29.6.2022
##JCAMPDX= 6.0         $$ Bruker NMR JCAMP-DX V2.0
##DATA TYPE= NMR SPECTRUM
##DATA CLASS= NTUPLES
##ORIGIN= UXNMR, Bruker Analytische Messtechnik GmbH
##OWNER= root
$$ XWIN-NMR		Version 3.5
$$ Wed Jun 29 15:15:35 2022 Russian Standard Time (UT+4h)  she@DPX200
##.OBSERVE FREQUENCY= 81.013821
##.OBSERVE NUCLEUS= ^31P
##.ACQUISITION MODE= SIMULTANEOUS
##.ACQUISITION SCHEME= undefined
##.AVERAGES= 124
##.DIGITISER RES= 16
##SPECTROMETER/DATA SYSTEM= spect
##.PULSE SEQUENCE= zgpg30
##.SOLVENT NAME= CDCl3
##.SHIFT REFERENCE= (INTERNAL, CDCl3, 0, 248.564)
##AUDIT TRAIL= $$ (NUMBER, WHEN, WHO, WHERE, WHAT)
$$ ##TITLE= Audit trail, XWIN-NMR		Version 3.5
$$ ##JCAMPDX= 5.01
$$ ##ORIGIN= Bruker BioSpin GmbH
$$ ##OWNER= she
$$ F:/spectra/data/she/nmr/P31/1/pdata/1/auditp.txt
$$ ##AUDIT TRAIL=  $$ (NUMBER, WHEN, WHO, WHERE, WHAT)
(   1,<2022-06-29 15:14:05.62 +0400>,<she>,<DPX200>,
      <continue with go, POWCHK disabled, PULCHK disabled
       configuration hash MD5:
       00 E9 B6 7A A2 85 ED C7 34 08 36 98 17 FE 4E 26
       data hash MD5: 32K
       BF 01 D3 8B 82 46 22 16 0E 3A A3 58 7E B8 0E 42>)
(   2,<2022-06-29 15:14:37.32 +0400>,<she>,<DPX200>,
      <Start of raw data processing
       efp BC_mod = 2 LB = 1 FT_mod = 6 PKNL = 1 PHC0 = -10447.35 PHC1 = 1413.256 SI = 64K 
       data hash MD5: 64K
       04 92 1D 3A 7E C3 54 5A 2C 4E F4 34 98 F5 FA 48>)
(   3,<2022-06-29 15:15:07.64 +0400>,<she>,<DPX200>,
      <pk PHC0 = 0.6509586 PHC1 = 2.799987 
       data hash MD5: 64K
       24 82 CB 29 0A FA 73 1A 45 2E 77 66 BA 71 D5 AE>)
(   4,<2022-06-29 15:15:10.95 +0400>,<she>,<DPX200>,
      <abs ABSG = 5 
       data hash MD5: 64K
       6A 9B 2A F7 96 A7 3A 97 41 4F 1E 8E 96 79 75 D7>)
$$ ##END=
$$ 
$$ hash MD5
$$ F8 F0 58 49 00 9E 08 74 42 C7 54 13 CF 5A 7E 70
##$RELAX= 
##$RELAX= 
##$RELAX= 
##$RELAX= 
##$RELAX= 
##$RELAX= 
##$RELAX= 
##$RELAX= 
$$ Bruker specific parameters
$$ --------------------------
##$DU= <F:/spectra>
##$EXPNO= 1
##$NAME= <P31>
##$PROCNO= 1
##$TYPE= <nmr>
##$USER= <she>
##$AMP= (0..31)
100 100 100 100 100 100 100 100 100 100 100 100 100 100 100 100 100 100 
100 100 100 100 100 100 100 100 100 100 100 100 100 100 
##$AQSEQ= 0
##$AQ_mod= 1
##$AUNM= <au_zg>
##$AUTOPOS= <>
##$BF1= 81.014009
##$BF2= 200.13
##$BF3= 200.13
##$BF4= 200.13
##$BF5= 200.13
##$BF6= 200.13
##$BF7= 200.13
##$BF8= 200.13
##$BYTORDA= 1
##$CFDGTYP= 0
##$CFRGTYP= 5
##$CHEMSTR= <none>
##$CNST= (0..31)
1 1 145 1 1 1 1 1 1 1 1 1 1 1 1 1 1 1 1 1 1 1 1 1 1 1 1 1 1 1 1 1 
##$CPDPRG= <waltz16>
##$CPDPRG1= <>
##$CPDPRG2= <waltz16>
##$CPDPRG3= <>
##$CPDPRG4= <mlev>
##$CPDPRG5= <mlev>
##$CPDPRG6= <mlev>
##$CPDPRG7= <mlev>
##$CPDPRG8= <mlev>
##$CPDPRGB= <>
##$CPDPRGT= <>
##$D= (0..31)
0 1 0 0 0 0 0 0 0 0 0 0.03 2e-05 3e-06 0 0 0 0 0 0 0 0 0 0 0 0 0 0 0 0 
0 0 
##$DATE= 1656501010
##$DBL= (0..7)
120 120 120 11 120 120 24 19 
##$DBP= (0..7)
150 150 150 150 150 150 150 150 
##$DBP07= 0
##$DBPNAM0= <>
##$DBPNAM1= <>
$$ [...]
##$SUBNAM3= <"">
##$SUBNAM4= <"">
##$SUBNAM5= <"">
##$SUBNAM6= <"">
##$SUBNAM7= <"">
##$SUBNAM8= <"">
##$SUBNAM9= <"">
##$SW= 501.771253377433
##$SWIBOX= (0..15)
0 1 3 0 0 0 0 0 0 0 0 0 0 0 0 0 
##$SW_h= 40650.406504065
##$TD= 32768
##$TD0= 1
##$TE= 0
##$TE2= 300
##$TE3= 300
##$TEG= 300
##$TL= (0..7)
0 120 53 12 22 120 120 120 
##$TP= (0..7)
150 150 150 150 150 150 150 150 
##$TP07= 0
##$TPNAME0= <>
##$TPNAME1= <>
##$TPNAME2= <>
##$TPNAME3= <>
##$TPNAME4= <>
##$TPNAME5= <>
##$TPNAME6= <>
##$TPNAME7= <>
##$TPOAL= (0..7)
0.5 0.5 0.5 0.5 0.5 0.5 0.5 0.5 
##$TPOFFS= (0..7)
0 0 0 0 0 0 0 0 
##$TUNHIN= 0
##$TUNHOUT= 0
##$TUNXOUT= 0
##$USERA1= <user>
##$USERA2= <user>
##$USERA3= <user>
##$USERA4= <user>
##$USERA5= <user>
##$V9= 5
##$VALIST= <valist>
##$VCLIST= <CCCCCCCCCCCCCCC>
##$VD= 0
##$VDLIST= <DDDDDDDDDDDDDDD>
##$VPLIST= <PPPPPPPPPPPPPPP>
##$VTLIST= <TTTTTTTTTTTTTTT>
##$WBST= 1024
##$WBSW= 4
##$XGAIN= (0..3)
0 0 0 0 
##$XL= 0
##$YL= 0
##$YMAX_a= 27918
##$YMIN_a= -38568
##$ZGOPTNS= <>
##$ZL1= 120
##$ZL2= 120
##$ZL3= 120
##$ZL4= 120
##$ABSF1= 248.5645
##$ABSF2= -253.2056
##$ABSG= 5
##$ABSL= 3
##$ALPHA= 0
##$AQORDER= 0
##$ASSFAC= 0
##$ASSFACI= 0
##$ASSFACX= 0
##$ASSWID= 0
##$AUNMP= <proc_1d>
##$AZFE= 0.1
##$AZFW= 0.5
##$BCFW= 0
##$BC_mod= 2
##$BYTORDP= 0
##$COROFFS= 0
##$CY= -3
##$DATMOD= 1
##$DC= 0
##$DFILT= <>
##$DTYPP= 0
##$F1P= 0
##$F2P= 0
##$FCOR= 1
##$FTSIZE= 65536
##$FT_mod= 6
##$GAMMA= 0
##$GB= 0
##$INTBC= 1
##$INTSCL= 5.30512e-09
##$ISEN= 30
##$LB= 1
##$LEV0= 0
##$LPBIN= 0
##$MAXI= 10000
##$MC2= 0
##$MEAN= 0
##$ME_mod= 0
##$MI= 50
##$NCOEF= 0
##$NC_proc= -3
##$NLEV= 6
##$NOISF1= 182.463
##$NOISF2= 159.3651
##$NSP= 0
##$NTH_PI= 0
##$NZP= 0
##$OFFSET= 248.5645
##$PC= 4
##$PHC0= -10446.7
##$PHC1= 1416.056
##$PH_mod= 1
##$PKNL= yes
##$PPARMOD= 0
##$PSCAL= 0
##$PSIGN= 0
##$REVERSE= no
##$SF= 81.014009
##$SI= 65536
##$SIGF1= 159.3651
##$SIGF2= -187.1042
##$SINO= 113.3802
##$SIOLD= 16384
##$SREGLST= <1H.CDCl3>
##$SSB= 0
##$STSI= 65536
##$STSR= 0
##$SW_p= 40650.406504065
##$SYMM= 0
##$S_DEV= 0
##$TDeff= 32768
##$TDoff= 0
##$TI= <>
##$TILT= no
##$TM1= 0
##$TM2= 0
##$TOPLEV= 0
##$USERP1= <user>
##$USERP2= <user>
##$USERP3= <user>
##$USERP4= <user>
##$USERP5= <user>
##$WDW= 1
##$XDIM= 65536
##$YMAX_p= 274880589
##$YMIN_p= -13798059
$$ End of Bruker specific parameters
$$ ---------------------------------
##NTUPLES= NMR SPECTRUM
##VAR_NAME=  FREQUENCY,     SPECTRUM/REAL,   SPECTRUM/IMAG
##SYMBOL=    X,             R,               I
##VAR_TYPE=  INDEPENDENT,   DEPENDENT,       DEPENDENT
##VAR_FORM=  AFFN,          ASDF,            ASDF
##VAR_DIM=   65536,         65536,           65536
##UNITS=     HZ,            ARBITRARY UNITS, ARBITRARY UNITS
##FACTOR=    0.620285442955139, 1,           1
##FIRST=     20137.2065510759, 0,            0
##LAST=      -20513.1999529892, 0,           0
##MIN=       -20513.1999529892, -13798059,   0
##MAX=       20137.2065510759, 274880589,    0
$$ Real data points
##PAGE= N=1
##DATA TABLE= (X++(R..R)), XYDATA
$$ [...]
62925 171959 483521 365892 -22175 -262825 -249411 -200163 -234154 -237872 -124803 37964
62915 37964 187863 333265 423972 357632 175015 64019 91987 104397 -17483 -162356
62905 -162356 -174279 -89945 -39457 -11804 114850 353660 561072 599445 455109 211636
62895 211636 -24190 -194255 -328927 -461715 -490753 -267477 98612 209400 -157091 -686093
62885 -686093 -877662 -679836 -482511 -499209 -496924 -246090 83819 205788 166150 232572
62875 232572 451757 603329 564656 466716 450744 473930 427021 296583 144031 39813
62865 39813 64394 250542 469798 504770 312976 102828 54735 77929 -33565 -289441
62855 -289441 -488914 -470701 -248491 60784 302022 305838 25097 -318822 -386335 -96609
62845 -96609 260491 372156 260543 191203 305504 475612 500234 326249 59552 -160115
62835 -160115 -263073 -277186 -275360 -270396 -168873 117883 504136 732802 609386 221952
62825 221952 -125971 -212422 -76419 117132 298852 477623 569780 440364 154051 -14193
62815 -14193 63160 178513 127021 43997 142794 268367 79723 -365642 -612692 -453545
62805 -453545 -172906 -19177 154580 478914 677989 447533 -38253 -356317 -378518 -260754
62795 -260754 -91575 93559 132853 -48147 -209214 -159334 -137768 -377004 -522904 -110190
62785 -110190 524987 553832 -89000 -536155 -280477 122242 17319 -367999 -435382 -173688
62775 -173688 -13352 -91080 -220035 -323058 -396197 -284554 42330 244178 96699 -56695
62765 -56695 160470 469471 369568 -3070 -122030 12639 -53500 -326180 -319510 35478
62755 35478 216471 8326 -157384 -4632 145701 59406 48830 337138 566583 432323
62745 432323 283281 540034 946894 995176 753769 666308 764089 701275 438887 300186
62735 300186 376667 396966 209965 -31570 -186217 -246712 -164706 74595 233803 66658
62725 66658 -248684 -325181 -189454 -234357 -529546 -674504 -449046 -130883 10269 78718
62715 78718 183912 144950 -128912 -342417 -255359 -104069 -199265 -373119 -260637 58701
62705 58701 166323 -34253 -210453 -157789 -55678 -94798 -202238 -257192 -289412 -322159 -254408
62694 -254408 -50818 130583 136599 7721 -128728 -219624 -262599 -264510 -291342 -401448 -466564
62683 -466564 -259279 175581 447731 278895 -146710 -457452 -530376 -446905 -218188 139972
62673 139972 388860 278384 -51776 -212639 -121010 -83795 -267898 -428981 -315053 -40308
62663 -40308 140717 180382 138686 -32271 -330074 -504606 -336919 -23788 33592 -198931
62653 -198931 -337739 -147592 129531 141125 -96432 -263061 -159706 106493 322367 408575
62643 408575 426301 424710 356304 159821 -114899 -328988 -405330 -389907 -348068 -290417 -239629
62632 -239629 -255874 -312290 -257788 -30380 181964 151118 -69760 -196633 -74440 158016
62622 158016 266271 152799 -118330 -402716 -550420 -500563 -341592 -220579 -189350 -195581
62612 -195581 -203123 -242601 -346303 -486114 -566118 -468144 -179280 109251 162161 9866 -74179
62601 -74179 6359 769 -266164 -548250 -534449 -343463 -299490 -362139 -216992 114201 225971
62590 225971 -33819 -311793 -285713 -76900 62375 130742 209948 204409 25057 -168327
62580 -168327 -169398 -34064 27857 -35797 -87070 9553 269643 554339 598347 251064 -244749
62569 -244749 -434695 -199874 116478 209750 133856 -7922 -315138 -773964 -1028139 -819591
62559 -819591 -415988 -244805 -303900 -298373 -179484 -141129 -200242 -196549 -153860 -239021 -365846
62548 -365846 -228026 210998 589067 596773 304627 -21352 -194654 -145967 87277 336075
62538 336075 433005 402316 371465 324795 139870 -155427 -375661 -425254 -362242 -239232 -82003
62527 -82003 8211 -47440 -129355 -57686 126681 236204 231162 195556 100954 -103950 -237327
62516 -237327 -75914 224241 290612 133475 152948 464209 669684 487406 179895 86862
62506 86862 98515 -64420 -320730 -354134 -111641 162657 312562 400672 481907 483190 342256
62495 342256 132100 7914 49116 129535 4087 -347718 -553789 -276850 241384 414880
62485 414880 115879 -177965 -152805 -88452 -253931 -354718 -21992 510557 738852 655071
62475 655071 639064 735859 618633 246994 6306 97735 258848 223153 49397 -140659
62465 -140659 -352298 -480274 -279401 193888 463823 241542 -146511 -240061 -87063 -43609
62455 -43609 -142093 -94093 152828 297582 183708 46731 118291 269825 249943 71902
62445 71902 -69356 -144042 -290587 -487689 -473621 -98343 407449 671797 608675 437994
62435 437994 313974 148862 -120386 -296936 -153021 205210 425055 345532 142641 14791
62425 14791 -57027 -149051 -204852 -161741 -109236 -139177 -161072 -69646 9831 -103590 -283624
62414 -283624 -206653 147069 404231 320541 111257 82452 187951 209396 175296 271167 437016
62403 437016 406608 139805 -113937 -229758 -362711 -585172 -686793 -527457 -326461 -348179
62393 -348179 -484833 -425117 -126928 145518 209147 149585 125803 182136 273044 331878 306504
62382 306504 225367 193374 236653 244839 181264 205634 403864 555745 446824 288833 474594
62371 474594 952425 1230431 1051023 675937 384561 83199 -360914 -734013 -734991 -402280
62361 -402280 4311 366181 663397 738050 443836 -36510 -334222 -340048 -255441 -237449
62351 -237449 -265607 -342407 -521859 -696887 -653029 -423434 -312745 -439521 -526032 -330079
62341 -330079 -35657 48403 -16291 62401 271905 278905 -17487 -275829 -206470 22460 104904
62330 104904 89210 239965 542263 701523 626404 568283 697342 844391 806586 643192
62320 643192 489017 323891 152066 171901 467405 715086 550808 119211 -110668 -19769
62310 -19769 64501 -46520 -135257 -4639 198372 260677 205788 140831 64391 862 75830
62299 75830 281889 412838 398903 439593 619405 700922 548566 438007 612911 824592
62289 824592 712633 398394 241555 200292 -40990 -417510 -533555 -368364 -348525 -598493
62279 -598493 -683201 -327496 119470 258780 233862 344375 431670 143680 -394556 -668731
62269 -668731 -463883 -50467 283612 488955 532526 328698 8338 -88817 130519 330588
62259 330588 208606 -89659 -237990 -221154 -275410 -438989 -474485 -268492 -47724 -75570
62249 -75570 -296116 -423002 -302233 -62175 69761 10776 -110703 -81202 183878 509943
62239 509943 589083 306172 -90043 -229594 -30744 228834 275636 167159 155964 282644
62229 282644 270574 -81429 -508352 -493267 66289 613292 569076 95050 -110608 216901
62219 216901 551681 388556 6811 4324 345673 453663 180385 46470 350168 632579
62209 632579 392809 -125348 -334299 -171825 -44508 -92198 -69470 77273 53424 -259940
62199 -259940 -567785 -604476 -450531 -243248 71196 468302 643890 387755 -44853 -231470
62189 -231470 -118213 10921 -8737 -76914 -88329 -68914 -42365 19487 83375 70748 10631
62178 10631 11618 62147 27351 -123096 -252094 -269560 -252292 -292856 -380679 -486947 -596397
62167 -596397 -590330 -311349 131644 347944 152452 -132398 -117948 87445 91825 -129668
62157 -129668 -216894 -41812 108530 67126 61402 250671 407184 351020 319535 522735 672363
62146 672363 437162 102667 196560 596918 651426 190924 -221521 -200414 -78200 -248901
62136 -248901 -514110 -489981 -250885 -109998 -51135 157534 469170 609054 513464 354548
62126 354548 221709 108343 106920 264590 328114 5104 -548913 -856223 -731646 -443372
62116 -443372 -251527 -131505 -19114 834 -115788 -242002 -268127 -237980 -217443 -206319
62106 -206319 -235224 -355272 -474262 -406972 -163965 3726 -64160 -236365 -307598 -250474
62096 -250474 -154473 -62558 22452 73274 67280 14263 -72856 -161288 -173290 -87967 -25474 -83054
62084 -83054 -143041 -36514 154910 203325 112425 106911 231160 274670 170063 139597 306005
62073 306005 460298 401736 235794 122019 -12154 -243273 -368545 -175993 149005 229931
62063 229931 52774 -13210 230162 521626 507866 201888 -60689 -31769 194633 330900
62053 330900 242963 92886 99237 229512 276792 216377 252089 425848 441137 91582 -329406
62042 -329406 -351773 19773 301391 204401 9437 129836 532260 810010 723494 439141
62032 439141 229477 135558 31692 -95436 -100959 89085 349025 514631 559898 525669
62022 525669 385787 135225 -60197 462 261072 430813 346260 159248 99589 185314
62012 185314 248764 143633 -147336 -516654 -779326 -803075 -644255 -472521 -342227 -166160
62002 -166160 50598 119506 -85972 -416654 -590582 -476741 -181932 45034 -33053 -423489
61992 -423489 -777368 -673065 -135295 324915 334007 107782 69129 225469 251521 76754
61982 76754 463 183654 378303 319131 125296 91916 235007 283920 82775 -212017
61972 -212017 -371902 -370165 -320800 -255376 -117018 40504 19009 -264301 -588014 -635880 -362302
61961 -362302 -24128 142573 148851 137546 167787 175455 74437 -143332 -355154 -357380 -60779
61950 -60779 348788 542975 380453 38503 -189436 -155639 60351 228335 142635 -164219
61940 -164219 -399967 -323527 -43450 130925 79476 -66670 -186391 -250285 -181362 74338
61930 74338 331853 340709 218717 358324 793781 1040235 763680 266862 44816 147142
61920 147142 274933 269446 196992 137629 172478 402579 718830 762651 406868 53641 111988
61909 111988 389756 405853 132871 -34410 41677 80852 -85023 -263018 -253758 -82659
61899 -82659 193267 558613 847072 824962 563894 399755 417856 317433 -75564 -499188
61889 -499188 -651647 -602481 -581864 -598958 -514574 -323479 -137718 -2426 94259 126932 91231
61878 91231 62945 93418 153771 256713 472965 726455 763735 488774 163463 75186 131037
61867 131037 17697 -293795 -453222 -190345 314051 633615 597809 467798 589572 952287
61857 952287 1188846 1009107 510687 4297 -336974 -533467 -622400 -609628 -547629 -492753
61847 -492753 -414794 -290000 -217229 -274242 -344671 -296408 -233753 -299386 -311316 41474 642941
61836 642941 981894 831822 530236 437644 480314 438561 352062 358106 391610 348163 344404
61825 344404 519130 733059 752553 608560 511050 524448 577679 661551 739138 598918 137599
61814 137599 -295952 -222786 290329 644568 484797 127742 58871 287874 444193 336062
61804 336062 141594 84716 150151 187085 158275 159890 218090 196265 -9474 -257928 -293372
61793 -293372 -80783 155102 259326 319835 419074 429581 243846 33625 35076 186068
61783 186068 238022 159526 148203 258934 309970 206511 95465 106584 156063 106866 -58148
61772 -58148 -299298 -559537 -667342 -441622 -24766 141361 -119026 -397630 -231831 213794
61762 213794 348858 -20830 -456470 -542226 -420328 -465880 -689329 -766039 -562374 -337075
61752 -337075 -376331 -632265 -820787 -760318 -513406 -254957 -94545 -21125 30463 70495
61742 70495 17943 -183029 -401441 -364426 44324 571454 801695 606989 289096 212480
61732 212480 379312 481343 343954 177016 313214 770160 1174971 1135144 631683 26713
61722 26713 -280822 -181077 126227 363238 386632 210845 -77508 -355388 -460840 -286017
61712 -286017 67332 310328 244833 -11950 -168009 -95958 65817 131624 66879 -35164
61702 -35164 -48131 121662 406924 500420 123076 -540378 -909848 -677718 -187505 61916
61692 61916 45380 36449 35633 -169650 -473313 -494042 -199366 691 -83227 -133335 86679
61681 86679 308813 232894 28814 -4037 42409 -88025 -317347 -375148 -245261 -79390
61671 -79390 142138 450245 580836 303752 -84917 -111036 130923 131344 -168178 -270293
61661 -270293 30357 306924 230136 88777 250014 540901 561543 312944 133937 198794
61651 198794 381954 490525 412644 168907 -33624 25977 245590 280553 75324 -13521
61641 -13521 189598 340191 131788 -155718 -77602 264543 399943 224008 80517 162695
61631 162695 286543 294984 280940 308616 258780 95586 9561 127650 290771 290270 169542
61620 169542 115648 153922 139095 30077 -7345 135301 252558 26088 -485829 -781302
61610 -781302 -528034 -71962 -12441 -345330 -454439 -34862 436722 414252 70719 -21158
61600 -21158 264413 526858 484754 278111 148040 170080 321631 516295 554855 309570
61590 309570 -33837 -167270 -78420 -11617 -35132 31033 220851 290050 91707 -199932
61580 -199932 -383098 -498307 -636606 -688075 -488476 -95020 262908 441803 465244 406192
61570 406192 304597 182586 67285 -7212 -13143 35561 81708 96902 117834 169306 222659
61559 222659 288561 439269 642792 719921 620727 583099 785285 985793 821577 377293
61549 377293 88772 90350 64294 -170022 -326871 -127752 228935 355238 197620 -15149
61539 -15149 -174320 -338595 -483294 -502396 -436114 -441303 -521377 -502631 -315211 -105237 -4470
61528 -4470 45657 146676 248503 225707 80417 -54643 -101565 -118328 -169783 -209951 -163058
61517 -163058 -64729 -20809 -35780 4958 143983 247297 171577 -34351 -188872 -196252 -114332
61506 -114332 -30497 32700 80845 92979 42627 -40214 -47359 124264 417458 588788 449465
61495 449465 117597 -105000 -99637 -1571 87522 200380 259416 48883 -396024 -676027
61485 -676027 -553254 -308001 -264152 -250293 38794 378986 268647 -237681 -521025 -277101
61475 -277101 131782 332218 418183 540053 505794 155655 -219326 -227026 81989 357739
61465 357739 447735 429260 316205 83860 -108196 -47627 202678 372874 362863 316974
61455 316974 339828 366431 331187 271117 225119 178015 131102 113616 117482 118090 144625 233307
61443 233307 335638 366946 313733 207908 55788 -95867 -92059 171501 535673 677981
61433 677981 461650 83643 -155993 -153440 -42367 -2367 -72034 -140286 -103814 -4172 34406
61422 34406 -14861 -48857 2926 80410 99961 67574 29206 -8321 -50343 -90824 -164289 -319113
61410 -319113 -481815 -475321 -264479 -53194 -11724 -35013 57794 192897 139653 -103684 -276281
61399 -276281 -252363 -235995 -428256 -678810 -664139 -331270 33019 166309 86088 -48789
61389 -48789 -144378 -132903 105364 586093 1066879 1259442 1172587 1043859 955476 776778
61379 776778 506994 351110 336177 191436 -169742 -375443 -124877 285615 373517 199597
61369 199597 212556 482900 611551 402949 126451 18690 -18820 -97255 -136919 -131474 -209262
61358 -209262 -273786 -2853 594857 1038654 1027955 828186 742432 629345 293668 -47929
61348 -47929 -114039 -37801 -62248 -65117 135424 284816 57476 -277990 -156156 403405 792450
61337 792450 700468 457800 413462 481649 470911 432659 469625 519408 513518 494527 444790
61326 444790 254183 -28187 -165564 -64941 115408 284324 555023 922192 1090963 848197
61316 848197 399081 112811 74249 80361 -30614 -226957 -385609 -395140 -203400 119138
61306 119138 389312 463927 368070 238094 165755 113510 -34549 -308892 -520076 -387169
61296 -387169 111123 624449 807697 703669 582703 529735 440325 338603 383542 549393
61286 549393 593967 411641 174209 49692 -616 -77383 -192994 -312219 -353666 -152372
61276 -152372 333727 781673 780642 402356 151830 247521 333001 101104 -185686 -132358
61266 -132358 129483 140084 -182064 -449513 -395182 -188776 -101750 -143048 -152245 -70756 15638
61255 15638 23109 -32248 -61585 -1564 105268 143825 53318 -112446 -252837 -285810 -153318
61244 -153318 124937 376903 390955 169634 -48509 -90992 -43934 -52172 -75628 5400 154108
61233 154108 228775 214664 223425 268585 211680 -16797 -266587 -330089 -208897 -128654 -263182
61222 -263182 -502488 -584199 -458505 -387327 -574974 -820140 -742822 -323109 34772 41814
61212 41814 -107368 -60126 180711 296431 131386 -105026 -153377 -33738 59966 83101
61202 83101 168364 321589 304856 -6504 -302245 -175768 241396 365852 14178 -238944
61192 -238944 133641 798564 1021003 705815 417182 449792 500731 345944 235081 364290
61182 364290 460907 233303 -140042 -310300 -251704 -141437 -9060 185315 350364 432277
61172 432277 574074 838870 997971 869141 634258 530820 468936 277619 92726 127028
61162 127028 248179 171120 -77799 -249130 -277323 -259901 -204615 -145420 -287770 -633275
61152 -633275 -720666 -257939 228896 20138 -679964 -982331 -629909 -273938 -326783 -386826
61142 -386826 -124886 54624 -240783 -626200 -544166 -161871 -6702 -47845 167825 646629
61132 646629 884377 645029 238356 -16835 -118560 -104850 94276 394356 519553 384678
61122 384678 216640 159363 46302 -260828 -555750 -533494 -207087 120955 232527 189568
61112 189568 183203 284601 355694 200959 -169818 -482443 -493292 -289315 -147345 -132896
61102 -132896 -50086 180359 335324 215382 -34588 -126739 -33628 29280 -28931 -63124 17111
61091 17111 65858 -63376 -251538 -259714 -72171 88525 79790 -12533 -89518 -210611 -419351
61080 -419351 -550325 -409875 -76730 188026 307550 443279 657706 765428 633581 428180
61070 428180 387099 478687 469371 256714 -28862 -207453 -191686 10919 293857 476690
61060 476690 467158 377561 360028 368808 241287 -6417 -147094 -39684 196185 357776 380431
61049 380431 319537 228851 134197 46490 -57288 -194935 -291600 -232280 -43192 95219 82444
61038 82444 28523 61181 115561 42284 -153898 -319386 -349087 -254578 -78514 118626 203496
61027 203496 53812 -264313 -510241 -507907 -312001 -128662 -135585 -360162 -635558 -692751
61017 -692751 -426618 -74290 28068 -105971 -108197 199805 475532 293097 -224262 -507921
61007 -507921 -279567 99849 128856 -201061 -454379 -319191 74881 388797 449112 326650
60997 326650 155190 -357 -96592 -47824 185095 460595 533658 332718 76331 24329
60987 24329 178933 339861 386660 350385 247849 50996 -153065 -181700 -22442 102541
60977 102541 45124 -72019 -101688 -128748 -278908 -424344 -346174 -117516 -43318 -213350
60967 -213350 -378370 -338740 -225988 -273401 -471579 -598679 -506140 -257261 -23072 88279
60957 88279 121683 212368 393644 496398 339520 2820 -225633 -184855 23652 257697
60947 257697 506359 757349 874661 765591 558716 452821 449758 388342 216103 81427
60937 81427 125815 278799 319419 126411 -169595 -326980 -294801 -283966 -455337 -647172
60927 -647172 -597252 -365858 -270419 -388248 -436608 -257907 -105781 -230575 -450925 -431745
60917 -431745 -193855 -27282 -33599 -80714 -110705 -148694 -77457 216434 486149 320733 -230803
60906 -230803 -616158 -492813 -131769 59254 66423 80842 85565 -47330 -240785 -304255 -227696
60895 -227696 -133585 -48217 43634 39214 -125026 -255366 -116409 199662 392312 389326 368419
60884 368419 359884 159440 -280746 -660281 -679054 -388113 -61992 134432 241891 387859
60874 387859 659025 992550 1143524 883821 294673 -251315 -453695 -331679 -98199 63976
60864 63976 65240 -87180 -276012 -385508 -451854 -553016 -561319 -257595 251934 531162 382002
60853 382002 139939 181562 389118 395538 161807 -38224 -91529 -140008 -235071 -240421 -108460
60842 -108460 41246 163357 332150 494568 459348 223055 41298 51173 65646 -102061
60832 -102061 -321956 -337626 -117119 155769 320741 333457 238018 169428 257703 419160
60822 419160 395123 119692 -134520 -139753 -43006 -89867 -211039 -190663 -114727 -278919 -670341
60811 -670341 -910700 -789678 -525431 -363396 -222047 48977 298848 249475 -71576 -337316
60801 -337316 -341806 -207598 -152161 -210454 -246962 -145215 66119 230603 202773 18444 -98542
60790 -98542 18257 245558 302363 133093 14683 183445 469400 476571 105104 -295443
60780 -295443 -367061 -184410 -110731 -299286 -524019 -514469 -296855 -129509 -196533 -434826
60770 -434826 -605783 -504930 -171636 95790 42430 -206785 -274296 -58835 72517 -205116
60760 -205116 -652483 -729223 -302611 197986 343732 148455 -114791 -269112 -262173 -59602
60750 -59602 278660 527535 493316 242994 17098 -40293 28726 107418 98737 -33672 -211844
60739 -211844 -276245 -167340 -28095 -35661 -179196 -288488 -225226 31953 402908 700147
60729 700147 714125 457298 227910 240064 278497 -14855 -534052 -709306 -224098 538432
60719 538432 956886 882322 658947 572570 563721 479546 348983 292922 302007 239068 32488
60708 32488 -210578 -293616 -114425 237171 556336 691592 629476 439123 198707 -3300
60698 -3300 -64920 61091 307815 536338 628824 548857 369439 248219 287970 391086 356159
60687 356159 172296 87529 276202 562121 638458 479201 332585 339879 375241 288019 106244
60676 106244 -63877 -173988 -194852 -91286 83429 205681 273979 437755 735224 951357
60666 951357 873390 570408 279045 117926 64070 105038 223712 292659 183919 -16884
60656 -16884 -64060 165352 551384 874473 968930 780567 421959 152913 158571 347596
60646 347596 491295 522292 534434 533068 417764 238959 226774 454142 665238 587185 277051
60635 277051 10427 -71363 -43999 2481 69475 137662 96145 -119956 -371054 -403270 -141754
60624 -141754 183827 309689 279433 336795 478963 387752 -53258 -442027 -334898 141359
60614 141359 478493 466915 332127 267918 232303 209683 278790 365587 303852 196863 318462
60603 318462 588751 606152 315366 129523 196910 114734 -310994 -598466 -343439 77925
60593 77925 119870 -74510 -73017 -11761 -282135 -641533 -502823 -1873 112957 -298306
60583 -298306 -540145 -264416 -13638 -218948 -448329 -193613 229434 218889 -113629 -162644
60573 -162644 189662 451296 320668 79465 115472 416935 658708 605172 359768 268494
60563 268494 533666 923869 1020186 746329 407102 186795 -38782 -299504 -357852 -147611
60553 -147611 13713 -66125 -101473 184635 564962 674039 559581 464701 348533 71236
60543 71236 -189419 -181044 -40541 -48842 -109179 41838 278406 273650 110982 152284 388485
60532 388485 493415 457882 558511 720264 574535 205343 138740 437686 518484 131302
60522 131302 -176868 30509 349991 224678 -170469 -311587 -186887 -159412 -254177 -203700
60512 -203700 -46875 -96749 -357930 -480886 -308821 -50868 110177 211622 280956 241171
60502 241171 97933 -30813 -84513 -51867 136443 454756 619757 398904 18006 -85722
60492 -85722 109559 197189 -24971 -285420 -291349 -108966 37927 60223 -38214 -235248 -391780
60481 -391780 -313303 -30604 201449 274854 344428 484450 542255 484940 553415 828363 956747
60470 956747 639144 143053 -47273 83281 154160 37415 -21604 69916 69310 -123519 -205755
60459 -205755 70837 473821 601603 427798 248187 202979 148576 -16776 -162224 -115742
60449 -115742 132628 470382 754238 821524 586015 216069 57134 232881 447283 359867
60439 359867 57701 -81300 50462 167989 99207 84318 346686 632114 533366 138691
60429 138691 -59644 98393 230430 65247 -122327 -9359 200572 108549 -203389 -296529
60419 -296529 -75099 128002 178055 350351 764236 1060366 914524 522711 265183 174863
60409 174863 79906 27246 160298 334052 275678 54599 -14051 98011 110557 -42259
60399 -42259 -103227 10955 47409 -82346 -72139 249079 549355 503673 347948 498426
60389 498426 842117 882096 495831 84845 -45239 -32559 -92788 -175485 -161825 -127279 -189754
60378 -189754 -260930 -150078 148417 400517 356583 7781 -347571 -344426 44278 416161
60368 416161 407341 167477 134375 389787 555690 372313 43122 -136874 -191408 -282399
60358 -282399 -361479 -270508 -39910 164732 293034 385270 392474 253248 88086 84672 208668
60347 208668 235075 70736 -133878 -209027 -150850 -70027 -80264 -229871 -423343 -437701 -154226
60336 -154226 248673 473985 451723 359242 332683 340302 333741 327509 298893 190801 54093
60325 54093 12011 43552 -4013 -124078 -85338 223991 580065 717937 689916 726608 831638
60314 831638 743575 318727 -217134 -486766 -378457 -176756 -240580 -559179 -725692 -440504
60304 -440504 69188 327525 235650 126406 183286 182923 -21297 -144961 72233 361284
60294 361284 310290 64396 134887 571941 862052 727561 514893 585427 777732 775764
60284 775764 631035 548423 451978 190272 -32368 103260 451017 526073 228104 -591
60274 -591 145877 394843 352152 98629 22652 206840 307356 81300 -197174 -29035
60264 -29035 632237 1185947 1032752 334235 -156556 -72885 117095 -126100 -565975 -568376
60254 -568376 -107050 202229 53662 -166901 -89261 128833 263534 471599 882591 1166605
60244 1166605 970405 486828 147063 2527 -137977 -203130 -11286 240095 185286 -86545
60234 -86545 -147112 64921 182827 65955 -30631 -10637 -101869 -314937 -286629 85020 341650
60223 341650 119287 -310181 -490655 -413085 -332255 -264123 -65063 200929 338174 312955
60213 312955 194291 -12022 -211917 -145326 233225 535852 444724 190637 134997 125042
60203 125042 -219417 -730744 -798712 -267733 317622 491019 416042 465383 648462 721626
60193 721626 596091 383612 201224 111769 136198 215197 274402 358302 521028 578695 250478
60182 250478 -358374 -704258 -430853 162431 492847 390050 203516 294047 616089 810818
60172 810818 607806 116371 -267183 -270390 -30200 112778 39873 -86278 -134970 -141628 -114100
60161 -114100 32133 260422 378622 338928 344411 510135 639853 530716 310120 243922
60151 243922 344837 399740 300594 138919 20463 -38364 -60025 -81236 -132191 -146261 11615
60140 11615 315789 513338 446961 314593 400706 649813 749719 590497 388421 341793
60130 341793 394407 401504 343877 289357 269659 273296 276486 236801 130857 20857 5951 90610
60118 90610 174756 185378 149651 133503 170615 248610 312514 305487 259144 291541 437820 545299
60106 545299 450294 220981 105484 250622 559140 790795 727924 328191 -157907 -315827
60096 -315827 3453 448791 567816 374061 254021 350430 394724 233503 140655 366029
60086 366029 668005 629963 275023 14533 48139 151392 78070 -135867 -356906 -568712
60076 -568712 -747144 -732610 -433693 -37545 183539 211659 240883 326759 289220 22967
60066 22967 -267376 -277585 17418 316069 324368 66794 -161720 -126376 95566 214811
60056 214811 75645 -164003 -255543 -190418 -165739 -236278 -203983 50425 309919 284530 26792
60045 26792 -135547 -48766 99511 80174 -108029 -323334 -458769 -453513 -275236 8911
60035 8911 247027 362249 408056 432613 419194 395142 427214 445712 277060 -37277 -172924
60024 -172924 49080 360814 399900 201900 74522 99867 71586 -110450 -287138 -316253
60014 -316253 -247334 -161701 -55398 46990 49306 -65575 -188337 -243700 -269144 -304027 -334984
60003 -334984 -365403 -397324 -352093 -176113 -3880 -5370 -83944 17317 291384 447865 385664
59992 385664 356685 515444 635709 501458 284675 243270 288178 195464 70213 210855
59982 210855 588679 836608 762423 550430 408764 301844 115913 -132712 -337429 -392124
59972 -392124 -226745 77337 238209 71691 -182635 -120891 226310 398164 193405 -26865
59962 -26865 69149 251739 119685 -243055 -399278 -201676 94013 292768 439645 527009
59952 527009 417037 157623 27863 109946 118686 -140068 -407080 -322780 52710 344721
59942 344721 348285 135131 -202706 -595718 -829277 -673538 -248168 9477 -159533 -567904
59932 -567904 -872221 -918805 -730932 -391618 -68772 50070 -6037 -2466 126836 142698
59922 142698 -82289 -256440 -55333 372171 608649 553656 456796 439831 367288 204464
59912 204464 130280 203252 242019 161518 130645 244720 316165 177022 -44851 -150233 -166001
59901 -166001 -214409 -265965 -238398 -190829 -201961 -180902 -13757 207169 310133 312358 363111
59890 363111 492607 600137 623024 558634 409065 253914 246690 364588 330834 19334
59880 19334 -243688 -95278 292924 436437 243954 74875 102080 82405 -132975 -306085
59870 -306085 -239983 -120608 -159315 -198948 9909 357802 521647 428481 291774 271409
59860 271409 338800 413580 428072 321026 142973 75719 170046 189223 -63879 -385358 -410208
59849 -410208 -130451 133619 241694 370078 601119 724797 585441 331112 135787 -69522
59839 -69522 -360436 -535277 -364558 4153 202978 152417 96520 119194 -22918 -437580
59829 -437580 -775140 -648549 -193186 122700 178126 325550 765280 1145795 1026895 512856
59819 512856 113131 72988 166612 158160 141082 286759 510086 601052 551879 538878 635833
59808 635833 730133 713531 603439 456130 284053 107073 8363 82729 340144 664455
59798 664455 869811 846405 677320 547360 491188 321369 -95013 -560259 -695265 -368303
59788 -368303 140255 425008 323495 -8584 -284323 -302765 -63270 253406 421796 327513
59778 327513 24832 -306265 -446414 -272085 99713 348925 247388 -93870 -365001 -417685
59768 -417685 -363654 -333659 -309632 -246124 -198447 -224207 -266887 -248399 -195955 -169798 -140271
59757 -140271 -58669 9961 -33595 -140570 -160968 -74590 -23719 -77257 -110875 -5383 162106
59746 162106 247454 266175 331001 404095 300795 -13026 -290885 -288726 -77375 66548 28888
59735 28888 -41423 -3914 67671 34735 -73258 -109915 -44811 -5386 -76016 -171579 -160128
59724 -160128 -28818 135247 265914 337377 304035 134947 -71782 -115295 84782 342864
59714 342864 383147 156280 -108274 -182855 -78559 52421 157392 310927 536679 730459
59704 730459 795031 765974 751636 794095 831146 771554 587037 350454 183883 136582 121797
59693 121797 19506 -170317 -338020 -415037 -430337 -413662 -343120 -220808 -107835 -41376
59683 -41376 -2729 -4884 -102754 -252774 -280732 -97231 143961 222836 119447 -21486 -128594
59672 -128594 -250508 -385453 -424834 -303338 -94183 81245 154067 100956 -63973 -246576
59662 -246576 -302966 -178434 12958 84380 -55518 -322766 -516072 -468515 -186810 159291
59652 159291 405718 521593 544511 466770 282584 105049 102997 294950 504451 568943
59642 568943 524030 518653 585181 573579 347624 6050 -176196 -63239 168887 268131 236289
59631 236289 260722 369042 394133 305650 286003 360328 259854 -122881 -430034 -312710
59621 -312710 18796 112943 -18551 23901 317858 488343 334739 99563 -17381 -136305
59611 -136305 -282898 -169975 279809 596588 371354 -84049 -138140 278113 641173 598207
59601 598207 330847 165375 207338 414603 698126 862615 730673 433028 339655 589808
59591 589808 888587 886397 596955 320378 275944 422306 559877 525747 333703 157900
59581 157900 137265 213708 240650 210681 243248 358059 418373 340804 227167 213864 278433
59570 278433 276351 141477 1573 71383 399453 739646 779150 522175 304875 358997
59560 358997 539612 612455 593940 577834 431670 11935 -435362 -490016 -162738 103962
59550 103962 82528 8843 81147 132153 15587 -60287 107570 319153 281096 94862 65570
59539 65570 175227 140578 -69606 -171026 -49062 50142 -70136 -243689 -209674 7411
59529 7411 180057 223033 260286 371227 434524 293661 5847 -175571 -92102 125090 235113
59518 235113 205001 201063 273928 255981 54676 -150032 -157681 -37867 25437 49816 175976
59507 175976 353103 369945 191201 10757 -61761 -124431 -223932 -212543 -1569 223942
59497 223942 214443 -20263 -233219 -217152 40051 393534 626000 567768 259484 -33926
59487 -33926 -71056 118490 302151 328800 267367 270275 359017 364025 90178 -417086 -801068
59476 -801068 -713593 -238644 146140 116127 -139949 -243623 -153690 -124950 -221556 -197143 65753
59465 65753 294395 207926 -34428 -31559 293034 590323 569340 342108 185970 152295 87094
59454 87094 -52968 -104032 62437 332278 456815 325741 88593 10037 204706 506044
59444 506044 626950 483229 313207 400825 708054 899055 756615 455165 332858 476073
59434 476073 656510 654446 507924 399790 402455 425255 373589 266872 185111 162885 174428
59423 174428 188026 189102 164865 116171 83606 105348 136355 80316 -57607 -131446 -53170
59412 -53170 41545 -35070 -219188 -246952 -47272 111507 -13277 -289644 -405013 -290520
59402 -290520 -126338 11473 233140 532618 683373 575260 432029 494713 653205 627963
59392 627963 401463 191480 53557 -160621 -406738 -365359 55198 427391 320891 -65010
59382 -65010 -138851 271080 702281 705595 371745 66124 -74353 -148310 -193229 -156022 -74375
59371 -74375 -51049 -78439 -73503 -53814 -104545 -199493 -220317 -120764 82637 404527 763738
59360 763738 852338 444576 -170742 -419097 -186131 14404 -225485 -654766 -791318 -587627
59350 -587627 -330242 -118695 146048 392145 424841 305508 282265 329414 151365 -284602
59340 -284602 -607270 -563573 -318878 -68974 265971 691621 838046 413122 -250622 -532510
59330 -532510 -324812 -99600 -191666 -412684 -459990 -344323 -231251 -136618 -8946 75121
59320 75121 42163 39295 281145 709654 1006938 966906 701551 444382 288536 198658 183621
59309 183621 323794 607858 825606 720853 292650 -109101 -93409 333192 720888 644206
59299 644206 165007 -261641 -313009 -107116 40973 40477 76392 278250 490295 456736 164849
59288 164849 -117608 -155556 10433 185433 279628 333105 347998 259169 84166 -43566
59278 -43566 -40518 44993 152980 267382 295298 83949 -306227 -533633 -393146 -151988
59268 -151988 -198560 -462350 -518950 -245250 11538 3121 -59081 89533 318866 342102 170020
59257 170020 19935 -68587 -207545 -348074 -315331 -125287 21647 63488 128779 251969
59247 251969 298889 224573 164726 196917 218322 136775 284 -125900 -230942 -254815 -105725
59236 -105725 157274 351449 438282 553441 703274 679785 403368 115598 60155 162602
59226 162602 199784 116143 -2335 -108823 -172257 -119611 27571 104145 51027 47016 212109
59215 212109 366332 305857 140355 101426 183104 254294 357053 548962 593696 234869
59205 234869 -269536 -337498 147051 640909 665434 360046 141695 143235 222902 271780 250060
59194 250060 93416 -174815 -361912 -345229 -286678 -406826 -630103 -663120 -392984 -26681
59184 -26681 173020 157052 76184 90264 219948 351809 381191 333344 294623 256623 149865
59173 149865 35990 95662 343232 510574 359346 4592 -238504 -272203 -296200 -460622
59163 -460622 -620817 -550389 -300336 -176803 -331818 -522192 -411296 -36122 227091 174370
59153 174370 14552 -7830 20803 -79855 -186048 -41642 268596 377735 168344 -93354
59143 -93354 -199084 -236429 -293418 -263397 -100244 38633 96809 282254 695726 1052435
59133 1052435 1048540 800546 631456 587178 473077 250569 79576 29049 41676 151679
59123 151679 441482 767749 808917 461678 -11599 -294607 -308771 -153722 58580 223595
59113 223595 237753 82898 -135859 -284981 -294880 -157404 95774 390265 631841 751003
59103 751003 720817 564600 360108 179824 9297 -200281 -385029 -386593 -158539 159804
59093 159804 417195 569985 595711 462199 251043 129444 117037 72955 -13173 31321
59083 31321 215579 285027 138567 24116 88729 88561 -130698 -229786 100946 525659 516148
59072 516148 195726 120841 358512 450079 267697 203597 397673 461085 195758 -39829
59062 -39829 16090 93557 -27697 -58510 219490 409855 100068 -369931 -352674 130050
59052 130050 464785 374087 176386 143556 158005 99100 93817 214142 286812 186859 53588
59041 53588 54823 147522 215379 278547 432467 673402 860578 799395 390193 -198696 -571265
59030 -571265 -493999 -206406 -139624 -350518 -477545 -279634 49698 209441 198497 228592
59020 228592 386422 564436 644652 587337 371540 1125 -390488 -536570 -237725 397654
59010 397654 951571 1025015 615354 110477 -135306 -135905 -112275 -118127 -8714 252901 469159
58999 469159 455948 267647 74765 -75135 -241093 -380029 -312083 40076 468645 659831
58989 659831 551334 383555 340555 288356 24327 -330671 -443522 -251596 -45547 390
58979 390 77402 347368 579678 470311 140976 -14858 94687 171473 16068 -204202
58969 -204202 -261935 -194633 -179643 -242440 -241417 -81556 156562 290802 212256 -4164 -179990
58958 -179990 -232899 -229097 -211648 -104980 118056 311383 347986 319938 363578 389088 212764
58947 212764 -101460 -283365 -234863 -131245 -117273 -126343 -65444 15424 30210 -7455 -33688
58936 -33688 -20324 27731 71339 30547 -119004 -261046 -267805 -186016 -163847 -227349 -267777
58925 -267777 -206583 -33768 239169 495352 491648 154455 -200782 -222942 -18455 24719
58915 24719 -160888 -276148 -198956 -150298 -244909 -291097 -170930 -32898 47676 213185 450365
58904 450365 477423 239081 112724 322788 528871 357652 9301 -76380 116311 278757
58894 278757 315178 335670 293381 89041 -87288 24204 273318 287955 90628 72003
58884 72003 352625 619238 640995 521677 366141 121235 -129323 -121057 156578 334222
58874 334222 179679 -64473 -80617 64511 118775 82202 151581 344837 450522 333656
58864 333656 106753 -25295 8914 99773 105812 36336 37933 171359 309829 351356 386371
58853 386371 485635 488035 266763 60888 175592 434489 378233 29936 -33692 458261
58843 458261 1000733 987661 494726 56121 -60817 -2601 53589 78547 86200 123052 276327
58832 276327 488165 505058 234017 -23060 37426 251372 229728 -42098 -198361 -46116
58822 -46116 217062 362731 404007 436304 454703 426035 365194 266568 93244 -130996 -331354
58811 -331354 -467806 -490868 -284574 155565 548049 574513 301075 109346 183621 314928
58801 314928 275923 143197 127546 274432 457472 529792 400897 115637 -78723 61699
58791 61699 400692 456895 -16742 -652641 -868599 -538293 -60043 165326 99460 -75817
58781 -75817 -235369 -353144 -405598 -357466 -217863 -48738 82262 142724 147098 146404 200490
58770 200490 341570 544606 725685 791151 717610 580584 485660 479500 540901 632254 729672
58759 729672 821834 904498 955814 909287 701419 364060 5205 -315716 -591942 -725972
58749 -725972 -551993 -111729 257807 295070 151901 155913 340765 457048 371707 171488
58739 171488 -91934 -435133 -699685 -622508 -253744 15109 -9690 -56588 152688 468946
58729 468946 590294 525222 492171 547531 614295 724685 911838 976436 710373 301769
58719 301769 170111 385765 575900 466081 217554 115708 172556 192664 74685 -86448
58709 -86448 -112869 95352 427284 597017 442826 166798 106581 294821 460412 455604
58699 455604 408869 404582 312601 78436 -80199 29776 270627 365968 261605 118426
58689 118426 68828 141603 307384 443303 380307 146588 28978 212860 491640 529648
58679 529648 289435 -11038 -236846 -386140 -414604 -292560 -168596 -190994 -220698 -34003
58669 -34003 221960 143924 -306974 -673684 -635342 -434605 -455616 -647832 -652318 -347321 -132
58658 -132 78491 -138524 -381774 -318097 125237 624757 781943 604262 452520 466291 364056
58647 364056 -24401 -384455 -381944 -199587 -202374 -294422 -102677 307376 433235 83815
58637 83815 -361871 -545994 -523804 -415674 -135317 280763 489747 325516 133888 262468
58627 262468 501523 446084 190069 183345 501885 733434 599744 286547 99473 142652
58617 142652 396608 768742 980305 745073 190345 -208870 -247456 -219013 -366890 -473681
58607 -473681 -280313 4975 7648 -197007 -186240 160431 493058 486945 195041 -132377
58597 -132377 -310290 -257565 -22797 174157 150360 42987 141846 413427 500277 287770
58587 287770 130432 312086 588147 561351 285698 146411 269246 410053 389135 292028
58577 292028 214047 123949 65978 213616 578198 877452 852780 569278 273281 98275
58567 98275 52238 161218 438011 754860 894181 737185 358926 -17597 -144556 54152
58557 54152 339535 332455 -62532 -505017 -593053 -291181 121078 406462 518094 483034
58547 483034 332610 136765 -30070 -150943 -213090 -165476 -38623 -2689 -142835 -267526
58537 -267526 -137744 182127 417330 464873 435672 365605 192431 29231 110348 364640
58527 364640 394191 71461 -169123 70369 520347 596942 250235 24341 242327 543655
58517 543655 442205 62544 -7717 469811 1031350 1087121 654896 299961 401901 741849
58507 741849 906492 855496 849973 961904 973547 762313 492159 344441 302717 305596 386088
58496 386088 530686 605325 566253 560044 670433 754759 689539 580828 545665 488405 323626
58485 323626 226455 372578 576255 515005 239675 131920 359834 672364 773257 646060
58475 646060 447185 287380 194857 146782 90342 33311 86372 291386 478420 471796 375166
58464 375166 438592 675909 831645 717547 383572 -23991 -371985 -536422 -500652 -432060
58454 -432060 -462017 -456746 -245376 17234 36608 -120334 -76090 283581 644147 730724 600512
58443 600512 397299 164876 -2159 20384 99324 -55341 -371644 -400633 -12933 306389
58433 306389 143626 -232910 -290661 42734 437369 691254 814936 767858 496352 142836
58423 142836 -88720 -191811 -247490 -207255 -43608 58052 -39235 -128219 48177 340352
58413 340352 386646 178147 63877 215039 419231 435771 284618 146224 177106 419887
58403 419887 723280 805146 567872 258362 136819 134294 63369 -15988 46841 122413 -43895
58392 -43895 -385327 -581840 -535711 -446814 -448343 -488572 -533594 -564895 -430796 -46372 316196
58381 316196 313456 60044 -33175 85394 72541 -168903 -297830 -89696 255065 487485
58371 487485 592932 584184 428566 302389 473764 779441 687564 87993 -451156 -469430
58361 -469430 -182505 39327 263971 639670 877563 634111 139495 -80264 57783 199889
58351 199889 169285 119908 150518 184278 212562 305147 392475 345274 240861 259307 353347
58340 353347 312131 126778 13246 80507 220759 310191 299608 157703 -48293 -88219
58330 -88219 164063 474808 535558 430841 505490 802813 987119 869743 677645 669803
58320 669803 740438 574164 66995 -522953 -797487 -586297 -149486 55053 -113111 -324369
58310 -324369 -259178 -32427 85867 146282 359928 622001 633845 442359 394814 532869
58300 532869 513807 254825 172722 531815 955832 925914 486776 113986 63847 182105
58290 182105 244937 184069 12500 -220353 -389632 -391269 -290395 -244342 -276855 -238989 -12103
58279 -12103 315445 498970 374888 72317 -67632 117977 367169 312525 11459 -99475
58269 -99475 169030 462573 370226 -32221 -346428 -376627 -233391 -33202 217161 456010
58259 456010 540809 447542 336120 360052 507482 645863 638142 431164 135004 -2421
58249 -2421 172438 500027 640412 455606 154867 20400 93247 199586 200518 106915 -21842
58238 -21842 -171386 -315146 -336840 -112614 303348 636448 605945 196682 -305936 -560218
58228 -560218 -442963 -100436 236319 461390 613165 709189 645446 343058 -50402 -254348
58218 -254348 -185984 -57477 -66214 -127874 -41847 199107 426044 530150 505407 331000 21952
58207 21952 -234452 -213385 54364 303959 363157 277118 110362 -142170 -388843 -418607
58197 -418607 -169437 145959 299078 296215 278557 314957 397722 514382 614567 611192 502984
58186 502984 393172 322002 205778 7927 -168368 -228485 -181302 -26478 268308 591813
58176 591813 701603 546478 379829 400114 481667 442922 364230 393038 418950 240358 -66844
58165 -66844 -249301 -265131 -270271 -265331 -76792 292365 588675 649324 572511 480714 344778
58154 344778 135637 -45549 -95892 -30892 87594 207687 239120 116789 -36185 17652
58144 17652 317779 620150 697640 579494 419372 280844 154010 56170 10089 11322 79511
58133 79511 239739 415940 483317 471069 538369 679075 660860 391112 132851 147405 285038
58122 285038 195725 -132684 -323508 -113236 320007 594776 538413 298419 155140 273348
58112 273348 555298 712567 557374 222598 4187 2984 54242 18792 -23369 57634 230249
58101 230249 386302 528334 708907 835593 725131 385911 88768 61846 216084 287716
58091 287716 187525 67185 54236 80261 29907 -71413 -124748 -122634 -119424 -90846 35921
58080 35921 229308 368671 417132 442697 453384 369789 211481 144641 249359 390424 440544
58069 440544 480092 604313 668620 469473 120061 -21865 168440 414287 426101 247834
58059 247834 91616 10277 -80516 -163417 -112648 83441 254216 245377 96602 -19987 8781
58048 8781 136426 226723 202883 112259 38720 -942 -17152 39616 205881 370833 380163
58037 380163 289753 313575 451319 414174 89149 -168449 3250 389173 450524 103216
58027 103216 -169283 -47090 191638 168034 -10806 23778 308481 528902 503514 363891
58017 363891 257484 159293 51380 58735 264100 506349 505451 184280 -193220 -246278 116694
58006 116694 530136 523416 86999 -263294 -109525 334409 521679 297502 39653 79646
57996 79646 282441 313601 92188 -188912 -343013 -322828 -168409 29068 166043 239852
57986 239852 364470 573383 685364 507920 134264 -117143 -72997 115288 203842 152111
57976 152111 102541 144509 224970 289765 387260 558591 707813 700233 565303 472876 492195
57965 492195 510445 443322 381070 418354 464130 369249 160035 -6367 -54377 -8584 129190
57954 129190 347968 529020 565084 529890 534474 481321 214494 -127277 -217922 -28888 114697
57943 114697 33077 -91730 -121765 -218720 -470202 -599009 -365278 -5722 81631 -90948
57933 -90948 -206374 -185119 -236281 -427549 -580849 -601233 -571374 -494678 -277531 -19717 19601
57922 19601 -143658 -145766 186985 516615 452061 113303 -51517 102346 265066 152993
57912 152993 -115275 -233079 -141266 -76343 -198618 -336671 -223187 97525 298767 229126
57902 229126 106161 130041 157157 16538 -59668 280285 866428 1097383 753305 307211
57892 307211 245751 446537 494486 310449 128527 63649 69897 201180 533733 865369
57882 865369 854145 507187 226096 273351 455818 465152 305347 204876 257739 346672 356974
57871 356974 304590 256900 227322 164228 14777 -174975 -217126 72649 622084 1069106
57861 1069106 1084139 703273 261365 21284 -28415 -14752 32722 142830 246801 220697
57851 220697 87822 29863 125268 204317 93819 -91915 -97206 77582 171031 104191 151862
57840 151862 485521 780777 594358 21995 -376545 -313437 -70097 45215 160119 497230
57830 497230 868354 898572 613042 383877 316712 129502 -243908 -366429 80323 689307
57820 689307 760476 225871 -269257 -234546 91478 179733 -80343 -353767 -363462 -150852
57810 -150852 108754 314817 437240 469687 454005 469817 560532 705653 849931 915484
57800 915484 844332 717424 759597 1074685 1411318 1384347 954438 493241 305208 290945
57790 290945 214028 93487 100687 199639 178405 14955 -60090 89267 333973 529840 695603
57779 695603 816536 717651 354981 50840 154827 554649 801825 691250 436166 261941
57769 261941 139929 22147 37783 254411 462328 434658 261911 198713 282333 336054
57759 336054 277267 179687 68833 -92815 -213709 -117382 168553 390804 413096 375545
57749 375545 424558 493527 479287 439447 443686 397743 227757 114913 294366 668786 876629
57738 876629 772709 613487 676787 887697 968909 835538 654740 560090 506306 452230
57728 452230 505421 739304 973840 944107 682826 527011 665474 867282 809309 528419
57718 528419 345127 417379 585586 636828 523584 321339 157656 187360 442456 694606
57708 694606 677217 464759 387335 516182 521469 180258 -245567 -357719 -145625 83527
57698 83527 159152 178371 255792 372048 456217 452826 319648 81718 -135276 -208828 -111083
57687 -111083 135604 464449 678576 574137 283239 264222 728747 1271328 1339126 919952
57677 919952 467671 268945 228401 221152 283925 412021 486804 496013 569600 708705 712840
57666 712840 480837 188742 61613 117353 215415 233361 151002 76310 182336 474431
57656 474431 667119 507727 188066 149843 454628 669331 491583 173241 114847 297555
57646 297555 399974 326748 316032 541110 845180 941669 756802 501481 431685 571394
57636 571394 703341 648236 477467 364394 315664 222406 126847 201903 435365 570812
57626 570812 456165 247290 151177 161150 191685 291128 522295 761993 837180 789338 791489
57615 791489 830359 688366 290195 -110164 -204438 -2746 193643 171087 28057 -32426
57605 -32426 -15861 -79546 -197374 -115615 247916 570342 513293 221207 150893 433685 703570
57594 703570 632996 375241 310701 532838 788400 849826 758509 686770 691716 684637 607249
57583 607249 550383 639528 840169 974432 935908 777290 566715 306432 51117 -64809
57573 -64809 -21467 28721 7707 24489 110477 91210 -63688 -28390 415958 917945 959006
57562 959006 599567 395807 602845 876344 822687 490714 209810 195510 401351 591284
57552 591284 554607 378104 382256 617512 669258 268267 -183481 -141645 269573 522859
57542 522859 564900 767596 1101576 1095922 674583 327656 326736 443164 574717 919350 1314498
57531 1314498 1173771 433045 -141604 -811 471685 703997 747747 859284 893700 689084
57521 689084 527258 638160 721468 512833 338338 525892 760845 667851 552392 841428
57511 841428 1214230 1093701 681439 665648 1099753 1394169 1323685 1256807 1389136 1466956
57501 1466956 1342972 1201657 1158613 1146869 1224862 1513111 1825409 1833395 1596856 1497300
57491 1497300 1665175 1870792 1924855 1812338 1546383 1278571 1389842 2037911 2774847 3051306
57481 3051306 2925035 2839205 2936260 3086992 3352997 3850438 4335920 4479706 4391591 4376129
57471 4376129 4385464 4232529 4084734 4185332 4351269 4314129 4262567 4476564 4786637 5001140
57461 5001140 5427013 6281065 7084086 7418706 7751124 8638713 9728057 10528527 11508569
57452 11508569 13251765 15214122 16690466 18352807 21282377 25122704 28940884 33289654
57444 33289654 39450023 47293412 56194464 67407523 82894143 102725690 127244513
57437 127244513 160518238 204990070 250436463 274880589 262958068 221544228 172790665
57430 172790665 133533823 105794907 84728459 68101860 56011276 47114587 39454030
57423 39454030 32906669 28123558 24458688 20879168 17669575 15553886 14121595 12525309
57415 12525309 10876276 9734247 8964417 8135568 7348201 6769551 6050957 5032556 4320968
57406 4320968 4363119 4609219 4350717 3744996 3298828 3004042 2714564 2714884 3131488 3381241
57396 3381241 3004211 2515524 2640026 3174932 3395278 3165404 2864092 2570441 2120015
57387 2120015 1710887 1698238 1936221 1961337 1701052 1460086 1360601 1293803 1251695 1235298
57377 1235298 1023855 499630 19596 14739 378520 650845 632834 456215 257750 152445
57367 152445 304124 656789 823896 589200 263268 210622 328381 351676 325118 349190
57357 349190 218955 -185665 -469034 -223429 294785 536289 471879 471390 576254 504012
57347 504012 269386 214513 443371 713300 850055 838462 599725 136631 -209715 -130795
57337 -130795 125991 97746 -151286 -176313 60818 171480 80079 125226 351724 365574
57327 365574 73329 -64795 202308 463661 308075 -38568 -142355 -41437 -52635 -176748
57317 -176748 -160356 1152 63053 61 90562 454629 794938 756474 392481 102544
57307 102544 148582 391407 562424 650078 830134 1062227 1021790 537588 -112723 -496482
57297 -496482 -457049 -125937 293278 584891 583092 393960 355287 554883 637770 369085
57287 369085 88117 198571 487438 484416 293370 411471 786662 787686 248675 -161167
57277 -161167 71244 533678 540144 102189 -224267 -148327 156785 437884 516839 238379
57267 238379 -312853 -662979 -431142 105055 325541 117790 -9753 284535 696374 762029
57257 762029 481680 194112 62716 -4328 -35398 76205 291797 338274 43246 -380004
57247 -380004 -540601 -315295 39792 207592 128548 -10338 -8012 160303 319976 253611
57237 253611 -55429 -357677 -414547 -302125 -278486 -377127 -377884 -225037 -172580 -357241 -520564
57226 -520564 -410264 -204348 -200901 -279203 -72167 423645 825761 923576 844802 655472
57216 655472 251896 -235578 -386427 -76407 240686 116652 -309874 -594462 -592947 -477220
57206 -477220 -356942 -226523 -149139 -161394 -88478 229275 601216 705442 594080 620235
57196 620235 844412 890786 514454 -15935 -288216 -242727 -94106 21503 75519 -11351
57186 -11351 -274772 -531974 -563869 -443144 -433804 -561318 -538425 -185182 302191 604900
57176 604900 615219 412319 106881 -135660 -104148 211721 507357 504402 299573 166811
57166 166811 146400 104973 83722 223939 391352 289645 -7239 -79186 143301 165248
57156 165248 -322745 -904380 -1034029 -828117 -782365 -941353 -902415 -551177 -231320 -132887
57146 -132887 -21510 267093 491472 385185 45129 -285313 -545059 -731894 -691948 -318833
57136 -318833 170607 416381 318021 82692 -68899 -92586 -72369 -124662 -316587 -563533
57126 -563533 -639985 -402852 3398 249899 146131 -179081 -423069 -415965 -267187 -190242
57116 -190242 -219347 -208897 -119463 -104596 -194978 -129576 232339 512835 222015 -488000 -907567
57105 -907567 -682188 -227246 -72557 -200310 -309629 -387331 -618824 -928708 -1015770 -788536
57095 -788536 -445347 -142950 137730 396097 535312 519014 410691 230924 -50312 -357130
57085 -357130 -515745 -467932 -345929 -294205 -320971 -346896 -301517 -160307 20268 111027 59591
57074 59591 15927 167991 440820 527266 296883 25937 72360 400875 615099 471703
57064 471703 175478 53222 90061 12271 -229106 -357699 -238071 -136490 -291308 -480265
57054 -480265 -356885 -43541 40310 -123846 -109659 238919 537496 489617 333465 388032
57044 388032 555913 612284 620858 663833 498251 -24053 -460005 -276544 297445 524888
57034 524888 222750 -59165 4053 28176 -345344 -793185 -798163 -407192 -67724 39229
57024 39229 79381 131279 80558 -89061 -230500 -277496 -300844 -301112 -178047 36445 114352
57013 114352 -90018 -416666 -571202 -472123 -323643 -327231 -409137 -334770 -71428 126085
57003 126085 80366 -18831 117007 420692 539900 336417 48158 -67899 21217 283655
56993 283655 697489 1032892 896275 243965 -401766 -535324 -272443 -84060 -115583 -135220
56983 -135220 -46681 -32443 -156289 -195462 70 251371 306720 166931 17146 -29020
56973 -29020 4638 55365 94914 155295 301911 511865 611524 471290 239716 196372 353361
56962 353361 417299 220835 -27982 -69027 23317 -23681 -273387 -523633 -614309 -590330 -544001
56951 -544001 -467014 -324513 -157650 -24462 97865 264929 439880 497309 380184 202566
56941 202566 139134 221778 302548 232560 24887 -186719 -298934 -312763 -306632 -371178 -510956
56930 -510956 -575767 -378725 52639 441440 570501 529493 544509 675605 835364 996531
56920 996531 1190146 1402075 1701438 2355708 3481500 4609601 4986059 4410896 3458663
56911 3458663 2751756 2346412 1996080 1655064 1427466 1284314 1155374 1118838 1204447 1178404
56901 1178404 833548 353356 77840 37143 39859 84590 283241 449730 224915 -326411
56891 -326411 -655365 -418534 88559 354413 253334 52982 20271 192676 422329 528918
56881 528918 478287 434982 563269 855406 1306563 2094007 3258254 4315876 4637202 4229395
56871 4229395 3688329 3312301 2809657 2068520 1583572 1674666 1804972 1303521 442932 107484
56861 107484 523454 1012133 1039458 847228 829803 859060 614072 205852 35432 198275
56851 198275 399892 404387 261886 83676 -140725 -406666 -564425 -485916 -280938 -179622
56841 -179622 -196746 -85909 273208 592559 490493 36314 -273602 -138056 188734 284990
56831 284990 100265 -82484 -73044 59184 173953 220819 228589 265725 392326 572768 688054
56820 688054 680145 583112 393401 105820 -68536 184781 777537 1125328 843826 291559
56810 291559 82442 272206 427417 335149 172918 37965 -201631 -531101 -692211 -574180
56800 -574180 -355751 -168116 46142 245296 209897 -101798 -414228 -493777 -396208 -255537
56790 -255537 -99547 17870 -20420 -174601 -238517 -142029 -8816 131981 364905 557891
56780 557891 408758 -42164 -346399 -276704 -120321 -129958 -119024 90725 238299 43549
56770 43549 -274076 -326668 -153274 -71379 -150674 -232902 -277227 -301300 -186166 65919 110905
56759 110905 -250262 -589291 -380802 154860 322460 -24454 -349727 -329301 -242498 -337955
56749 -337955 -406690 -241842 -40984 -54066 -199622 -298001 -366986 -439146 -380261 -140018 62413
56738 62413 23047 -191872 -429822 -628216 -661720 -346645 183765 444780 226988 -47047
56728 -47047 83014 456509 616076 532749 527077 620286 496011 106178 -178542 -132275 25790
56717 25790 54211 52451 184321 328373 270102 56057 -96703 -121333 -97126 -13014 217226
56706 217226 516794 645653 495283 229730 63486 12861 -51189 -181784 -283091 -242411
56696 -242411 -78845 49487 -13046 -247237 -439642 -390344 -137789 100648 217918 327056
56686 327056 526026 693890 661433 489085 389554 407732 368644 156756 -130796 -343307
56676 -343307 -416767 -316053 -34329 268075 322122 76176 -199240 -256329 -144433 -4048
56666 -4048 188871 438652 487120 94366 -506284 -765016 -456837 86639 410617 360776
56656 360776 50403 -321191 -523223 -410980 -135037 -52988 -287607 -524618 -408557 -20712
56646 -20712 220503 85378 -212623 -312561 -138311 43149 -34867 -322690 -538387 -513769
56636 -513769 -332166 -128419 56852 142128 -49811 -501987 -826257 -658788 -153086 200955
56626 200955 199665 71477 31585 38564 39075 97081 157685 17869 -289328 -391512 -90933
56615 -90933 285950 330752 126902 62878 223473 316621 154030 -125140 -338906 -486349
56605 -486349 -594503 -563743 -317976 1127 132430 -19892 -269018 -343219 -198273 -90890
56595 -90890 -277424 -665611 -891423 -772678 -538044 -508792 -684605 -798735 -706867 -544817
56585 -544817 -505423 -605709 -714420 -713266 -580988 -373421 -171240 -37924 -1812 -55001
56575 -55001 -147922 -193725 -115546 92481 352413 535323 513221 248468 -125604 -382523
56565 -382523 -424728 -365153 -338240 -340638 -340028 -386852 -468517 -414906 -166295 12425 -134410
56554 -134410 -418668 -437704 -169411 26215 -26622 -148494 -217976 -323399 -418615 -279478
56544 -279478 35296 119957 -163270 -427131 -374899 -244222 -309735 -365313 -130731 178646
56534 178646 181858 -28245 -84334 6468 -62372 -279903 -296666 -15280 247337 228563 -11948
56523 -11948 -308153 -537394 -554459 -298814 29012 179673 195906 252923 266991 38293
56513 38293 -292718 -356147 -109106 123275 166777 155726 163978 98895 -1225 22181 106357
56502 106357 59758 7006 248654 637537 669181 321413 179658 475531 634308 183159
56492 183159 -454909 -599619 -303314 -118986 -199766 -244548 -153346 -130351 -186376 -74952
56482 -74952 238705 481800 504247 436006 361603 186740 -81788 -230198 -138147 42365
56472 42365 121219 107109 117801 196402 299506 369370 362623 272272 141672 20089 -65377
56461 -65377 -66933 60125 230983 257034 99557 -38136 -3885 59894 -61604 -314134 -458685
56450 -458685 -414167 -317590 -299792 -379810 -527102 -661185 -651088 -479351 -331583 -347347 -370414
56439 -370414 -164271 182164 309125 60967 -292957 -363326 -46011 397959 592811 406766
56429 406766 107825 65226 254802 265969 -77979 -381807 -230541 156061 212074 -155882
56419 -155882 -477893 -448519 -310667 -379681 -537846 -433833 8873 490907 675024 514825
56409 514825 265448 178183 183977 -4115 -418532 -692143 -571801 -327649 -332196 -452841
56399 -452841 -305260 31315 95620 -164785 -254463 82446 464594 495225 310394 205355
56389 205355 126344 -94107 -307908 -251502 19088 223162 237999 132126 -14330 -94755
56379 -94755 19551 234844 225016 -93368 -342363 -219945 43610 120038 153853 420500
56369 420500 680465 477743 -40017 -237466 59614 350237 301297 188182 258271 236807
56359 236807 -140857 -556496 -547933 -232947 -113804 -316214 -474304 -323064 -8276 220904
56349 220904 300047 260604 120240 -38424 -81875 -20962 -35422 -205629 -354019 -271747 -15034
56338 -15034 150477 72421 -124078 -211434 -131412 -37870 -75203 -172424 -119383 158371 475169
56327 475169 572927 381072 49861 -217158 -307841 -244010 -173506 -278648 -575085 -808139
56317 -808139 -680347 -225030 163042 151712 -158626 -388436 -335994 -147206 -49821 -74726
56307 -74726 -97980 -37633 93292 259941 421862 508350 483693 432591 480296 605165 615945
56296 615945 363228 -73149 -443138 -546996 -391240 -166538 -78159 -158700 -246880 -182993
56286 -182993 7612 187455 309295 422571 504344 454860 295099 187874 175048 74445
56276 74445 -209619 -430023 -281109 127265 331588 91054 -299541 -377243 -59497 308519
56266 308519 401460 270178 206207 331734 443183 298213 -47028 -311465 -350170 -273058
56256 -273058 -197593 -84628 100707 260798 333479 414472 545883 552430 305804 5284
56246 5284 -73783 -10133 -115355 -435137 -691062 -717973 -629330 -504243 -260788 45576 146903
56235 146903 -18451 -119846 81043 325503 245762 -51421 -154312 18911 149165 75202
56225 75202 41726 269724 578569 635024 397595 112347 -29657 -32719 67673 301194
56215 301194 612416 750718 485095 -59669 -431397 -325205 49050 210377 -27297 -401010
56205 -401010 -596055 -573210 -431493 -187890 121322 295030 168712 -114942 -261309 -212537
56195 -212537 -165880 -217140 -219663 -56522 143768 167698 -32649 -331259 -564674 -609677 -435714
56184 -435714 -166327 -2086 -597 -10615 98229 234716 233210 129380 123259 264742 340429
56173 340429 155970 -182192 -390323 -355522 -218979 -119998 -22181 135108 260496 228884
56163 228884 90357 3797 11782 39279 65505 100094 25868 -268560 -567942 -452846 112339
56152 112339 596211 533786 121427 -89071 87204 359583 448020 330933 57745 -326166
56142 -326166 -625155 -585444 -250723 19491 -2618 -148507 -132567 88656 332147 403678
56132 403678 224309 -101293 -295262 -167834 88689 86614 -214687 -414970 -242921 53818
56122 53818 88499 -130839 -305645 -314173 -286021 -295696 -254155 -98378 110590 280628 338615
56111 338615 222740 -34667 -259116 -307129 -244115 -222216 -244077 -192587 -36086 147710
56101 147710 298144 372568 288702 41915 -171877 -139178 92406 291657 360271 381257
56091 381257 393952 353400 310511 382417 498623 426076 146253 -15578 214707 695797
56081 695797 1047854 1075156 878111 640450 446169 272205 76818 -87659 -51093 285791
56071 285791 728102 906433 686858 315569 73327 -47793 -195500 -354580 -394837 -320250
56061 -320250 -253878 -216790 -123945 10393 57363 -14840 -91868 -119535 -191974 -361996 -512286
56050 -512286 -515875 -414681 -342984 -368834 -496091 -707072 -890034 -855646 -598510 -424770
56040 -424770 -571573 -769404 -522721 119607 457562 38529 -652093 -774444 -221206 334032
56030 334032 429066 345940 503948 781409 774993 443881 122795 45595 186896 469181
56020 469181 793546 921069 661257 191884 -102200 -131163 -152558 -294772 -362200 -225101
56010 -225101 -80303 -127605 -245619 -227216 -142214 -201570 -380238 -440102 -292678 -117994
56000 -117994 -98677 -183138 -159123 90526 407189 444614 40604 -486565 -588855 -127506
55990 -127506 411522 478710 75556 -359451 -511925 -406373 -188472 17884 71318 -97229
55980 -97229 -324037 -353068 -167810 -683 492 -78891 -122883 -125746 -81610 61508 259637
55969 259637 365826 349496 356224 466013 564002 550447 503825 504265 454975 244508 -30695
55958 -30695 -178377 -172146 -148137 -187996 -235574 -199627 -44813 179839 335344 287754 79193
55947 79193 -89452 -120540 -137443 -241270 -312529 -222664 -94815 -128980 -269310 -289703 -143524
55936 -143524 21767 139866 231753 174907 -188949 -670136 -809832 -475294 -62159 62626
55926 62626 8498 34674 89293 -6305 -154627 -142211 -53159 -130237 -301732 -252738 27857
55915 27857 168114 -29773 -298545 -313209 -103634 97827 179551 160196 85364 68637 234078
55904 234078 464150 420642 10509 -368871 -285412 176390 557289 593620 400177 180675
55894 180675 24534 -40035 -30968 -58311 -199155 -332335 -268211 -31667 146914 115499 -60042
55883 -60042 -206840 -170052 98423 426228 492644 194910 -167170 -275581 -210405 -203383 -153248
55872 -153248 184112 599137 543473 -64368 -629403 -666857 -370626 -157455 -63032 67013
55862 67013 134357 -36155 -288744 -312895 -108745 70577 138444 204545 272427 245227 186317
55851 186317 247789 352966 264308 -9751 -168756 -40559 204291 337539 360721 409788
55841 409788 522558 593543 490752 195489 -136084 -313838 -366872 -513978 -784154 -880134
55831 -880134 -613973 -248676 -117466 -118969 29461 219045 115236 -194957 -275091 -92536
55821 -92536 -123310 -534265 -813776 -532434 -18787 123242 -154540 -411428 -394186 -239307
55811 -239307 -119006 -44304 17597 92414 229953 398109 429731 256027 82493 133735
55801 133735 325336 389007 232803 -11566 -209346 -309301 -296994 -225146 -199327 -204408 -87787
55790 -87787 147710 233092 7067 -311441 -463738 -542821 -739472 -899940 -719408 -258252
55780 -258252 117683 245086 253705 221576 125209 84897 242672 400788 220071 -174017
55770 -174017 -238756 207315 682759 704961 367140 38080 -150426 -243943 -200023 1815
55760 1815 184967 182164 72357 16674 27582 71335 195307 369727 422278 327875 326209
55749 326209 527050 655517 466118 158794 54255 91560 39070 -1315 222491 539561
55739 539561 490755 52995 -270561 -195404 -30959 -119967 -314309 -288664 -58983 132846
55729 132846 228738 317222 328873 110719 -231289 -368334 -180358 71960 91320 -103305
55719 -103305 -267209 -252769 -116513 35450 173227 305072 424811 548887 715036 859276
55709 859276 782604 394816 -49176 -167021 55874 211490 22074 -281722 -340944 -225779
55699 -225779 -303794 -647313 -915829 -845410 -545195 -232254 44836 291139 420040 390951
55689 390951 308875 228470 27258 -355199 -707607 -780845 -622878 -472516 -397410 -263730
55679 -263730 -42437 86500 -376 -169419 -204418 -97297 -55050 -221769 -468307 -520710
55669 -520710 -302154 -70902 -133623 -460598 -711599 -650349 -396041 -224606 -263742 -454158
55659 -454158 -665683 -742059 -559690 -184460 112984 125359 -73042 -267291 -352946 -328606
55649 -328606 -168398 116559 372363 443230 364714 256920 110916 -119046 -296112 -234109
55639 -234109 -21049 66119 -12287 -2184 206201 371358 271785 35978 -85737 -81214 -92366
55628 -92366 -114563 -17830 192438 341493 308294 143088 -34491 -151303 -198357 -197732 -139490
55617 -139490 52142 397123 691258 630954 202430 -219634 -305166 -147197 -36279 -21534
55607 -21534 52976 188627 217784 131585 128329 284764 430876 426415 334502 230276 58239
55596 58239 -192590 -361832 -318649 -150571 -18248 53673 120374 180370 219160 262076 263129
55585 263129 92470 -215631 -370541 -191617 75979 71298 -159164 -253778 -110700 -22446
55575 -22446 -166728 -297204 -132964 185108 282680 82673 -96901 24356 327967 429998
55565 429998 115704 -404875 -696537 -566447 -274195 -197875 -365386 -483101 -391620 -251038
55555 -251038 -223849 -235835 -190412 -177209 -256919 -243225 32683 386934 506779 405629 332309
55544 332309 294864 61656 -329427 -468995 -151053 282255 405053 260121 181648 266746
55534 266746 331769 285820 239071 256520 260261 202985 138505 88443 4245 -116079 -224440
55523 -224440 -342118 -515558 -638433 -513680 -162561 105113 41846 -243773 -450213 -421319
55513 -421319 -199752 140761 529111 797773 749481 399001 35067 -59232 94621 230861
55503 230861 172402 4293 -100225 -105745 -72171 17512 216396 428800 476282 395092 439307
55492 439307 660445 719351 352552 -158719 -305328 -33594 254509 357068 500674 808290
55482 808290 978050 771842 487468 563887 915679 1063762 837581 538226 388347 223658
55472 223658 -115022 -409217 -353368 -52455 57063 -230240 -631577 -765404 -646635 -622697
55462 -622697 -846986 -1030233 -851351 -458522 -293821 -448225 -515069 -201093 224021 323946
55452 323946 103445 -77993 -28342 169728 440377 725714 792111 448742 -34909 -164838
55442 -164838 55950 100355 -239297 -469493 -151723 391087 538125 226287 -116053 -271736
55432 -271736 -376121 -456396 -318517 74577 495382 770731 897536 842790 572668 296297
55422 296297 308363 524940 543356 251859 -12202 -50317 -121991 -420801 -619960 -321209
55412 -321209 290445 634184 448990 -3952 -350366 -408669 -176124 173781 316456 84341
55402 84341 -264859 -337985 -125803 38374 1060 -52566 16660 95782 94873 119628 222906
55391 222906 259546 173402 180551 428771 669175 552590 152230 -91706 61319 371926
55381 371926 445870 168979 -234645 -451300 -327214 36804 372621 463572 313358 96973
55371 96973 -28448 -31923 24414 52285 -9138 -128498 -169952 -18471 259584 431735 308115
55360 308115 -77303 -493383 -698849 -614481 -351986 -93819 62659 151931 251129 375672
55350 375672 466792 446176 272655 -5931 -228975 -212605 61655 370609 449055 284680
55340 284680 135888 203995 358604 301525 -10750 -262350 -180953 88670 192557 79818
55330 79818 55871 280949 482426 338298 -53268 -324899 -341248 -299759 -389143 -583004
55320 -583004 -747738 -745356 -470372 -12446 271658 127176 -192988 -222877 15934 9019
55310 9019 -458864 -928200 -895569 -452723 -23956 210554 309672 267006 76068 -93157
55300 -93157 -118078 -154413 -336833 -455476 -284189 -26354 -20512 -170931 -126990 98845 189696
55289 189696 125928 197168 413914 443951 203288 -11224 -83925 -242094 -498211 -483643
55279 -483643 -95591 210756 115247 -44995 156931 546246 665549 468123 234722 44445
55269 44445 -208781 -443498 -473999 -354849 -260728 -140131 132631 373490 265969 -125131
55259 -125131 -395157 -344811 -158055 -54081 -69381 -163906 -250903 -157698 149524 358840
55249 358840 153889 -288390 -490763 -329523 -112476 -14548 126482 370138 465662 269877
55239 269877 18726 -37778 5739 -71047 -264378 -414783 -441366 -347084 -169857 -65384
55229 -65384 -236780 -625135 -868719 -750333 -506082 -489566 -682272 -764490 -577539 -286880
55219 -286880 -104601 -34717 58277 219730 308238 153313 -189624 -433342 -404563 -296561
55209 -296561 -393552 -613932 -586637 -188642 266321 446626 365927 241253 224649 370753
55199 370753 624582 728181 408095 -182796 -479141 -180185 317404 421182 87998 -223241
55189 -223241 -215717 -61152 -71025 -317946 -623095 -768415 -692318 -535947 -459924 -410634 -217153
55178 -217153 53758 95944 -156694 -342133 -201961 -24046 -201295 -558994 -575381 -198484
55168 -198484 38245 -204203 -598392 -653381 -373198 -156575 -229068 -433828 -518427 -424016
55158 -424016 -274116 -196548 -208055 -244822 -259826 -239570 -132242 127807 452120 570704
55148 570704 315446 -134281 -435579 -459142 -331557 -170485 3098 99087 -39923 -372899
55138 -372899 -591533 -467761 -157335 -8542 -127599 -282378 -244242 -93936 -94053 -307720
55128 -307720 -486359 -406070 -197933 -175076 -377608 -515216 -401840 -201253 -116276 -77336
55118 -77336 47199 137438 8378 -222923 -284029 -206753 -301466 -645147 -915367 -836475 -528127
55107 -528127 -281023 -208184 -263366 -408257 -579728 -626415 -460827 -201838 -25634 61003
55097 61003 171184 320327 397813 340279 214847 118846 89856 136842 266866 410395 382507
55086 382507 51148 -423365 -652382 -452139 -122426 -95161 -346228 -433393 -174786 45050
55076 45050 -138324 -471628 -433732 -20416 237644 23054 -393064 -604363 -556933 -434307
55066 -434307 -334388 -263004 -256099 -296404 -222095 90002 498278 701188 566446 269906 94520
55055 94520 123722 152718 -65440 -485476 -774523 -705816 -424556 -208117 -98459 43100
55045 43100 227866 323504 291036 210681 108669 -29262 -129779 -144024 -200679 -379111 -448910
55034 -448910 -199659 66536 -155227 -770868 -1118135 -902659 -564316 -507780 -518422 -278879
55024 -278879 35365 129442 162419 439330 813861 909594 733791 571547 425063 72179
55014 72179 -401188 -633211 -544167 -415106 -401899 -399351 -406215 -572828 -800447 -727269 -273705
55003 -273705 157100 199372 -47635 -265131 -315727 -247197 -141907 -107852 -204872 -275118 -83308
54992 -83308 283507 439240 249255 53078 150793 362542 349171 117816 -86078 -194282
54982 -194282 -306383 -398531 -360032 -250327 -227766 -259410 -172407 26542 152320 162999 201152
54971 201152 273051 180848 -106955 -289139 -137848 129909 135720 -132693 -360872 -425993
54961 -425993 -550217 -848187 -1023419 -751970 -186137 220200 315870 360416 503063 508403
54951 508403 189062 -176855 -176579 132426 284132 43535 -321272 -450422 -305570 -81094
54941 -81094 62828 52773 -114004 -290421 -244332 47251 307082 307710 167598 123590 156557
54930 156557 82225 -87829 -165538 -142501 -221333 -430305 -505617 -313783 -136378 -292022
54920 -292022 -643312 -761468 -495695 -83798 272612 597138 825042 678000 119745 -335432
54910 -335432 -161428 435784 723754 422198 62849 191082 571766 539608 -52009 -637242
54900 -637242 -691282 -335182 -64075 -112067 -284087 -309684 -166073 -37601 -80635 -292511
54890 -292511 -555732 -730292 -708205 -476042 -189031 -104118 -319290 -614220 -684924 -517858
54880 -517858 -366923 -362190 -360591 -246174 -136950 -152501 -194181 -148163 -117830 -225536 -344703
54869 -344703 -292833 -165634 -191199 -341918 -402118 -374121 -487394 -789799 -1042565 -1076755
54859 -1076755 -969509 -801204 -527920 -202340 -50568 -175295 -384270 -443780 -329535 -137854
54849 -137854 52094 135387 17151 -197645 -257432 -110157 26588 37833 74815 196942
54839 196942 165413 -148960 -420464 -266798 172426 390161 160730 -254469 -493632 -433316
54829 -433316 -190223 -14489 -129490 -467521 -640951 -395849 8617 136691 -15753 -82100
54819 -82100 69221 186897 126741 73675 130306 72534 -230741 -472232 -327597 -20765
54809 -20765 -67724 -508417 -787959 -504692 39362 246410 -21462 -368182 -465464 -419578
54799 -419578 -460536 -534477 -425694 -145256 58986 51284 -60033 -150249 -217537 -250935 -180628
54788 -180628 -42806 13073 -20635 38710 236338 333550 158835 -112363 -232092 -224375 -219105
54777 -219105 -151197 77094 302461 302715 172081 154521 207333 110035 -56631 35471 406785
54766 406785 674718 594880 331411 92577 -134862 -353304 -416172 -308303 -252984 -348262
54756 -348262 -392780 -276099 -239562 -489884 -811452 -855193 -625289 -406117 -356335 -422682
54746 -422682 -522234 -581890 -515861 -354683 -260151 -254033 -134817 144640 270540 17384 -327625
54735 -327625 -329538 -17431 225046 232541 145016 44953 -83977 -110725 110330 388784 391549
54724 391549 173819 88571 161076 36992 -360619 -621548 -478068 -186510 -42022 58332
54714 58332 269808 408692 272831 45606 782 51757 -30630 -173503 -171189 -111832 -212451
54703 -212451 -363385 -275530 -1937 130299 76748 111741 282443 289088 22183 -211926
54693 -211926 -185469 -92344 -171149 -311611 -299008 -184333 -136752 -147669 -158211 -282325 -592404
54682 -592404 -830505 -669268 -195585 171051 218623 121926 83331 71757 -20870 -186050
54672 -186050 -339466 -396234 -271098 33223 318694 355503 183993 68273 119563 177404
54662 177404 115937 24737 -21200 -124348 -324410 -408491 -190834 157146 285707 91066
54652 91066 -231776 -471083 -534981 -395502 -126269 52315 -8421 -146210 -82732 165750
54642 165750 304703 183276 -48015 -223245 -338940 -379942 -241768 33562 167714 -32740
54632 -32740 -409347 -638424 -559239 -236182 133032 282520 62926 -311582 -418558 -176918
54622 -176918 3426 -185793 -483992 -474799 -218362 -92489 -173583 -208078 -126322 -140943 -311989
54611 -311989 -424764 -383398 -361597 -453947 -511540 -444247 -365078 -302445 -96174 252044 439894
54600 439894 280145 -23706 -214323 -305467 -362130 -283159 -87476 -98048 -473135 -826089
54590 -826089 -742909 -458806 -510931 -840649 -818406 -213176 403363 426510 -21424 -370085
54580 -370085 -348084 -158898 -78651 -150687 -240720 -223469 -97804 30634 82514 83354 52191
54569 52191 -90728 -357088 -529948 -399292 -103096 36244 -5126 50261 264054 320220
54559 320220 28643 -329145 -387319 -193112 -68084 -137221 -240368 -217207 -77154 66732
54549 66732 109629 62218 94088 326837 549409 387563 -136123 -512266 -420350 -188270
54539 -188270 -265927 -516294 -465345 -91750 138295 8728 -170135 -138348 -91537 -270868
54529 -270868 -491417 -401629 -24105 271488 260807 76802 -56056 -88363 -103797 -162469
54519 -162469 -263431 -378348 -443457 -362198 -105587 184203 276461 89063 -226152 -501520
54509 -501520 -753955 -1022515 -1115999 -807136 -281038 -42057 -232067 -382896 -103087 309959
54499 309959 329934 27172 -72036 150954 246019 -35434 -344960 -323072 -125500 -67311
54489 -67311 -118924 -119140 -188678 -497250 -801539 -678040 -171994 203941 161410 -38161 -48538
54478 -48538 95992 143922 -4733 -292777 -666819 -1014748 -1089647 -765610 -316384 -179319
54468 -179319 -420595 -663704 -608804 -394542 -318919 -414382 -509418 -555809 -621089 -630885 -427851
54457 -427851 -105314 20356 -141662 -315458 -287366 -185415 -158283 -96077 54886 17626
54447 17626 -364758 -652426 -319172 372871 619242 245805 -3439 402179 958626 894028
54437 894028 315185 -5025 234811 555048 508889 246653 103297 53975 -138326 -478733
54427 -478733 -723462 -706078 -480986 -197780 6049 16038 -198208 -491879 -614661 -447132
54417 -447132 -138373 51830 41571 -11749 35658 90575 -41851 -343931 -556777 -495054
54407 -495054 -257192 -59090 19338 29206 4079 -53040 -98437 -96679 -110494 -218977 -360069
54396 -360069 -379628 -253063 -141502 -179465 -300815 -348670 -288038 -203713 -114939 63617 310478
54385 310478 376121 49080 -478031 -710950 -413292 84777 266299 2483 -398489 -613105
54375 -613105 -576737 -388046 -158661 5202 23496 -99992 -302861 -519375 -652910 -603497
54365 -603497 -434636 -359833 -398588 -255890 186745 500257 257438 -225127 -267042 105053
54355 105053 143679 -429754 -934247 -776890 -345491 -329384 -662437 -780881 -577032 -406048
54345 -406048 -345674 -143578 158087 200483 -37065 -144590 35156 156050 -21288 -237577
54335 -237577 -192197 -11134 9506 -155977 -328298 -415476 -423120 -336791 -173918 -32788 28523
54324 28523 49748 51572 12573 -7673 82474 197026 132253 -111355 -302209 -333138 -342926
54313 -342926 -403598 -388089 -290261 -359845 -688286 -937968 -788779 -453913 -407129 -708210
54303 -708210 -953204 -871396 -624395 -439499 -267596 -1951 188002 36416 -359982 -556100
54293 -556100 -333839 -37771 -121133 -490247 -609672 -270012 83289 -46680 -546109 -892107
54283 -892107 -838409 -602023 -461650 -473156 -560475 -612848 -473757 -75121 381226 581972
54273 581972 472697 289311 216367 207829 154618 37299 -98868 -150631 30410 432690
54263 432690 738224 618837 152976 -287821 -517384 -625243 -649806 -512329 -286926 -187347
54253 -187347 -237731 -279554 -323240 -518724 -744312 -665962 -309097 -106203 -201076 -188661 181850
54242 181850 514313 366180 -34865 -133993 144469 400120 421820 402583 510480 603680
54232 603680 440667 -21033 -561644 -845360 -704563 -354496 -192374 -315149 -430120 -322181
54222 -322181 -147524 -122601 -194236 -207653 -153452 -59645 109056 264478 191390 -82323 -238561
54211 -238561 -201879 -324307 -741773 -977310 -623270 -55021 59037 -298145 -566895 -438232
54201 -438232 -87070 267408 511085 462347 80712 -222453 -577 537354 752387 463369
54191 463369 99770 -23132 -40453 -90604 -64543 58070 76440 -76153 -226035 -305284
54181 -305284 -419557 -504484 -341454 -5637 144317 39527 16051 219964 358407 223322
54171 223322 11977 -78100 -121827 -113813 164706 621945 690358 105497 -560620 -626266 -232069
54160 -232069 -20494 -130323 -108875 248213 552454 434669 70791 -98449 92922 444838
54150 444838 661501 570823 193845 -265518 -533633 -463963 -155154 133283 202252 68623
54140 68623 -108675 -245032 -388180 -535657 -554270 -412737 -335220 -500482 -705178 -604974
54130 -604974 -224321 80872 143300 136712 188674 185505 47290 -112320 -203475 -262818 -266082
54119 -266082 -134375 1370 -126601 -483994 -705378 -615201 -421391 -272461 -40116 272473
54109 272473 355454 106430 -101875 -12174 56463 -246633 -653772 -671112 -359343 -187740
54099 -187740 -269017 -281579 -96647 39422 -1816 -8060 178297 389169 399463 218338 -1212
54088 -1212 -148627 -166550 -37527 163392 301651 291562 113790 -201536 -504660 -552135
54078 -552135 -274613 59436 123226 -83175 -282185 -280560 -119373 67851 179434 174087
54068 174087 107484 88772 119855 94418 36302 144819 455643 666898 519210 176797
54058 176797 -3032 67198 206266 288441 318235 285547 172268 25907 -127193 -313555
54048 -313555 -447045 -362854 -155883 -162703 -396212 -399913 3904 266712 -83721 -593545
54038 -593545 -496797 97048 388359 135779 -83648 93242 304791 187155 -77466 -223256
54028 -223256 -335722 -515913 -605136 -540238 -528527 -597635 -443536 -22249 198553 -60718
54018 -60718 -412189 -435975 -336436 -459252 -563562 -201204 434146 688790 385801 -3191
54008 -3191 -107419 -43928 -7607 28702 75137 3405 -162387 -164061 103875 387407 409542
53997 409542 188218 -111008 -399928 -588032 -515664 -191201 69582 -24003 -366568 -623961
53987 -623961 -669648 -618027 -508295 -269228 -13517 -23653 -298617 -416913 -95545 353136
53977 353136 431589 136091 -152352 -316489 -553659 -797477 -662076 -138626 197783 -844
53967 -844 -315712 -248060 -8953 -85026 -367615 -372148 -124861 -124122 -457170 -640573 -430704
53956 -430704 -173762 -186610 -346789 -495318 -720257 -993684 -1007519 -656196 -274640 -132991
53946 -132991 -83896 40342 85692 -92853 -341057 -511037 -667859 -747627 -476185 60598
53936 60598 275157 -79321 -424076 -216087 189549 157586 -174631 -211541 26340 -28434
53926 -28434 -452026 -668623 -384272 28211 203467 212344 163184 -35901 -319639 -401498
53916 -401498 -272081 -265718 -437297 -402290 -48843 139171 -163356 -534820 -433609 -26929
53906 -26929 119783 -86909 -239529 -125388 55496 131863 172538 213126 142958 -48134
53896 -48134 -203152 -266719 -372114 -573639 -723990 -723978 -682131 -695135 -663946 -498488 -339891
53885 -339891 -359227 -449441 -383796 -233921 -313121 -642922 -817498 -602345 -357298 -513005
53875 -513005 -848638 -774732 -269071 26833 -228634 -563950 -446740 -74140 33320 -135024
53865 -135024 -196677 -100887 -143341 -332952 -327513 -47449 182932 228381 372596 756256 1042782
53854 1042782 924598 596916 426188 442350 458863 437416 414535 272518 -86898 -474857
53844 -474857 -611493 -488535 -298147 -130312 6180 -1443 -232689 -492342 -501157 -285113
53834 -285113 -101908 -20777 132728 422057 692558 856473 989027 1059147 858716 359067
53824 359067 -97528 -167229 77832 274875 200560 -76762 -362350 -484142 -365893 -126912
53814 -126912 -39795 -210057 -369825 -216077 90134 61874 -415205 -840210 -746818 -331119
53804 -331119 -129872 -249682 -310265 -121745 10192 -198553 -541491 -634768 -468587 -339302
53794 -339302 -355789 -331468 -150367 43951 90585 27273 -35406 -100320 -224992 -367640 -410325
53783 -410325 -313055 -161327 -40469 87216 308995 548563 533799 113904 -444124 -683768
53773 -683768 -514136 -315459 -405414 -640660 -703572 -547933 -336925 -147191 -6389 -48445
53763 -48445 -320511 -573199 -571327 -488152 -619698 -814077 -637382 -95354 285205 186919
53753 186919 -120898 -275418 -277064 -259966 -193668 -72906 -86321 -312404 -495375 -393303
53743 -393303 -143548 -32912 -86911 -121619 -42413 120294 323540 482203 487608 401142 426000
53732 426000 543847 442870 540 -445968 -559694 -459082 -430938 -466192 -419625 -373101
53722 -373101 -442412 -432623 -119794 274013 327277 37319 -234217 -339008 -414288 -449192 -275967
53711 -275967 913 59457 -97377 -135039 -15170 -122076 -577299 -913213 -716655 -206524
53701 -206524 137199 182823 64088 -196625 -590891 -869515 -794850 -534396 -436395 -486749
53691 -486749 -357961 9863 254486 131986 -92448 -6992 366521 598746 422908 58422
53681 58422 -118752 -68890 -62522 -214192 -295851 -112254 168614 267900 204550 174385 145715
53670 145715 -62851 -328998 -267007 161751 456117 214557 -325310 -638975 -561980 -305162
53660 -305162 -44382 150664 114445 -277211 -752897 -788995 -234672 450243 715954 494661
53650 494661 117889 -161820 -355422 -515428 -563358 -421813 -197372 -106022 -227609 -418371
53640 -418371 -485952 -386804 -222415 -109292 -101727 -172851 -203230 -61783 213565 401248 382643
53629 382643 342633 499128 718813 668461 333992 76580 90105 117354 -111923 -435425
53619 -435425 -516835 -352875 -207140 -145567 17405 297351 383640 46800 -488071 -744185
53609 -744185 -503630 -4566 345518 365582 185320 -8945 -202933 -453161 -643046 -540852
53599 -540852 -151863 180617 173447 -26647 -50174 198412 447975 439616 204153 -68289
53589 -68289 -264652 -373920 -393740 -322662 -210886 -141176 -143729 -151093 -61452 129860 277017
53578 277017 220700 -11225 -210763 -225164 -112660 -37486 -104962 -333927 -655736 -861769
53568 -861769 -715368 -277293 8940 -221714 -764466 -1041722 -789775 -326160 -89963 -142866
53558 -142866 -246260 -248103 -200139 -168927 -117908 1379 149103 228593 176522 15339 -150379
53547 -150379 -198003 -92276 66636 134526 70328 -37756 -96917 -114018 -149382 -219510 -308647
53536 -308647 -436252 -610312 -722403 -628141 -382067 -246081 -353123 -492834 -395220 -125776
53526 -125776 14016 -71554 -170548 -112440 23107 114052 190678 303680 367112 267150 21521
53515 21521 -261127 -487521 -594407 -567759 -483446 -422412 -364840 -312513 -422125 -740628 -891843
53504 -891843 -455894 306761 618685 240711 -172342 -67240 216558 122098 -179202 -180504
53494 -180504 2387 -136092 -485053 -395720 202221 569936 249661 -311799 -522901 -430034
53484 -430034 -394489 -500236 -656063 -852399 -956153 -670406 -85999 140170 -379478 -1099888
53474 -1099888 -1229250 -799773 -488819 -558384 -601576 -337589 -64433 -140897 -448581 -616494
53464 -616494 -523155 -357533 -320884 -428595 -552080 -576734 -527111 -521262 -589584 -631535 -599255
53453 -599255 -584809 -635916 -649654 -575578 -539979 -600949 -579983 -360485 -162060 -241366 -479998
53442 -479998 -573751 -492119 -415425 -342691 -157831 -13913 -205844 -633105 -823145 -592266
53432 -592266 -280723 -180247 -125076 108063 338915 255486 -69047 -271887 -214574 -105878
53422 -105878 -134246 -225192 -216503 -112976 -77556 -220673 -456194 -587089 -532177 -417079 -396373
53411 -396373 -452330 -454789 -344452 -131016 207743 639810 944778 890779 549639 227803
53401 227803 74556 -23773 -151176 -224855 -209901 -211546 -256648 -225629 -108358 -76301 -169521
53390 -169521 -175848 5112 143236 52147 -64377 65060 300867 278631 -31526 -301335
53380 -301335 -354676 -365476 -490067 -599187 -515929 -313504 -200638 -214716 -189863 -8912
53370 -8912 233596 357448 314239 198535 65350 -130540 -353109 -407395 -224194 -91990
53360 -91990 -316507 -696960 -701913 -231542 180184 103188 -219504 -327783 -242865 -306616 -536823
53349 -536823 -607933 -415166 -230924 -254320 -350805 -325828 -185975 -39149 52347 55074 -18759
53338 -18759 -49991 57527 194569 191613 115058 171578 331214 338788 140936 -2878 63673
53327 63673 149628 35717 -201765 -353676 -369967 -322772 -240742 -141466 -98477 -137731 -183981
53316 -183981 -216447 -336903 -566972 -724646 -638862 -364098 -63147 185619 338101 303356
53306 303356 93575 -68662 2198 173852 163453 -48458 -169568 9725 325065 415783
53296 415783 127827 -317216 -545242 -399745 -72358 133441 108992 -33188 -154857 -203231
53286 -203231 -187422 -178656 -287145 -498263 -596881 -426482 -144808 -8629 875 60702 115151
53275 115151 -24448 -247269 -267564 -187037 -389242 -770491 -711063 -90787 318924 -48329
53265 -48329 -645459 -631069 -127659 100956 -92488 -171958 6953 -43782 -489094 -790120
53255 -790120 -579127 -251965 -302694 -588761 -678752 -533292 -405842 -336127 -151588 166045
53245 166045 426679 473658 302402 34159 -134290 -104879 -50507 -201597 -443602 -435187
53235 -435187 -174662 -59006 -256693 -455035 -440342 -469977 -736912 -890907 -545853 46518
53225 46518 315752 153516 -95561 -255446 -433971 -606910 -591175 -446659 -455183 -630031
53215 -630031 -646430 -368997 -90717 -90294 -242173 -252032 -71806 102273 116119 -8377 -158589
53204 -158589 -243114 -229847 -116472 97509 339651 384406 18555 -632608 -1119961 -1136484
53194 -1136484 -804545 -390217 19518 362087 413373 94223 -239264 -193419 99471 187339
53184 187339 -35498 -266486 -337600 -399193 -548982 -664637 -662110 -597155 -476654 -265285
53174 -265285 -67553 5371 89316 327718 476747 213471 -230893 -308519 -33808 7588
53164 7588 -362158 -606209 -389218 -121129 -205366 -373715 -265815 -117375 -280642 -509963
53154 -509963 -374923 -49883 -26885 -282794 -395325 -320220 -383452 -587611 -591255 -374653
53144 -374653 -288452 -383325 -313260 -30137 33335 -308740 -632083 -550347 -255400 -92217
53134 -92217 -15840 149555 252154 49937 -298078 -393630 -158138 119291 240645 276600
53124 276600 274161 101519 -287962 -650546 -699072 -467067 -246327 -177024 -104087 69531
53114 69531 110896 -198961 -586624 -553343 -136357 65312 -199512 -404156 -89785 337341
53104 337341 230634 -221591 -272361 185540 481284 264838 -27691 -9674 74491 -60424
53094 -60424 -206690 -155366 -177486 -508447 -797513 -622679 -208471 -61667 -158205 -88276
53084 -88276 156241 146379 -266171 -728080 -917168 -851260 -626115 -266978 79319 180335
53074 180335 60302 10224 170751 372271 450350 445236 409702 279119 43502 -148499
53064 -148499 -154419 20381 262864 410071 321995 60100 -100240 -31797 19562 -154602
53054 -154602 -282087 2130 458547 476670 6808 -326216 -171208 78716 26319 -86142
53044 -86142 109268 409107 376410 69835 -101561 -69361 -129061 -353022 -471238 -356585
53034 -356585 -213154 -214559 -295873 -375886 -482635 -576111 -514480 -288336 -68317 41477 82842
53023 82842 44431 -158094 -435486 -530952 -393614 -295260 -420905 -579195 -519199 -328908
53013 -328908 -267699 -347154 -359843 -259135 -229291 -362021 -504345 -493324 -351992 -179271
53003 -179271 -23119 43975 -91240 -369194 -486411 -257879 48309 5730 -366097 -593858
52993 -593858 -410773 -101459 -8761 -12585 175310 431769 382988 57166 -110845 19307
52983 19307 76807 -150263 -294640 8702 497098 668278 535602 510323 667103 637444
52973 637444 245458 -199842 -345909 -180191 115483 369506 394275 88551 -313565 -410329
52963 -410329 -180606 -47563 -246640 -477059 -399406 -139271 -3146 8070 53038 63510
52953 63510 -100966 -284789 -236451 -73714 -136227 -423032 -592978 -534278 -512958 -664525
52943 -664525 -731664 -484951 -97615 102739 38098 -132217 -241021 -186376 53589 348968
52933 348968 506193 504934 477933 429477 241227 13370 33916 245447 154779 -415077 -871355
52922 -871355 -610990 59060 336449 96653 -17782 288818 465103 12720 -689678 -917693
52912 -917693 -584487 -212385 -153875 -318234 -546998 -782805 -873752 -645229 -246766 -66261
52902 -66261 -194608 -306397 -197877 -100186 -252338 -475880 -469669 -300606 -261820 -376338
52892 -376338 -389301 -206340 -14762 44358 32406 -2616 -118512 -266158 -238466 29011
52882 29011 294917 285131 -6494 -373952 -606327 -584768 -365370 -225270 -390677 -645478
52872 -645478 -515299 25184 401099 245755 -30571 116020 491001 482664 42100 -292483
52862 -292483 -287311 -266938 -400240 -392851 -119487 35864 -190728 -481223 -488576 -399095 -505375
52851 -505375 -626999 -471694 -243138 -310203 -497103 -318160 185755 457022 280222 65198
52841 65198 158560 362088 327608 59453 -179217 -212296 -72162 40856 -95757 -417614
52831 -417614 -498099 -88931 388104 332946 -127316 -286538 57484 310588 61019 -300399
52821 -300399 -295566 -114101 -171370 -383023 -437352 -436376 -669417 -985461 -990466 -737202 -645009
52810 -645009 -788394 -814206 -587224 -411341 -518479 -764813 -935326 -976627 -847138 -510265
52800 -510265 -170802 -145939 -380767 -454732 -213632 -28601 -230436 -633626 -880125 -958727
52790 -958727 -1072415 -1204811 -1150204 -866000 -517651 -238434 -71243 -80282 -285748 -513005
52780 -513005 -524621 -325433 -167996 -217881 -348256 -321830 -87140 166037 211046 13272
52770 13272 -236206 -317568 -216494 -133964 -245033 -482960 -606517 -479511 -243187 -163767
52760 -163767 -301611 -415195 -290949 -93934 -178068 -531787 -699374 -416580 -49488 -102128
52750 -102128 -483958 -656344 -423214 -151133 -169111 -352818 -428742 -344197 -172412 47599
52740 47599 199780 99224 -200623 -374468 -290169 -222260 -371342 -481780 -270856 25628
52730 25628 -39918 -429035 -669392 -547635 -315487 -183692 -44515 171328 247000 23570
52720 23570 -282380 -375500 -321017 -409312 -673105 -828782 -716791 -541151 -549098 -668136 -670256
52709 -670256 -587382 -671510 -909573 -901941 -436230 72413 57637 -415402 -744671 -638024
52699 -638024 -421977 -422685 -504842 -447698 -353876 -357283 -286574 -21936 110346 -225348 -743634
52688 -743634 -852989 -499645 -192302 -212953 -310229 -237124 -110456 -90676 -116467 -131865 -223015
52677 -223015 -360094 -340427 -165105 -137605 -381987 -586448 -470168 -207346 -106386 -131240
52667 -131240 -62691 68383 52289 -114576 -223915 -169240 -24357 112554 138244 -79148
52657 -79148 -495252 -760954 -574812 -111618 162017 65883 -153747 -236586 -188539 -126663
52647 -126663 -99687 -129841 -226961 -293194 -190267 43927 216033 257662 294277 367662 300141
52636 300141 -22718 -388618 -456397 -154845 251559 463666 410831 234459 105271 77802
52626 77802 82133 35833 -47327 -85366 -60702 -74514 -233303 -496146 -667576 -569787 -238050
52615 -238050 78209 153701 7269 -185375 -362152 -604016 -873485 -940873 -714769 -460786
52605 -460786 -464391 -602041 -528032 -228426 -63520 -218260 -433147 -420917 -272557 -238244
52595 -238244 -323218 -368951 -395889 -560489 -806976 -855170 -596201 -266765 -122181 -123711 -99449
52584 -99449 -73685 -229958 -584887 -895448 -945471 -794439 -658995 -630594 -608750 -478627
52574 -478627 -265229 -112201 -160294 -422705 -716174 -756979 -442811 -40463 39363 -297416
52564 -297416 -706722 -806384 -579226 -288730 -120896 -63500 -64461 -124916 -225918 -291043 -244067
52553 -244067 -37279 329013 709561 811055 468561 -91770 -458541 -517469 -521750 -640222
52543 -640222 -691996 -481253 -169988 -62186 -135789 -78739 213091 445515 334160 -182
52533 -182 -211661 -187660 -124571 -165963 -177047 14294 291960 352681 110839 -174002 -228994
52522 -228994 -83726 41003 39088 -23371 -76719 -117510 -144193 -165923 -252766 -437149 -586969
52511 -586969 -529225 -286893 -32648 169879 371614 486826 308199 -131560 -471733 -470603
52501 -470603 -333646 -382632 -559431 -521108 -163937 191512 166139 -265187 -739615 -819790
52491 -819790 -402912 114620 194012 -229494 -639980 -587523 -243367 -78775 -187378 -282483
52481 -282483 -257988 -310864 -471523 -460548 -196780 -68902 -403924 -918845 -1038518 -635169
52471 -635169 -144080 12818 -152896 -367594 -451933 -416596 -346435 -298268 -276046 -259267 -252965
52460 -252965 -285095 -336760 -333423 -256997 -207016 -274495 -402165 -461747 -445166 -478394 -629417
52449 -629417 -779890 -739559 -472962 -173128 -73330 -183700 -281912 -219756 -152707 -327906
52439 -327906 -693741 -917974 -814101 -539914 -307428 -132307 -9897 -91993 -430424 -709206
52429 -709206 -549589 -36660 340110 277199 -55784 -326730 -381906 -233861 27193 209364
52419 209364 134368 -106011 -217712 -144641 -197072 -555661 -891339 -774771 -313757 -38468
52409 -38468 -188835 -451583 -464230 -277447 -165751 -204419 -241784 -175098 -61393 6920 -2674
52398 -2674 -75523 -160453 -192372 -181952 -231156 -362796 -405676 -209184 61659 60860 -252962
52387 -252962 -484769 -313118 40130 90228 -245487 -553508 -522441 -337427 -324998 -456887
52377 -456887 -478074 -387843 -458222 -763583 -1000930 -905911 -617892 -449688 -456262 -453641 -381731
52366 -381731 -403313 -618344 -872320 -931918 -738261 -417086 -126847 38085 74393 81007
52356 81007 189016 403127 553636 482492 243956 37244 -34828 -38574 -46035 -29186 21413
52345 21413 -17112 -268009 -640810 -872952 -813630 -580834 -392469 -311841 -232109 -79272
52335 -79272 53483 -135 -283375 -638594 -831949 -769914 -593982 -528961 -621250 -673519 -486274
52324 -486274 -126642 121292 72848 -164995 -334535 -284414 -47278 253802 477646 480422
52314 480422 191983 -265233 -611739 -659985 -520641 -488178 -700749 -971902 -1006105 -748651
52304 -748651 -461190 -444668 -726560 -1035198 -1061894 -748581 -345238 -185152 -373106 -690483
52294 -690483 -828419 -695462 -453760 -287896 -233721 -234189 -242288 -218498 -135567 -58587 -114195
52283 -114195 -285377 -348707 -155167 118652 176629 576 -163099 -189814 -209461 -309278
52273 -309278 -355304 -248701 -162884 -324944 -664738 -874473 -783484 -526087 -349858 -373950
52263 -373950 -535680 -685056 -717804 -653543 -574258 -499213 -407632 -378646 -537730 -798695 -866761
52252 -866761 -655852 -503968 -725040 -1096718 -1120268 -733075 -405519 -482077 -764858 -883051
52242 -883051 -780184 -637795 -543353 -460836 -379018 -285627 -119074 72249 61427 -255628
52232 -255628 -611339 -655611 -407952 -183199 -146237 -211861 -330660 -544583 -728649 -614589
52222 -614589 -198136 157952 192098 75975 91157 193065 135850 -126166 -414768 -602869
52212 -602869 -675350 -598474 -374959 -176611 -177194 -287085 -298222 -248902 -343513 -515912 -444371
52201 -444371 -107001 54824 -244011 -665945 -714446 -426390 -235747 -298485 -360151 -253490
52191 -253490 -125388 -107130 -110513 -69856 -83270 -166035 -141723 36731 108266 -127207 -465172
52180 -465172 -570405 -428769 -263094 -144736 2862 107819 3895 -228308 -309707 -204194
52170 -204194 -192763 -406387 -598453 -552920 -435201 -498369 -670658 -727258 -706837 -817079
52160 -817079 -999292 -948865 -612500 -340605 -406855 -624404 -630301 -388466 -201616 -298169
52150 -298169 -589717 -823159 -834183 -633821 -342411 -82489 86609 145223 66693 -128365
52140 -128365 -291456 -266321 -131187 -145832 -352582 -430015 -149148 198294 135505 -320751
52130 -320751 -678267 -675382 -574005 -627331 -665975 -492301 -348670 -585064 -1045880 -1220907
52120 -1220907 -952058 -591126 -437652 -399508 -304534 -207756 -222683 -300428 -344772 -358503 -351625
52109 -351625 -292872 -253087 -376190 -591686 -604512 -326237 -56322 -33094 -73313 68932
52099 68932 232962 97932 -267248 -486451 -429289 -315661 -302422 -318360 -312237 -326681 -299091
52088 -299091 -115205 102685 93543 -105418 -170788 -21067 47176 -115237 -250857 -181327
52078 -181327 -160215 -419834 -697909 -620676 -325429 -257947 -477278 -612656 -487969 -355236
52068 -355236 -420840 -510799 -383574 -111177 64681 104617 194358 439836 692185 718373
52058 718373 489136 225949 125742 108893 -28764 -249552 -288815 -98325 -1928 -224507
52048 -224507 -514964 -515734 -309123 -250891 -395680 -485881 -455755 -514344 -681146 -663465 -344339
52037 -344339 -33374 -32866 -242204 -394405 -428355 -412421 -331599 -192951 -163108 -360010 -630781
52026 -630781 -732634 -624824 -434997 -283632 -279965 -495647 -766201 -733368 -308611 109799
52016 109799 130044 -132346 -328109 -417808 -569213 -700990 -583271 -303354 -169501 -181751
52006 -181751 -69032 137294 81505 -268381 -478617 -354138 -272993 -518514 -759032 -614478
51996 -614478 -347675 -467690 -892881 -1062988 -780990 -416501 -265344 -194115 -33764 87790
51986 87790 7373 -167176 -225293 -152403 -90595 -112152 -150426 -86771 136759 406952 453645
51975 453645 120711 -374887 -631008 -537154 -379565 -419157 -568027 -598035 -494832 -431939
$$ [...]
##END NTUPLES=NMR SPECTRUM
##END=
