##TITLE=31Pdec_LR-773-RM1
  
  24 sc
 24.10.2023
##JCAMPDX= 6.0         $$ Bruker NMR JCAMP-DX V2.0
##DATA TYPE= NMR SPECTRUM
##DATA CLASS= NTUPLES
##ORIGIN= UXNMR, Bruker Analytische Messtechnik GmbH
##OWNER= root
$$ XWIN-NMR		Version 3.5
$$ Tue Oct 24 14:18:22 2023 Russian Standard Time (UT+4h)  she@DPX200
##.OBSERVE FREQUENCY= 81.013821
##.OBSERVE NUCLEUS= ^31P
##.ACQUISITION MODE= SIMULTANEOUS
##.ACQUISITION SCHEME= undefined
##.AVERAGES= 24
##.DIGITISER RES= 16
##SPECTROMETER/DATA SYSTEM= spect
##.PULSE SEQUENCE= zgpg30
##.SOLVENT NAME= CDCl3
##.SHIFT REFERENCE= (INTERNAL, CDCl3, 0, 248.564)
##AUDIT TRAIL= $$ (NUMBER, WHEN, WHO, WHERE, WHAT)
$$ ##TITLE= Audit trail, XWIN-NMR		Version 3.5
$$ ##JCAMPDX= 5.01
$$ ##ORIGIN= Bruker BioSpin GmbH
$$ ##OWNER= she
$$ F:/spectra/data/she/nmr/P31/1/pdata/1/auditp.txt
$$ ##AUDIT TRAIL=  $$ (NUMBER, WHEN, WHO, WHERE, WHAT)
(   1,<2023-10-24 14:17:16.20 +0400>,<she>,<DPX200>,
      <created by zg, POWCHK disabled, PULCHK disabled
       configuration hash MD5:
       00 E9 B6 7A A2 85 ED C7 34 08 36 98 17 FE 4E 26
       data hash MD5: 32K
       CA D5 D2 0D 1B E8 EC 3F 77 CC AD DB 25 CD C9 9E>)
(   2,<2023-10-24 14:17:19.06 +0400>,<she>,<DPX200>,
      <Start of raw data processing
       efp BC_mod = 2 LB = 5 FT_mod = 6 PKNL = 1 PHC0 = -10680.02 PHC1 = 76.0864 SI = 64K 
       data hash MD5: 64K
       7A 5E 3C B7 26 7B 78 63 20 CE 2C B5 96 B6 0F 66>)
(   3,<2023-10-24 14:17:35.40 +0400>,<she>,<DPX200>,
      <pk PHC0 = 15.75009 PHC1 = 0 
       data hash MD5: 64K
       C8 53 94 53 D0 F3 D9 5E 6B 91 2B D5 53 8D 2D 80>)
(   4,<2023-10-24 14:17:38.92 +0400>,<she>,<DPX200>,
      <abs ABSG = 5 
       data hash MD5: 64K
       08 AB 41 D1 24 6D F2 95 DD EB C9 89 25 3A 74 AD>)
(   5,<2023-10-24 14:17:54.79 +0400>,<she>,<DPX200>,
      <pk PHC0 = 1.393499 PHC1 = 0 
       data hash MD5: 64K
       B6 A6 58 81 E3 C4 FC 9D 95 E5 AD DF DD 22 E4 1A>)
$$ ##END=
$$ 
$$ hash MD5
$$ 66 73 2F 49 16 A7 10 6E 4C 1F 2D 79 C3 5F FA 9C
##$RELAX= 
##$RELAX= 
##$RELAX= 
##$RELAX= 
##$RELAX= 
##$RELAX= 
##$RELAX= 
##$RELAX= 
##$RELAX= 
$$ Bruker specific parameters
$$ --------------------------
##$DU= <F:/spectra>
##$EXPNO= 1
##$NAME= <P31>
##$PROCNO= 1
##$TYPE= <nmr>
##$USER= <she>
##$AMP= (0..31)
100 100 100 100 100 100 100 100 100 100 100 100 100 100 100 100 100 100 
100 100 100 100 100 100 100 100 100 100 100 100 100 100 
##$AQSEQ= 0
##$AQ_mod= 1
##$AUNM= <au_zg>
##$AUTOPOS= <>
##$BF1= 81.014009
##$BF2= 200.13
##$BF3= 200.13
##$BF4= 200.13
##$BF5= 200.13
##$BF6= 200.13
##$BF7= 200.13
##$BF8= 200.13
##$BYTORDA= 1
##$CFDGTYP= 0
##$CFRGTYP= 5
##$CHEMSTR= <none>
##$CNST= (0..31)
1 1 145 1 1 1 1 1 1 1 1 1 1 1 1 1 1 1 1 1 1 1 1 1 1 1 1 1 1 1 1 1 
##$CPDPRG= <waltz16>
##$CPDPRG1= <>
##$CPDPRG2= <waltz16>
##$CPDPRG3= <>
##$CPDPRG4= <mlev>
##$CPDPRG5= <mlev>
##$CPDPRG6= <mlev>
##$CPDPRG7= <mlev>
##$CPDPRG8= <mlev>
##$CPDPRGB= <>
##$CPDPRGT= <>
##$D= (0..31)
0 1 0 0 0 0 0 0 0 0 0 0.03 2e-05 3e-06 0 0 0 0 0 0 0 0 0 0 0 0 0 0 0 0 
$$ [...]
##$SUBNAM3= <"">
##$SUBNAM4= <"">
##$SUBNAM5= <"">
##$SUBNAM6= <"">
##$SUBNAM7= <"">
##$SUBNAM8= <"">
##$SUBNAM9= <"">
##$SW= 501.771253377433
##$SWIBOX= (0..15)
0 1 3 0 0 0 0 0 0 0 0 0 0 0 0 0 
##$SW_h= 40650.406504065
##$TD= 32768
##$TD0= 1
##$TE= 0
##$TE2= 300
##$TE3= 300
##$TEG= 300
##$TL= (0..7)
0 120 53 12 22 120 120 120 
##$TP= (0..7)
150 150 150 150 150 150 150 150 
##$TP07= 0
##$TPNAME0= <>
##$TPNAME1= <>
##$TPNAME2= <>
##$TPNAME3= <>
##$TPNAME4= <>
##$TPNAME5= <>
##$TPNAME6= <>
##$TPNAME7= <>
##$TPOAL= (0..7)
0.5 0.5 0.5 0.5 0.5 0.5 0.5 0.5 
##$TPOFFS= (0..7)
0 0 0 0 0 0 0 0 
##$TUNHIN= 0
##$TUNHOUT= 0
##$TUNXOUT= 0
##$USERA1= <user>
##$USERA2= <user>
##$USERA3= <user>
##$USERA4= <user>
##$USERA5= <user>
##$V9= 5
##$VALIST= <valist>
##$VCLIST= <CCCCCCCCCCCCCCC>
##$VD= 0
##$VDLIST= <DDDDDDDDDDDDDDD>
##$VPLIST= <PPPPPPPPPPPPPPP>
##$VTLIST= <TTTTTTTTTTTTTTT>
##$WBST= 1024
##$WBSW= 4
##$XGAIN= (0..3)
0 0 0 0 
##$XL= 0
##$YL= 0
##$YMAX_a= 22731
##$YMIN_a= -23937
##$ZGOPTNS= <>
##$ZL1= 120
##$ZL2= 120
##$ZL3= 120
##$ZL4= 120
##$ABSF1= 248.5645
##$ABSF2= -253.2056
##$ABSG= 5
##$ABSL= 3
##$ALPHA= 0
##$AQORDER= 0
##$ASSFAC= 0
##$ASSFACI= 0
##$ASSFACX= 0
##$ASSWID= 0
##$AUNMP= <proc_1d>
##$AZFE= 0.1
##$AZFW= 0.5
##$BCFW= 0
##$BC_mod= 2
##$BYTORDP= 0
##$COROFFS= 0
##$CY= -3
##$DATMOD= 1
##$DC= 0
##$DFILT= <>
##$DTYPP= 0
##$F1P= 0
##$F2P= 0
##$FCOR= 1
##$FTSIZE= 65536
##$FT_mod= 6
##$GAMMA= 0
##$GB= 0
##$INTBC= 1
##$INTSCL= 6.047779e-11
##$ISEN= 30
##$LB= 5
##$LEV0= 0
##$LPBIN= 0
##$MAXI= 10000
##$MC2= 0
##$MEAN= 0
##$ME_mod= 0
##$MI= 50
##$NCOEF= 0
##$NC_proc= -5
##$NLEV= 6
##$NOISF1= 182.463
##$NOISF2= 159.3651
##$NSP= 0
##$NTH_PI= 0
##$NZP= 0
##$OFFSET= 248.5645
##$PC= 4
##$PHC0= -10662.88
##$PHC1= 76.0864
##$PH_mod= 1
##$PKNL= yes
##$PPARMOD= 0
##$PSCAL= 0
##$PSIGN= 0
##$REVERSE= no
##$SF= 81.0140089999694
##$SI= 65536
##$SIGF1= 159.3651
##$SIGF2= -187.1042
##$SINO= 113.3802
##$SIOLD= 16384
##$SREGLST= <1H.CDCl3>
##$SSB= 0
##$STSI= 65536
##$STSR= 0
##$SW_p= 40650.406504065
##$SYMM= 0
##$S_DEV= 0
##$TDeff= 32768
##$TDoff= 0
##$TI= <>
##$TILT= no
##$TM1= 0
##$TM2= 0
##$TOPLEV= 0
##$USERP1= <user>
##$USERP2= <user>
##$USERP3= <user>
##$USERP4= <user>
##$USERP5= <user>
##$WDW= 1
##$XDIM= 65536
##$YMAX_p= 325125092
##$YMIN_p= -2951786
$$ End of Bruker specific parameters
$$ ---------------------------------
##NTUPLES= NMR SPECTRUM
##VAR_NAME=  FREQUENCY,     SPECTRUM/REAL,   SPECTRUM/IMAG
##SYMBOL=    X,             R,               I
##VAR_TYPE=  INDEPENDENT,   DEPENDENT,       DEPENDENT
##VAR_FORM=  AFFN,          ASDF,            ASDF
##VAR_DIM=   65536,         65536,           65536
##UNITS=     HZ,            ARBITRARY UNITS, ARBITRARY UNITS
##FACTOR=    0.620285442955139, 1,           1
##FIRST=     20137.2065510682, 0,            0
##LAST=      -20513.1999529968, 0,           0
##MIN=       -20513.1999529968, -2951786,    0
##MAX=       20137.2065510682, 325125092,    0
$$ Real data points
##PAGE= N=1
##DATA TABLE= (X++(R..R)), XYDATA
$$ [...]
$$ plain form
43313 210421 145227 97837 69236 49833 33606 25696 36385 69113 113802 150947 163761 148342
43301 148342 111884 62100 2628 -60948 -118905 -167999 -218182 -277872 -333765 -356639 -330616
43290 -330616 -268705 -196424 -129090 -70914 -27699 -9187 -19499 -51976 -94035 -134010 -165151
43279 -165151 -187450 -205407 -221845 -235098 -242948 -245187 -240448 -227401 -215123 -226267 -279579 -369303
43267 -369303 -468849 -553979 -615226 -650233 -658229 -649579 -651239 -689178 -761997 -835737 -866817 -831884
43255 -831884 -741319 -629847 -533338 -468612 -430571 -405741 -385434 -365522 -339739 -301432 -252572
43244 -252572 -203895 -161576 -118051 -62039 4499 66707 114275 149618 174275 176650 145349 91850
43232 91850 45760 22196 3460 -39036 -110584 -188757 -248494 -281925 -294672 -292961 -278684 -251752
$$ packed form
43313B10421o5194m7390k8601j9403j6227p910J0689L2728M4689L7145J2814j5419
43301A48342l6458m9784n9472o3576n7957m9094n0183n9690n5893k2874K6023
43290c30616O1911P2281O7334N8176M3215J8512j0312l2477m2059l9975l1141
43279a65151k2299j7957j6438j3253p850k239M739J3047J2278j1144n3312q9724
43267c69303r9546q5130o1247l5007p996Q650j660l7939p2819p3740l1080L4933
43255h31884R0565J11472R6509O4726L8041K4830K0307J9912K5783L8307M8860
43244b52572M8677M2319M3525N6012O6538O2208M7568L5343K4657K375l1301n3499
43232I1850m6090k3564j8736m2496p1548p8173n9737l3431j2747J711J4277K6932
$$ plain form
43220 -251752 -213346 -169394 -132662 -118364 -134773 -178208 -236749 -297205 -350348 -394333 -434610
43209 -434610 -477624 -523515 -567283 -606781 -645010 -682475 -711086 -719767 -706212 -681969 -665818 -670528
43197 -670528 -692371 -712006 -707490 -668290 -597440 -503504 -395352 -284496 -185611 -108852 -51549
43186 -51549 476 62268 137802 214588 270267 290111 282041 272955 287811 331835 390771 443180
43174 443180 471406 467398 434828 385263 329100 270519 212439 162719 130616 117757 117018 121269
43162 121269 130172 146637 168361 185108 185304 165809 135274 106771 85424 62176 19676 -53976
43150 -53976 -153518 -255512 -330584 -361312 -350996 -315788 -270395 -223036 -180324 -150022 -137289
43139 -137289 -142185 -162239 -194522 -235378 -282369 -336571 -397736 -456724 -499129 -518096 -517195 -499474
$$ packed form
43220b51752L8406M3952L6732J4298j6409m3435n8541o0456n3143m3985m0277
43209d34610m3014m5891m3768l9498l8229l7465k8611q681J3555K4243J6151m710
43197f70528k1843j9635M516L9200P0850R3936J08152J10856R8885P6759N7303
43186e1549N2025O1792P5534P6786N5679J9844q070r086J4856M4024N8936N2409
43174D43180K8226m008l2570m9565n6163n8581n8080m9720l2103j2859p39M251
43162A21269Q903J6465K1724J6747J96j9495l0535k8503k1347k3248m2500p3652
43150e3976r9542j01994p5072l0728J0316L5208M5393M7359M2712L0302J2733
43139a37289m896k0054l2283m0856m6991n4202o1165n8988m2405j8967R01J7721
$$ plain form
43127 -499474 -463589 -416077 -377292 -364090 -371018 -378026 -373304 -359238 -340133 -317430 -297616 -291398
43115 -291398 -298854 -304129 -291570 -262110 -228841 -201221 -178432 -153579 -118317 -66231 1157 70195
43103 70195 120676 138750 126305 99455 76701 64074 49695 15472 -43766 -114004 -174557 -212731
43091 -212731 -225183 -211829 -176182 -130691 -93676 -75201 -66266 -44572 8034 94139 205458
43080 205458 334462 476263 619291 741374 821917 857617 862763 855225 845065 833435 815662
43069 815662 785350 741707 693941 652641 615145 565056 488938 389689 283026 187150 116966
43058 116966 78382 60344 37681 -9058 -76055 -141259 -184246 -198607 -191260 -178146 -178787 -206169
43046 -206169 -258001 -319087 -371226 -399826 -396686 -363915 -314160 -260603 -206164 -146394 -81443 -20003
$$ packed form
43127d99474L5885M7512L8785J3202o928p008M722J4066J9105K2703J9814O218
43115b91398p456n275J2559K9460L3269K7620K2789K4853L5262N2086O7388O9038
43103G0195N0481J8074j2445k6850k2754j2627j4379l4223n9238p0238o0553l8174
43091b12731j2452J3354L5647M5491L7015J8475Q935K1694N2606Q6105J11319
43080B05458J29004J41801J43028J22083Q0543L5700N146p538j0160j1630j7773
43069H15662l0312m3643m7766m1300l7496n0089p6118r9249j06663r5876p0184
43058A16966l8584j8038k2663m6739o6997o5204m2987j4361P347J3114o41k7382
43046b06169n1832o1086n2139k8600L140L2771M9755N3557N4439N9770O4951O1440
$$ plain form
43034 -20003 27418 53941 57041 41438 21491 13206 20987 36059 47379 48664 37350 17792
43022 17792 7706 29045 83700 145083 182619 191007 189227 196822 221221 264383 327204 401706
43010 401706 467433 504331 509079 496144 484023 482077 488534 497172 503495 504968 499293 488041 482692
42997 482692 500097 544966 598607 631582 628612 597662 556738 519616 495517 492207 509557 532068
42985 532068 535793 505933 447070 378777 324883 303435 317391 349751 371859 363236 326346 282822
42973 282822 256479 258574 283363 312325 324191 307392 266936 219197 179540 154399 141084 129513
42961 129513 104752 55755 -13143 -83036 -137627 -177278 -211223 -238676 -245333 -219526 -165437 -98567
42949 -98567 -35107 10218 23474 -605 -49116 -96277 -122525 -127947 -127737 -137676 -163911 -201965
$$ packed form
43034b0003M7421K6523L100j5603j9947q285P781J5072J1320J285j1314j9558
43022A7792j0086K1339N4655O1383L7536Q388j780P595K4399M3162O2821P4502
43010D01706O5727L6898M748j2935j2121j946O457Q638O323J473n675j1252n349
42997D82692J7405M4869N3641L2975k970l0950m0924l7122k4099l310J7350K2511
42985E32068L725k9860n8863o8293n3894k1448J3956L2360K2108q623l6890m3524
42973B82822k6343K095K4789K8962J1866j6799m0456m7739l9657k5141j3315j1571
42961A29513k4761m8997o8898o9893n4591l9651l3945k7453o657K5807N4089O6870
42949i8567O3460M5325J3256k4079m8511m7161k6248n422K10r939k6235l8054
$$ plain form
42937 -201965 -241856 -275187 -299837 -318065 -329444 -326703 -300402 -248261 -179206 -107813 -44893 7093
42925 7093 51400 92202 132363 172752 210974 242303 265754 289259 324225 371981 418177 443966
42913 443966 442116 420672 393165 368482 348726 332527 319308 312316 317342 336114 361405 381646
42901 381646 390705 390849 386735 380087 370240 355108 329806 289323 237605 192706 178867 211490 287977
42888 287977 388602 483926 546739 565829 551645 525765 502137 478382 443684 390927 319779
42877 319779 232490 132565 28224 -67327 -143445 -200665 -250258 -303647 -361076 -409391 -430269
42866 -430269 -412401 -359056 -285744 -209677 -140228 -79057 -27257 12172 40351 65641 95034
42855 95034 124115 141695 145122 145917 158745 189759 237674 299646 369158 430350 462152 452077
$$ packed form
42937b01965l9891l3331k4650j8228j1379K741K6301N2141O9055P1393O2920N1986
42925G093M4307M0802M0161M0389L8222L1329K3451K3505L4966M7756M6196K5789
42913D43966j850k1444k7507k4683j9756j6199j3219o992N026J8772K5291K0241
42901C81646R059J44m114o648r847j5132k5302m0483n1718m4899j3839L2623P6487
42888B87977J00625R5324O2813J9090j4184k5880k3628k3755l4698n2757p1148
42877C19779q7289r9925j04341r5551p6118n7220m9593n3389n7429m8315k0878
42866d30269J7868N3345P3312P6067O9449O1171N1800L9429K8179K5290K9393
42855I5034K9081J7580L427P95J2828L1014M7915O1972O9512O1192L1802j0075
$$ plain form
42843 452077 405077 337876 264803 188748 105371 15857 -66214 -123291 -148570 -149364 -137140 -119999
42831 -119999 -105279 -100357 -104240 -103826 -86798 -56519 -27921 -10925 -4823 -7152 -19037 -40079 -65039
42818 -65039 -88260 -106910 -119876 -130180 -149164 -188993 -245776 -296340 -317865 -307842 -282048 -258445
42806 -258445 -247143 -248779 -253093 -240740 -195411 -118339 -30277 39797 68767 50691 2849 -41146
42794 -41146 -52113 -22287 38251 116700 203042 284843 347138 379856 379568 343944 273198 180337
42782 180337 91850 30160 -3200 -22683 -38206 -42728 -19645 39644 125447 215890 292999 352150
42770 352150 396027 423917 431992 421461 398599 365606 319057 261336 208209 180373 190312 238832
42758 238832 317245 406586 479804 514401 505020 461260 395979 320444 247269 189189 152570 136393
$$ packed form
42843D52077m7000o7201p3073p6055q3377q9514q2071n7077k5279p94J2224J7141
42831a19999J4720M922l883M14J7028L0279K8598J6996O102k329j1885k1042k4960
42818f5039k3221j8650j2966j0304j8984l9829n6783n0564k1525J0023K5794K3603
42806b58445J1302j636m314J2353M5329P7072Q8062P0074K8970j8076m7842m3995
42794d1146j0967K9826O0538P8449Q6342Q1801O2295L2718k88l5624p0746r2861
42782A80337q8487o1690l3360j9483j5523m522K3083N9289Q5803R0443P7109N9151
42770C52150M3877K7890Q075j0531k2862l2993m6549n7721n3127k7836R939M8520
42758B38832P8413Q9341P3218L4597r381m3760o5281p5535p3175n8080l6619j6177
$$ plain form
42746 136393 137778 154020 179744 208416 237733 267109 287779 283142 245585 189693 142795 122944
42734 122944 128807 147302 164330 168563 152629 115966 65177 9107 -45496 -92450 -123059 -128845
42722 -128845 -108999 -73372 -35716 -3002 28164 64058 103050 133112 140354 119633 77070 24328
42710 24328 -26926 -65164 -78332 -59234 -14443 34550 63655 62155 36867 2055 -31657 -58396
42698 -58396 -72928 -71762 -58102 -39860 -18967 15162 77284 169768 274751 363071 411778 415672
42686 415672 385461 337142 282713 227752 173332 118155 61449 7797 -31175 -43895 -29397
42675 -29397 1311 35335 66556 93303 111744 115530 99409 59336 -7874 -98064 -193098 -268428
42663 -268428 -311499 -328820 -332281 -323813 -298905 -261015 -223434 -194844 -168355 -128056 -64115 19805
$$ packed form
42746A36393J385J6242K5724K8672K9317K9376K0670m637l7557n5892m6898j9851
42734A22944N863J8495J7028M233j5934l6663n0789n6070n4603m6954l0609n786
42722a28845J9846L5627L7656L2714L1166L5894L8992L0062P242k0721m2563n2742
42710B4328n1254l8238j3168J9098M4791M8993K9105j500k5288l4812l3712k6739
42698e8396j4532J166J3660J8242K0893L4129O2122R2484J04983Q8320M8707L894
42686D15672l0211m8319n4429n4961n4420n5177n6706n3652l8972j2720J4498
42675b9397L0708L4024L1221K6747J8441L786j6121m0073o7210r0190r5034p5330
42663b68428m3071j7321l461Q468K4908L7890L7581K8590K6489M0299O3941Q3920
$$ plain form
42651 19805 110402 192736 256186 296626 315087 315287 303227 287862 278420 278856 286244 295991 306942
42638 306942 319596 330993 334484 324697 300771 264518 217720 163138 108174 65999 50408 66685
42626 66685 106443 152298 187705 201947 189080 149202 93474 41354 5666 -17950 -41004 -63117
42614 -63117 -70208 -52310 -15667 26108 66209 104233 136311 153497 150467 131680 108838 94740
42602 94740 96888 110729 117769 95645 34760 -54151 -148017 -225120 -272767 -288043 -276078 -247077
42590 -247077 -212074 -179752 -155662 -141912 -136828 -137065 -141724 -152821 -170030 -186426 -192003 -181376
42578 -181376 -156432 -121919 -81176 -37843 -547 17022 4200 -35357 -80017 -102017 -89044
42567 -89044 -56365 -34275 -39157 -56139 -51848 -4466 79536 175874 264238 337866 397149 441264
$$ packed form
42651A9805R0597Q2334O3450M0440J8461K00j2060j5365r442M36P388R747J0951
42638C06942J2654J1397L491r787k3926l6253m6798n4582n4964m2175j5591J6277
42626F6685L9758M5855L5407J4242j2867l9878n5728n2120l5688k3616k3054k2113
42614f3117p091J7898L6643M1775M0101L8024L2078J7186l030j8787k2842j4098
42602I4740K148J3841P040k2124o0885q8911r3866p7103m7647j5276J1965K9001
42590b47077L5003L2322K4090J3750N084k37m659j1097j7209j6396n577J0627
42578a81376K4944L4513M0743M3333L7296J7569j2822l9557m4660k2000J2973
42567h9044L2679K2090m882j6982M291M7382Q4002R6338Q8364P3628N9283M4115
$$ plain form
42555 441264 467427 473638 459247 425535 378708 330033 288640 254188 220792 189927 176078 195499
42543 195499 249059 318187 378083 413322 420746 401611 356825 291341 218504 153815 102558 56149
42531 56149 3052 -57138 -111660 -146550 -160363 -166293 -180098 -204368 -224384 -220765 -186593 -131271
42519 -131271 -68821 -6082 56616 117572 170601 208641 227844 229565 220860 210970 203329 191502
42507 191502 166486 127546 82726 40150 3698 -24214 -44085 -66956 -112934 -194000 -299770
42496 -299770 -405752 -494778 -565589 -621916 -660701 -674617 -662128 -630661 -590344 -546811 -500322
42485 -500322 -451244 -406049 -376045 -367122 -370462 -366970 -343614 -304354 -264089 -235169 -223664 -236280
42473 -236280 -282517 -363803 -461675 -542158 -575867 -555542 -495728 -418128 -338338 -263851 -199384
$$ packed form
42555D41264K6163O211j4391l3712m6827m8675m1393l4452l3396l0865j3849J9421
42543A95499N3560O9128N9896L5239P424j9135m4786o5484p2837o4689n1257m6409
42531E6149n3097o0190n4522l4890j3813n930j3805k4270k0016L619L4172N5322
42519a31271O2450O2739O2698O0956N3029L8040J9203J721q705r890p641j1827
42507A91502k5016l8940m4820m2576l6452k7912j9871k2871m5978q1066j05770
42496b99770j05982q9026p0811n6327l8785j3916J2489L1467M0317M3533M6489
42485e00322M9078M5195L0004Q923l340L492K3356L9260M0265K8920J1505j2616
42473b36280m6237q1286r7872q0483l3709K0325N9814P7600P9790P4487O4467
$$ plain form
42462 -199384 -149762 -116838 -95646 -76139 -50527 -20066 4914 12318 -2609 -33451 -66634 -89796
42450 -89796 -98732 -99551 -105142 -126082 -159680 -187199 -187365 -157786 -121677 -108930 -130498 -174454 -224084
42437 -224084 -270549 -305301 -311401 -274868 -203497 -125021 -64993 -32747 -28506 -53156 -104341 -169178
42425 -169178 -228468 -266502 -274132 -248901 -200099 -149685 -117424 -102916 -88408 -60321 -21866 16670
42413 16670 52336 89576 130768 171715 204086 218508 208072 174540 132324 103061 102970 132881
42401 132881 178086 217362 234442 223717 187985 135435 81540 48128 49657 76238 96231 81657
42389 81657 30370 -37403 -99384 -145350 -177663 -205395 -235709 -263621 -269989 -236128 -163541 -76637
42377 -76637 -4374 39831 61847 75070 85668 85752 59710 341 -79019 -149978 -188976 -193009
$$ packed form
42462a99384M9622L2924K1192J9507K5612L0461K4980P404j4927l0842l3183k3162
42450h9796q936q19n591k0940l3598k7519j66K9579L6109J2747k1568m3956m9630
42437b24084m6465l4752o100L6533P1371P8476O0028L2246M241k4650n1185o4837
42425a69178n9290l8034p630K5231M8802N0414L2261J4508J4508K8087L8455L8536
42413A6670L5666L7240M1192M0947L2371J4422j0436l3532m2216k9263r1K9911
42401A32881M5205L9276J7080j0725l5732n2550n3895l3412J529K6581J9993j4574
42389H1657n1287o7773o1981m5966l2313k7732l0314k7912o368L3861P2587Q6904
42377g6637P2263M4205K2016J3223J0598Q4k6042n9369p9360p0959l8998m033
$$ plain form
42365 -193009 -177790 -163216 -160386 -168469 -179660 -185826 -182037 -166868 -141985 -110662 -73107 -22355
42353 -22355 50834 145725 247847 342765 432245 531769 652170 788304 925762 1053564 1169218
42342 1169218 1276961 1384706 1499584 1622675 1747808 1864304 1957109 2005090 1987796 1901415
42332 1901415 1766745 1616623 1474765 1347360 1230619 1120302 1014513 913498 820412 740888
42322 740888 680443 642366 626356 625710 625576 608091 562744 492026 407336 321920 248326 197325
42310 197325 171737 159597 139214 97708 45744 11036 15776 60919 130812 208049 281924 348138
42298 348138 407664 466259 529973 599655 673218 753569 848639 960144 1076625 1183295 1278087
42287 1278087 1373718 1483878 1611281 1750803 1901159 2069133 2259538 2459795 2635622 2746013
$$ packed form
42365a93009J5219J4574K830q083j1191o166L789J5169K4883L1323L7555N0752
42353b2355P3189R4891J02122R4918Q9480R9524J20401J36134J37458J27802J15654
42342A169218J07743J07745J14878J23091J25133J16496R2805M7981j7294q6381
42332A901415j34670j50122j41858j27405j16741j10317j05789j01015r3086p9524
42322G40888o0445l8077j6010o46j34j7485m5347p0718q4690q5416p3594n1001
42310A97325k5588j2140k0383m1506n1964l4708M740M5143O9893P7237P3875O6214
42298C48138N9526N8595O3714O9682P3563Q0351R5070J11505J16481J06670R4792
42287A278087R5631J10160J27403J39522J50356J67974J90405K00257J75827J10391
$$ plain form
42277 2746013 2766720 2700967 2569156 2392089 2185393 1963176 1737030 1509995 1279647 1053106
42267 1053106 854783 711768 630366 590509 563384 531370 491891 449082 406839 367029 328840
42256 328840 289737 250790 221030 211893 225114 249059 269592 282814 295372 315043 344252 380614
42244 380614 418531 449017 461860 451769 423427 389988 364787 351116 338401 311323 266199
42233 266199 217117 183255 172253 179782 202081 241285 297963 365589 434494 494798 533495 537931
42221 537931 509635 469283 439477 424265 410900 387235 348583 290357 206764 101464 -8043
42210 -8043 -101701 -168190 -203003 -203215 -171454 -121319 -71116 -31150 -32 28114 56152 81375
42198 81375 95469 88211 57081 14519 -18512 -27696 -11205 28636 91920 174578 260833 331304
$$ packed form
42277B746013K0707o5753j31811j77067k06696k22217k26146k27035k30348k26541
42267A053106j98323j43015q1402l9857k7125l2014l9479m2809m2243l9810l8189
42256C28840l9103l8947k9760r137J3221K3945K0533J3222J2558J9671K9209L6362
42244C80614L7917L0486J2843j0091k8342l3439k5201j3671j2715k7078m5124
42233B66199m9082l3862j1002P529K2299L9204N6678O7626O8905O0304L8697M436
42221E37931k8296m0352k9806j5212j3365k3665l8652n8226q3593j05300j09507
42210h043r3658o6489l4813k12L1761N0135N0203L9966L1118K8146K8038K5223
42198H1375J4094p258l1130m2562l3031r184J6491L9841O3284Q2658Q6255P0471
$$ plain form
42186 331304 379878 416653 451683 480380 488860 471244 437990 408930 401861 425692 477233 540892
42174 540892 595313 625711 631629 623210 611955 605199 604930 607454 605845 597755 591833 602732 636953
42161 636953 683527 718679 719541 676123 594933 493185 387793 288358 200618 133863 98936
42150 98936 95961 108102 113335 103484 89407 87825 106499 142823 191684 248607 304776 344606
42138 344606 353956 332134 294095 259644 240077 233205 227712 211462 179095 135478 92169 59354
42126 59354 41633 41124 60316 97303 139855 170523 180992 179651 183136 201141 229666 256538
42114 256538 271608 272797 264588 251986 236787 219791 204260 194133 189379 186657 185306 189259 200934
42101 200934 215249 221470 209944 177234 128642 78150 42479 30364 36759 48277 52923 44247
$$ packed form
42186C31304M8574L6775L5030K8697Q480j7616l3254k9060p069K3831N1541O3659
42174E40892N4421L0398N918q419j1255o756k69K524j609q090n922J0899L4221
42161F36953M6574L5152Q62m3418q1190j01748j05392r9435q7740o6755l4927
42150I8936k975J2141N233r851j4077j582J8674L6324M8861N6923N6169L9830
42138C44606R350k1822l8039l4451j9567o872n493j6250l2367m3617m3309l2815
42126E9354j7721n09J9192L6987M2552L0668J0469j341L485J8005K8525K6872
42114B56538J5070J189q209j2602j5199j6996j5531j0127m754k722j351L953J1675
42101B00934J4315O221j1526l2710m8592n0492l5671j2115O395J1518M646q676
$$ plain form
42089 44247 21347 -8981 -30865 -26521 11053 72370 137772 188551 215341 222419 226261 245267
42077 245267 285426 335150 375649 396887 403817 408680 418086 426463 421706 398713 367459 344668
42065 344668 335786 328749 309745 282637 265936 269393 280975 282823 275851 280321 311730 363290 414621
42052 414621 451060 469909 474334 470035 465589 466167 464934 449228 420096 399561 411954 460573 527236
42039 527236 591080 641306 674045 686334 677401 651553 615970 577105 540380 510369 488259 470082
42027 470082 450046 426613 405235 394928 401377 422910 453977 492419 540400 596325 649462 687231
42015 687231 706334 711537 704225 679132 635293 585232 548576 537805 551949 581202 614885 647568
42003 647568 681643 724269 780168 847377 918927 984980 1033086 1053091 1048122 1038408 1048098 1087293
$$ packed form
42089D4247k2900l0328k1884M344L7574O1317O5402N0779K6790P078L842J9006
42077B45267M0159M9724M0499K1238O930M863R406Q377m757k2993l1254k2791
42065C44668q882p037j9004k7108j6701L457J1582J848o972M470L1409N1560N1331
42052D14621L6439J8849M425m299m446N78j233j5706k9132k0535J2393M8619O6663
42039E27236O3844N0226L2739J2289q933k5848l5583l8865l6725l0011k2110j8177
42027D70082k0036k3433k1378j0307O449K1533L1067L8442M7981N5925N3137L7769
42015F87231J9103N203p312k5093m3839n0061l6656j0771J4144K9253L3683L2683
42003F47568L4075M2626N5899O7209P1550O6053M8106K0005m969r714R690L9195
$$ plain form
41991 1087293 1149603 1225445 1312668 1414403 1532950 1670023 1831417 2028849 2276370 2583247
41981 2583247 2947726 3358341 3804873 4289002 4821460 5406900 6031663 6664136 7262335
41972 7262335 7780522 8174365 8406689 8452578 8303710 7973679 7500195 6935628 6328553 5712869
41962 5712869 5113328 4554474 4057053 3627331 3257027 2935258 2655726 2411142 2187938
41953 2187938 1973781 1769214 1586232 1434318 1312351 1216290 1149498 1118072 1114860 1114081 1087370
41942 1087370 1025480 942943 863662 804740 770799 755423 744257 721897 682455 634306 592621
41931 592621 567994 562817 573777 591783 600927 585409 541982 483078 424738 372428 319476 256791
41919 256791 182188 102766 31580 -18997 -44701 -52426 -55330 -63596 -78659 -94588 -104399 -106937
$$ packed form
41991A087293O2310P5842Q7223J01735J18547J37073J61394J97432K47521L06877
41981B583247L64479M10615M46532M84129N32458N85440O24763O32473N98199
41972G262335N18187L93843K32324M5889j48868l30031m73484n64567o07075o15684
41962E712869n99541n58854m97421m29722l70304l21769k79532k44584k23204
41953B187938k14157k04567j82982j51914j21967r6061o6792l1426l212p79k6711
41942A087370o1890q2537p9281n8922l3941j5376j1166k2360l9442m8149m1685
41931E92621k4627n177J0960J8006R144j5518m3427n8904n8340n2310n2952o2685
41919B56791p4603p9422p1186n0577k5704p725k904q266j5063j5929r811k538
$$ plain form
41907 -106937 -109701 -123738 -152165 -182251 -191297 -164003 -105634 -37571 20443 62939 93998 113994
41895 113994 117433 106459 100946 126496 189757 270028 338302 381777 407446 426648 443323 457217
41883 457217 471619 493416 527059 570273 614230 646999 659387 649883 623741 587427 546650 510625
41871 510625 493380 505060 541838 588472 632219 672294 715639 766582 821905 872872 909608
41860 909608 925818 923149 911246 900744 894476 885362 862458 819312 759396 696593 648760 625165
41848 625165 617408 605472 575796 532802 491808 463640 448945 444109 445703 447793 441077 420239
41836 420239 391056 366265 353664 350209 347902 342565 334301 319751 287663 226941 141636 56211
41824 56211 2037 -3562 33895 94447 156647 204850 233498 251331 278522 332504 414265 509357
$$ packed form
41907a06937k764j4037k8427l0086r046K7294N8369O8063N8014M2496L1059J9996
41895A13994L439j0974n513K5550O3261Q0271O8274M3475K5669J9202J6675J3894
41883D57217J4402K1797L3643M3214M3957L2769J2388r504k6142l6314m0777l6025
41871E10625j7245J1680L6778M6634M3747M0075M3345N0943N5323N0967L6736
41860I09608J6210k669j1903j0502o268r114k2904m3146n9916o2803m7833k3595
41848F25165p757j1936k9676m2994m0994k8168j4695m836J594K090o716k0838
41836D20239k9183k4791j2601l455k307n337q264j4550l2088o0722q5305q5425
41824E6211n4174n599L7457O0552O2200M8203K8648J7833K7191N3982Q1761R5092
$$ plain form
41812 509357 599946 672859 720115 741158 747916 761171 794957 844430 891911 924703 945090 963036
41800 963036 980661 985272 959802 902414 834884 787685 774876 784606 792701 780949 743242 684081
41788 684081 619182 572669 562381 584233 615556 636113 643286 646887 654422 664333 670426 669535 665699
41775 665699 668111 683475 709163 735014 751401 752824 734501 691995 628342 557389 494290 443838
41763 443838 402494 370361 355214 363669 393184 434464 477658 514382 539210 554694 572461 602725
41751 602725 640842 667470 663545 623239 552327 458674 348674 231349 119960 25685 -49419
41740 -49419 -110277 -158806 -187983 -188022 -158156 -109968 -58203 -10548 31972 67944 94986 117096
41728 117096 146651 193522 253172 309370 348563 368873 376125 376312 374065 374428 381593 395920 414432
$$ packed form
41812E09357R0589P2913M7256K1043O758J3255L3786M9473M7481L2792K0387J7946
41800I63036J7625M611k5470n7388o7530m7199j2809R730Q095j1752l7707n9161
41788F84081o4899m6513j0288K1852L1323K0557P173L601P535R911O093q91l836
41775F65699K412J5364K5688K5851J6387J423j8323m2506o3653p0953o3099n0452
41763D43838m1344l2133j5147Q455K9515M1280M3194L6724K4828J5484J7767L0264
41751F02725L8117K6628l925m0306p0912r3653j10000j17325j11389r4275p5104
41740d9419o0858m8529k9177l9K9866M8188N1765M7655M2520L5972K7042K2110
41728A17096K9555M6871N9650N6198L9193K0310P252J87k247L63P165J4327J8512
$$ plain form
41715 414432 434307 454962 477270 501422 523963 535211 521406 473680 397502 312836 243002
41704 243002 200635 181505 170657 155950 137750 126497 132133 157864 203174 267212 344507 419757
41692 419757 472639 489364 467799 413517 336966 255419 189978 152810 137507 126550 109830
41681 109830 94111 94098 116120 151563 185512 211150 235471 270771 321175 378981 433730 481391
41669 481391 522243 552599 563824 551017 519727 481872 445963 412640 378644 343119 309609
41658 309609 283174 266929 262202 271969 302546 359211 437906 521098 583673 606145 586111 540046
41646 540046 493902 467536 462539 462783 448730 413687 366426 318667 273894 231675 199445 192183
41634 192183 217867 269007 332830 405154 487389 571982 639568 673990 675792 658083 632512 602059
$$ packed form
41715D14432J9875K0655K2308K4152K2541J1248j3805m7726p6178q4666o9834
41704B43002m2367j9130j0848j4707j8200j1253N636K5731M5310O4038P7295P5250
41692D19757N2882J6725k1565n4282p6551q1547o5441l7168j5303j0957j6720
41681A09830j5719j3K2022L5443L3949K5638K4321L5300N0404N7806N4749M7661
41669D81391M0852L0356J1225j2807l1290l7855l5909l3323l3996l5525l3510
41658C09609k6435j6245m727R767L0577N6665P8695Q3192O2575K2472k0034m6065
41646E40046m6144k6366m997K44j4053l5043m7261m7759m4773m2219l2230p262
41634A92183K5684N1140O3823P2324Q2235Q4593O7586L4422J802j7709k5571l0453
$$ plain form
41622 602059 564307 517814 466327 419878 391270 388846 411042 446616 478131 486408 457667 391801
41610 391801 303867 215680 145598 103756 89901 91494 88969 70303 40408 12648 -5784 -13549
41598 -13549 -3041 40089 119707 217527 305525 369571 418511 472381 544312 631198 717405 787420
41586 787420 837569 876507 914473 953505 988732 1017090 1043553 1080586 1141853 1231649 1335430
41575 1335430 1421881 1460034 1438921 1372482 1286523 1200698 1120706 1045649 981716 945608 950089
41564 950089 986756 1030090 1062235 1087830 1118370 1147407 1152308 1122044 1074823 1043105 1044240 1067808
41552 1067808 1087720 1083861 1055835 1020881 999072 998785 1015444 1042429 1080260 1135760 1216329 1326166
41540 1326166 1464506 1626182 1807313 2011698 2247131 2512525 2792724 3070498 3342616
$$ packed form
41622F02059l7752m6493n1487m6449k8608k424K2196L5574L1515Q277k8741o5866
41610C91801q7934q8187p0082m1842j3855J593k525j8666k9895k7760j8432p765
41598a3549J0508M3130P9618R7820Q7998O4046M8940N3870P1931Q6886Q6207P0015
41586G87420N0149L8938L7966L9032L5227K8358K6463L7033O1267Q9796J03781
41575A335430Q6451L8153k1113o6439q5959q5825p9992p5057o3933l6108M481
41564I50089L6667M3334L2145K5595L0540K9037M901l0264m7221l1718J135K3568
41552A067808J9912l859k8026l4954k1809k87J6659K6985L7831N5500Q0569J09837
41540A326166J38340J61676J81131K04385K35433K65394K80199K77774K72118
$$ plain form
41531 3342616 3622710 3931887 4288253 4698200 5148080 5603080 6019045 6356786 6584191
41522 6584191 6670614 6591221 6343659 5958701 5490675 4994745 4508417 4047631 3615765 3214901
41512 3214901 2848522 2516766 2216927 1952452 1734603 1567390 1435477 1317781 1211954
41503 1211954 1133756 1089743 1061803 1024183 966446 892936 809070 719382 634288 566677 520736
41492 520736 491099 473143 468193 479108 506884 551533 610030 672235 724342 758771 777816 786862
41480 786862 786786 773281 741600 693454 642226 609214 609914 644249 701900 771934 840923 887298
41468 887298 890632 849524 782584 709616 638730 572489 516162 473846 442578 415258 384755 343092
41456 343092 284974 218029 162619 133714 126788 127381 129893 139897 161689 191302 220291 240308
$$ packed form
41531C342616K80094L09177L56366M09947M49880M55000M15965L37741K27405
41522F584191Q6423p9393k47562l84958m68026m95930m86328m60786m31866m00864
41512C214901l66379l31756k99839k64475k17849j67213j31913j17696j05827
41503A211954p8198m4013k7940l7620n7737p3510q3866q9688q5094o7611m5941
41492E20736k9637j7956m950J0915K7776M4649N8497O2205N2107L4429J9045R046
41480G86862p6j3505l1681m8146n1228l3012P00L4335N7651P0034O8989M6375
41468H87298L334m1108o6940p2968p0886o6241n6327m2316l1268k7320l0503m1663
41456C43092n8118o6945n5410k8905o926N93K512J0004K1792K9613K8989K0017
$$ plain form
41444 240308 245826 238522 228281 225167 231530 244883 264251 288274 311243 327816 337954 339436
41432 339436 319229 262768 172063 66622 -33070 -115050 -171171 -195453 -190615 -166906 -130251
41421 -130251 -79003 -15592 46721 93067 116603 117565 103346 94489 117997 182196 263602 329579
41409 329579 371198 404626 444094 486229 522541 556301 600565 663262 736853 800080 830404
41398 830404 820694 786257 751606 727731 704133 662582 593591 497779 377605 235588 82051
41387 82051 -59211 -157372 -191012 -162463 -97609 -29209 23391 61147 94825 130165 163591
41376 163591 189488 207482 221021 231616 238819 246246 262340 290475 320804 338411 341045 344508
41364 344508 368562 419984 488994 556562 603607 620316 613113 600125 594894 595572 592400 581955
$$ packed form
41444B40308N518p304j0241l114O363J3353J9368K4023K2969J6573J0138J482
41432C39436k0207n6461r0705j05441r9692q1980n6121k4282M838K3709L6655
41421a30251N1248O3411O2313M6346K3536R62j4219q857K3508O4199Q1406O5977
41409C29579M1619L3428L9468M2135L6312L3760M4264O2697P3591O3227L0324
41398H30404r710l4437l4651k3875k3598m1551o8991r5812j20174j42017j53537
41387H2051j41262r8161l3640K8549O4854O8400N2600L7756L3678L5340L3426
41376A63591K5897J7994J3539J0595P203P427J6094K8135L0329J7607K634L463
41364C44508K4054N1422O9010O7568M7045J6709p203j2988n231O78l172j0445
$$ plain form
41352 581955 569752 562300 561942 566505 567654 551761 509817 446906 376645 307638 242369 188264
41340 188264 159177 160955 182207 205241 222617 238594 257543 275854 284179 274976 249721 221775
41328 221775 210645 229629 276808 336040 384732 403267 384261 336764 278848 223922 176466
41317 176466 140657 126058 139969 178307 228769 279472 319615 336111 318566 269045 202286
41306 202286 136305 87178 70860 100290 174837 276805 384187 486674 586378 684280 770853
41295 770853 832935 868238 888735 906763 919918 915144 888925 856906 837872 832375 825583 810498
41283 810498 798741 804278 823550 838094 833434 809996 778563 751984 740854 750000 775107 804447
41271 804447 825100 826732 802254 751560 687188 631488 602997 605206 628726 660505 688012 699189
$$ packed form
41352E81955j2203p452l58M563J149j5893m1944o2911p0261o9007o5269n4105
41340A88264k9087J778K1252K3034J7376J5977J8949J8311Q325r203k5255k7946
41328B21775j1130J8984M7179N9232M8692J8535j9006m7497n7916n4926m7456
41317A76466l5809j4599J3911L8338N0462N0703M0143J6496j7545m9521o6759
41306B02286o5981m9127j6318K9430P4547J01968J07382J02487R9704R7902Q6573
41295G70853O2082L5303K0497J8028J3155m774k6219l2019j9034n497o792j5085
41283H10498j1757N537J9272J4544m660k3438l1433k6579j1130R146K5107K9340
41271H04447K0653J632k4478n0694o4372n5700k8491K209K3520L1779K7507J1177
$$ plain form
41259 699189 686641 654479 617136 588545 573676 571112 580452 603498 638037 672494 688430 670244
41247 670244 615117 534959 448340 369900 306476 259566 227134 203767 184769 172457 174086 190013
41235 190013 207110 207935 184891 143448 96292 60063 53746 90222 166514 267260 378361 491470
41223 491470 595061 671156 707872 710469 693890 667661 633951 597670 571156 567674 593087 641876
41211 641876 696925 736093 746774 735369 717013 694851 654952 583782 485823 381281 290940
41200 290940 226519 191362 184824 206541 259021 344395 456007 575369 681030 759757 807557
41189 807557 823691 809694 773613 729133 687755 654048 628933 614166 612296 625072 653018 693279
41177 693279 735974 766212 773596 758851 728954 687312 631341 558755 474045 390202 326361 300730
$$ packed form
41259F99189j2548l2162l7343k8591j4869k564R340K3046L4539L4457J5936j8186
41247F70244n5127q0158q6619p8440o3424m6910l2432k3367j8998j2312J629J5927
41235A90013J7097Q25k3044m1443m7156l6229o317L6476P6292J00746J11101J13109
41223D91470J03591P6095L6716K597j6579k6229l3710l6281k6514l482K5413M8789
41211F41876N5049L9168J0681j1405j8356k2162l9899p1170r7959j04542r0341
41200B90940o4421l5157o538K1717N2480Q5374J11612J19362J05661P8727M7800
41189H07557J6134j3997l6081m4480m1378l3707k5115j4767j870J2776K7946M0261
41177F93279M2695L0238P384j4745k9897m1642n5971p2586q4710q3843o3841k5631
$$ plain form
41165 300730 319334 369645 428755 479635 517528 541631 547752 534042 509568 489794 483250 487743
41153 487743 500222 524424 565054 617821 669748 708814 730422 734552 719525 680531 614976 530421
41141 530421 447120 389101 368162 375582 391398 402177 408507 416861 429144 442638 456861 476117
41129 476117 505074 543545 584664 615818 622683 597507 546995 491055 451082 438030 450964 484926
41117 484926 537765 609012 694332 783882 867567 941293 1006129 1060647 1096506 1104880 1087667 1059746
41105 1059746 1038471 1031626 1035494 1041295 1040078 1022503 978827 903516 801270 687736 582059
41094 582059 495708 426419 363304 299638 242089 207930 212494 256784 324724 392880 446081 485643
41082 485643 522385 563270 608149 658092 719229 793938 873512 946150 1010400 1075043 1146725
$$ packed form
41165C00730J8604N0311N9110N0880L7893K4103O121j3710k4474j9774o544M493
41153D87743J2479K4202M0630N2767N1927L9066K1608M130j5027l8994o5555q4555
41141E30421q3301n8019k0939P420J5816J0779O330Q354J2283J3494J4223J9256
41129D76117K8957L8471M1119L1154O865k5176n0512n5940l9973j3052J2934L3962
41117D84926N2839P1247Q5320Q9550Q3685P3726O4836N4518L5859Q374j7213k7921
41105A059746k1275o845L868N801j217j7575m3676p5311j02246j13534j05677
41094E82059q6351o9289o3115o3666n7549l4159M564M4290O7940O8156N3201L9562
41082D85643L6742M0885M4879M9943O1137P4709P9574P2638O4250O4643P1682
$$ plain form
41071 1146725 1222010 1288643 1327598 1316953 1246480 1134687 1025268 960557 959512 1019992 1131917
41060 1131917 1280679 1444239 1598120 1725684 1820354 1879624 1901732 1888020 1844976 1782981
41050 1782981 1712630 1638719 1556875 1462073 1365012 1295199 1281537 1331052 1427865 1545141 1651871
41039 1651871 1718456 1733002 1715038 1703590 1729079 1801737 1922147 2087181 2281049 2473634
41029 2473634 2637180 2758651 2830434 2838383 2770614 2636137 2466562 2298499 2156998 2052230
41019 2052230 1984499 1949353 1939082 1941508 1942802 1938736 1942495 1971943 2025297 2077566 2107080 2118652
41007 2118652 2133076 2158888 2182654 2183969 2152903 2096146 2035008 1997089 2002666 2056724 2154098 2285825
40995 2285825 2435247 2576675 2691465 2784929 2877338 2978351 3079061 3166798 3234544 3274405
$$ packed form
41071A146725P5285O6633L8955j0645p0473j11793j09419o4711j045O0480J11925
41060A131917J48762J63560J53881J27564R4670N9270K2108j3712m3044o1995
41050A782981p0351p3911q1844r4802r7061o9813j3662M9515R6813J17276J06730
41039A651871O6585J4546j7964j1448K5489P2658J20410J65034J93868J92585
41029B473634J63546J21471P1783P949o7769j34477j69575j68063j41501j04768
41019B052230o7731l5146j0271K426J294m066L759K9448N3354N2269K9514J1572
41007B118652J4424K5812K3766J315l1066n6757o1138l7919N577N4058R7374J31727
40995B285825J49422J41428J14790R3464R2409J01013J00710Q7737O7746L9861
$$ plain form
40985 3274405 3276872 3244973 3199864 3164401 3147560 3150331 3177220 3231317 3303604 3378819 3451330 3527755
40973 3527755 3616001 3720005 3843663 3989142 4147321 4296141 4412874 4486022 4515447 4506691
40963 4506691 4467663 4405497 4321045 4207460 4058087 3877132 3682483 3498452 3344734 3228905
40953 3228905 3146685 3088761 3046737 3011956 2971300 2910030 2822280 2717296 2613446 2527246 2468943
40942 2468943 2445278 2461294 2517612 2607166 2715347 2823281 2912930 2972393 2998393 2994287 2966514
40931 2966514 2923312 2874644 2830883 2802498 2803397 2852275 2964520 3139887 3360252 3599579 3831474
40920 3831474 4026682 4153469 4192249 4151072 4060533 3951629 3841172 3735575 3639123 3554512
40910 3554512 3481904 3424587 3394542 3408195 3475779 3594503 3749019 3917312 4079974 4227074
$$ packed form
40985C274405K467l1899m5109l5463j6841K771K6889N4097P2287P5215P2511P6425
40973C527755Q8246J04004J23658J45479J58179J48820J16733P3148K9425q756
40963D506691l9028o2166q4452j13585j49373j80955j94649j84031j53718j15829
40953C228905q2220n7924m2024l4781m0656o1270q7750j04984j03850q6200n8303
40942B468943k3665J6016N6318Q9554J08181J07934Q9649N9463K6000m106k7773
40931B966514m3202m8668m3761k8385Q99M8878J12245J75367K20365K39327K31895
40920C831474J95208J26787L8780m1177r0539j08904j10457j05597r6452q4611
40910C554512p2608n7317l0045J3653O7584J18724J54516J68293J62662J47100
$$ plain form
40900 4227074 4354720 4454525 4511784 4518558 4486121 4440750 4408952 4408185 4444733 4510242 4579016 4616577
40888 4616577 4597439 4516800 4388173 4233871 4076702 3933896 3813248 3713567 3628271 3548550
40878 3548550 3466189 3377600 3285561 3195071 3108843 3029820 2966275 2928529 2918519 2926044 2938296
40867 2938296 2953133 2983042 3046389 3152117 3288840 3428926 3547367 3639045 3717207 3795744
40857 3795744 3874467 3940208 3979273 3989668 3984644 3983806 3996452 4011760 4007306 3968316 3897921 3809607
40845 3809607 3711781 3599552 3461305 3296600 3130027 3003135 2946534 2959952 3021379 3109552
40835 3109552 3209685 3303001 3366987 3393440 3399258 3413345 3455549 3528100 3617013 3693605 3720794
40824 3720794 3671275 3546788 3379610 3212939 3075391 2968830 2878903 2798824 2741120 2722322
$$ packed form
40900D227074J27646R9805N7259O774l2437m5371l1798p67L6548O5509O8774L7561
40888D616577j9138q0639j28627j54302j57169j42806j20648r9681q5296p9721
40878C548550q2361q8589r2039r0490q6228p9023o3545l7746j0010P525J2252
40867B938296J4837K9909O3347J05728J36723J40086J18441R1678P8162P8537
40857C795744P8723O5741L9065J0395n024q38J2646J5308m454l8990p0395q8314
40845C809607r7826j12229j38247j64705j66573j26892n6601J3418O1427Q8173
40835C109552J00133R3316O3986K6453N818J4087M2204P2551Q8913P6592K7189
40824C720794m9519j24487j67178j66671j37548j06561q9927q0079n7704j8798
$$ plain form
40814 2722322 2739683 2772241 2805365 2844056 2898440 2966930 3042063 3125351 3225588 3345170 3476704
40803 3476704 3611380 3742570 3861505 3957102 4021971 4053838 4050620 4010064 3937566 3852000 3781009
40792 3781009 3748922 3765808 3823606 3901242 3974899 4026300 4046911 4041481 4029726 4039480 4093044 4198892
40780 4198892 4353524 4545142 4755805 4969364 5182768 5403740 5632739 5853996 6051543
40771 6051543 6230271 6415702 6637333 6916472 7262133 7668689 8121877 8617880 9177227
40762 9177227 9836139 10630080 11592734 12762276 14172706 15833145 17706404 19673901 21488446
40753 21488446 22782695 23202029 22603048 21148083 19202571 17132724 15174398 13431750
40745 13431750 11934404 10677505 9637345 8782550 8082434 7507968 7032339 6635189 6302855
$$ packed form
40814B722322J7361L2558L3124L8691N4384O8490P5133Q3288J00237J19582J31534
40803C476704J34676J31190J18935R5597O4869L1867l218m0556p2498q5566p0991
40792C781009l2087J6886N7798P7636P3657N1401K0611n430j1755R754N3564J05848
40780D198892J54632J91618K10663K13559K13404K20972K28999K21257J97547
40771F051543J78728J85431K21631K79139L45661M06556M53188M96003N59347
40762I177227O58912P93941R62654J169542J410430J660439J873259J967497J814545
40753B1488446J294249M19334n98981j454965j945512k069847j958326j742648
40745A3431750j497346j256899j040160q54795p00116n74466m75629l97150l32334
$$ plain form
40736 6302855 6021884 5775472 5548817 5336271 5142094 4974596 4836676 4717550 4595087
40727 4595087 4453338 4301685 4173914 4104447 4103645 4153761 4224987 4294451 4353446 4401502 4437293
40716 4437293 4457598 4465072 4473616 4501867 4559253 4637578 4715380 4771854 4801131 4815949 4834883 4862984
40704 4862984 4886582 4889492 4871043 4843406 4813462 4774332 4716298 4640846 4561130 4491664 4439626
40693 4439626 4403346 4376982 4358724 4356318 4382598 4443593 4532420 4636115 4746443 4862782 4987169
40682 4987169 5118724 5250323 5367959 5456559 5511478 5543433 5567260 5585631 5588448 5568676 5532653
40671 5532653 5491432 5447060 5393886 5332265 5275132 5238948 5230455 5243387 5266697 5295856 5337822
40660 5337822 5405236 5504293 5628508 5766065 5912865 6076163 6265760 6484493 6727034 6983446
$$ packed form
40736F302855k80971k46412k26655k12546j94177j67498j37920j19126j22463
40727D595087j41749j51653j27771o9467q02N0116P1226O9464N8995M8056L5791
40716D437293K0305P474Q544K8251N7386P8325P7802N6474K9277J4818J8934K8101
40704D862984K3598K910j8449k7637k9944l9130n8034p5452p9716o9466n2038
40693D439626l6280k6364j8258k406K6280O0995Q8827J03695J10328J16339J24387
40682D987169J31555J31599J17636Q8600N4919L1955K3827J8371K817j9772l6023
40671E532653m1221m4372n3174o1621n7133l6184q493J2932K3310K9159M1966
40660E337822O7414R9057J24215J37557J46800J63298J89597K18733K42541K56412
$$ plain form
40650 6983446 7241897 7493120 7739615 8002386 8314498 8702451 9170132 9699804 10269774
40641 10269774 10873196 11521315 12230589 13010432 13864920 14800151 15818694 16900359 17991043
40632 17991043 19016585 19912423 20645726 21217447 21650360 21977583 22241605 22501243 22832915
40623 22832915 23317449 24022123 24994752 26269894 27870790 29797252 32002888 34364331
40615 34364331 36650424 38526736 39637599 39748011 38851626 37160525 34991904 32643532
40607 32643532 30327637 28164470 26205978 24468868 22962103 21695104 20669541 19873841
40599 19873841 19289072 18895056 18668885 18583798 18614156 18737871 18929070 19148156 19339713 19440487
40589 19440487 19395755 19180184 18810971 18340323 17832865 17348476 16939147 16649261 16511475
$$ packed form
40650F983446K58451K51223K46495K62771L12112L87953M67681N29672N69970
40641A0269774O03422O48119P09274P79843Q54488R35231J018543J081665J090684
40632A7991043J025542Q95838P33303N71721M32913L27223K64022K59638L31672
40623B2832915M84534P04674R72629J275142J600896J926462K205636K361443
40615C4364331K286093J876312J110863J10412q96385j691101k168621k348372
40607C2643532k315895k163167j958492j737110j506765j266999j025563p95700
40599A9873841n84769l94016k26171q5087L0358J23715J91199K19086J91557J00774
40589A9440487m4732k15571l69213m70648n07458m84389m09329k89886j37786
$$ plain form
40580 16511475 16544040 16752750 17131290 17661334 18323724 19118075 20069019 21210074 22565593
40571 22565593 24150090 25974505 28038603 30310041 32706004 35086380 37263594 39039574
40563 39039574 40265831 40890474 40954593 40547129 39765812 38712372 37502484 36257791 35076098
40554 35076098 34001958 33016689 32050765 31012487 29823975 28451689 26917628 25286237
40546 25286237 23637239 22042483 20557018 19219504 18052215 17059342 16228938 15538851
40538 15538851 14961594 14467491 14029931 13631365 13264097 12926881 12624550 12369925 12179454
40529 12179454 12063534 12023553 12057311 12158735 12307956 12470901 12620948 12761628 12920751 13121615
40519 13121615 13366899 13651898 13984640 14385567 14871091 15445708 16111715 16881022 17773888
$$ packed form
40580A6511475L2565K08710L78540N30044O62390P94351R50944J141055J355519
40571B2565593J584497J824415K064098K271438K395963K380376K177214J775980
40563C9039574J226257O24643O4119m07464p81317j053440j209888j244693j181693
40554C5076098j074140r85269r65924j038278j188512j372286j534061j631391
40546B5286237j648998j594756j485465j337514j167289r92873q30404o90087
40538A5538851n77257m94103m37560l98566l67268l37216l02331k54625j90471
40529A2179454j15920l9981L3758J01424J49221J62945J50047J40680J59123K00864
40519A3121615K45284K84999L32742M00927M85524N74617O66007P69307Q92866
$$ plain form
40510 17773888 18809647 20002508 21361139 22879287 24516368 26183987 27747746 29036041
40502 29036041 29854614 30027936 29474397 28267892 26620473 24785947 22961906 21259016
40494 21259016 19727675 18388612 17244222 16284884 15497475 14865389 14360820 13946836 13593940
40485 13593940 13293405 13053437 12884574 12786435 12740186 12709359 12652004 12537576 12354613 12106482
40475 12106482 11806841 11480740 11162968 10888213 10682481 10563845 10544114 10620988 10768601 10943979
40465 10943979 11109196 11248142 11362722 11458051 11536561 11604747 11677947 11773139 11898813 12056435
40455 12056435 12252158 12503617 12834209 13263806 13806793 14476031 15285243 16248634 17381502
40446 17381502 18702058 20231654 21994106 24016298 26326941 28948480 31883653 35101185
$$ packed form
40510A7773888J035759J192861J358631J518148J637081J667619J563759J288295
40502B9036041Q18573J73322n53539j206505j647419j834526j824041j702890
40494B1259016j531341j339063j144390r59338p87409o32086n04569m13984l52896
40485A3593940l00535k39968j68863r8139m6249l0827n7355j14428j82963k48131
40475A2106482k99641l26101l17772k74755k05732j18636j9731P6874J47613J75378
40465A0943979J65217J38946J14580R5329P8510O8186P3200R5192J25674J57622
40455A2056435J95723K51459L30592M29597N42987O69238Q09212R63391J132868
40446A7381502J320556J529596J762452K022192K310643K621539K935173L217532
$$ plain form
40438 35101185 38516147 41957636 45140574 47689550 49248956 49640676 48964205 47557770
40430 47557770 45845847 44182736 42779075 41707128 40927609 40306933 39641267 38709932 37349864
40421 37349864 35516085 33293265 30849762 28364179 25974312 23772364 21822052 20160478
40413 20160478 18783805 17646419 16686330 15855456 15130451 14503916 13970764 13520818 13140732
40404 13140732 12821167 12559789 12355726 12203589 12094602 12018748 11961811 11907064 11849147 11803706
40394 11803706 11794290 11830830 11908560 12023899 12177605 12360372 12548184 12719059 12869102 13010910
40384 13010910 13164593 13351810 13586804 13865100 14164615 14460294 14734038 14974243 15179198
40375 15179198 15365139 15560974 15790364 16065414 16395141 16781658 17198375 17583864 17869651
$$ packed form
40438C5101185L414962L441489L182938K548976J559406L91720o76471j406435
40430D7557770j711923j663111j403661j071947p79519o20676o65666r31335j360068
40421C7349864j833779k222820k443503k485583k389867k201948j950312j661574
40413B0160478j376673j137386r60089q30874p25005o26535n33152m49946l80086
40404A3140732l19565k61378k04063j52137j08987p5854n6937n4747n7917m5441
40394A1803706r416L6540P7730J15339J53706J82767J87812J70875J50043J41808
40384A3010910J53683J87217K34994K78296K99515K95679K73744K40205K04955
40375A5179198J85941J95835K29390K75050L29727L86517M16717L85489K85787
$$ plain form
40366 17869651 18013296 18007625 17875378 17664273 17433384 17227996 17067899 16961950 16923847 16969028
40356 16969028 17108442 17352796 17710505 18172943 18715251 19324224 20016269 20817999 21739361
40347 21739361 22775972 23927671 25205431 26631973 28247152 30102927 32244116 34705060
40339 34705060 37529654 40773624 44473145 48628212 53230004 58289448 63838308 69946444
40331 69946444 76773241 84579421 93655353 104248817 116569298 130801653 147030728
40324 147030728 165095330 184405149 203672627 220665274 232418817 236237439 231031122
40317 231031122 217952154 199769940 179533292 159548893 141138333 124875296 110864546
40310 110864546 98931546 88770793 80054587 72483923 65814993 59883864 54599870 49902077
$$ packed form
40366A7869651J43645n671j32247k11105k30889k05388j60097j05949l8103M5181
40356A6969028J39414K44354L57709M62438N42308O08973O92045Q01730R21362
40347B1739361J036611J151699J277760J426542J615179J855775K141189K460944
40339C4705060K824594L243970L699521M155067M601792N059444N548860O108136
40331F9946444O826797P806180R075932J0593464J2320481J4232355J6229075
40324A47030728J8064602J9309819J9267478J6992647J1753543L818622n206317
40317B31031122j3078968j8182214k0236648j9984399j8410560j6263037j4010750
40310A10864546j1933000j0160753q716206p570664o668930n931129n283994m697793
$$ plain form
40302 49902077 45729159 42027962 38763935 35907413 33420830 31264748 29401596 27787094
40294 27787094 26372600 25123731 24024150 23053175 22170828 21334318 20522829 19740378 19001734
40285 19001734 18321971 17713403 17183224 16732278 16357898 16058132 15833709 15686083 15610843
40276 15610843 15591607 15604270 15630394 15664282 15707736 15765785 15850497 15979773 16164387 16399678
40266 16399678 16673341 16975448 17298121 17635532 17992902 18390391 18851348 19389133 20006796
40257 20006796 20703111 21477213 22334600 23288144 24343272 25484930 26696797 27996926 29438539
40248 29438539 31072403 32925065 35014453 37361563 39979968 42883121 46121306 49794501
40240 49794501 54017288 58890863 64518373 71021863 78533678 87205469 97249554 108949163
$$ packed form
40302D9902077m172918l701197l264027k856522k486583k156082j863152j614502
40294B7787094j414494j248869j099581r70975q82347q36510q11489p82451p38644
40285A9001734o79763o08568n30179m50946l74380k99766k24423j47626p5240
40276A5610843j9236J2663K6124L3888M3454N8049Q4712J29276J84614K35291
40266A6399678K73663L02107L22673L37411L57370L97489M60957N37785O17663
40257B0006796O96315P74102Q57387R53544J055128J141658J211867J300129J441613
40248B9438539J633864J852662K089388K347110K618405K903153L238185L673195
40240D9794501M222787M873575N627510O503490P511815Q671791J0044085J1699609
$$ plain form
40232 108949163 122614107 138550429 157063129 178401082 202602204 229295920 257430162
40225 257430162 284843615 307991297 322547216 325125092 315106123 295048011 269282933
40218 269282933 241912331 215653436 191839437 170895725 152725023 136968059 123223615
40211 123223615 111159148 100493259 90979899 82453961 74842245 68093122 62122485 56839907
40203 56839907 52183114 48097166 44506241 41328964 38501396 35969358 33680658 31603762
40195 31603762 29738296 28090827 26649436 25387316 24274570 23278663 22371322 21546805
40187 21546805 20820172 20197792 19660040 19177894 18732466 18313395 17916500 17554721 17257236
40178 17257236 17043558 16905126 16820307 16779221 16786925 16851610 16977786 17162798 17391353 17638862
$$ packed form
40232A08949163J3664944J5936322J8512700K1337953K4201122K6693716K8134242
40225B57430162K7413453K3147682J4555919K577876j0018969k0058112k5765078
40218B69282933k7370602k6258895k3813999k0943712j8170702j5756964j3744444
40211A23223615j2064467j0665889r513360q525938p611716o749123n970637n282578
40203E6839907m656793m085948l590925l177277k827568k532038k288700k076896
40195C1603762j865466j647469j441391j262120j112746r95907r07341q24517
40187B1546805p26633o22380n37752m82146m45428m19071l96895l61779k97485
40178A7257236k13678j38432q4819m1086P704O4685J26176J85012K28555K47509
$$ plain form
40168 17638862 17886545 18129615 18370152 18612877 18873051 19177229 19544880 19971990 20437842
40159 20437842 20923918 21422344 21930211 22438538 22922015 23338184 23643831 23816555 23857605
40150 23857605 23775504 23575044 23261616 22845168 22337513 21757233 21141393 20539174 19982117
40141 19982117 19463869 18954093 18427593 17878564 17318603 16771830 16267844 15830681 15473755
40132 15473755 15204620 15025617 14924831 14875727 14856318 14866250 14919037 15022401 15175228 15382093
40122 15382093 15661576 16036409 16517111 17094988 17749648 18465067 19239459 20076950 20968750
40113 20968750 21886256 22792861 23655218 24437844 25091133 25551143 25753323 25652195 25241712
40104 25241712 24566254 23705536 22734769 21691822 20580372 19399575 18167043 16918941
$$ packed form
40168A7638862K47683K43070K40537K42725K60174L04178L67651M27110M65852
40159B0437842M86076M98426N07867N08327M83477M16169L05647J72724M1050
40150B3857605q2101k00460l13428m16448n07655n80280o15840o02219n57057
40141A9982117n18248n09776n26500n49029n59961n46773n03986m37163l56926
40132A5473755k69135j79003j00786m9104j9409R932N2787J03364J52827K06865
40122A5382093K79483L74833M80702N77877O54660P15419P74392Q37491Q91800
40113B0968750R17506R06605Q62357P82626O53289M60010K02180j01128m10483
40104B5241712o75458q60718r70767j042947j111450j180797j232532j248102
$$ plain form
40096 16918941 15696751 14533737 13446589 12435745 11494770 10620277 9813501 9076361 8410466
40087 8410466 7819076 7306070 6871416 6507541 6198242 5920392 5650781 5376280 5098264
40078 5098264 4826301 4568926 4330977 4115311 3922060 3747199 3586871 3445124 3335277
40069 3335277 3271059 3254948 3273945 3305966 3330717 3335492 3313425 3261346 3182511 3088003 2989856
40058 2989856 2893017 2797727 2707467 2627145 2552562 2469458 2367807 2253562 2144011 2055920 2000045
40047 2000045 1979961 1988640 2007752 2016214 2001992 1967344 1927034 1902088 1907723 1940384 1978721 2002753
40035 2002753 2012143 2023677 2052757 2098853 2144561 2165164 2144226 2087693 2023209 1981022 1973959 1994875
40023 1994875 2027526 2055150 2064049 2049184 2019020 1991050 1981213 1997196 2035264 2076662 2092352 2063774
$$ packed form
40096A6918941j222190j163014j087148j010844r40975q74493q06776p37140o65895
40087H410466n91390n13006m34654l63875l09299k77850k69611k74501k78016
40078E098264k71963k57375k37949k15666j93251j74861j60328j41747j09847
40069C335277o4218j6111J8997L2021K4751M775k2067n2079p8835r4508r8147
40058B989856r6839r5290r0260q0322p4583q3104j01651j14245j09551q8091n5875
40047B000045k0084Q679J9112Q462j4222l4648m0310k4946N635L2661L8337K4032
40035B002753R390J1534K9080M6096M5708K0603k0938n6533o4484m2187p063K0916
40023A994875L2651K7624Q899j4865l0164k7970r837J5983L8068M1398J5690k8578
$$ plain form
40011 2063774 2001655 1936277 1886804 1847346 1804502 1757445 1713522 1672879 1629025 1582370 1543275
40000 1543275 1520683 1514635 1520858 1535826 1554868 1571168 1580470 1582932 1577371 1558744 1527062 1496174
39988 1496174 1486547 1507745 1551727 1603949 1656725 1709811 1761706 1803818 1822267 1804544 1748160
39977 1748160 1666957 1588223 1539489 1534925 1572063 1638655 1722489 1818838 1931651 2064940 2210442
39966 2210442 2347943 2464040 2569818 2694482 2860285 3064765 3282021 3472056 3590209
39957 3590209 3602011 3501574 3316328 3090459 2864165 2667032 2520874 2437886 2415987 2443160
39947 2443160 2509534 2613391 2756017 2934983 3144410 3379148 3634360 3897076 4135834 4301549
39937 4301549 4347545 4257540 4056540 3793454 3513168 3243518 3000719 2796903 2639115 2524750
$$ packed form
40011B063774o2119o5378m9473l9458m2844m7057m3923m0643m3854m6655l9095
40000A543275k2592o048O223J4968J9042J6300R302K462n561j8627l1682l0888
39988A496174r627K1198M3982N2222N2776N3086N1895M2112J8449j7723n6384
39977A748160q1203p8734m8734m564L7138O6592Q3834R6349J12813J33289J45502
39966B210442J37501J16097J05778J24664J65803K04480K17256J90035J18153
39957C590209J1802j00437j85246k25869k26294j97133j46158q2988k1899K7173
39947B443160O6374J03857J42626J78966K09427K34738K55212K62716K38758J65715
39937D301549M5996r0005k01000k63086k80286k69650k42799k03816j57788j14365
$$ plain form
39927 2524750 2441079 2369569 2293348 2206121 2116805 2043482 2000227 1989684 2007898 2052745 2123360
39916 2123360 2210635 2292213 2342848 2353672 2340559 2330440 2338425 2359684 2381586 2397063 2402885 2391212
39904 2391212 2351737 2282913 2195095 2100655 2005572 1913411 1833306 1778383 1755586 1758817 1771495
39893 1771495 1774258 1752315 1700889 1627467 1547714 1475161 1412270 1352293 1292136 1243738 1230197
39882 1230197 1267391 1348000 1443717 1523594 1571549 1589971 1591696 1590420 1594519 1603125 1605742 1589981
39870 1589981 1554944 1516551 1494647 1492381 1490992 1468291 1422249 1376104 1362559 1404503 1507053
39859 1507053 1661246 1851424 2058938 2259632 2420729 2507632 2501328 2410512 2263892 2090558
39849 2090558 1909029 1730472 1563712 1415530 1293000 1208127 1172622 1182113 1211053 1231820
$$ packed form
39927B524750q3671p1510p6221q7227q9316p3323m3255j0543J8214M4847P0615
39916B123360Q7275Q1578N0635J0824j3113j0119P985K1259K1902J5477N822j1673
39904B391212l9475o8824q7818r4440r5083r2161q0105n4923k2797L231J2678
39893A771495K763k1943n1426p3422p9753p2553o2891n9977o0157m8398j3541
39882A230197L7194Q0609R5717P9877M7955J8422J725j276M099Q606K617j5761
39870A589981l5037l8393k1904k266j389k2701m6042m6145j3545M1944J02550
39859A507053J54193J90178K07514K00694J61097Q6903o304r0816j46620j73334
39849B090558j81529j78557j66760j48182j22530q4873l5505R491K8940K0767
$$ plain form
39839 1231820 1237751 1240498 1245467 1239113 1206035 1153924 1113843 1113535 1153186 1209507 1261927 1311976
39827 1311976 1377929 1476084 1610847 1777915 1966998 2158365 2324333 2442514 2508174 2531034
39817 2531034 2522491 2490906 2448642 2416925 2418129 2461867 2538240 2623647 2693682 2734011 2743990 2733961
39805 2733961 2719386 2712968 2716000 2715129 2691074 2635528 2562434 2503895 2493933 2550634 2666653 2814593
39793 2814593 2965309 3104881 3235794 3365474 3498325 3636279 3777733 3912320 4024331
39784 4024331 4108230 4177333 4251038 4334918 4416774 4478330 4505611 4492399 4443395 4375739 4311295
39773 4311295 4264426 4238889 4234420 4250482 4283363 4325857 4372888 4424837 4485325 4560693 4663590
39762 4663590 4811621 5015013 5260616 5504696 5681996 5731594 5629295 5404121 5121786 4846272
$$ packed form
39839A231820N931K747M969o354l3078n2111m0081l08L9651N6321N2420N0049
39827A311976O5953R8155J34763J67068J89083J91367J65968J18181O5660K2860
39817B531034q543l1585m2264l1717J204M3738P6373Q5407P0035M0329R979j0029
39805B733961j4575o418L032q71k4055n5546p3094n8539r962N6701J16019J47940
39793B814593J50716J39572J30913J29680J32851J37954J41454J34587J12011
39784D024331Q3899O9103P3705Q3880Q1856O1556K7281j3212m9004o7656o4444
39773D311295m6869k5537m469J6062L2881M2494M7031N1949O0488P5368J02897
39762D663590J48031K03392K45603K44080J77300M9598j02299k25174k82335k75514
$$ plain form
39752 4846272 4611265 4419777 4261590 4129600 4027773 3970804 3975386 4048118 4180813 4354668
39742 4354668 4541478 4696904 4760905 4680297 4441889 4086261 3687407 3314292 3003154 2755631
39732 2755631 2555325 2384625 2230334 2081546 1929944 1775384 1629403 1509884 1429879 1389676
39722 1389676 1377855 1379387 1383590 1385695 1382879 1371764 1351490 1327211 1307005 1294051 1282885 1263820
39710 1263820 1230947 1186633 1138770 1092138 1041487 975482 889893 795025 706891 632817 570005
39699 570005 517349 482560 474855 493690 527238 560492 583706 595299 599433 601923 608734 627123
39687 627123 663485 715891 770945 813689 841201 863089 890192 928676 983935 1059604 1146315
39676 1146315 1217686 1246333 1224350 1164998 1086948 1001794 915046 832387 761871 711986 688488
$$ packed form
39752D846272k35007j91488j58187j31990j01827n6969M582P2732J32695J73855
39742D354668J86810J55426O4001q0608k38408l55628l98854l73115l11138k47523
39732B755631k00306j70700j54291j48788j51602j54560j45981j19519q0005m0203
39722A389676j1821J532M203K105k816j1115k0274k4279k0206j2954j1166j9065
39710A263820l2873m4314m7863m6632n0651o6005q5589r4868q8134p4074o2812
39699E70005n2656l4789p705J8835L3548L3254K3214J1593M134K490O811J8389
39687F27123L6362N2406N5054M2744K7512K1888K7103L8484N5259P5669Q6711
39676A146315P1371K8647k1983n9352p8050q5154q6748q2659p0516m9885k3498
$$ plain form
39665 688488 691450 714535 747572 779799 801397 805741 793869 776563 769659 785832 828592 889696
39653 889696 950832 993332 1012164 1018935 1025798 1027030 1002356 940164 852840 766674 700128 654533
39641 654533 621933 595789 573759 555303 541139 535449 547190 588043 667787 789173 945011
39630 945011 1120209 1298901 1471610 1635631 1788210 1920313 2018045 2069078 2066961 2012071
39620 2012071 1913608 1792000 1674790 1584136 1525343 1487099 1453168 1415492 1378649 1353559 1347186
39609 1347186 1358763 1385754 1430323 1495743 1576501 1655831 1714794 1742179 1736873 1706752 1668087
39598 1668087 1639999 1631845 1635794 1635923 1624970 1609428 1599554 1599406 1608278 1627847 1663522 1717451 1780579
39585 1780579 1832836 1854678 1842319 1812342 1789974 1793292 1829889 1905136 2025389 2187653 2367655
$$ packed form
39665F88488K962K3085L3037L2227K1598M344j1872j7306o904J6173M2760O1104
39653H89696O1136M2500J8832O771O863J232k4674o2192q7324q6166o6546m5595
39641F54533l2600k6144k2030j8456j4164n690J1741M0853P9744J21386J55838
39630I45011J75198J78692J72709J64021J52579J32103R7732N1033k117n4890
39620B012071r8463j21608j17210r0654n8793l8244l3931l7676l6843k5090o373
39609A347186J1577K6991M4569O5420Q0758P9330N8963K7385n306l0121l8665
39598A668087k8088q154L949J29j0953j5542r874j48Q872J9569L5675N3929O3128
39585A780579N2257K1842j2359k9977k2368L318L6597P5247J20253J62264J80002
$$ plain form
39574 2367655 2522627 2609534 2605311 2516710 2376123 2226477 2102925 2022040 1984741 1987266 2027240
39563 2027240 2099655 2191650 2287006 2377138 2463945 2548427 2617958 2649188 2625620 2551578 2448500
39552 2448500 2338392 2230233 2119437 1998144 1866122 1732709 1609009 1499217 1399743 1304557
39542 1304557 1209552 1114764 1027835 965247 943618 965163 1013180 1063355 1097251 1105261 1084305
39531 1084305 1040014 988834 950995 939659 959031 1010233 1092456 1196838 1303465 1386709 1423004
39520 1423004 1397198 1309383 1178687 1035451 904646 796139 708889 638423 578434 522784
39510 522784 473563 444205 446672 474948 507590 528761 541461 556526 572872 574243 544800 483808
39498 483808 405127 326904 263865 225720 217173 237012 278345 331618 388377 442745 489790 523254
$$ packed form
39574B367655J54972Q6907m223q8601j40587j49646j23552q0885l7299K525L9974
39563B027240P2415R1995R5356R0132Q6807Q4482O9531L1230k3568p4042j03078
39552B448500j10108j08159j10796j21293j32022j33413j23700j09792r9474r5186
39542A304557r5005r4788q6929o2588k1629K1545M8017N0175L3896Q010k0956
39531A084305m4291n1180l7839j1336J9372N1202Q2223J04382J06627Q3244L6295
39520A423004k5806q7815j30696j43236j30805j08507q7250p0466n9989n5650
39510E22784m9221k9358K467K8276L2642K1171J2700J5065J6346J371k9443o0992
39498D83808p8681p8223o3039l8145q547J9839M1333N3273N6759N4368M7045L3464
$$ plain form
39486 523254 536519 528048 506492 487906 484215 492623 496932 480359 438091 378714 314759 252374
39474 252374 190558 130682 84539 67782 82239 107748 117167 100723 73102 56742 61411 79830
39462 79830 97800 105098 99331 83485 60503 29584 -11966 -63771 -121116 -177830 -227625 -263679
39450 -263679 -282415 -289430 -296688 -310388 -324333 -326824 -309826 -270079 -209127 -138395 -77955 -40464
39438 -40464 -17488 11398 57649 118675 190119 271157 355303 427038 475172 504390 527781 551392
39426 551392 570431 576405 562483 524996 467057 401768 347529 318118 317881 344511 392049 449583
39414 449583 500204 526470 521135 493698 463932 445983 438943 433834 426705 421316 422474 434175 463063
39401 463063 513285 572917 613356 610824 567062 504619 445217 397774 363066 340077 325559 313659
$$ packed form
39486E23254J3265q471k1556j8586l691Q408M309j6573m2268n9377o3955o2385
39474B52374o1816n9876m6143j6757J4457K5509R419j6444k7621j6360M669J8419
39462G9830J7970P298n767j5846k2982l0919m1550n1805n7345n6714m9795l6054
39450b63679j8736p015p258j3700j3945k491J6998L9747O0952P0732O0440L7491
39438d0464K2976K8886M6251O1026P1444Q1038Q4146P1735M8134K9218K3391K3611
39426E51392J9039N974j3922l7487n7939o5289n4239k9411k37K6630M7538N7534
39414D49583N0621K6266n335k7437k9766j7949p040n109p129n389J158J1701K8888
39401D63063N0222N9632M0439k532m3762o2443n9402m7443l4708k2989j4518j1900
$$ plain form
39389 313659 300404 287519 281082 287401 308923 341513 376439 407849 438386 476352 529309 601959
39377 601959 694843 797961 887380 937164 938606 904268 852556 794183 735468 686298 655243
39366 655243 636730 609120 549438 451674 333394 226069 155497 125787 119220 111739 89683
39355 89683 54383 15491 -17130 -37565 -45160 -44072 -40528 -39270 -41904 -47874 -56906 -71389 -95898
39342 -95898 -132013 -172331 -201374 -204050 -172651 -106242 -8023 112227 234642 333508 388081
39331 388081 390113 343807 262670 166472 76529 9647 -25535 -29790 -15128 -3760 -16656 -56546
39319 -56546 -104302 -136878 -147465 -143102 -124241 -75814 15788 140941 268358 368649 433216
39308 433216 471751 497537 517560 531615 534593 519326 481232 422595 351867 278526 209176 147807
$$ packed form
39389C13659j3255j2885o437O319K1522L2590L4926L1410L0537L7966N2957P2650
39377F01959R2884J03118Q9419M9784J442l4338n1712n8373n8715m9170l1055
39366F55243j8513k7610n9682r7764j18280j07325p0572k9710o567p481k2056
39355H9683l5300l8892l2621k0435p595J088L544J258k634n970r032j4483k4509
39342i5898l6115m0318k9043k676L1399O6409R8219J20250J22415R8866N4573
39331C88081K032m6306q1137r6198q9943o6882l5182m255J4662J1368j2896l9890
39319e6546m7756l2576j0587M363J8861M8427R1602J25153J27417J00291O4567
39308D33216L8535K5786K0023J4055K978j5267l8094n8637p0728p3341o9350o1369
$$ plain form
39296 147807 97017 56896 22969 -12816 -56587 -105759 -147648 -167747 -162637 -144490 -130304 -125820
39284 -125820 -121155 -101623 -60515 -1756 65282 130113 182232 212067 213045 184061 132330 74285
39272 74285 29574 9205 8836 14722 14519 485 -33473 -89870 -160516 -226342 -268305 -277492 -254317
39259 -254317 -202489 -127627 -39575 48213 122301 172152 192698 187593 168485 147857 133038 128806
39247 128806 142281 179655 238609 309085 381607 449276 500889 520497 500826 454431 405247
39236 405247 368410 341057 311204 270761 219214 159254 92317 18338 -60655 -136107 -193110
39225 -193110 -217795 -205971 -164126 -103163 -34029 30500 74709 86392 66920 34323 14279
39214 14279 24397 63155 112262 150893 169647 172870 171215 175631 196831 242853 310892 383016
$$ packed form
39296A47807n0790m0121l3927l5785m3771m9172m1889k0099N110J8147J4186M484
39284a25820M665J9532M1108N8759O7038O4831N2119K9835R78k8984n1731n8045
39272G4285m4711k0369l69N886k03j4034l3958n6397p0646o5826m1963r187K3175
39259b54317N1828P4862Q8052Q7788P4088M9851K0546n105j9108k0628j4819m232
39247A28806J3475L7374N8954P0476P2522O7669N1613J9608j9671m6395m9184
39236D05247l6837k7353k9853m0443n1547n9960o6937p3979p8993p5452n7003
39225a93110k4685J1824M1845O0963O9134O4529M4209J1683j9472l2597k0044
39214A4279J0118L8758M9107L8631J8754L223j655M416K1200M6022O8039P2124
$$ plain form
39202 383016 435627 456067 450118 435258 429418 443569 476983 514732 533853 519189 475230 420202
39190 420202 369027 324916 286083 253417 227719 204875 181576 165467 172560 210826 269216 325695
39178 325695 365002 388226 408812 441535 491376 547927 591710 610854 612745 617794 643811 700508
39166 700508 796229 939713 1129179 1344274 1555503 1741487 1894440 2012775 2096564 2152589
39156 2152589 2198051 2253032 2327581 2416713 2507606 2591407 2668530 2742928 2812014 2864380 2888570
39145 2888570 2881763 2847410 2788016 2707094 2618500 2545068 2500528 2474429 2440039 2377115 2284334
39134 2284334 2172351 2052080 1931629 1818142 1715850 1622247 1530092 1434681 1337832 1243529
39124 1243529 1150367 1050091 935883 813328 702309 625580 593190 595493 607854 601140 553329
$$ packed form
39202C83016N2611K0440n949j4860n840J4151L3414L7749J9121j4664m3959n5028
39190D20202n1175m4111l8833l2666k5698k2844k3299j6109P093L8266N8390N6479
39178C25695L9307K3224K0586L2723M9841N6551M3783J9144J891N049K6017N6697
39166G00508R5721J43484J89466K15095K11229J85984J52953J18335Q3789N6025
39156B152589M5462N4981P4549Q9132R0893Q3801P7123P4398O9086N2366K4190
39145B888570o807l4353n9394q0922q8594p3432m4540k6099l4390o2924r2781
39134B284334j11983j20271j20451j13487j02292r3603r2155r5411r6849r4303
39124A243529r3162j00276j14208j22555j11019p6729l2390K303J2361o714m7811
$$ plain form
39113 553329 459973 337100 210610 99588 10330 -55487 -94365 -107257 -107080 -111791 -128889
39102 -128889 -149911 -159193 -144633 -102739 -40471 26785 85937 138731 200180 281610 377942 472998
39090 472998 552233 606581 628947 615372 571334 512665 457257 415384 386746 364985 345033
39079 345033 326731 310919 293435 267504 234537 209077 208852 240383 295387 357267 407266 428656
39067 428656 413918 370524 316010 265815 227632 205003 199453 206791 216249 216719 202383 172698
39055 172698 132431 93538 70321 66260 68454 61087 43592 30298 32792 48911 70994 98571
39043 98571 136874 185317 234488 276787 315302 357856 404599 447067 479901 507415 534083 551612
39031 551612 541166 489799 403614 307136 232817 206564 232589 286845 330564 338431 316282 290864
$$ packed form
39113E53329r3356j22873j26490j11022q9258o5817l8878j2892J77m711j7098
39102a28889k1022r282J4560M1894O2268O7256N9152N2794O1449Q1430R6332R5056
39090D72998P9235N4348K2366j3575m4038n8669n5408m1873k8638k1761j9952
39079C45033j8302j5812j7484k5931l2967k5460k25L1531N5004O1880M9999K1390
39067D28656j4738m3394n4514n0195l8183k2629n550P338R458M70j4336k9685
39055A72698m0267l8893k3217m061K194p367j7495j3294K494J6119K2083K7577
39043I8571L8303M8443M9171M2299L8515M2554M6743M2468L2834K7514K6668J7529
39031E51612j0446n1367q6185r6478p4319k6253K6025N4256M3719P867k2149k5418
$$ plain form
39019 290864 283033 290915 295321 277896 235457 181181 133821 104754 93914 96301 109500 133354
39007 133354 164075 191523 203643 194429 168871 140228 120910 114859 117989 122955 120154 96534
38995 96534 41459 -41579 -131693 -202584 -237933 -237055 -211713 -179910 -156033 -140227 -120107 -88413
38983 -88413 -56131 -41193 -45026 -47181 -24071 32048 112056 199326 276521 329673 352957 349729
38971 349729 327474 293733 257640 230319 219197 223775 240312 268379 308519 354328 391203 403797
38959 403797 383019 327769 245453 152261 67522 2011 -48463 -95758 -146546 -199199 -251752
38948 -251752 -307144 -367531 -427270 -476614 -511021 -531646 -536888 -520558 -482671 -437674 -405994 -397639
38936 -397639 -406434 -417291 -414119 -383504 -319956 -232580 -143279 -74309 -36568 -27471 -34522 -39461
$$ packed form
39019B90864p831P882M406j7425m2439n4276m7360k9067j0840K387J3199K3854
39007A33354L0721K7448J2120r214k5558k8643j9318o051L130M966k801k3620
38995I6534n5075q3038r0114p0891l5349Q78K5342L1803K3877J5806K0120L1694
38983h8413L2282J4938l833k155K3110N6119Q0008Q7270P7195N3152K3284l228
38971C49729k2255l3741l6093k7321j1122M578J6537K8067M0140M5809L6875J2594
38959D03797k0778n5250q2316r3192q4739o5511n0474m7295n0788n2653n2553
38948b51752n5392o0387n9739m9344l4407k0625n242J6330L7887M4997L1680Q355
38936c97639q795j0857L172L0615O3548Q7376Q9301O8970L7741R097p051m939
$$ plain form
38924 -39461 -25432 12997 66883 122589 172921 215407 241846 236908 192281 121443 57015 30446
38912 30446 51808 106731 170220 221850 249707 246457 209268 145465 73515 13098 -27363 -53544
38900 -53544 -77577 -109165 -152545 -208634 -277636 -358536 -446043 -529781 -598530 -644708 -662424 -642825
38888 -642825 -578046 -474084 -356504 -257507 -195729 -169474 -166892 -177392 -192226 -199237 -183378
38877 -183378 -135464 -60941 20805 87469 125810 133918 114764 72617 17822 -30103 -51144 -37988
38865 -37988 1711 54935 110917 160331 194522 210632 215268 219865 234083 264982 317391 388185
38853 388185 460916 512911 531386 521018 495624 465935 436117 406314 373476 332214 280720
38842 280720 226334 181691 154869 145978 151710 166758 179259 172479 138505 88995 47756 33348
$$ packed form
38924c9461J4029L8429N3886N5706N0332M2486K6439m938m4627p0838o4428k6569
38912C0446K1362N4923O3489N1630K7857l250l7189o3803p1950o0417m0461k6181
38900e3544k4033l1588m3380n6089o9002q0900q7507q3738o8749m6178j7716J9599
38888f42825O4779J03962J17580R8997O1778K6255K582j0500j4834p011J5859
38877a83378M7914P4523Q1746O6664L8341Q108j9154m2147n4795m7925k1041J3156
38865c7988L9699N3224N5982M9414L4191J6110M636M597J4218L0899N2409P0794
38853C88185P2731N1995J8475j0368k5394k9689k9818k9803l2838m1262n1494
38842B80720n4386m4643k6822q891N732J5048J2501o780l3974m9510m1239j4408
$$ plain form
38830 33348 51086 96414 156742 210332 234370 221410 184642 143532 108264 80578 61634 49468
38818 49468 31990 -5868 -64056 -122525 -158523 -166031 -156962 -148044 -149718 -163778 -185877 -209096
38806 -209096 -226095 -227758 -201765 -138856 -45111 54447 129842 165289 164341 139051 97788 41896
38794 41896 -31218 -123679 -232560 -347305 -452770 -536155 -590858 -614987 -609559 -579189 -530897
38783 -530897 -468436 -388378 -285380 -163411 -40612 59795 125657 163154 186979 203890 208669
38772 208669 196739 175832 160190 155316 154526 150904 146746 149198 161822 183300 208767 227799 226785
38759 226785 201601 166302 141348 132096 124510 102750 65560 25053 -3434 -8558 11064 41399
38747 41399 58821 49278 20732 -7697 -26037 -37719 -46792 -49092 -36642 -3976 52118 133229
$$ packed form
38830C3348J7738M5328O0328N3590K4038j2960l6768m1110l5268k7686j8944j2166
38818D9468j7478l7858n8188n8469l5998p508R069Q918j674j4060k2099k3219
38806b09096j6999j663K5993O2909R3745R9558P5395L5447r48k5290m1263n5892
38794D1896p3114r2461j08881j14745j05465q3385n4703k4129N428L0370M8292
38783e30897O2461Q0058J02998J21969J22799J00407O5862L7497K3825J6911M779
38772B08669j1930k0907j5642m874p90l622m158K452J2624K1478K5467J9032j014
38759B26785k5184l5299k4954r252p586k1760l7190m0507k8487n124J9622L0335
38747D1399J7422r543k8546k8429j8340j1682r073k300J2450L2666N6094Q1111
$$ plain form
38735 133229 234727 341361 429286 473753 460257 396117 312319 246600 218442 220426 233124
38724 233124 243361 247233 244161 236274 230782 234750 246049 254010 250438 237122 221877 209637 197642
38711 197642 177055 139608 85770 27377 -19769 -46516 -52994 -42983 -20055 10725 42270 69439
38699 69439 90750 104069 104060 88250 64009 44414 35724 32181 25046 14271 8223 12987 24950
38686 24950 33780 29159 3806 -44942 -110891 -177780 -228954 -261274 -286493 -317209 -354800 -392706
38674 -392706 -425827 -451069 -462067 -451044 -416177 -361496 -289848 -203497 -113884 -42345 -3922
38663 -3922 5657 130 -17366 -56049 -118237 -186304 -233944 -247088 -229743 -192628 -142523 -83012
38651 -83012 -19084 43931 103575 157116 195208 204822 183431 148068 124412 125095 141787 159415
$$ packed form
38735A33229J01498J06634Q7925M4467j3496o4140q3798o5719k8158J984J2698
38724B33124J0237L872l072p887n492L968J1299P961l572j3316j5245j2240j1995
38711A97642k0587l7447n3838n8393m7146k6747o478J0011K2928L0780L1545K7169
38699F9439K1311J3319rj5810k4241j9595q690l543p135j0775o048M764J1963
38686B4950Q830m621k5353m8748o5949o6889n1174l2320k5219l0716l7591l7906
38674c92706l3121k5242j0998J1023L4867N4681P1648Q6351Q9613P1539L8423
38663c922R579n527j7496l8683o2188o8067m7640j3144J7345L7115N0105N9511
38651h3012O3928O3015N9644N3541L8092R614k1391l5363k3656O83J6692J7628
$$ plain form
38639 159415 173532 189804 209942 225321 226737 216216 205304 202373 203796 197353 172668 128784
38627 128784 74245 21639 -19483 -48247 -73715 -109294 -161958 -224610 -279998 -314094 -326025
38616 -326025 -324902 -318654 -307694 -288207 -258342 -220235 -178158 -136446 -98241 -64975 -37683 -19831
38604 -19831 -17749 -36020 -71249 -110837 -139085 -146617 -136658 -123804 -125097 -148650 -188497 -230658
38592 -230658 -265399 -294163 -324859 -361122 -396825 -420826 -426368 -416118 -399096 -382898 -367148 -342706
38580 -342706 -297848 -228356 -144073 -65304 -10650 13775 15063 5362 -6643 -18455 -31124 -45566
38568 -45566 -61514 -79627 -102884 -132866 -163502 -182019 -180768 -168201 -164608 -185720 -232134 -293269
38556 -293269 -356158 -408700 -440893 -449689 -441889 -427890 -412976 -397589 -384211 -378651 -384214 -398944
$$ packed form
38639A59415J4117J6272K0138J5379J416j0521j0912k931J423o443k4685m3884
38627A28784n4539n2606m1122k8764k5468l5579n2664o2652n5388l4096j1931
38616c26025J123O248J0960J9487K9865L8107M2077M1712L8205L3266K7292J7852
38604a9831K082j8271l5229l9588k8248p532R959J2854j293k3553l9847m2161
38592b30658l4741k8764l0696l6263l5703k4001n542J0250J7022J6198J5750K4442
38580c42706M4858O9492Q4283P8769N4654K4425J288r701j2005j1812j2669j4442
38568d5566j5948j8113k3257k9982l0636j8517J251J2567L593k1112m6414o1135
38556b93269o2889n2542l2193q796P800J3999J4914J5387J3378N560n563j4730
$$ plain form
38544 -398944 -419466 -443532 -467598 -485993 -494925 -494515 -484751 -461412 -417771 -349368 -257975 -154380
38532 -154380 -57028 17567 65437 92763 102731 92009 63064 30813 8449 -7716 -29296 -54649
38520 -54649 -67608 -57590 -31026 -778 26463 49099 66366 80834 97262 111847 109242 79579
38508 79579 35246 1124 -12408 -20490 -47835 -107604 -195508 -296463 -392058 -465390 -504677 -505012
38496 -505012 -468043 -401513 -318431 -233934 -161108 -109062 -82832 -83046 -106156 -146066 -194192 -238226
38484 -238226 -266631 -280085 -295829 -333310 -393386 -454886 -491616 -489720 -451315 -390501 -329618 -292430
38472 -292430 -292618 -327487 -383709 -446820 -504152 -544165 -559862 -553645 -535772 -517278 -505433 -504460
38460 -504460 -517381 -545416 -585199 -625862 -650056 -642113 -598655 -530955 -456785 -392427 -352642 -351388
$$ packed form
38544c98944k0522k4066k4066j8395q932M10R764K3339M3641O8403R1393J03595
38532a54380R7352P4595M7870K7326R968j0722k8945l2251k2364j6165k1580k5353
38520e4649j2959J0018K6564L0248K7241K2636J7267J4468J6428J4585k605k9663
38508G9579m4333l4122j3532q082k7345n9769q7904j00955r5595p3332l9287l35
38496e05012L6969O6530Q3082Q4497P2826N2046K6230k14k3110l9910m8126m4034
38484b38226k8405j3454j5744l7481o0076o1500l6730J896L8405O0814O0883L7188
38472b92430j88l4869n6222o3111n7332m0013j5697O217J7873J8494J1845R73
38460e04460j2921k8035l9783m0663k4194P943M3458O7700P4170O4358L9785J254
$$ plain form
38448 -351388 -394757 -473093 -565330 -652935 -727868 -788089 -829536 -843062 -815534 -734082 -596200
38437 -596200 -420991 -247580 -115369 -42369 -22392 -41096 -90729 -168766 -266574 -364188 -437985
38426 -437985 -474046 -475669 -458677 -437506 -413547 -377975 -328114 -278989 -253069 -257136 -274616 -284685
38414 -284685 -284308 -285364 -293858 -301832 -300506 -291263 -278448 -259856 -233139 -206821 -194314 -197055 -202238
38401 -202238 -199037 -189345 -179344 -167985 -150029 -125581 -98582 -66478 -18293 54465 148118 249505
38389 249505 345321 426815 488147 524964 536974 531078 519964 515612 522234 534208 541149 536578
38377 536578 523007 508137 495302 478625 449791 409520 369934 344810 339652 351350 372475 392131
38365 392131 397273 381280 351785 323106 297755 260057 192352 95398 -9900 -99198 -161937
$$ packed form
38448c51388m3369p8336r2237q7605p4933o0221m1447j3526K7528Q1452J37882
38437e96200J75209J73411J32211P3000J9977j8704m9633p8037r7808r7614p3797
38426d37985l6061j623J6992K1171K3959L5572M9861M9125K5920m067j7480j0069
38414b84685L77j056q494p974J326R243J2815J8592K6717K6318J2507k741n183
38401b02238L201R692J0001J1359J7956K4448K6999L2104M8185P2758R3653J01387
38389B49505R5816Q1494O1332L6817J2010n896j1114m352O622J1974O941m571
38377E36578j3571j4870j2835j6677k8834m0271l9586k5124n158J1698K1125J9656
38365C92131N142j5993k9495k8679k5351l7698o7705r6954j05298q9298o2739
$$ plain form
38354 -161937 -206387 -251503 -310598 -377473 -428972 -445186 -427091 -392070 -354566 -316132 -272981
38343 -272981 -226148 -181811 -146346 -123209 -110178 -96962 -70404 -26958 21760 58413 71494
38332 71494 54896 3098 -82613 -183156 -266795 -311300 -317829 -300613 -267867 -216707 -141774 -42024
38320 -42024 78738 209864 330910 418108 460399 468189 462701 456128 443480 413143 363231 306753
38308 306753 261208 233818 217653 202623 188377 183342 191193 202770 204484 192236 173075 154679
38296 154679 138327 122910 110012 100328 87507 61528 20417 -23798 -53215 -57509 -38396 -2749
38284 -2749 44385 98645 152798 200059 240429 277346 305308 306429 265557 187172 92660 2788
38272 2788 -71982 -127600 -163931 -189023 -216140 -250070 -282793 -309655 -343291 -400940 -479648 -553915
$$ packed form
38354a61937m4450m5116n9095o6875n1499j6214J8095L5021L7504L8434M3151
38343b72981M6833M4337L5465K3137J3031J3216K6558M3446M8718L6653J3081
38332G1494j6598n1798q5711j00543q3639m4505o529J7216L2746N1160P4933R9750
38320d2024J20762J31126J21046Q7198M2291P790n488o573j2648l0337m9912n6478
38308C06753m5545k7390j6165j5030j4246n035P851J1577J714j2248j9161j8396
38296A54679j6352j5417j2898r684j2821k5979m1111m4215k9417m294J9113L5647
38284b749M7134N4260N4153M7261M0370L6917K7962J121m0872p8385r4512q9872
38272B788p4770n5618l6331k5092k7117l3930l2723k6862l3636n7649p8708p4267
$$ plain form
38260 -553915 -599002 -609524 -595935 -573403 -557298 -558351 -572183 -577712 -555133 -506788 -456970 -431885
38248 -431885 -441374 -475489 -512653 -532668 -529087 -512515 -500541 -503312 -518075 -534125 -540479 -532640
38236 -532640 -517893 -513592 -535226 -584311 -649047 -714369 -768165 -801895 -813855 -812287 -806729 -792816
38224 -792816 -753100 -679130 -587943 -509170 -456796 -419108 -375798 -319284 -258341 -206371 -169892
38213 -169892 -146232 -128843 -114518 -106800 -112446 -133474 -162178 -184182 -187225 -168195 -133367 -93312
38201 -93312 -58025 -35164 -29288 -39207 -55192 -60480 -38670 16380 94254 170918 221885 237247
38189 237247 225400 202159 177767 154674 132695 109768 78326 28035 -43241 -122342 -185926
38178 -185926 -212446 -192326 -133351 -58748 4981 43854 60993 66464 66644 64964 67135 78858
$$ packed form
38260e53915m5087j0522J3589K2532J6105j053j3832n529K2579M8345M9818K5085
38248d31885r489l4115l7164k0015L581J6572J1974k771j4763j6050o354P839
38236e32640J4747M301k1634m9085o4736o5322n3796l3730j1960J568N558J3913
38224g92816L9716P3970R1187P8773N2374L7688M3310N6514O0943N1970L6479
38213a69892K3660J7389J4325P718n646k1028k8704k2004l043J9030L4828M0055
38201i3312L5287K2861N876r919j5985n288K1810N5050P7874P6664N0967J5362
38189B37247j1847k3241k4392k3093k1979k2927l1442n0291p1276p9101o3584
38178a85926k6520K0120N8975P4603O3729L8873J7139N471J80j680K171J1723
$$ plain form
38166 78858 98318 114509 113936 88918 42096 -14631 -67374 -109481 -143783 -175537 -205385 -229691
38154 -229691 -243971 -244405 -230757 -211314 -200175 -204076 -214742 -219893 -219303 -223456 -237218 -251427 -251344
38141 -251344 -228521 -184590 -129325 -76376 -35249 -4324 26101 63697 110128 165408 228717
38130 228717 291820 336742 344576 306241 225971 120289 15638 -59657 -88957 -75057 -35127
38119 -35127 9218 37630 35041 -2017 -62692 -128511 -183422 -217684 -226357 -208729 -169299 -116823
38107 -116823 -61539 -12548 24375 47269 54393 40072 -1892 -68168 -141957 -202500 -238595 -252612
38095 -252612 -253860 -249675 -240942 -224478 -200387 -176004 -158631 -143691 -114984 -59904 17927 102228
38083 102228 176192 229561 259738 270996 269472 254554 217791 153982 70245 -19703 -106068 -182449
$$ packed form
38166G8858J9460J6191n73k5018m6822n6727n2743m2107l4302l1754k9848k4306
38154b29691j4280m34J3648J9443J1139l901j0666n151N90m153j3762j4209Q3
38141b51344K2823M3931N5265N2949M1127L0925L0425L7596M6431N5280O3309
38130B28717O3103M4922P834l8335q0270j05682j04651p5295k9300J3900L9930
38119c5127M4345K8412k589l7058o0675o5819n4911l4262q673J7628L9430N2476
38107a16823N5284M8991L6923K2894P124j4321m1964o6276p3789o0543l6095j4017
38095b52612j248M185Q733J6464K4091K4383J7373J4940K8707N5080P7831Q4301
38083A02228P3964N3369L0177J1258j524j4918l6763o3809q3737q9948q6365p6381
$$ plain form
38071 -182449 -239941 -271832 -285118 -299041 -327746 -367184 -400596 -413624 -402801 -372832 -329060
38060 -329060 -273138 -206190 -135617 -75644 -38670 -28130 -41755 -77465 -130756 -189322 -237914
38049 -237914 -269452 -286238 -289759 -274962 -236491 -176887 -107536 -45034 -6016 1044 -17291 -43866
38037 -43866 -65118 -80039 -95732 -117923 -146007 -172613 -186576 -181105 -161645 -141722 -128279 -114694
38025 -114694 -91445 -60594 -36163 -31840 -50542 -83307 -114890 -131627 -127675 -106224 -77510 -58016
38013 -58016 -67345 -115343 -186995 -246338 -263214 -235755 -184147 -127932 -77368 -43481 -42790 -83547
38001 -83547 -151065 -214209 -248963 -254997 -249764 -248461 -250724 -246135 -230027 -210023 -195150 -181297 -152501
37988 -152501 -98597 -29130 33086 72391 93126 112588 142946 180280 208707 212512 186195 138545
$$ packed form
38071a82449n7492l1891j3286j3923k8705l9438l3412j3028J0823K9969M3772
38060c29060N5922O6948P0573N9973L6974J0540j3625l5710n3291n8566m8592
38049b37914l1538j6786l521J4797L8471N9604O9351O2502L9018P060j8335k6575
38037d3866k1252j4921j5693k2191k8084k6606j3963N471J9460J9923J3443J3585
38025a14694K3249L0851K4431M323j8702l2765l1583j6737L952K1451K8714J9494
38013e8016r329m7998p1652n9343j6876K7459N1608N6215N0564L3887O91m0757
38001h3547o7518o3144l4754o034N233J303k263M589J6108K0004J4873J3853K8796
37988a52501N3904O9467O2216L9305K0735J9462L0358L7334K8427L805k6317m7650
$$ plain form
37976 138545 89689 59726 54048 59210 55850 34913 -992 -47843 -103288 -158713 -197086 -204899
37964 -204899 -182940 -141691 -90915 -39514 -1268 9461 -8728 -39362 -59935 -58107 -36832 -7519
37952 -7519 19114 36414 39109 20834 -21780 -80925 -136010 -164150 -154182 -112273 -57745 -14801
37940 -14801 -2435 -24434 -68149 -117531 -168303 -226470 -291863 -349310 -380149 -379436 -358601 -334518
37928 -334518 -320755 -326624 -355826 -401069 -443506 -463459 -454130 -424872 -391715 -364927 -343173 -316731
37916 -316731 -277007 -225722 -174360 -131471 -91126 -39766 22885 75077 91064 65989 18368
37905 18368 -29565 -67665 -95830 -115748 -128644 -135015 -130946 -107359 -57412 15492 97755 171134
37893 171134 218784 232558 218743 192335 160949 117910 55951 -16385 -79076 -119423 -139499
$$ packed form
37976A38545m8856k9963n678N162l360k0937l5905m6851n5445n5425l8373p813
37964b04899K1959M1249N0776N1401L8246J0729j8189l0634k0573J828K1275K9313
37952g519K6633J7300K695j8275m2614n9145n5085k8140R968M1909N4528M2944
37940a4801J2366k1999m3715m9382n0772n8167o5393n7447l0839P13K0835K4083
37928c34518J3763n869k9202m5243m2437j9953R329K9258L3157K6788K1754K6442
37916c16731L9724N1285N1362M2889M0345N1360O2651N2192J5987k5075m7621
37905A8368m7933l8100k8165j9918j2896o371M069K3587M9947P2904Q2263P3379
37893A71134M7650J3774j3815k6408l1386m3039o1959p2336o2691m0347k0076
$$ plain form
37882 -139499 -145791 -140022 -123315 -103099 -90572 -92961 -110431 -138080 -168357 -193241 -207351 -210071
37870 -210071 -204969 -197709 -193836 -196852 -207845 -226793 -251901 -275436 -282341 -257436 -195630 -104762
37858 -104762 -502 99126 177572 224330 236920 215773 159414 70287 -36303 -137948 -222706
37847 -222706 -293856 -353319 -388109 -381671 -335835 -274321 -224598 -200234 -197515 -201162 -192999 -163987
37835 -163987 -124202 -98946 -110975 -165422 -249970 -344757 -430275 -491234 -520131 -519337 -498249 -467817
37823 -467817 -437269 -412535 -393680 -374344 -347438 -312566 -275922 -243279 -216573 -197463 -188272 -185053
37811 -185053 -173673 -139672 -82641 -17222 39362 75984 85407 63205 15943 -32970 -52913 -24739
37799 -24739 48352 143971 231958 288151 305012 291002 258091 211823 155875 100961 59675 30950
$$ packed form
37882a39499o292N769J6707K0216J2527k389j7470k7649l0277k4884j4110k720
37870b10071N102P260L873l016j0993j8948k5108k3535o905K4905O1806R0868
37858a04762J04260R9628P8446M6758J2590k1147n6359q9127j06590j01645q4758
37847b22706p1150n9463l4790O438M5836O1514M9723K4364K719l647Q163K9012
37835a63987L9785K5256j2029n4447q4548r4787q5518o0959k8897P94K1088L0432
37823d67817L0548K4734J8855J9336K6906L4872L6644L2643K6706J9110R191L219
37811a85053J1380L4001N7031O5419N6584L6622R423k2202m7262m8913j9943K8174
37799b4739P3091R5619Q7987N6193J6861j4010l2911m6268n5948n4914m1286k8725
$$ plain form
37787 30950 -2716 -57466 -130107 -200700 -250334 -273871 -277925 -270385 -251924 -216210 -159096 -88929
37775 -88929 -26897 4842 -3137 -43045 -95673 -140761 -166826 -176148 -181393 -195825 -225189 -266889
37763 -266889 -314025 -358834 -393974 -412873 -410228 -383528 -335751 -276541 -218918 -173410 -144649 -132072
37751 -132072 -132496 -142899 -161825 -186566 -208317 -214839 -203566 -190101 -196815 -231402 -280629 -324537
37739 -324537 -350704 -354795 -336936 -303586 -267436 -239106 -221210 -213079 -214699 -219226 -206835 -156359
37727 -156359 -63804 56728 189416 325757 455554 557246 604798 585147 508719 405003
37717 405003 307315 236686 195825 176776 172048 176203 180222 172271 147014 110279 72652 42753
37705 42753 29310 44075 95093 176335 267742 346642 398122 416981 405377 371033 324500 274513
$$ packed form
37787C0950l3666n4750p2641p0593m9634k3537m054P540J8461L5714N7114P0167
37775h8929O2032L1739p979l9908n2628m5088k6065r322n245j4432k9364m1700
37763b66889m7136m4809l5140j8899K645K6700M7777N9210N7623M5508K8761J2577
37751a32072m24j0403j8926k4741k1751o522J1273J3465o714l4587m9227m3908
37739c24537k6167m091J7859L3350L6150K8330J7896Q131j620m527J2391N0476
37727a56359R2555J20532J32688J36341J29797J01692M7552j9651p6428j03716
37717D05003r7688p0629m0861j9049m728M155M019p951k5257l6735l7627k9899
37705D2753j3443J4765N1018Q1242R1407P8900N1480J8859j1604l4344m6533m9987
$$ plain form
37693 274513 225854 182650 151718 139131 143125 153420 159202 155502 140596 112109 72554 37851
37681 37851 31510 63849 119039 166747 186003 176849 153884 134728 132225 148711 172995 185767
37669 185767 171731 128249 65409 1923 -40520 -46535 -16128 36068 91915 138774 168809 175641
37657 175641 156553 116187 64613 12120 -33036 -64540 -79496 -79976 -71300 -58883 -47040 -38668
37645 -38668 -34149 -31623 -28534 -19724 6765 65280 156874 259908 342983 387668 394115 367064
37633 367064 307566 223639 140111 86331 72936 86346 106503 124977 144793 168784 193574
37622 193574 214045 230108 248006 275787 317166 368538 421056 465295 494263 503902 492779 460607
37610 460607 404546 318006 199205 64787 -49400 -109541 -109432 -73104 -31872 -2465 11696
$$ packed form
37693B74513m8659m3204l0932j2587L994J0295N782l700j4906k8487l9555l4703
37681C7851o341L2339N5190M7708J9256r154k2965j9156k503J6486K4284J2772
37669A85767j4036m3482o2840o3486m2443o015L0407N2196N5847M6859L0035O832
37657A75641j9088m0366n1574n2493m5156l1504j4956m80Q676J2417J1843Q372
37645c8668M519K526L089Q810K6489N8515R1594J03034Q3075M4685O447k7051
37633C67064n9498q3927q3528n3780j3395J3410K0157J8474J9816K3991K4790
37622A93574K0471J6063J7898K7781M1379N1372N2518M4239K8968R639j1123l2172
37610D60607n6061q6540j18801j34418j14187o0141J09L6328M1232K9407J4161
$$ plain form
37599 11696 5390 -32642 -106606 -201438 -288143 -341829 -354468 -332583 -285845 -219241 -135622 -44142
37587 -44142 36488 86688 100472 91326 82139 88105 108243 131060 145661 147693 138718 123689 108605
37574 108605 97206 87919 74343 49041 7001 -52003 -119856 -178122 -205348 -193031 -155067 -117769
37562 -117769 -99060 -99019 -109995 -131235 -170492 -233331 -314131 -397259 -465150 -505928 -515979 -496670
37550 -496670 -448647 -370570 -265828 -151015 -54579 -2359 -975 -33930 -73081 -93730 -81955
37539 -81955 -35746 32718 96561 125714 107424 55248 -4846 -54076 -83166 -82274 -42201 30676
37527 30676 110148 168528 196316 200660 191145 174444 158042 148165 142075 129111 101739 61297
37515 61297 12417 -41762 -95669 -137593 -155239 -144343 -109962 -60988 -4884 54990 120193 194207
$$ packed form
37599A1696o306l8032p3964r4832q6705n3686j2639K1885M6738O6604Q3619R1480
37587d4142Q0630N0200J3784r146r187N966K0138K2817J4601K032q975j5029j5084
37574A08605j1399r287j3576k5302m2040n9004o7853n8266k7226J2317L7964L7298
37562a17769J8709M1j0976k1240l9257o2839q0800q3128o7891m0778j0051J9309
37550d96670M8023P8077J04742J14813R6436N2220J384l2955l9151k0649J1775
37539h1955M6209O8464O3843K9153j8290n2176o0094m9230k9090Q92M0073P2877
37527C0676P9472N8380K7788M344r515j6701j6402r877o090j2964k7372m0442
37515F1297m8880n4179n3907m1924j7646J0896L4381M8974N6104N9874O5203P4014
$$ plain form
37503 194207 275514 353136 411135 439277 440448 428691 419965 423212 438424 461105 485747 504652
37491 504652 508683 495349 474775 460579 452686 435465 397091 345754 300889 271591 250911 230491
37479 230491 212707 205180 208821 216349 220236 217708 208615 192470 169404 142977 121330 114980 130829
37466 130829 164868 200627 218121 207415 174259 133178 96294 67304 40930 4558 -56395
37455 -56395 -148178 -261459 -376479 -476042 -551968 -601498 -624838 -629232 -628587 -631050 -627676 -599222
37443 -599222 -535171 -442540 -336204 -225165 -109432 14059 144734 274068 385578 462688
37433 462688 501150 513289 517455 523759 531439 537079 539730 536901 520900 485080 434252 385072 352839
37420 352839 338183 328394 311426 286687 262706 247877 245156 252323 263634 272629 277501 283853 299045
$$ packed form
37503A94207Q1307P7622N7999K8142J171j1757q726L247J5212K2681K4642J8905
37491E04652M031j3334k0574j4196p893j7221l8374n1337m4865k9298k0680k0420
37479B30491j7784p527L641P528L887k528r093j6145k3066k6427k1647o350J5849
37466A30829L4039L5759J7494j0706l3156m1081l6884k8990k6374l6372o0953
37455e6395r1783j13281j15020r9563p5926m9530k3340m394O45k463L374K8454
37443e99222O4051R2631J06336J11039J15733J23491J30675J29334J11510P7110
37433D62688L8462J2139M166O304P680N640K651k829j6001l5820n0828m9180l2233
37420C52839j4656r789j6968k4739k3981j4829k721P167J1311Q995M872O352J5192
$$ plain form
37407 299045 323256 348769 368644 383444 398360 416022 433955 448649 461532 480343 512076
37396 512076 552543 585767 598051 591000 575489 554302 518837 464816 402515 345320 293992 240422
37384 240422 184814 141451 126028 141461 176626 215324 245913 265540 276951 281701 279204 274219
37372 274219 279926 305584 340685 358250 337112 277852 196771 111717 38834 -3919 -2672 38261
37360 38261 93510 133882 147388 142838 135389 132078 130458 126408 120554 119908 136376 180855 252558
37347 252558 332558 393038 417975 414808 404111 398724 394693 381541 358800 341043 346127 377400
37335 377400 417115 438396 424142 374541 299839 211574 120941 38085 -32995 -96743 -159902
37324 -159902 -225798 -297344 -379627 -470747 -550802 -589090 -567728 -497043 -406956 -324996 -260883
$$ packed form
37407B99045K4211K5513J9875J4800J4916J7662J7933J4694J2883J8811L1733
37396E12076M0467L3224J2284p051j5511k1187l5465n4021o2301n7195n1328n3570
37384B40422n5608m3363j5423J5433L5165L8698L0589J9627J1411M750k497m985
37372B74219N707K5658L5101J7565k1138n9260q1081q5054p2883m2753J247M0933
37360C8261N5249M0372J3506m550p449l311j620m050n854o46J6468M4479P1703
37347B52558Q0000O0480K4937l167j0697n387m031j3152k2741j7757N084L1273
37335C77400L9715K1281j4254m9601p4702q8265r0633q2856p1080o3748o3159
37324a59902o5896p1546q2283r1120q0055l8288K1362P0685R0087Q1960O4113
$$ plain form
37313 -260883 -206653 -148936 -83163 -17807 34728 68861 85863 88000 78916 66866 58408 48284
37301 48284 24951 -10596 -40149 -48165 -39074 -27196 -14629 11924 64240 139920 225217 302920
37289 302920 357715 381856 378777 356823 317798 255044 162609 41573 -101655 -254624 -393238
37278 -393238 -485814 -513136 -485198 -433710 -387267 -354502 -327627 -297353 -264956 -243434 -246728 -275459
37266 -275459 -314946 -350411 -381402 -415886 -452284 -475816 -474263 -448937 -405870 -344938 -267294 -189046
37254 -189046 -135037 -116063 -120208 -130751 -146229 -177055 -225927 -277999 -311171 -314378 -297795 -287239
37242 -287239 -305239 -352469 -407405 -445998 -459643 -452011 -424238 -372457 -300130 -223905 -162502 -123818
37230 -123818 -105748 -104478 -117025 -139002 -165520 -193231 -217605 -230599 -227394 -216018 -214603 -235986
$$ packed form
37313b60883N4230N7717O5773O5356N2535L4133J7002K137r084j2050q458j0124
37301D8284k3333l5547k9553q016R091J1878J2567K6553N2316P5680Q5297P7703
37289C02920N4795K4141l079k1954l9025o2754r2435j21036j43228j52969j38614
37278c93238r2576k7322K7938N1488M6443L2765K6875L0274L2397K1522l294k8731
37266b75459l9487l5465l0991l4484l6398k3532J553K5326M3067O0932P7644P8248
37254a89046N4009J8974m145j0543j5478l0826m8872n2072l3172l207J6583J0556
37242b87239j8000m7230n4936l8593j3645P632K7773N1781P2327P6225O1403L8684
37230a23818J8070J270j2547k1977k6518k7711k4374j2994L205J1376J415k1383
$$ plain form
37218 -235986 -277513 -327399 -377613 -427475 -476804 -519644 -545157 -542597 -505357 -433012 -332143
37207 -332143 -215890 -101827 -7920 53261 80381 84824 84478 92782 111921 136274 161841 191178
37195 191178 229300 276735 327672 373157 404231 414103 401888 375888 350158 334938 330459 330019
37183 330019 326279 312698 282319 231033 164190 97758 50190 30938 33784 39338 26497 -13508
37171 -13508 -72683 -137740 -205791 -284873 -377832 -470657 -541478 -579119 -588405 -578667 -553171 -511917
37159 -511917 -460126 -409550 -372436 -356355 -362530 -384167 -404979 -403283 -363062 -284793 -186984 -96019
37147 -96019 -30418 9734 39985 76661 122111 162749 180786 168270 132370 90342 59400 46757
37135 46757 44412 32920 -6068 -76344 -162665 -238301 -279526 -278910 -250111 -219876 -210911 -228059
$$ packed form
37218b35986m1527m9886n0214m9862m9329m2840k5513K560L7240P2345J00869
37207c32143J16253J14063R3907O1181K7120M443l46Q304J9139K4353K5567K9337
37195A91178L8122M7435N0937M5485L1074R872j2215k6000k5730j5220m479m40
37183C30019l740j3581l0379n1286o6843o6432m7568j9252K846N554j2841m0005
37171a3508n9175o5057o8051p9082r2959r2825p0821l7641r286R738K5496M1254
37159e11917N1791N0576L7114J6081o175k1637k0812J696M0221P8269R7809R0965
37147i6019O5601M0152L0251L6676M5450M0638J8037j2516l5900m2028l0942j2643
37135D6757k345j1492l8988p0276q6321p5636m1225O16K8799L0235Q965j7148
$$ plain form
37123 -228059 -258834 -285932 -299019 -298243 -292560 -296348 -321784 -367625 -415419 -441799 -437009 -409717
37111 -409717 -373833 -335011 -292296 -247934 -208692 -177967 -153240 -133710 -124381 -126667 -128266 -111077
37099 -111077 -72585 -35044 -29131 -68738 -142258 -224809 -295005 -341748 -361127 -351614 -313498 -252691
37087 -252691 -183324 -122533 -79478 -51311 -33592 -32687 -60960 -117489 -179250 -216518 -214788 -179248
37075 -179248 -124120 -66590 -28626 -30838 -75578 -140850 -198723 -238381 -265682 -283470 -282859 -257084
37063 -257084 -215698 -177827 -154406 -142466 -133971 -123003 -104503 -74179 -34643 1780 21501 21961
37051 21961 15150 20091 51206 109036 177559 231133 248322 222576 162180 82671 -580 -76970
37039 -76970 -143081 -201148 -252832 -294239 -317866 -318050 -292992 -244156 -177870 -106437 -42294 10494
$$ packed form
37123b28059l0775k7098j3087P76N683l788k5436m5841m7794k6380M790K7292
37111d09717L5884L8822M2715M4362L9242L0725K4727J9530R329k286j599J7189
37099a11077L8492L7541N913l9607p3520q2551p0196m6743j9379R513L8116O0807
37087b52691O9367O0791M3055K8167J7719R05k8273n6529o1761l7268J730L5540
37075a79248N5128N7530L7964k212m4740o5272n7873l9658k7301j7788O11K5775
37063b57084M1386L7871K3421J1940Q495J0968J8500L0324L9536L6423J9721M60
37051B1961o811M941L1115N7830O8523N3574J7189k5746o0396p9509q3251p6390
37039g6970o6111n8067n1684m1407k3627j84K5058M8836O6286P1433O4143N2788
$$ plain form
37027 10494 55315 92305 113361 111608 92664 71437 58552 54473 56746 66832 85919 107795
37015 107795 122143 125640 125202 127841 130852 126392 114434 105833 110839 128618 151528 177001 209871
37002 209871 252155 294697 322664 329553 324236 322939 333332 346116 342752 312036 259276 200468
36990 200468 149903 113830 92122 81714 78633 80156 86521 99450 118930 142602 167475 189659
36978 189659 202070 195421 164796 116931 71148 50573 66963 109966 152640 171431 161425 131546
$$ packed form
37027A0494M4821L6990K1056j753j8944k1227j2885m079K273J0086J9087K1876
37015A07795J4348L497m38K639L011m460j1958q601N006J7779K2910K5473L2870
37002B09871M2284M2542K7967O889n317j297J0393J2784l364l0716n2760n8808
36990B00468n0565l6073k1708j0408l081J523O365J2929J9480K3672K4873K2184
36978A89659J2411o649l0625m7865m5783k0575J6390M3003M2674J8791j0006k9879
$$ [...]
##END NTUPLES=NMR SPECTRUM
##END=
