##TITLE=1H_T-3948-24
 CDCl3, 32 sc, 
 27.3.2020
##JCAMPDX= 6.0         $$ Bruker NMR JCAMP-DX V2.0
##DATA TYPE= NMR FID
##DATA CLASS= NTUPLES
##ORIGIN= UXNMR, Bruker Analytische Messtechnik GmbH
##OWNER= root
$$ XWIN-NMR		Version 3.5
$$ Fri Mar 27 16:28:29 2020 Russian Standard Time (UT+4h)  she@DPX200
##.OBSERVE FREQUENCY= 200.1315
##.OBSERVE NUCLEUS= ^1H
##.DELAY= (6, 6)
##.ACQUISITION MODE= SIMULTANEOUS
##.ACQUISITION SCHEME= undefined
##.AVERAGES= 32
##.DIGITISER RES= 18
##SPECTROMETER/DATA SYSTEM= spect
##.PULSE SEQUENCE= zg30
##.SOLVENT NAME= CDCl3
##.SHIFT REFERENCE= (INTERNAL, CDCl3, 0, 15.7039)
##AUDIT TRAIL= $$ (NUMBER, WHEN, WHO, WHERE, WHAT)
$$ ##TITLE= Audit trail, XWIN-NMR		Version 3.5
$$ ##JCAMPDX= 5.01
$$ ##ORIGIN= Bruker BioSpin GmbH
$$ ##OWNER= she
$$ F:/spectra/data/she/nmr/H-F/1/audita.txt
$$ ##AUDIT TRAIL=  $$ (NUMBER, WHEN, WHO, WHERE, WHAT)
(   1,<2020-03-27 16:25:49.06 +0400>,<she>,<DPX200>,
      <continue with go, POWCHK disabled, PULCHK disabled
       configuration hash MD5:
       00 E9 B6 7A A2 85 ED C7 34 08 36 98 17 FE 4E 26
       data hash MD5: 16K
       2F EE 32 C5 55 93 D9 FD 19 4D E7 F0 D3 77 AE 9D>)
$$ ##END=
$$ 
$$ hash MD5
$$ 1B 65 5E 5B C7 A1 48 38 B9 E4 65 0A E1 A2 C0 62
##$RELAX= 
##$RELAX= 
##$RELAX= 
##$RELAX= 
##$RELAX= 
##$RELAX= 
$$ Bruker specific parameters
$$ --------------------------
##$DU= <F:/spectra>
##$EXPNO= 1
##$NAME= <H-F>
##$PROCNO= 1
##$TYPE= <nmr>
##$USER= <she>
##$AMP= (0..31)
100 100 100 100 100 100 100 100 100 100 100 100 100 100 100 100 100 100 
100 100 100 100 100 100 100 100 100 100 100 100 100 100 
##$AQSEQ= 0
##$AQ_mod= 1
##$AUNM= <au_zg>
##$AUTOPOS= <>
##$BF1= 200.13
##$BF2= 200.13
##$BF3= 200.13
##$BF4= 200.13
##$BF5= 200.13
##$BF6= 200.13
##$BF7= 200.13
##$BF8= 200.13
##$BYTORDA= 1
##$CFDGTYP= 0
##$CFRGTYP= 5
##$CHEMSTR= <none>
##$CNST= (0..31)
1 1 145 1 1 1 1 1 1 1 1 1 1 1 1 1 1 1 1 1 1 1 1 1 1 1 1 1 1 1 1 1 
##$CPDPRG= <>
##$CPDPRG1= <>
##$CPDPRG2= <>
##$CPDPRG3= <>
##$CPDPRG4= <mlev>
##$CPDPRG5= <mlev>
##$CPDPRG6= <mlev>
##$CPDPRG7= <mlev>
##$CPDPRG8= <mlev>
##$CPDPRGB= <>
##$CPDPRGT= <>
##$D= (0..31)
0 1.2 0 0 0 0 0 0 0 0.06 0 0.03 0 0 0 0 0.0002 0 0 0 0 0 0 0 0 0 0 0 0 
0 0 0 
##$DATE= 1585311842
##$DBL= (0..7)
120 120 120 120 120 120 120 120 
##$DBP= (0..7)
150 150 150 150 150 150 150 150 
##$DBP07= 0
##$DBPNAM0= <>
##$DBPNAM1= <>
##$DBPNAM2= <>
##$DBPNAM3= <>
##$DBPNAM4= <>
##$DBPNAM5= <>
##$DBPNAM6= <>
##$DBPNAM7= <>
##$DBPOAL= (0..7)
0.5 0.5 0.5 0.5 0.5 0.5 0.5 0.5 
##$DBPOFFS= (0..7)
0 0 0 0 0 0 0 0 
##$DE= 6
##$DECBNUC= <off>
##$DECIM= 24
##$DECNUC= <off>
##$DECSTAT= 4
##$DIGMOD= 1
##$DIGTYP= 9
##$DL= (0..7)
0 120 120 120 120 120 120 120 
##$DP= (0..7)
150 150 150 150 150 150 150 150 
##$DP07= 0
##$DPNAME0= <>
##$DPNAME1= <>
##$DPNAME2= <>
##$DPNAME3= <>
##$DPNAME4= <>
##$DPNAME5= <>
##$DPNAME6= <>
##$DPNAME7= <>
##$DPOAL= (0..7)
0.5 0.5 0.5 0.5 0.5 0.5 0.5 0.5 
##$DPOFFS= (0..7)
0 0 0 0 0 0 0 0 
##$DQDMODE= 0
##$DR= 18
##$DS= 0
##$DSLIST= <SSSSSSSSSSSSSSS>
$$ [...]
##$SUBNAM2= <"">
##$SUBNAM3= <"">
##$SUBNAM4= <"">
##$SUBNAM5= <"">
##$SUBNAM6= <"">
##$SUBNAM7= <"">
##$SUBNAM8= <"">
##$SUBNAM9= <"">
##$SW= 24.9337058887773
##$SWIBOX= (0..15)
0 0 2 0 0 0 0 0 0 0 0 0 0 0 0 0 
##$SW_h= 4990.01996007984
##$TD= 16384
##$TD0= 1
##$TE= 0
##$TE2= 300
##$TE3= 300
##$TEG= 300
##$TL= (0..7)
0 120 120 120 120 120 120 120 
##$TP= (0..7)
150 150 150 150 150 150 150 150 
##$TP07= 0
##$TPNAME0= <>
##$TPNAME1= <>
##$TPNAME2= <>
##$TPNAME3= <>
##$TPNAME4= <>
##$TPNAME5= <>
##$TPNAME6= <>
##$TPNAME7= <>
##$TPOAL= (0..7)
0.5 0.5 0.5 0.5 0.5 0.5 0.5 0.5 
##$TPOFFS= (0..7)
0 0 0 0 0 0 0 0 
##$TUNHIN= 0
##$TUNHOUT= 0
##$TUNXOUT= 0
##$USERA1= <user>
##$USERA2= <user>
##$USERA3= <user>
##$USERA4= <user>
##$USERA5= <user>
##$V9= 5
##$VALIST= <valist>
##$VCLIST= <CCCCCCCCCCCCCCC>
##$VD= 0
##$VDLIST= <DDDDDDDDDDDDDDD>
##$VPLIST= <PPPPPPPPPPPPPPP>
##$VTLIST= <TTTTTTTTTTTTTTT>
##$WBST= 1024
##$WBSW= 4
##$XGAIN= (0..3)
0 0 0 0 
##$XL= 0
##$YL= 0
##$YMAX_a= 392524
##$YMIN_a= -168883
##$ZGOPTNS= <>
##$ZL1= 120
##$ZL2= 120
##$ZL3= 120
##$ZL4= 120
##$ABSF1= 10
##$ABSF2= 0
##$ABSG= 5
##$ABSL= 3
##$ALPHA= 0
##$AQORDER= 0
##$ASSFAC= 0
##$ASSFACI= 0
##$ASSFACX= 0
##$ASSWID= 0
##$AUNMP= <proc_1d>
##$AZFE= 0.1
##$AZFW= 0.1
##$BCFW= 1
##$BC_mod= 2
##$BYTORDP= 1
##$COROFFS= 0
##$CY= 11.3945322036743
##$DATMOD= 1
##$DC= 2
##$DFILT= <>
##$DTYPP= 0
##$F1P= 16.9975609425685
##$F2P= -3.02152046262296
##$FCOR= 0.5
##$FTSIZE= 0
##$FT_mod= 4
##$GAMMA= 1
##$GB= 0.15
##$INTBC= 1
##$INTSCL= 1
##$ISEN= 128
##$LB= 0.24
##$LEV0= 0
##$LPBIN= 0
##$MAXI= 10000
##$MC2= 0
##$MEAN= 0
##$ME_mod= 0
##$MI= 1.114404
##$NCOEF= 0
##$NC_proc= 0
##$NLEV= 6
##$NOISF1= 3.799351
##$NOISF2= 2.8
##$NSP= 1
##$NTH_PI= 0
##$NZP= 0
##$OFFSET= 15.70392
##$PC= 1
##$PHC0= -9786.896
##$PHC1= 14.60082
##$PH_mod= 1
##$PKNL= yes
##$PPARMOD= 0
##$PSCAL= 0
##$PSIGN= 0
##$REVERSE= no
##$SF= 200.130013532006
##$SI= 16384
##$SIGF1= 3
##$SIGF2= 2
##$SINO= 400
##$SIOLD= 16384
##$SREGLST= <1H.CDCl3>
##$SSB= 0
##$STSI= 0
##$STSR= 0
##$SW_p= 3612.71676300578
##$SYMM= 0
##$S_DEV= 0
##$TDeff= 0
##$TDoff= 0
##$TI= <>
##$TILT= no
##$TM1= 0
##$TM2= 0
##$TOPLEV= 0
##$USERP1= <user>
##$USERP2= <user>
##$USERP3= <user>
##$USERP4= <user>
##$USERP5= <user>
##$WDW= 1
##$XDIM= 8192
##$YMAX_p= 0
##$YMIN_p= 0
$$ End of Bruker specific parameters
$$ ---------------------------------
##NTUPLES= NMR FID
##VAR_NAME=  TIME,          FID/REAL,        FID/IMAG
##SYMBOL=    X,             R,               I
##VAR_TYPE=  INDEPENDENT,   DEPENDENT,       DEPENDENT
##VAR_FORM=  AFFN,          ASDF,            ASDF
##VAR_DIM=   8192,          8192,            8192
##UNITS=     SECONDS,       ARBITRARY UNITS, ARBITRARY UNITS
##FACTOR=    0.0002004,     1,               1
##FIRST=     0,             0,               0
##LAST=      1.6414764,     0,               0
##MIN=       0,             -168883,         0
##MAX=       1.6414764,     392524,          0
$$ Real data points
##PAGE= N=1
##DATA TABLE= (X++(R..R)), XYDATA
$$ [...]
2937C142k323k346L055m95k356L092Q39m316J758L175l268j460M507q68m198L141
2953A079K346m165N08L552l403j676M811o86m013K168K395l733O22L605l030k073
2969a693M106l98m053K350K568m441L72L744j233k757K263M58m098M021J229m170
2985a732K09M144k599k602L702J2l988K561K579l620o24L337j756k033K759J194
3001A543l374J435K071l581L51L892k598l024L927J169m432P70K810k701p9L909
3017B088j508l669K632J338k760R80L036m317k29M261j633k754L318Q64l297J005
3033f45K803l271r40M176j898j885K357P92m231J996L847l370k050L645j217j813
3049a704K160K584l996O02K889k534j157L725j185l016K684J373k557k62K550
$$ plain form
2937 3142 819 -1527 1528 1033 -1323 1769 2608 -1708 50 3225 -43 -1503 3004 2136 -2062 1079
2953 1079 3425 -740 -232 3320 -83 -1759 3052 2366 -1647 521 2916 -817 -195 3410 380 -1693
2969 -1693 2413 2015 -2038 312 2880 -1561 -1189 2555 1322 -1435 828 1286 -2812 1209 2438 -1732
2985 -1732 -1523 2621 22 -2580 1122 1134 -2854 -293 2286 -1334 -1958 1379 -377 -2410 349 1543
3001 1543 -1831 -396 1675 -1906 -1555 2337 -261 -3285 642 1811 -2621 -1851 959 -1742 -1821 2088
3017 2088 580 -3089 -457 881 -1879 -899 2137 -2180 -2409 1852 219 -2535 783 1647 -1650 -645
3033 -645 2158 -1113 -2053 2123 225 -1660 697 1489 -2742 -746 3101 -269 -2319 1326 109 -1704
3049 -1704 456 3040 -956 -354 2535 1 -1156 2569 1384 -1632 1052 2425 -132 -394 2156
3064B156k637j115M494o65l355J361K637m250J331K670k361j275L237m58l605
3079a835L156K022m354Q90K581j923j898K738l3k623L019O75l425m28L361j262
3095F61j702K769l52l176K402J993m160J01M267k358k666L778K71m017J258L442
3111B511l402o7L098k051k676L427J289m237J581K817l990q6L417k026k757M103
3127I51K4l135J522J793k665q89L762j954k125K747N77l247R88K977l605j137
3143c416L635q18k073K240Q15l153K055K974l612j936L617r93j432J703O70k593
3159b317J443L203l094j645L865k077k261K601J798l943P63L126k596l45L662
3174B183j368l479K554K499l800M17L273l030p27K928n78k120J371K161l970J546
$$ plain form
3064 2156 -481 -1596 2898 2233 -1122 239 2876 -1374 -43 2627 266 -1009 2228 1770 -1835
3079 -1835 1321 3343 -1011 -121 2460 537 -1361 1377 1344 -1279 1740 2415 -1010 -1438 1923 661
3095 661 -1041 1728 1376 -1800 602 2595 -1565 -1464 2803 445 -2221 1557 1828 -2189 -931 2511
3111 2511 -891 -958 2140 89 -2587 840 2129 -2108 -527 2290 -1700 -1786 1631 -395 -3152 951
3127 951 975 -2160 -638 1155 -1510 -2399 1363 -591 -2716 31 608 -2639 -1651 1326 -2279 -3416
3143 -3416 219 -599 -2672 -432 383 -2770 -715 2259 -1353 -3289 328 -665 -2097 -394 276 -2317
3159 -2317 -874 2329 -765 -2410 1455 -622 -2883 -282 1516 -2427 -1664 1462 -1134 -1479 2183
3174 2183 815 -2664 -110 2389 -1411 -994 2279 -751 -1478 1450 872 -1248 123 2284 -1686 -140
3190a40L121k564j816K760k68j522J868O34l592N99M069l013k131L663j4l497
3206a843J813K029l094J181K052j991j532L435n97l226K177K054l509Q8L646k831
3222a48j432K638O40l067J956J492k130p85L366j685k705L037N1l078J912J957
3238B019l209k16L309j789j846K696J53k550J335J555l136K4L103j000k837K682
3254B93J041l850J885K398l939K09K951j517k117K628P19l427J639K720k812l87
3270a566K568j586k223K621J713m345J267K745k276O7K602k250j600L182R15l654
3286a820J77L819k962q04K182j0k376J553Q58k820J331K999k949j408M263j167
3302H66k414K090L89k052O96K843k367j825L927j035k935K088J477r40p33K206
$$ plain form
3190 -140 2981 417 -1399 1361 1093 -429 1439 2073 -1519 -920 3149 136 -1995 1668 1654 -1843
3206 -1843 -30 1999 -1095 86 2138 147 -1385 2050 1453 -1773 404 2458 -1051 -963 2683 -148
3222 -148 -1580 1058 1698 -1369 587 2079 -51 -836 2530 845 -1860 1177 1228 -1850 62 2019
3238 2019 -1190 -1406 1903 114 -1732 964 1117 -1433 -98 1457 -1679 -1655 1448 448 -2389 293
3254 293 1334 -2516 -631 1767 -2172 -1963 988 -529 -2646 -18 701 -2726 -1087 1633 -1179 -1566
3270 -1566 1002 -584 -2807 -186 1527 -2818 -1551 1194 -1082 -1015 1587 -663 -2263 919 1834 -1820
3286 -1820 -1643 2176 -786 -1590 592 582 -1794 -241 617 -2203 -872 2127 -822 -2230 2033 866
3302 866 -1548 542 931 -1121 -425 2418 51 -1774 2153 1118 -1817 271 1748 808 75 2281
3318B281k362j393K824M4k707J845K146l556K46K815k304j267L020J219l767J342
3334D26K390m420J958K394k360k54K859j350j868J379J074k886n56L424j141k190
3350a121K077R75l105K259J828k581j218K628j289j326J158J268l076J013K935
3365B425k798j51K358j567k228K792R38l709Q59K498k314j22K333r83k685K440
3381H6J287l216J503J845k088j729L326o38k566J510J653k834M37K440k163j783
3397b930L485k77k784J798J229l401J881K220j844j858L228n55k952K698R88k704
3413a778Q83K425k732q68K940l73k841J546J528j330r77L153k517r40K882j68
3429H33k077J486J666l292N00J520r49j227K864p12k017J764J560k992K61L110
$$ plain form
3318 2281 -81 -1474 1350 1394 -1313 532 2678 -878 -632 2183 -121 -1388 1632 2851 -916 426
3334 426 2816 -1604 354 2748 388 134 2993 1643 -225 1154 2228 -658 -1214 2210 1069 -1121
3350 -1121 956 1931 -1174 1085 2913 332 -886 1742 453 -873 285 1553 -1523 -510 2425
3365 2425 -373 -524 1834 267 -1961 831 1769 -1940 -1081 1417 -897 -1019 1314 331 -2354 86
3381 86 1373 -1843 -340 1505 -583 -2312 1014 376 -2190 -680 973 -1861 -1424 1016 -1147 -2930
3397 -2930 555 278 -2506 -708 521 -2880 -999 1221 -623 -2481 747 192 -2760 -62 926 -1778
3413 -1778 -895 1530 -1202 -2070 870 497 -2344 -798 730 -600 -1577 1576 -941 -1881 1001 833
3429 833 -1244 242 1908 -1384 -884 636 -313 -1540 1324 612 -1405 359 1919 -1073 -812 2298
3445B298j929k338K514Q11k122P11K115k757M74J488p07j844L166q28k450J918
3461E20K078l134n5K514j161j799L301j35l142J084K215l276J1L083k436j070
3477a402K644J23l488K824Q69j625m87K693j695j270K495q9k249O42J309l776
3493b482Q63L480j452j902J806L69k598J792J683j770j949L896j187k286J599
3508a38J002k146m6K128j701jJ750j443k062K650Q08k819Q16K365k129m52K986
3525A568j186k852K308J496k945l4K459p92j285J678k21j653J802L29k286J587
3541b7K059k988j279L105q2k466J751N05j506L5K345j508j372K235O60k573J118
3558A2J022k116L25J832j180j304L387r67k229J184K539k464p55K328j066j273
$$ plain form
3445 2298 369 -1969 545 1356 -766 -55 2060 -697 -223 1265 558 -1286 1880 1052 -1398 520
3461 520 2598 -536 -591 1923 762 -1037 2264 2129 -1013 71 2286 -990 -979 2104 -332 -1402
3477 -1402 1242 1365 -2123 701 1570 -55 -542 2151 456 -814 1681 1592 -657 -15 1294 -2482
3493 -2482 -1619 1861 409 -1493 313 682 -1916 -124 1559 -211 -2160 1736 549 -1737 -138
3508 -138 864 -1282 -1328 800 -901 -902 848 -595 -2657 -7 801 -2018 -1202 1163 -966 -1418 1568
3525 1568 382 -2470 -162 1334 -1611 -1645 814 22 -1263 415 194 -1459 343 672 -1614 -27
3541 -27 2032 -956 -2235 870 788 -1678 73 578 -928 -893 1452 -56 -1428 807 1467 -1106 12
3558 12 1034 -1082 -757 1075 -105 -1409 1978 1011 -1218 -34 2505 41 -714 1614 548 -725
3574g25J925J22k464J391K180k499o32K613p41k052K407J38j837J111Q03j863
3590a23o32K774j146j674K152p60j177J091J555k282m45K818j326k399J925J791
3606B142l166Q23J580j430j83J289j62k143K225J38k509J114K025k033n42K513
3622A681j626j640K723K39k226M06K111k022j013K369m52k588L070l13j926M00
3638h07R00q75j267K133n04k405L176Q52k432k5K577k241r27K348n03k792K463
3655c29J091j709L45J458j903j108K622n19k950J952J650j453q47K028q36r62
3671a470J666r84j190K520Q47k875N66J807j384n73J994q83k371J977J258j767
3687h62o35J981k91j652J943n5j323J349Q51k252K37K057j498j700K901Q04k388
$$ plain form
3574 -725 1200 1322 -1142 249 2429 -70 -702 1911 1170 -882 1525 1663 -174 937 1740 -123
3590 -123 -755 2019 873 -801 1351 591 -586 505 2060 -222 -667 2151 825 -1574 351 2142
3606 2142 -1024 -201 1379 -51 -234 1055 893 -1250 975 1113 -1396 -282 1743 -290 -832 1681
3622 1681 55 -1585 1138 1377 -849 -443 1668 -354 -1367 1002 550 -2038 1032 719 -1207 -807
3638 -807 93 -782 -2049 84 -420 -2825 351 1203 -1229 -1254 1323 -918 -1845 503 0 -2792 -329
3655 -329 762 -947 -602 856 -1047 -2155 467 -52 -3002 -1050 600 -853 -1700 328 -508 -1470
3671 -1470 196 -788 -1978 542 1389 -1486 -920 887 -497 -1070 924 41 -2330 -353 905 -862
3687 -862 -1497 484 193 -1459 484 429 -894 455 1306 -946 -709 1348 -150 -1850 1051 1855 -533
3704e33M71J171j315n67J818q51j859K228J092k195L46J653j840k44K377j123
3720F29j414J724K98k297R80J601j906K5J499p3j707J362R10k963J335J545k291
3737g43j39K388o06k246K008Q49k402R49J649k370m48K265k54k115J642P16j011
3754A32p24J577j334r15K369l13k207J100J296k334Q86K009k568J2J848q98j737
3771a801J739J611k779K25K501k069j053J886K1k110J613Q32k113M40K405k197
3787h49r89K108M10j964J351J46j082q3J762j309j314J755O18k200J285J409j810
3804g56n27J672l41j871K227J35k054J213J666k520Q75J071p77j100J677K86k550
3821a674J754J291r74p42K951j904j194J220j26j397Q00J504j907o03K883j122
$$ plain form
3704 -533 -62 1109 -206 -773 1045 194 -1665 563 1655 -540 -194 1459 -381 -625 1752 629
3720 629 -785 939 1237 -1060 -80 1521 -385 -360 1139 1066 -641 721 1631 -1332 3 1548 -743
3737 -743 -882 1506 900 -1346 662 1511 -891 58 1707 -663 -1111 1154 900 -1215 427 1143 132
3754 132 -592 985 -349 -1264 1105 792 -1415 -315 981 -1353 -467 1542 -1026 -1014 834 -64 -1801
3771 -1801 -62 1549 -1230 -1005 1496 -573 -1626 260 281 -1829 -216 616 -1497 -1057 1348 -849
3787 -849 -1838 270 680 -1284 67 213 -869 -952 810 -499 -1813 -58 560 -1640 -355 1054 -756
3804 -756 -1283 389 48 -1823 404 539 -1515 -302 1364 -1156 -281 790 13 -1087 590 876 -1674
3821 -1674 80 1371 397 -345 2606 702 -492 728 602 -795 5 1509 -398 -1001 1882 760
3837G60j560J770J36j460L03J992k410K02K156j613l36N62J301k090R6K340j878
3854B71q26J759n53j747J879J101k615P09K363k374r45K758j181j338J550R1j567
3871f65N25K361k591q80K508n57j627J081N97j123l16K321j780o02J926l12k149
3888a283J150Q11j620N70J700j739j310K589r6k390R96J253j899N23J285r06n85
3905i51J156L1k261J924P94j892N5J537o11r68J482r29q77J634Q82j814p97K337
3923G32j209j236K178n56j464Q82J547j906K19J695j396n94J330N26j839O01R74
3940D84j344l70K189L5k740J922J37r87k02J886j898M87R38K19k003K020K54k720
3958a693J283J463j424L51J040r28q67J699L29k173N83J970k075j59J415o3j061
$$ plain form
3837 760 -800 970 1106 -354 -51 1941 -469 -267 1889 276 -60 502 1803 -287 -191 2149 271
3854 271 -555 1204 651 -1096 783 1884 -731 -22 2341 -33 -978 1780 599 -739 811 902 -665
3871 -665 -140 2221 -370 -1250 1258 701 -926 155 752 -371 -687 1634 -146 -748 1178 866 -1283
3888 -1283 -133 678 -942 -372 1328 -411 -1721 868 772 -1618 -622 631 -1268 -745 540 -366 -951
3905 -951 205 236 -2025 -101 693 -1199 -1144 393 -218 -1186 296 -633 -1510 124 1006 -808 -1605 732
3923 732 -477 -1713 465 -91 -1555 -673 874 -1032 -813 882 -514 -1108 222 748 -1091 -490 484
3940 484 -860 -1230 959 994 -1746 176 313 -674 -876 1010 -888 -401 537 756 -1247 773 1027 -1693
3958 -1693 -410 1053 -371 -20 1020 92 -775 924 1253 -920 -337 1633 -442 -601 814 751 -310
3975c10J240O83k056P87J690k600K4K191n46j819J054J055j607M54J753k147n42
3992f96J858M3j604M99J007k113Q70J040j145m26J683p56j669K113Q09k075L78
4009a84J425m75j549J770n17j492J484L15j699J75J799j059j182J830r0j953J311
4026i1J185j686n62K083q09j485J694P79j918R62O59j517j38J935j402q98J404
4043A95P9j635J063O41j300N45J247j009j432J940L17k262J201J338j441m94J530
4060E23o50r24J439k77r77L33J586j456o29J738j124r80K186n19j494Q96J437
4077A108j290p06J398K86j638J304M98j392L05J100j757j90J787k45j641J591
4093E18R84k111L21J626j362k64J129L4j942J344M37j277O83J472j291l61P57
$$ plain form
3975 -310 930 1613 -443 344 2034 -566 -542 1649 1103 -716 338 1393 -214 240 1993 -154 -696
3992 -696 1162 1205 -399 100 1107 -1006 -136 904 -241 -667 1016 260 -1409 704 1513 -562 -184
4009 -184 1241 766 -783 987 470 -1022 462 777 -922 -747 1052 -7 -1189 641 551 -1402 -91
4026 -91 1094 -592 -1154 929 120 -1365 329 1108 -810 152 811 -706 -844 1091 -311 -1209 195
4043 195 274 -1361 -298 343 -957 -412 835 -174 -1606 334 651 -1611 -410 928 -513 -1007 523
4060 523 -127 -1051 388 111 -866 -533 1053 -403 -1032 706 -418 -1398 788 269 -1225 -329 1108
4077 1108 -182 -888 510 796 -842 462 960 -432 -127 973 -784 -974 813 568 -1073 518
4093 518 1502 -609 -288 1338 -24 -288 841 875 -1067 277 714 -563 120 1592 301 -60 697
4110F97m07j596K433j72j495K13J532j221m44J115N92k199J370J058j404l28J893
4127A637j679o81K248r74j428J040P44j712N41J806j613j663K515J12j620O81
4143d6J157j882N35R06o72r10R90K95j656J037J006k110N38J418r83q54J882l72
4161B79j962J303J320j536m48J802j486j33R59M63j502J043O43j884m55J958l63
4178Aj445J361M86j975J541J98j315K83J301o72j396J619N45k035J316P04j579
4195a062J23J782q64k505L009j98j639N71K214j252r40J283m85j169J612P90k212
4212i42Q22J513j935m31J647j16j675J610P26j702L42J341r28q20J054j025J82
4229c37P12J153k441j63L207k447J094L98n43j579J333J204k426L55J496j110
$$ plain form
4110 697 290 -1306 1127 955 -540 -327 1205 -16 -460 655 1247 -952 418 1476 72 -256 1637
4127 1637 -42 -723 1525 551 -877 163 907 -805 -264 1542 -71 -1734 781 893 -727 -46
4143 -46 1111 -771 -236 670 -2 -912 78 373 -1283 -246 760 -1350 -812 606 -377 -1231 651 279
4161 279 -1683 -380 940 -596 -1044 758 -728 -861 98 561 -941 102 745 -1139 -1594 364 1
4178 1 -1444 -83 403 -1572 -31 167 -1148 -865 436 -236 -1632 -13 532 -1503 -187 517 -1062
4195 -1062 -939 843 -21 -2526 483 285 -1354 -783 1431 179 -761 522 37 -1132 480 1270 -942
4212 -942 -120 1393 -542 -973 674 558 -1117 493 1219 -483 -141 1200 272 -548 506 -519 -337
4229 -337 375 1528 -913 -1076 2131 -316 778 1176 633 -946 387 1591 -835 -480 1016 -94
4245i4r8J314p30j181J315O63j792J18K201r82j237J716q56q12K84J341j500M42
4263A12P68q08r46J387O36k237J450R35k756R64K079j606n79J743j092o65O27
4280A2M31l01n07N36m71j45J786r87r03Q26J166k266n79J961k00n36M27K06r29
4299d73q57K308j686N92J259j068j154J618r62m07O76N50m67r47J434L44j725
4316i65J018P32j199Q89R48j337j249J969j159j54R83p16r28l39K875k197n54
4333a383J875n80r61J014J313j645J21J376p46l15N13nq00R41N97j243K01Q73
4351A146j217m53J318j30j394J158L43j078O1J510j328r34J666O41j200L19P42
4368A170k130P82J069o08j010J519K62j585J408K63j557J08K109j389j035J316
$$ plain form
4245 -94 -192 1122 392 -789 526 1189 -603 -485 1716 734 -503 1213 357 -455 -171 1170 -330 112
4263 112 880 72 -874 513 1149 -1088 362 1297 -1459 -495 1584 -22 -601 1142 50 -615 12
4280 12 443 142 -365 171 -300 -445 1341 354 -549 277 1443 -823 -1402 559 359 -177 250 456 -473
4299 -473 -1330 978 -708 -116 1143 75 -1079 539 -423 -830 -154 396 -71 -1018 416 760 -965
4316 -965 53 785 -414 475 1423 86 -1163 806 -353 -507 476 -240 -1168 -1507 1368 -829 -1383
4333 -1383 492 -88 -1049 -35 1278 -367 -246 1130 384 69 582 577 -223 718 1315 72 273 1146
4351 1146 -71 -524 794 664 -730 428 771 -307 -246 1264 -64 -998 668 1309 109 428 1170
4368 1170 -960 -178 891 283 -727 792 1054 -531 877 1140 -417 -309 1800 411 -624 692
4384F92k28o14lJ952k119K71J035q31p63J323K09k226Q52J720j219j67J043m99
4402D28j085J918p29j734J126J207j750J088R81j762m80P81P37k016Q06J711k144
4419i17p5J697n26j398J574j12j762J839k87j099m11J805m86r19J332l44q07J249
4437C53n11m22q17J947p39k54l0J904j803k22K52K95l12J229j409j502L067l91
4455F35j483P8J773j251m38J014q4j440J469N15j530O23J302j791L05J749j348
4472I8r71P64Q26j569J384M48j775j03K051m40j202O77K72j048q8J933j766m56
4490i65K234m09j689J043N29j300K45O97k75k65R33J54j928Q59J171j496K9J163
4508G30q57n43P00R04j829J298J136k100N14N85j0k425K572r8o30k58L1l51n10
$$ plain form
4384 692 464 -150 -153 1799 -320 -49 986 155 -608 715 924 -1302 -450 1270 51 -116 927 428
4402 428 -657 1261 532 -1202 -76 1131 -619 469 1450 -312 -792 -11 726 -1290 -484 1227 -917
4419 -917 -992 705 179 -1219 355 243 -1519 320 33 -1066 -1477 328 -158 -1077 255 -89 -896 353
4437 353 -158 -580 -1397 550 -189 -443 -473 1431 -372 -594 -342 -47 -359 870 -539 -2041 1026 635
4455 635 -848 -770 1003 -248 -686 328 244 -1196 273 788 -742 -119 1183 -608 -303 1446 98
4472 98 -873 -109 717 -852 532 980 -795 -898 1153 713 -489 188 460 -588 -676 1257 -509 -965
4490 -965 1269 860 -829 214 743 -557 -312 385 110 -155 778 932 -996 -137 1034 -462 -433 730
4508 730 -127 -670 30 934 -895 403 1539 -561 -47 538 528 -1897 675 577 -53 -311 -280 -631 -1141
4527a141J540n2j063O33J272k362J407O48j715L26Q68o67j050J812M28k103L56
4544h63J623j139k34Q38o17n28J380j09p47LP83j004l77J727q31o23J110M20j843
4563a031Q18K18n31p27K242q49j826J429P00j545M74Q91o63k15J720r26j383Q13
4581c91J235j967P4J880k097Q14J496j079j301J668N69j448L25P95o59k54R90
4598F50m31j311J483L23q77r0J227j695K64J202l45j331J230O25r55K19R67j113
4616D2l81R41j62j432Q50n68k05J199M66M68k612K861j691l62J387K55j181J19
4634fJ847j603n87Q49k8j448J270R15j772J12J615j229n64J317o6q13O55N29j031
4653c8l53Q75n14l73O81P11j552J53M35p31j24J121m31p02J460N4q24O92O34k072
$$ plain form
4527 -1141 399 347 -716 -83 1189 -1173 234 882 -833 -507 361 -306 -1356 456 884 -1219 -863
4544 -863 760 -379 -613 225 -392 -920 460 351 -396 -393 390 -614 -991 736 -95 -718 392 812 -1031
4563 -1031 -213 5 -526 -1253 989 140 -1686 -257 443 -1102 -628 263 -400 -615 1105 179 -1204 -391
4581 -391 844 -1123 -1049 831 -1266 -452 1044 -35 -1336 332 901 -547 -222 573 -86 -340 650
4598 650 219 -1092 391 714 -163 -253 974 -721 -457 745 400 -931 299 924 -31 188 1155 42
4616 42 -339 602 440 -992 -142 -710 -915 284 750 1218 -1394 1467 -224 -586 801 1056 -125 -6
4634 -6 1841 238 -349 500 472 -976 294 1209 -563 -451 1164 -65 -629 688 622 -191 464 993 -38
4653 -38 -391 484 -30 -403 278 989 -563 -410 25 -706 -830 291 -140 -842 618 672 -152 540 1174 -898
4673h98K69O61M18j301Q66m63k40M33P67m74n81J104o15q33J448n12o19M18M36
4692B84l83o47R91M4j180R19K68j454P34J094j079m33J401l79j097J125P07j468
4710e53N87O07q24k68M23L20j138O68P56j095N76N12k93m72O18j63k61K51L87
4729F38o88J48R61o96j225J345k98o95M20J190j345J74Q15j266j41J326l50j600
4747a287J765N87j095l30J748j201p84J307j38j807J534O05l93l35K07k52k68
4764a37P09k02p84J056K4n24m26J322o18j139R90L64j096N66R75j228n67J196
4782D81m5n95K62J81o40l73J823r75k49l14L60m75J191M2j206k06J330j150m06
4801i64Q89Q5p87J154J14j286Q00N73q05l04J214j90j303J146M83j914Q85J166
$$ plain form
4673 -898 -629 32 450 -851 15 -448 -688 -255 512 38 -543 561 -54 -887 561 49 -570 -152 284
4692 284 -99 -746 245 289 -891 28 296 -1158 -424 670 -409 -842 559 180 -917 208 915 -553
4710 -553 34 641 -183 -451 -28 292 -846 -178 578 -517 59 571 278 -194 424 261 0 251 638
4729 638 -50 98 1059 363 -862 483 185 -510 -90 1100 -245 -71 744 -522 -663 663 313 -1287
4747 -1287 478 1065 -30 -360 1388 187 -597 710 572 -1235 299 904 511 176 383 131 -137
4764 -137 572 370 -414 642 666 142 -284 1038 420 -719 271 635 -461 105 1080 -148 -715 481
4782 481 436 -159 103 284 -356 -729 1094 119 -130 -444 -84 -559 632 674 -532 -738 592 -558 -964
4801 -964 -75 10 -777 377 491 -795 5 578 -227 -531 683 493 -810 336 819 -1095 -210 956
4819I56j434j188K560j015j588J318Q7r81O33J179J0j685J334p83p79J041q50
4836a185J312J80p23J04r82J107J62k18n4J043j812O28M09O8r70J218k83o58N56
4855i8J316j271J2O00l00j389J161Q54j906J239J7o33j33J404n89r25J026L86
4873G71j405O30Q24p20K24J11l65o25J153k55o94J70Q03k64q92J233m63J30m9
4892C17M43j006O27J67o36p0J092p37O8J30L02p57o2Q63j118p01J805l76q14N55
4912I2R97j368l33Q44n36p34J413l6j439J765l53p39P4R41j327M63P95k04j137
4931h22K63J292j275OQ27o20k39J222n01j027R56M78j108n4R72k08n16N11p13
4950e56k67Q15Q8p66K84Q84n99m27O21N53j474N00J165q68q91J698q03q70J349
$$ plain form
4819 956 -478 -1666 894 -121 -1709 -391 -304 -1285 -652 527 537 -1148 186 -597 -1376 -335 -1185
4836 -1185 127 307 -416 -312 -1294 -187 -25 -243 -297 746 -1066 -438 -29 39 -931 287 4 -654 -98
4855 -98 1218 -53 -41 559 259 -1130 31 885 -1021 218 235 -398 -531 873 284 -641 385 771
4873 771 -634 -4 820 100 324 435 70 -555 598 343 -351 -181 622 358 -534 699 236 366 317
4892 317 760 -246 381 548 -88 -158 934 197 265 395 697 -60 -122 741 -377 -1078 727 351 -463 92
4912 92 1089 -279 -612 232 -304 -1038 375 339 -1100 665 312 -427 -353 588 -739 -276 519 315 -822
4931 -822 -559 733 -542 -536 291 -329 -568 654 153 -874 82 560 -548 -602 370 162 -354 157 -556
4950 -556 -823 -8 80 -686 -402 482 -117 -544 77 630 -844 -344 821 -47 -938 760 -43 -913 436
4969D36m50m94Q52L00j049K00N02q35L06L56O18k139J143P45j440K55J256j5j424
4988h77R31N87r85j19Q16O1j182J059K4o57J164P5j975J981q81m39O19K73n02
5007b7R9j39J293j243m16J372j034n26J524n8j302O56L25r59M73R89j389l12J692
5026A018p47l82J069J21k249Q63J43k50j24J712j752L56J468j146k29m30J342
5043G83j351o14K354j912M02R62K85j84j873J140p89N62O47j140O5J090j58r36
5061f67R24j29r24k90J063O12j224l67J155p23L46r7K86O2K60N23j207M94L60
5080D57j080M89P9r50L36L97P35j300J015n76Q46j379J534k70Q99j537Q03k300
5098a802J791p63K60j434J978n53j099K099M6j178J72J405k057Q06K46N03o30
$$ plain form
4969 436 -14 -508 344 644 -405 -205 297 -538 -232 124 742 -1397 -254 491 -949 -694 562 547 -877
4988 -877 54 641 -344 -463 353 414 -768 291 315 -342 822 897 -1078 903 22 -417 202 475 -27
5007 -27 72 -67 1226 -17 -433 939 -95 -621 903 845 -457 199 524 -435 38 1027 -362 -674 1018
5026 1018 271 -111 958 1079 -1170 -307 -164 -414 -538 1174 -578 -222 1246 100 -129 -559 783
5043 783 -568 -1182 1172 -740 -338 624 909 725 -1148 -8 -797 -235 412 -728 -663 427 269 -667
5061 -667 257 128 -796 -1086 -23 589 -635 -1002 153 -570 -224 -321 -35 27 287 810 -397 97 457
5080 457 -623 -134 -55 -1005 -669 -272 463 -837 178 -398 448 -931 603 333 1232 -305 498 -1802
5098 -1802 -11 -774 -514 -1948 30 -523 -1622 477 523 -655 -483 922 -1135 -329 -83 420 -210
5115b10M38J048k456M80Q50p45J360J96j149o17J346J02k09n22N62j078J58N28
5133H2K94n17J285k96q29r69J75K88n22J633m33L04o14L01m07M50J80l09l34J068
5153H30p81j032J509p00k21l3J109j011J75J105p59o51J640l50l37o85O60o47
5171a79LL95q1l99N6O94p18N4O31k91q68P58k0n95N66M00p10L18K00M13j607R23
5193e7L1m68M43M71q88J51Q35l87j528J426M2l61L54m68k28r6R23j56n19P84r1
5214B13r21O72k91J33m59J129o55o80J065q72l86Q41O57n29k04L47k27m83Q45
5233A95N06j151O55J62r88O98N45p11l17L08N27l61l53Q84j433O14P50n88m35
5252d93P07L62j026J26P31o89O01J7k35o38N04Q59j248N64n5Jn67R05l08o14M45
$$ plain form
5115 -210 228 1276 -1180 -700 150 -595 765 961 -188 -805 541 643 434 -88 474 -604 -446 82
5133 82 376 -141 1144 848 19 -950 -775 -487 -1009 624 191 495 -119 182 -225 225 405 96 -238 830
5153 830 49 -983 526 -174 -395 -428 681 -330 -155 950 191 -460 1180 830 493 -192 468 -179
5171 -179 -176 219 138 -261 -205 489 -229 -175 456 165 -703 55 35 -560 6 406 -304 14 214 627 -980 -57
5193 -57 -26 -494 -51 420 -468 -317 518 131 -1397 29 71 -290 64 -404 -632 -728 195 39 -480 304 213
5214 213 -708 -36 -327 -194 -653 476 -179 -859 206 -666 -1052 -211 446 -83 -287 60 -167 -650 195
5233 195 701 -450 205 367 -621 77 622 -89 -406 -98 429 68 -285 599 -834 -220 530 -58 -493
5252 -493 214 576 -450 -324 407 -282 319 336 101 -537 -33 826 -422 142 87 88 -479 426 118 -496 -51
5273e1O53m72K70m34K68q29Q28q3j239J432N11j297L09O96q97L54K74r1l44J95
5293E3K9n9q0J111j158p22R29J0n11R59L25j330L5J269j105j97R30l53n89R14
5313D60l21j168Q52P67j25j230J269n71n53R93r4j010R78M24n95j079J512o52
5331a43n74M11n4j20k17Q90m17k79K7R24p35p5Q04n05o07K40n1L74J50Q2q75M46
5353c04P82r60J78k47N09m4M73j04p93M24J118j362N4O79l61p64Q90o3j079L40
5373f34J703q11K1P35j552K58j40Q97q57R41r25m91J179k12l10l82J147k02O33
5392I98L9M99k648k08J126Q13l77P6j122R08M65n50L74j591K133j219j013J132
5410a65J123k223J222J126j994R07J173k327L7J430M4L18j582J608q99r46J506
$$ plain form
5273 -51 602 130 400 -34 234 -595 233 150 -1089 343 854 -443 -134 562 -335 19 293 202 -142 53
5293 53 82 23 -57 1054 -104 -826 103 113 -398 561 886 -444 -409 860 -245 -442 488 135 -454 460
5313 460 139 -1029 -177 590 465 -765 504 -67 -620 373 279 -731 247 671 76 -1003 509 -143
5331 -143 -717 -306 -360 -480 -697 193 -224 -503 -476 448 -287 -362 442 -63 -670 -430 -481 -107 43 125 -750 -304
5353 -304 478 -482 -304 -551 -42 -86 387 283 -510 -86 1032 -330 -276 403 42 -722 168 105 -974 -634
5373 -634 1069 258 279 1014 -538 -280 -420 477 -380 561 -364 -855 324 112 -198 -580 567 365 998
5392 998 1037 1536 -1112 -1320 -194 619 242 318 -804 104 569 19 393 -1198 935 -284 -1297 -165
5410 -165 958 -1265 -43 1083 -911 -4 1169 -1158 -1121 309 353 671 -911 697 -202 -1148 358
5427C58m62k18R59q6l51K20l35m27o61O80m86r29K156l30m27K28l09P13n00n4
5447b61q59J024o93J285m38l21j6j084M66J681q00j74r98P48J243r37N58j322
5465h98R50lK33n93k69O66r11N72J516j734Q63j039R30l92L3J61k20L33O31k322
5485a493O09K350j255j200J018K95p97O48L39j8j512J192l40l5j104R94J01q5
5503b93k4J39N42P3O9j477J233l7k64J15O5L80m48L2N66j173N37r38Q08j061J241
5524H5Q10n65M48n98n22J01J089j375L87J532q97p22j38N29n48k4j37j06M18J494
5544A261o84j815J17J495j017K70m46J218k50N96k19r63L46o5l20L34N06p94R92
5563E62J19m09j125L58Q35m89k84O33L07j242Q66L85j033K83O97j221N54J14M72
$$ plain form
5427 358 -104 -322 637 551 200 420 85 -342 -1003 -323 -809 -1738 418 88 -339 -111 -420 293 -207 -261
5447 -261 -1120 -96 -789 496 58 -263 -279 -1363 -897 784 -16 -190 -1188 -440 803 -134 424 -898
5465 -898 52 49 282 -311 -580 86 -825 -253 1263 -471 392 -647 283 -109 -76 85 -135 198 829 -1493
5485 -1493 -884 1466 211 -989 29 324 -473 175 514 496 -1016 176 -164 -199 -1303 -309 -208 -293
5503 -293 -317 -178 364 437 506 -971 262 225 -39 76 141 521 73 105 671 -502 35 -903 -95 -1156 85
5524 85 895 330 778 180 -342 -241 848 -527 -140 1392 495 -227 -365 164 -384 -408 -545 -651 -233 1261
5544 1261 577 -1238 -1121 374 -643 -373 -819 399 149 745 526 -437 -91 -156 -476 -142 364 -430 562
5563 562 681 272 -853 -495 340 -149 -433 200 507 -735 131 516 -517 -234 463 -758 -204 -90 382
5582C82j167L51O86j171M24P59n22j57M44j15n07K76L27J11l47J82l14p51J680
5601E71q60n84Q49J49n98P15l34N3m12R11o13O7L4j25n02N24Q85p15j025J465
5621D55j19m27Q98l42m55J87K67m1p14L11M43n70L83k21k43n20J362o18n54P50
5641B32K42j023R56K19q71j6M84K33m84K48k09l06M45m65o8O28R64o91m92J49
5661A75l44k13N80j67l61L22P10r87K07M43n64j52L81p8M2l77P80N60j87j861
5681a091P50m72J041P0R2m99P50M76r75M42m33M5p19R74q66Q72n56n21P16q94
5701g98J215n00J88K10j68q73J269q86l4M13j64k42J91L51j02o23J248k75j121
5720g01O32K9j023J895o14n21R8N50j56o10K57Q65j042K88N18p48o18R40L05r36
$$ plain form
5582 382 -785 -434 252 -919 -495 264 -258 -415 29 -86 -593 -317 10 121 -226 -44 -358 -1109 571
5601 571 -289 -873 -24 125 -473 242 -92 -39 -451 460 -153 -86 -52 -177 -679 -155 730 15 -1010 455
5621 455 336 -91 807 465 10 197 464 423 -291 20 463 -107 276 55 -188 -708 654 36 -518 232
5641 232 474 -549 407 626 -245 -261 223 456 -28 220 11 -295 150 -315 -383 245 1209 518 26 175
5661 175 -169 -382 198 31 -330 -8 702 -285 -78 365 -199 -351 30 -48 -6 -383 397 957 770 -1091
5681 -1091 -341 -813 228 298 390 -109 641 1117 142 584 151 196 -523 451 -415 457 -99 -620 96 -798
5701 -798 417 -83 105 315 147 -726 543 -343 -377 36 -128 -370 -179 172 70 -553 695 420 -701
5720 -701 -69 -40 -1063 832 218 -303 -205 345 189 -421 -164 701 -341 -53 465 -283 -901 39 344 -592
5740e92L62J007j662r0P87o5R52K03j337j21L28n80N06L35l3r17M09L35M88j009
5760f94J533p80l20l15J72j61L22Q82k23j907J581P53j803J386j89m86m48P98
5778A01K37j35j67R86k39p44n29O53L3J19M83j893M72R04n95J41R84m68p46R55
5798E52K81o68J81L1j055J192p6o39j52N67m48p63J414p45l56j41O47j17l30O22
5818cK79j540J358R2l73J22O21j002K82o5N63o78Q70K12j103M88L5l51P4N71k19
5839B33j004K88Q34o59K1R06M8j122k84M33M81j179J046m51j35J200o83o03Q91
5858B61l2r38N6N65J3q99J461K06j910J653m20K78l98N41j79p76Q59l75r06O79
5878b61P58n09O7J43k30n51N41M1l12J25M28q49N77O56q7q77J277r25p89J034
$$ plain form
5740 -592 -230 777 -885 -975 -188 -253 699 902 -435 -556 -228 -808 -302 33 0 -917 -508 -173 315 -694
5760 -694 839 59 -261 -576 -404 -565 -243 639 416 -1491 90 843 -960 426 237 -249 -697 101
5778 101 338 203 36 1022 783 39 -490 163 196 315 798 -1095 -623 281 -314 -173 811 343 -403 552
5798 552 833 165 346 377 -678 514 438 -201 -353 214 -234 -997 417 -328 -684 -825 -178 -295 -625 -3
5818 -3 276 -1264 94 186 -187 -65 556 -446 -164 -229 334 -344 526 738 -365 123 158 -193 -119 452 233
5839 233 -771 -483 351 -308 -287 619 667 -455 -739 -306 175 -1004 42 -409 -544 656 -27 -630 261
5858 261 229 -709 -653 -88 -75 -974 487 693 -1217 436 16 294 -104 437 258 -518 341 -34 -940 -261
5878 -261 497 -12 55 198 -32 -583 -42 -1 -313 -188 240 -609 -32 624 537 -340 937 12 -777 257
5898B57n77K58l16P65Jq39O45J36j104J053k36N09j088Q66p88J08R73o20l07P3
5918b31O40n69K57K21np47L03J43K5L5N26m05l77O26l39N4P2J41o48J15J050j124
5940b37o0O50no71J70K23K61p58R18p97k49R74K16r61P93l32n49R9M65m99k46
5961e95N80j65k40N28L09r77J62P39m41l91P77m19o89O24J219j549q5O81m19l37
5981f88J089l91k17K54k87m75P4J039J36j297R17K94n76j04j90L25J49m1j0j43
6001a42J98k26j95N09J02l32K2m7k30n43J061j5o96R05J76o33l61P21kn43L38
6022F7J57k61L12J90o53n30J096q11NR5R7k38L55M8k25O48K74q85k10P35L20p20
6044a34K39L87p00m80J494q29o4N51K55j350N75Q08p98J53k61K38j66Q24j5q78
$$ plain form
5898 257 -320 -62 -378 387 388 -451 194 330 -774 279 43 552 -536 330 -458 -350 623 3 -304 -231
5918 -231 409 -160 97 318 313 -434 -131 12 37 72 598 193 -184 442 103 157 229 370 -278 -163 887 -237
5940 -237 -297 353 348 -323 -153 70 331 -427 491 -306 -555 419 635 -326 467 135 -414 -315 150 -349 -595
5961 -595 -15 -180 -420 108 417 -560 -398 341 -100 -491 286 -133 -822 -198 1021 -528 -613 68 -351 -688
5981 -688 401 10 -207 47 -240 -715 -641 398 534 -763 154 448 -128 -232 -422 -97 52 11 1 -142
6001 -142 56 -170 -365 144 246 -86 -64 -111 -341 -884 177 162 -534 371 547 -86 -447 274 272 -271 67
6022 67 224 -37 275 465 -188 -718 378 -433 -428 -333 -236 -474 -119 -71 -296 352 626 -259 -469 266 586 -134
6044 -134 105 492 -208 -688 806 -23 -87 464 719 -631 -56 752 -46 107 -154 84 -82 742 727 -151
6064a51P12j52k76P6k3o25M24K00K43n61r4R84p86o5M25m84j96R09p5q50J098
6085G33p64J57o1N37n93l84M95Q2l82J6Q21j034k63P21jj02O7P05j022l61R89
6106C56m93m30P70n77J92j12k36L46L38k7n6l03m89O13m70j2R52m71j91O09m86
6127a77K09M95j35q28L41J47n18K17Q69j012M00L00k64n75L19N89j26J44on54
6147a65l33L94K65l25P17m82l33J08N47m25k5P30l06l73M2J021j391K85M76j82
6167B45m90M95L87o12N09m02k30p19J694o63q2L3J93n47J29K79p94L87P85l33
6187B64o32J152o35o12R4N03q29M45P72j208J33J9Q78n54l2P00j074L12O51m40
6207i3k95L29J170n0m23O64j817k58J738j81q32k72Q06j566N78J054j545J044
$$ plain form
6064 -151 561 409 133 209 186 -439 -15 185 428 -133 -227 757 -29 -94 331 -153 -349 560 485 -365 733
6085 733 -31 126 65 602 9 -375 120 202 -180 -164 657 -377 -640 81 80 -22 45 750 -272 -633 356
6106 356 -137 -567 203 -374 -182 -294 -530 -184 154 127 71 -232 -721 -108 -578 -590 362 -109 -300 309 -177
6127 -177 32 527 392 -436 -95 52 -466 -249 620 -392 8 308 44 -531 -212 377 251 395 389 -165
6147 -165 -498 -104 161 -164 553 71 -262 -154 393 -32 -57 673 367 -6 36 1057 -334 -49 427 245
6167 245 -245 250 637 25 534 132 -98 -817 877 214 132 165 358 -189 -60 219 -575 -188 597 264
6187 264 -368 784 149 -463 -369 134 -695 -250 522 -686 -553 -534 344 -210 -242 458 -616 -304 347 -93
6207 -93 -388 -59 1111 1061 638 1302 -515 -773 965 784 -48 -320 486 -1080 -502 552 -993 51
6225E1m27J546j557Q19m39p4m69R10L10k004J146M75j212N09J259j096R35j49
6243E33o28N91l80J21q80J038k37j136Q01O79q72Q10l27l28j3j33J195p20j75
6262f1l99J152n71O3o06k54L55N08O5k10p2k09nO05M86j126k03J279j478J631
6282I50l15o93M60k95j19L8L29M95j627P66N21q6m48K57J27p58K5M81L0r83Q15
6303c0N04r12M71j23m44O80M63p32k6N86l39K33M53j81No46j60k44N80O70q22
6324a4J49l80O10l95j07J168j791K11P80k95J77J64k43q36J196k08L80l96M0k40
6344c0p41R05J13rq90J430j336N15P9O82r58l69L15m0K74l90K89M76M17q85k22
6365c75j63J057n77l50O70j107P26J33K05m87k59M74J26m77K79L55p09M33j78
$$ plain form
6225 51 -376 1170 -387 432 -7 -81 -550 360 670 -1334 -188 287 -925 -416 843 -253 682 533
6243 533 -95 496 116 237 -643 395 158 -978 -177 502 -370 440 113 -215 -228 -361 834 114 -61
6262 -61 -460 692 121 184 -422 -676 -321 187 252 42 -30 -239 -244 361 847 -279 -482 797 -681 950
6282 950 635 -58 402 107 -12 26 355 850 -777 -11 510 424 -24 233 360 -398 -373 108 138 -845 -30
6303 -30 474 -438 33 -90 -534 146 609 -123 -149 437 98 331 784 603 608 -38 -198 -442 138 808 -14
6324 -14 135 -245 365 -30 -137 1031 -760 -549 231 -64 113 277 34 -802 394 186 566 170 210 -30
6344 -30 -771 134 247 238 -652 778 -558 -43 36 718 -240 -609 -294 -334 -60 -450 -161 315 732 -153 -375
6365 -375 -538 519 -58 -408 262 -845 -119 14 219 -268 -527 -53 73 -404 -125 230 -479 -46 -224
6384b24n18J156j49l43o47Q66mK38r82L13m61R34m38K24P58K75q44M03j036P10
6404B31n74n77J343m62L17oj28j2l87L40K05n80P78o12R4J161q48m32r0Q16q62
6425b85J33N62j061N75P47j194L59J111l35j232J22Q72o33O21P27r52j052J159
6443B44j45N3l33L57m24K58Q33K19k358J480M24j145J138q10J11M58N86j222l34
6462f10P92k18k5j15q0O1O63M45n42m70J51M37p07M12p2M35j09p95O03q37R91
6483D10PK17n87o43N01o74R99m39m01P49n12q28J76J431qK47k39l71p14J2J447
6504G80j809J551l18n70R14r34j06l46Q68j20j36k00P37j70J9K65q4j153Q91J077
6524A156j066M27m18O08k086J989l85j33L2M29j2k11n68K83l7M23j41r2k51L79
$$ plain form
6384 -224 -742 414 265 -78 -725 141 137 375 -607 -294 -755 179 -259 -35 723 998 154 557 -479 231
6404 231 -343 -920 423 -39 278 272 144 132 -255 85 290 -290 488 -124 -30 1131 283 -149 -239 577 -285
6425 -285 -152 410 -651 -76 671 -523 -164 947 612 -620 -498 374 -259 362 1089 137 -915 244
6443 244 99 152 -181 176 -248 10 843 1062 -1296 184 608 -537 601 -209 -98 360 946 -276 -610
6462 -610 182 -36 -61 -176 -256 -195 468 913 371 -99 52 489 -218 194 122 557 448 -347 256 -581 410
6483 410 417 634 47 -596 -95 -769 230 -209 -610 139 -373 -1201 -1025 406 398 645 406 35 -679 -667 780
6504 780 -1029 522 204 -366 548 -386 -492 -838 30 -90 -226 -426 311 141 160 425 341 -812 79 1156
6524 1156 90 517 99 707 -1379 610 225 92 124 553 541 330 -238 45 8 431 290 198 -53 326
6544C26k44r75J857j280O2J61r8N30l25N53p51j96J052p49n57J100K99j115J00
6563b50J591j181o56R24o35j55J51P71m17m81J126p38j86j61P01p98R86K00q72
6582h0m14M4L13n30J226o07k89N49N52K14n43l27L49k37O74j059j67K39N94m67
6602C4L20P9r61j10Q51o9Q7n7K87j26q39P09j37n54J033l96n88M68k88o3L85l41
6624b76L78l43P60l22o36M60p6LJ34M07l87l15J44M0mN0Q9m83M99k02l5m08K01
6647c22N77n67L33J02l97L65K02j58k7k24K20j73p1K40l54K69O07r80p7M42N47
6668E54o01K5k83K79k50M59K00p5p36J454q12k05L0N8J67l03K27m72M70J17l32
6689b9K92K63J06k09k85R0l76j96P75q4k91r0M31l41L91N53j390J72Q4L48q63
$$ plain form
6544 326 82 -893 964 -316 -254 -93 -191 339 14 567 -184 -380 672 -77 -634 466 765 -350 -250
6563 -250 1341 160 -496 428 -207 -362 -211 560 143 -338 788 50 -136 -297 404 -394 592 792 -80
6582 -80 -494 -450 -137 -667 559 -48 -337 212 764 978 435 108 457 220 894 -165 -332 -93 501 34
6602 34 354 433 -528 -638 213 144 231 174 461 335 -504 205 68 -486 547 151 -437 31 -257 -320 65 -276
6624 -276 102 -241 519 197 -439 21 -55 -52 82 489 102 -213 -69 -29 -33 17 106 -377 122 -80 -115 -523 -322
6647 -322 255 -312 21 123 -274 91 293 135 108 -116 104 -69 -140 100 -254 15 622 -358 -435 7 554
6668 554 -47 -22 -305 -26 -276 183 383 308 -428 1026 214 9 39 97 264 -39 188 -284 186 303 -29
6689 -29 263 526 632 423 138 228 -148 -344 431 347 56 -34 397 56 447 1000 -390 -218 -134 214 -649
6710f49L94N81l38L28k98k95M79L64r95K03M19k91L47p70P41rm09N21p50K01L40
6731A14N3r9L07k12p34K49M33j78n64J306o44o02J230p22o25N57L40l80n52Q44
6751A21j50L9L30l35n7k42O78l15j296Q30J67k7N40rm88J16P98j305P56J88r9
6772B40p88P21j8m33k41M50J92n3k12l53l40Q88J94o61K24O39p0n90N33k27p83
6793f88P73K83o93K58jO7L1J031j359P68K53n36o73L04L16l96Mk24J058j006J133
6814G03k76m28n64O74l51M91j05j75k65M25k87j4J53K84L10o36L5K67m03M84j14
6835B08m18l6N32j62M63k99m68J49K87L4l35L28k64Lj20N06k29o53L87k14J91
6856a10l69L49k3j63Q09j9n04o1q8m6m67J120mj216O67k48M70q1j9n6l21Q44k77
$$ plain form
6710 -649 -255 326 -12 316 18 -277 202 566 -429 -226 193 -98 249 -521 220 211 -198 323 -427 -226 114
6731 114 167 68 375 163 -571 -322 111 -67 -631 675 31 -571 659 -63 -688 -131 209 -171 -723 121
6751 121 -29 10 340 5 -52 -294 384 69 -1227 -397 -230 -257 283 274 -214 -98 700 -605 151 339 240
6772 240 -548 173 155 -278 -519 -69 123 70 -142 -495 -835 53 247 -414 -190 449 379 -211 322 95 -688
6793 -688 85 368 -325 -67 -68 -1 30 1061 -298 470 723 187 -486 -182 134 -262 -258 -482 576 -430 703
6814 703 427 -1 -565 109 -242 249 144 -31 -296 129 -158 -172 -19 265 575 -61 -26 241 -162 322 208
6835 208 -210 -246 286 124 587 288 -180 -31 256 290 -45 283 19 22 -98 408 179 -474 -87 -301 -110
6856 -110 -479 -130 -153 -316 493 474 -30 -91 -179 -225 -692 428 424 -792 -125 -373 97 16 -3 -59 -380 464 187
6879A87n61L79m33j46J4M88o1k17O71o38M65K14k10o52J10L46j14N07o96K08k17
6900c56O9O10l21j263J969j090N22N04k01n75J467l22k08j328L10N60k37o95M40
6919a45k58O43J70j088P33j105J055J7l44o3l35Q78n43L72l8M16l01l52l22R47
6939C37r87J299m96n68M83l27M46l74M34j87m94P94k53J25m57P26l37k04M71P
6959D38K06o37J23l19p68J353q11R38q83M06n47M29L77m64k0M35k00m49N17k96
6979a72k48P50k79q3j59M45j50l77LJ162j062K21N13j192O43L92q89L83k77J28
6999b48Q2n4M19o72M14m6J47o17K40O81j59j97Q5m86K66l8j78P29o65L66o11j81
7021g23O58N2J96k41k39J33L01M34j043L52L88p48J4N34M31p24P32k34p36K17
$$ plain form
6879 187 -374 5 -428 -574 -560 -72 -133 -350 321 -317 148 362 152 -500 -390 -44 -158 349 -347 -139 -356
6900 -356 -287 323 2 -1261 708 -382 140 644 443 -132 1335 1013 805 -523 -213 347 110 -585 -145
6919 -145 -403 240 410 -678 55 -1050 5 22 -322 -385 -720 158 -385 -13 -51 365 64 -288 -610 337
6939 337 -650 649 153 -415 68 -259 187 -187 247 60 -434 360 107 232 -225 501 164 -40 431 438
6959 438 644 7 130 -189 -957 396 -415 523 -360 46 -501 -72 305 -159 -179 256 56 -393 124 -172
6979 -172 -420 330 51 -32 -191 254 104 -273 -270 892 -170 51 564 -628 15 407 -482 -99 -376 -248
6999 -248 -166 -220 199 -473 -59 -105 42 -575 -335 346 187 -10 75 -411 -145 -183 -361 368 -297 69 -542 -723
7021 -723 -65 -13 183 -58 -297 -164 137 571 -472 -120 268 -480 -466 68 499 -225 507 273 -463 -246
7041b46Q30j091J40P02J35n98l65O62m92O60j88m81l12J281n85n02O77j11k05
7060h9l94P93l39L7K77p29n01O18R24n32L54k48j82l18M95k04k93L79P1k19Q8
7081a2L92k43n77K59N60p20OM59o65O59O41q19O2P35m77n13L23N56j388R76k90
7102g6N49p31K15M53n94M8j84j09K81M38o14J7N50R6n04Q3N23j096J016N38j036
7123a37O71n93J4Q5o10R68o64J75L81q3Q5j58J92m88m64N28r3m79J335j159K39
7144b55M26K01p14L7M65q10K06R37kj464Q89pk59J75J93m41r5O02k78k77KN52
7166H3l40K51N24j415P77j03N25j330J101J52l56M49L6L61r55j58R44o76L42L17
7186E29j231O25J16k2p02P65on31N85K07m19J86k52J54N0K34N0o72J05K02O85
$$ plain form
7041 -246 584 -507 -367 335 470 -128 -493 169 -323 337 149 -332 -644 637 52 -450 227 116 -89
7060 -89 -483 310 -29 8 285 -444 -945 -327 597 65 419 171 -11 -329 166 -38 -331 48 119 -100 -12
7081 -12 380 137 -440 -181 379 -341 -335 124 -541 118 759 -60 2 737 260 -253 70 626 -762 214 -76
7102 -76 473 -258 -43 410 -184 -136 -320 -429 -148 290 -324 -307 243 339 -165 -82 441 -655 361 899 -137
7123 -137 534 -59 -45 40 -570 398 -266 -91 290 207 292 134 326 -162 -626 -98 -191 -670 665 -494 -255
7144 -255 171 372 -342 -305 160 -650 -444 493 491 -973 -84 -91 -350 -175 18 -423 -518 84 -194 -471 -469 83
7166 83 -257 -6 518 -897 -120 -223 302 -1028 73 225 -131 318 354 715 -240 -398 546 -130 212 529
7186 529 -702 -77 39 17 -685 80 74 -457 128 335 -84 102 -150 4 54 288 338 -334 -229 -27 658
7207F58q73N32p7K1j67l22P7N31J44o18J07N6J35p93Q12O1j102M65N73n8j44j60
7229a42J93M67r11J91R9L30M32o71k09J91j3k61n7R06q77K08J72K49l48j14K92
7250A27l67M30P26j368L68K08p43J015Jm25j95J67K57o93M23J69p2m1P63j077
7270c27K36M7R90j024k49M09o27R9J374j475J14P25J21k17L81K30j685N98l08
7289e88R38o34Q7j27k69P13L82p15K41k38p4l56O12K41r76L55l75L64L75O47l52
7310B51r04M23K65O35r36l51O99p49Q22R4o02M61P55p45j96Q9J49r2Q6j80l38
7331c64m48R44j98l04K59J57n28Q89k71n43L36R63j552K68Q33n00l71J219q63
7350g4R5L92L64r59K60O20n64j62K92lkj63o3j51l08R81p02P4N42o3n46m03N08
$$ plain form
7207 658 -215 317 240 261 94 -228 -151 380 524 -94 13 69 204 -589 223 284 -818 -353 220 162 18 -142
7229 -142 51 518 -393 -202 -103 227 659 -12 -221 -30 -43 -304 -361 545 -332 -124 48 297 -51 -165 127
7250 127 -240 190 916 -452 -84 124 -619 396 397 -28 -223 -56 201 -492 -69 100 28 -13 750 -327
7270 -327 -91 -44 946 -78 -327 82 -545 -446 928 -547 -433 292 413 196 577 807 -878 -280 -588
7289 -588 350 -284 -197 -324 -593 120 502 -213 28 -210 -284 -640 -28 213 -763 -408 -783 -419 -44 603 251
7310 251 -653 -230 35 670 -266 -617 82 -667 155 249 -353 108 863 118 -78 11 160 68 154 -26 -364
7331 -364 -812 132 -66 -370 -111 46 -482 407 136 -407 -71 892 -660 -392 441 -59 -430 789 -74
7350 -74 21 413 777 -182 78 698 134 -28 264 261 259 96 33 -118 -426 555 -147 -73 469 406 -140 -543 -35
7373c5k06R3L65O9l03L20n36m9L66J5j15QQ2n0l86K85K09n76M38M90l86j63L34
7396B69n37o1J11J67o63L45L59K24m30P58j018o9O42J62r64M22n4p9L17O35J27
7417F63j360Q70O2l50L8R0l78k7P38j84k35n90O81K1m00Q60k60j038J327j32n00
7438a04J012j137J4m48N48N22q13O1N07o66L46K84k01J74m70P21k9j92n47L84
7458c4K89n30L93K69L8o20L74L53n64J86n10R5M42K22k31K06j60m11J43l04O14
7479B60K87j379P78J62J92n47Q86m42j51j36M20k96k91N40p92K44K51J89qo76
7499e09J182p72k69j6j85M48M4O46j134P16N2K98m36K79k83o69O19J7n3J98K75
7520D48o20j81K54K12n80M89Q1M21l44L85q52N66j78p88R54o74O00m50p44N36
$$ plain form
7373 -35 -241 -148 217 286 -17 303 -233 -282 84 99 -16 -8 74 24 -362 -77 132 -444 -6 484 98 -65 269
7396 269 -268 -329 -218 -51 -714 -369 -10 214 -216 542 -476 -545 97 259 -705 -283 -337 -416 -99 536 663
7417 663 -697 173 235 -115 -77 13 -365 -392 346 162 -73 -663 18 39 -361 499 239 -799 528 396 -104
7438 -104 908 -229 -215 -663 -115 407 -406 -345 162 -504 -158 126 -75 99 -371 350 321 129 -418 -34
7458 -34 255 -275 118 387 425 -195 179 532 -32 154 -356 -261 181 403 172 378 218 -193 -50 -354 260
7479 260 547 -832 -54 108 300 -247 639 197 46 -90 330 34 -257 283 -509 -265 -14 175 167 -509
7499 -509 673 -99 -368 -384 -569 -121 -77 569 -565 151 203 501 65 344 61 -608 11 28 -25 173 448
7520 448 -172 -353 -99 113 -467 22 103 524 180 565 -287 279 101 -687 267 -407 193 -257 -1001 -465
7540d65K69j4K70m51K46L20K79j031L15J070p25l36P39p01O4l73P79j048P06O61
7560E74M06j094P07m82m01P27m13j11K59M62k01l41j84O21p31j71K75k99K24K34
7580F1k3j107J236n24k2J23J58K96m42K10J69K15m1m59L44k78L91k59p09P62O9
7601A70K45N67n11j055J151n4m60P13j409J029k02r08l23P1J331L07p28K22m62
7620c06r19Q65n8K14p1L41J14j14p06L14n61M59L37j07k95K7Q39m65q52O87M71
7641B14j149J865o01j605Q66J69k18K25R04j255O06o2R09j006R9L90k70j199J681
7660E63j033KJ305n64m76k14M28p5l15Q02p20Mm3J38m4L22j3m50m55J006L07o79
7682b04L51K41n39k02P53O9q36J10K66j68L00m15N12n10N63J19q36J81MK62j98
$$ plain form
7540 -465 -196 -210 60 -391 -145 175 454 -577 -262 808 83 -253 486 -215 -151 -524 255 -793 -87 574
7560 574 980 -114 593 111 -290 437 24 -87 172 634 433 92 -92 529 -202 -373 -98 -397 -173 61
7580 61 38 -1069 167 -357 -379 -256 -98 198 -244 -34 135 350 309 -150 194 -84 307 48 -661 101 170
7601 170 415 982 471 -584 567 513 53 766 -643 386 184 -724 -1047 -976 355 662 -66 156 -306
7620 -306 -1225 -360 -418 -204 -275 66 180 66 -640 -326 -887 -428 -91 -198 -493 -466 373 -92 -944 -257 214
7641 214 -935 930 329 -1276 -410 -241 -459 -234 670 -585 21 -41 868 -138 -39 351 81 -1118 563
7660 563 -470 -468 837 273 -203 -417 11 -64 -379 423 -297 -293 -336 -198 -242 80 67 -383 -838 168 475 -204
7682 -204 147 388 -151 -353 400 469 -367 -257 9 -159 141 -274 238 -272 291 410 -426 -245 -241 21 -177
7703a77Q18n01K19k06n44J12J196l81j327J791j48j282P43r97J425k20j052O02
7721G1j078Q34Q53p98L26K5j85P08m34J86j45K47k40P86j261Q77r34J463m10k1
7741H70r13J74L02j066K35K84R18M29l11p33p38L2N96m8l2O59j379L50J546n16
7761F59p86J87R04k60j585R53K59q96J161n53j333M09J357m19k56k68Q23n13N39
7780C82p28j30o4L85K48l32m8L91j393R34M87m85R42q85p89J061k10l88R28k26
7800H0L76r54Q16K89j70L64n44R74j339L7R43j19M56j186j35k32J155j049L61
7819A23p5m45L60K93J56O0p27J0N28q9j00N95n82O8l06N02j122P56K52n81M20
7840I6M55m73j68M03P44m34j10o67O45O9o14o13l86J072J9k05J87L61j639J247
$$ plain form
7703 -177 641 140 359 153 -391 -279 917 536 -791 1000 852 -430 313 -684 741 521 -531 71
7721 71 -1007 -173 680 -118 208 233 48 756 322 508 363 610 370 1156 -105 772 -162 1301 891 870
7741 870 -43 131 433 -633 -398 -114 804 1233 922 189 -549 -517 79 31 -1 658 -721 -371 1175 659
7761 659 -127 60 964 704 -881 72 331 -565 596 43 -1290 -881 476 57 -199 -467 356 -157 382
7780 382 -346 -476 -540 -155 93 -239 -287 104 -1289 -355 132 -353 589 -296 -1085 -24 -234 -622 306 80
7800 80 456 -498 318 607 437 801 257 1231 -108 -71 872 753 1209 23 -112 -344 811 -238 123
7819 123 48 -397 -37 256 412 472 -255 -245 283 194 94 689 107 175 -131 371 -751 5 257 -324 96
7840 96 551 78 -90 313 1057 623 513 -154 491 560 -54 -667 -1053 19 38 -167 20 381 -1258 -11
7860a1N60q71K92K61Rj01J112j911j06Q23n47p14o92J056P00j335K984o68j430
7879e89O25p56M18k46J607j415j62L54M41n46J48K29K06J68m67k22m16M59N65
7898D01j3n48O69k93l28L60k56o43l30R40r9O21K50j277P3K66K98j133M3N35M22
7919d2j69J53L5k14J38J03P7j07P61l09n42om4k10R73o23l08K3q6k97P50O4n9
7942F1l38j53J352j205j22M58l40J49K48m47m87Q20J28j85J428r79l22j45O59
7961E80l60q74O95L80j125N57P16j010J752r48m78J32R22q76Q0P6l84L47J83j51
7981B14j30n31K91P57q11K74J72J24j083M77R76j727J374k98j081J338p21k23
7999f08Q61j18q99P24M11j37m05j040J327N21m80J69k62o21O99M13m06o29J221
$$ plain form
7860 -11 549 -322 -30 231 240 139 1251 -660 -766 57 -490 -1204 -1896 -840 -140 -1475 1509 841 -589
7879 -589 36 -720 -302 -548 1059 -356 -518 -164 277 -269 -121 108 314 482 15 -207 -623 -164 401
7898 401 388 -160 509 216 -112 248 -8 -651 -981 -41 -140 481 731 -546 -473 -207 91 -1042 -999 -464 -42
7919 -42 -211 -58 -23 -237 -99 4 81 -26 735 426 -116 -122 -166 -376 597 -26 -334 -311 -397 -694 56 120 61
7942 61 -277 -430 922 -283 -405 53 -287 -138 110 -337 -824 -4 124 -61 1367 388 66 -79 580
7961 580 220 -654 41 421 -704 -147 569 -441 1311 363 -115 17 939 63 143 219 -165 182 365 214
7981 214 84 -447 -156 601 -210 64 236 360 -723 -246 730 -997 377 79 -1002 336 -385 -608
7999 -608 253 135 -764 -40 371 234 -171 -1211 116 637 157 326 64 -557 142 555 149 -480 741
8018G41l77j381J025jJ64N4L6J53m12o88N28m52J005J4o41m2N95Q6o35N7j17O10
8040C22p2j73J34k47K22k71m56K55N20j230J492o96j112J384L28p88Q6O40r50
8059f12J84P26n52J56P12l77n13j00N61o18J45M37J33Kl91R97j121m84O31k03
8079b87K56L31M47j287R43l40j55j51L16O51p33K57K69r37N68J467k289J107O31
8098A064j248O83k7o8l57N15j133Q93j16j95N16r58Q90J53r93L36O62p38o9L04
8118A14L91m01j11K44k16L38l35n0m34M09P13o05J57K96p19N7O92o74k94P55j88
8139A39m22K5K41m49N52j30r5J64o9k18K00k06K83j72m50O03q09O61J74p38R93
8160B77M01N1M65p88l48k68n51R16J80r67Q72l17m67J24O87o50n03O42R37m20
$$ plain form
8018 741 364 -1017 8 7 171 225 261 414 2 -686 -158 -610 395 409 -232 -274 321 407 -228 -171 -288 322
8040 322 250 77 211 -36 186 -85 -541 -286 234 -996 496 -200 -1312 72 400 -388 -302 338 -612
8059 -612 -428 298 -254 -98 614 237 -276 -376 185 -433 -288 149 282 284 -107 890 -231 -715 -84 -287
8079 -287 -31 300 747 -540 403 63 -92 -243 73 724 -9 248 517 -420 148 1615 -674 433 1064
8098 1064 -184 499 472 404 47 562 -571 322 206 11 527 -431 459 612 -381 -45 617 -121 -190 114
8118 114 505 104 -7 237 21 359 24 -26 -460 -51 662 57 214 510 -209 -152 540 -134 -428 327 139
8139 139 -283 -258 -17 -466 86 -44 -139 25 -44 -262 -62 -268 15 -157 -607 -4 -813 -152 22 -716 277
8160 277 678 729 1194 406 58 -210 -761 155 335 -632 240 -77 -544 -420 267 -383 -886 -244 693 273
8180B73l08K84p18M63r4mN9r2j00N71j000
$$ plain form
8180 273 -35 249 -469 -6 -100 -104 -45 -137 -237 334 -666
8191f66
$$ Imaginary data points
##PAGE= N=2
##DATA TABLE= (X++(I..I)), XYDATA
0@%%%%%%%%%mL6o4O4o4O8j00J28j36J68k03K35k82L25l67M24m90N61o39P27q24
30d37R28j044J172j311J465j636J821k018K241k491K755l048L377l738M141m590
46b413N097n675O338p104Q001r071J0377j2008J4119j6974K1060k7446L8931o5970
60d2738K41543J93719m21121r2982J21702J21505N107j9049j09399j5943M8426
71C0770j2673m365J32725j3101j86904l8848J44245K8177m9883k9897o2440l355
83f5549J54229L0979j72999m8569J35650L7265m7827j2633n1072m1944R6805O4653
95G8988o9790k4194K7722m9421J3373J21911q565j21865j175L7735k9487N6909
107C2141Q7884r1006j19158O6720R3936j098j0389n0021p6620N9712R3106p4661
$$ plain form
0 0 0 0 0 0 0 0 0 0 0 -4 32 -32 32 -32 36 -64 64 -72 96 -107 128 -154 171 -196 228 -262 299 -340 387 -437
30 -437 491 -553 619 -692 773 -863 958 -1060 1181 -1310 1445 -1603 1774 -1964 2177 -2413
46 -2413 2684 -2991 3347 -3757 4244 -4827 5550 -6458 7661 -9313 11747 -15699 23232 -42738
60 -42738 198805 392524 -28597 -121579 123 121628 126735 107686 -1713 -17656 30770
71 30770 18097 13732 146457 133356 -53548 -92396 51849 80026 30143 246 -62194 -65549
83 -65549 88680 119659 -53340 -101909 33741 71006 23179 10546 -40526 -82470 14335 78988
95 78988 9198 -14996 12726 -36695 -23322 98589 90024 -31841 -33016 4719 -24768 32141
107 32141 120025 29019 -90139 -23419 70517 69419 59030 9009 -67611 -7899 85207 10546
119A0546o9850Q6178K6814q3553J3688N7072l8227j6988L2750m7209k9939P0344
131A1626m135p7047M5437O5993o7378l9959N6656J351j8829L3709m2600p8633
143a13809P2207R3728n9048n0369L8158k1235k2299Q1708K0555q8219q526M3562
155a3587k4662J3632O0076m2729n6306O2070K7787o1289J7583M9770n1262j6889
167c5806O5594j7886o3636L2483L3279k0674L6355J6538j00169k5243J15048L2043
179F7926p0166j7098o753l0261N8933P1372n7651n4995L2036j0474j9646P5442
191C8665K3152r7682k8945N8737R643R613L9064n5455p1998O6691O6116n4911
203B690k6551L2414k4120p578N9247j2454n8345L1991L1920m1420J2857M1788
$$ plain form
119 10546 -59304 26874 53688 -29865 -16177 40895 2668 -14320 18430 -28779 -58718 11626
131 11626 7491 -69556 -24119 41874 -25504 -65463 -8807 -7456 -26285 7424 -35176 -113809
143 -113809 -41602 52126 -6922 -57291 -19133 -40368 -62667 19041 39596 -48623 -57149 -13587
155 -13587 -38249 -24617 35459 -7270 -63576 -1506 26281 -35008 -17425 32345 -18917 -35806
167 -35806 29788 11902 -51734 -19251 14028 -6646 29709 46247 -53922 -79165 35883 67926
179 67926 -2240 -19338 -26091 -56352 2581 73953 16302 -38693 -6657 -17131 -36777 38665
191 38665 61817 -35865 -64810 -6073 3570 13183 52247 -3208 -75206 -8515 57601 2690
203 2690 -23861 8553 -15567 -23145 36102 23648 -34697 -2706 29214 -12206 651 42439
215D2439n9310l9472P6203K6166n3451M895J1688m5346K4361P1997l9646n9047
227c8523L1053J0220k6769M1295K0409p0757r412N9794j4216k4078M3836j4631
239H221o4964L6020N5625m5752k4674L9694j7540k4778M5920M885m8025K2755
251a2613K8503m8544j186N6214k7241m2147M7520J5906m9698J4796L7392l7588
263a8686o059M8492k6410m4835M4600K5453m2554O954K7859l5225j831M7808k5822
276b56l8607M8495J4582n9299J1718N1047l0613k4909L8943q078l2330L4986R992
289A5671m7088J9178M2734m3787k6031M9510K886l2577K6126L832m7552K6090
301a1008N2558m1996l4783M7188K530m0147K8451K4280l7550M565K9391l3675
$$ plain form
215 42439 -16871 -56343 19860 46026 -7425 -2530 9158 -36188 -11827 60170 20524 -38523
227 -38523 -7470 2750 -24019 17276 37685 -33072 -42484 17310 3094 -20984 22852 8221
239 8221 -56743 -20723 34902 -10850 -35524 4170 -13370 -38148 7772 12657 -35368 -12613
251 -12613 15890 -32654 -33840 22374 -4867 -47014 506 16412 -33286 -18490 18902 -18686
263 -18686 -24745 23747 -2663 -47498 -2898 22555 -19999 -13045 14814 -20411 -22242 25566 -256
276 -256 -38863 9632 24214 -35085 -23367 27680 -2933 -27842 11101 3023 -29307 5679 15671
289 15671 -31417 -12239 30495 -13292 -39323 10187 13073 -19504 6622 10454 -37098 -11008
301 -11008 41550 -446 -35229 11959 14489 -25658 2793 27073 -10477 -5912 23479 -10196
313a0196o658N7148j5264n9598L2865L9401l5858o033L0655k5276j0356M7067
325C7897j3437m9682L5624L4262m7126o950M2105j7406k5251L2648k939l1436
337a1691L3570J5761n5102M445N7435k1397m3867L0361J1902k7803J8515J3366
349B5495m1479P023M5389l0648l2841M3708J1166m7757J2559L0952k9876l087
361i396L1201k6471k3477M7575K712n3567J5911L9840k9674j4451K9590j5202
373e409k0405L8511p50m7511K1622L6267l8277j5782M2897r599l2534K7450Q701
386E181l4526J9572K7253m2068j0546M8579r899l7573K6502J4057l4422J6135
398a1755K8302l7354r807M5539j1104l8929L0927K1058l8064N695L0293k6755
$$ plain form
313 -10196 -16854 40294 25030 -34568 -1703 37698 1840 -4193 26462 1186 -9170 37897
325 37897 24460 -25222 10402 44664 -2462 -9412 32693 15287 -9964 22684 19745 -11691
337 -11691 21879 37640 -17462 -13017 44418 23021 -20846 9515 21417 -6386 12129 25495
349 25495 -15984 -8961 36428 5780 -27061 16647 27813 -19944 -7385 23567 -6309 -9396
361 -9396 21805 -4666 -28143 19432 22144 -31423 -15512 24328 -5346 -19797 9793 -5409
373 -5409 -25814 12697 11947 -35564 -13942 22325 -15952 -31734 11163 1564 -30970 -3520 5181
386 5181 -29345 -9773 17480 -24588 -35134 13445 3546 -34027 -7525 6532 -27890 -11755
398 -11755 16547 -20807 -30614 14925 3821 -35108 -4181 16877 -21187 -15492 14801 -11954
410a1954q502L7356j4872l5280L7291J9411m3533K685L7146k1782j6514L3168
422A4620r445k9395L2287J5123m3235M965M0921k3923k3226L2987j017k8528K4218
435F352J2945l8747J0881L7814k9702k4893M0980L805l6808J6908K0419k8606
447h652L902K9837k6785j7055M1087j513m0021J9992K7406l2300k354L2112j9708
460E948k0570L6205j77l6072K1572K4469l5108m550L6118j5052k4369K8177K918
473A9509l1865K1497K2027l8305m728L7975j4993k7315L0260O127l6332J5071
485a072K6644l0635q229L1958j5331k2641L1796M375l9019J4564K7953k9774q356
498a7767L4079j6026k8525L1534J3569l4855N794K5019k6469n295L4442j3204
$$ plain form
410 -11954 -20456 16900 2028 -33252 4039 23450 -20083 -17398 19748 -2034 -18548 14620
422 14620 5175 -24220 8067 23190 -20045 -15080 25841 1918 -21308 11679 10662 -17866 6352
435 6352 19297 -19450 -8569 29245 -457 -25350 15630 19435 -17373 -465 19954 -8652
447 -8652 -4750 25087 -1698 -18753 22334 20821 -19200 792 28198 -4102 -6456 25656 5948
460 5948 -14622 21583 21406 -14666 6906 31375 -3733 -8283 27835 12783 -11586 16591 19509
473 19509 -12356 9141 31168 -7137 -11865 26110 11117 -16198 14062 20189 -16143 -1072
485 -1072 25572 -5063 -13292 18666 3335 -19306 12490 16865 -22154 -7590 20363 -9411 -17767
498 -17767 16312 286 -28239 3295 16864 -17991 -12197 12822 -13647 -18942 15500 2296
510B296l1113K6972J2337k9036J1641K4254l2809j2118L9376n840k8555K1723
522h72R470l3415J0911L3478k6121j9454K7852m096k0160K6624O074l6475O863
535a9321L2034k1409j2714K9895j0688l2438K8791K2575k9661m301K2302j9502
547a4437n505L6456q158l5458J9743K1304k4276O006K5836k7087j6785L7722M238
560A9599k7491J5511J2509l1166Q390L7788j9014k6296K5340K334k0563K4394
572B1335J4010l7768k897L5190j0263j7731K2905n746l0017K5093K3046l1426
584E731q629K6052j3518j5401K9886p49l4995J2573K0460k4344L14K8606k2864
597C122k7611L1499J4165k8909K307J3776k0371N918K9357k4402k6622L2685J3289
$$ plain form
510 2296 -28817 -1845 10492 -18544 -6903 17351 -15458 -27576 11800 5960 -22595 -872
522 -872 8598 -24817 -13906 19572 -6549 -26003 1849 -2247 -22407 4217 10291 -26184 -19321
535 -19321 12713 -8696 -21410 8485 -2203 -34641 -5850 16725 -12936 -17237 5065 -14437
547 -14437 -19942 16514 8356 -27102 -7359 13945 -10331 -4325 21511 -5576 -22361 15361 19599
560 19599 -7892 7619 20128 -11038 -2648 35140 16126 -10170 15170 17504 -3059 21335
572 21335 35345 -2423 -5320 29870 19607 1876 24781 19035 -10982 14111 37157 5731
584 5731 -2898 23154 9636 -5765 24121 23372 -11623 950 21410 -2934 -2620 25986 3122
597 3122 -24489 7010 21175 -7734 -5427 8349 -12022 -6104 23253 -1149 -27771 4914 18203
610A8203l1245O284K1634k2438o043K8769r475k0135K4920L655l1855J3943L0321
623B6538k4000j7217K4217j452j0185K1143r261l5129K3954L8988l0504k6533
635a9441K6057K712j7442J8816M911l0164O749K3411k0250p928K7828j3487k9054
648b7282K2577J8347k2174P3R702k9295L347M8037j0011n1349Q357L0455o303
661e519M27O256k6649n512L5674k017k6087J6411Q284k9777R427L5845j6390k3329
675b2956J5039k273r673L5179J1772n1245j4164M3794J3624j2273k80j7862j3466
688b4784L5652J9240l4013n408K3541j7187j1365L6866M803l9126m05K0775o924
701A665R677J7198l3458k6321L6159K2687k0579m500j556j9506J6081L3826k2785
$$ plain form
610 18203 -13042 -6758 14876 -7562 -13605 15164 5689 -14446 10474 14129 -17726 -3783 26538
623 26538 2538 -14679 9538 8086 -2099 19044 9783 -25346 -1392 37596 7092 -19441
635 -19441 6616 9328 -8114 10702 15613 -14551 -7802 15609 -4641 -12569 15259 1772 -27282
648 -27282 -4705 13642 -8532 -8459 1243 -28052 -24705 23332 13321 -38028 -29671 784 -5519
661 -5519 -5092 1164 -25485 -30997 4677 2660 -23427 -7016 1268 -28509 -19082 16763 373 -22956
675 -22956 -7917 -10190 -19863 15316 27088 -24157 -38321 5473 19097 6824 6544 -11318 -24784
688 -24784 10868 30108 -3905 -9313 14228 -2959 -14324 22542 27345 -11781 -12186 8589 1665
701 1665 11342 28540 -4918 -31239 4920 27607 7028 2528 972 -18534 -2453 31373 8588
714H588k9662K2131Q691k0964J6074J8292l1660j3102K9901L205j2781J1912q399
727B226k6798K1507K9103k0911j2355J4753j4313r140L5878N473l8867J489K6365
740A4410j2285n667J9628j2443j8427K3109R562k6477N819J8364k0241o284K6176
753A5244p895k0269J7136N196k5349J0991K3694k3317j4618K6341j113k2588J1900
766d647R334j6914J0147J4239k8414j0602L5856K748k6862O356Q335j5623J0266
779e781J9059k3632j2556K7940m05k2200J5619J1792k5649Q01K3635r451q820
792i648J6764j2244k2363K9446K3290k9965j6173J8386m67M80J8033j5642k7934
805b8037K3359K3174k2845m879J8424j6697j4909K8459J0609k1523K144J803j9779
$$ plain form
714 8588 -21074 1057 9748 -11216 4858 23150 -8510 -21612 8289 11494 -1287 10625 2226
727 2226 -24572 -3065 26038 5127 -7228 7525 -6788 -15928 19950 25423 -13444 -11955 14410
740 14410 2125 -3542 16086 3643 -14784 8325 17887 -8590 -2771 15593 -4648 -10932 15244
753 15244 7349 -12920 4216 9412 -15937 -4946 18748 -4569 -19187 7154 6041 -16547 -4647
766 -4647 4687 -12227 -2080 12159 -16255 -26857 8999 11747 -15115 -8759 -424 -16047 -5781
779 -5781 13278 -10354 -22910 5030 4625 -17575 -1956 9836 -15813 -15012 8623 -828 -9648
792 -9648 7116 -5128 -27491 1955 25245 -4720 -20893 -2507 -2974 -2494 15539 -103 -28037
805 -28037 -4678 18496 -4349 -9228 9196 -7501 -22410 6049 16658 -4865 -2721 -918 -20697
818b0697J4563L5458j9384l2121J4289J2556p278J3314M196k9412K678L0478j0943
831G697j9618K2102M237k5743J0533K3538j6621j1183J2869n675l897K4672m617
844A8294l1933J0114K4165j3595m297J6727j4743j7654K5416R702k4309K844J6959
857A7690j8097n752K3063l880j9673J1012M451j5530J1943J2815k3019o321K4034
870A2736p546j8975K1513R141k8771Q00K2660j1395j0103J7320m917j6990J4109
883d18O494j7023P765J4264k0797q001K6876l112k1826J2547R256k0729P340K2664
897A5300j8841j6697K0409L884j6310J1555O951k0051K952J8590j3272o715K0469
910H224p880k2061J8941J8454k5373n569J8639o815o250J8698o857k3132J3848
$$ plain form
818 -20697 -6134 29324 9940 -22181 -7892 4664 -2614 10700 14896 -14516 -11838 18640 7697
831 7697 -11921 10181 14418 -11325 -792 22746 6125 -5058 7811 2136 -1761 22911 18294
844 18294 -13639 -3525 20640 7045 2748 19475 4732 -12922 12494 22196 -2113 731 17690
857 17690 -407 -6159 16904 13024 -6649 4363 8814 -6716 5227 18042 -4977 -11298 12736
870 12736 5190 -13785 7728 16869 -11902 -11102 11558 163 -9940 7380 2463 -14527 -418
883 -418 6076 -10947 -3182 11082 -9715 -17716 9160 6048 -15778 -3231 6025 -14704 -7364 15300
897 15300 -3541 -20238 171 4055 -12255 -700 6251 -13800 -10848 7742 -5530 -12245 8224
910 8224 344 -21717 -2776 15678 -9695 -15264 3375 -3440 -9690 9008 2151 -20981 -7133
923g133J7930j5332k112J2534j5469q955K4649K132j9219Q518P900k0899L816
936a1640K8348j1638k2348J3730Q118j0882Q474N582j9404K244K3797j0628j6994
949a3241J7161M702j7886R900J4316j8613n727J8885n512j1161K0000j80k5881
962a3237P821K3736j1851q752J0866r220p621K1774K190k5141Q703J7649j7776
975h59n493K1292n100j6472J2329O306j5405P568J2132j9223l300K4671o320k2603
989a0477J1520J1742j3274N164Q911j8619l441K4083m846k0664J5106P388k1037
1002h444M055J8666j1252j1117J4510m253j2339J8229M994k5942K202K2208q282
1015C235j2745J3541l920j3473J5648Q175k1582J011J8349j1925r706J8922j329
$$ plain form
923 -7133 10797 -4535 -6647 5887 -9582 -18537 6112 8244 -10975 -2457 5443 -15456 -11640
936 -11640 16708 5070 -17278 -3548 4570 -6312 2162 7744 -11660 -9416 14381 3753 -13241
949 -13241 3920 8622 -9264 636 14952 -3661 -9388 9497 3985 -7176 12824 12644 -13237
962 -13237 -5416 18320 6469 -2283 8583 -637 -8258 13516 15706 -9435 -732 16917 -859
975 -859 -6352 14940 9840 -6632 5697 12003 -3402 4166 16298 -2925 -6225 18446 12126 -10477
989 -10477 1043 12785 -489 4675 13586 -5033 -8474 15609 10763 -9901 5205 12593 -8444
1002 -8444 -4389 14277 3025 -8092 6418 2165 -10174 8055 13049 -12893 -10691 11517 3235
1015 3235 -9510 4031 111 -13362 2286 10461 -11121 -10110 8239 -3686 -13392 5530 4201
1028D201j9170R197J1227j3736K211J2862j5658q013K3178J248k2638O324J2532
1041C765j1911J544J4364j4487j0650K0166J886j7996J0722J0457j8782j768K0207
1054G517p496j2059J3901q28j4850J1765J3655k0355m384K0460n113j3112J3039
1067B140J044j4596J1628J1744j9168m123K0620o684j3098J6148M226j9947O153
1080c913J4303j1038j916J5355j2372j2975K1144P234k0240K181J3581j2139k329
1093c124J7363p972j4712J5756N700j8153O735J3874j6085n820J9170k957j4943
1106e168J0015M548j4442P614J4083j7978r237K0983j366j5053J0269N406j7472
1119g798M312J6403j2069p476J4343n131j3331J5117Q834k0821p38J7070q861
$$ plain form
1028 4201 -14969 -5772 5455 -8281 -6070 6792 -8866 -16879 6299 7547 -15091 -8767 3765
1041 3765 -8146 -6602 7762 -6725 -17375 2791 4677 -13319 -2597 7860 -10922 -12690 7517
1054 7517 21 -12038 1863 1035 -13815 -2050 11605 -8750 -13134 7326 2213 -10899 2140
1067 2140 3184 -11412 216 11960 -7208 -11331 9289 2605 -10493 5655 9881 -10066 -3913
1080 -3913 10390 -648 -2564 12791 419 -12556 8588 15822 -4418 -2237 11344 -795 -3124
1093 -3124 14239 6267 -8445 7311 13011 -5142 1593 15467 -618 -6438 12732 9775 -5168
1106 -5168 4847 9395 -5047 2567 16650 -1328 -10565 10418 9052 -6001 4268 9674 -7798
1119 -7798 -3486 12917 848 -6628 7715 2584 -10747 4370 13204 -7617 -8355 8715 -146
1132a46o483J5042m931j5966J3965J0502j7802K49J5615j1373q175J7133q7j7413
1146i870R018Q793j3864K508J5165j4682j0054K0005K195j7962O388R325j5060
1159h095K652J5150j1531j1515J5695J176j4603R458J0052j8350k036J6934n447
1172d60j0796J2488j043j6407J2274J2200j6973n592J7502o027r690J4227P71
1185B474j7022Q097J2556j3175k730J5146q063j2207J7002N961j7404M427J0792
1198E854j1535L32J7326q866j5366J4555Q188j4577L657J0889j2627l308J6542
1211A1064m444j2008J2171L793j7635P549J5809j2794r499J4054k094r132J2353
1224I187J173j7607O138J6780j3206r558J5648j514j3498J0117O352j3640L707
$$ plain form
1132 -146 -6629 8413 3482 -12484 1481 11983 -5819 -5570 10045 -1328 -9503 7630 7543 -9870
1146 -9870 -852 7941 -5923 -3415 11750 -2932 -12986 7019 9214 -8748 -2360 6965 -8095
1159 -8095 -5443 9707 -1824 -13339 2356 3532 -11071 -1613 8439 -9911 -11947 4987 -460
1172 -460 -11256 1232 189 -16218 -3944 8256 -8717 -14309 3193 -2834 -12524 1703 2474
1185 2474 -14548 -6451 6105 -7070 -9800 5346 -2717 -14924 2078 8039 -9365 -4938 5854
1198 5854 -5681 -5349 11977 3111 -12255 2300 10488 -4089 -432 10457 -2170 -5478 11064
1211 11064 6620 -5388 6783 10576 -7059 490 16299 3505 -5994 8060 5966 -3166 9187
1224 9187 10360 -7247 -1109 15671 2465 -7093 8555 7041 -6457 3660 10012 -3628 79
1237G9J0439j3610l595J9538m716j8156R550J0585j2059J382R515j1570m137J8023
1251A1268l756j7420J0594J1107j3792j375J2695p806p061J3449m259j1333J4198
1264F509N832j9448P22J9267q526j2089J0938J756j1289J0166N892j7093M92J6800
1278I929p980r929J0821m87j0707Q489P219j5707J493J4402j0552j0699J7945
1291D237L083j8986L492J3101r548j713J0317j0490q349J7853L086j5971M348
1304e540P253j1082J364J5775q507j4684J4240N101j4451P180J0934j4546o290
1317a3253J6759m17q760P909k283j3617J1928J4734j5694q082J3322k877q479
1330h810J5319K968j8752K696J3900p068m335J2319o735j2561J3557Q875j3718
$$ plain form
1237 79 10518 -3092 -6687 12851 8135 -10021 -471 10114 -1945 -563 8952 -2618 -6755 11268
1251 11268 7512 -9908 686 11793 -1999 -3374 9321 1515 -5546 7903 3644 -7689 6509
1264 6509 12341 -7107 -6385 12882 4356 -7733 3205 4961 -6328 3838 9730 -7363 -6871 9929
1278 9929 1949 -7980 2841 2354 -8353 136 7355 -8352 -6859 7543 -3009 -13708 4237
1291 4237 7320 -11666 -8174 4927 -4621 -6334 3983 -6507 -14856 2997 6083 -9888 -5540
1304 -5540 1713 -9369 -8005 7770 -737 -15421 -1181 3920 -10531 -3351 7583 -6963 -13253
1317 -13253 3506 3089 -5671 2238 -45 -13662 -1734 13000 -2694 -10776 2546 -331 -8810
1330 -8810 6509 9477 -9275 -6579 7321 253 -4082 8237 1502 -11059 2498 11373 -2345
1343b345O00P831j1431Q61J8135n656j7796R001Q550j0024M852J0545j3914q941
1357i732J5908L042r469N474J229j3392O711J4895j1809r713J3190r34j0327J1058
1371F131O942j6938k121J3894n116l765J1060n567j6195J2669J1753j2550k874
1384b677Q756p607l838J4342k886j5470Q492R720j2820m25J1910q923q616J3554
1398C512J051j1486O973N033j5245K001J7843q310j1907J0356K614j0723O728
1411a560O813j2783l98J4509o952j0432J1312J874j1982P142Q624j3622r04J3901
1425E542o136j0903J3007L817j4287L288J0685q915l373R796n355o374J3572M72
1439D836j7424N657J2910q961l425J1265p113j0636J3826O426j4691J449J0620
$$ plain form
1343 -2345 -1745 6086 -5345 -4484 13651 7995 -9801 -800 7750 -2274 2578 13123 -791 -9732
1357 -9732 6176 9218 -251 5223 6452 -6940 -229 14666 2857 -6856 6334 5400 -4927 6131
1371 6131 13073 -3865 -5986 7908 2792 -973 10087 4520 -11675 994 12747 197 -2677
1384 -2677 6079 -1528 -5366 8976 6090 -9380 -888 8832 -3988 -4413 7497 -1426 -10042 3512
1398 3512 4563 -6923 50 5083 -10162 -8161 9682 1372 -10535 -179 2435 -8288 -1560
1411 -1560 5253 -7530 -7928 6581 -371 -10803 509 2383 -9599 -2457 6167 -7455 -8359 5542
1425 5542 -594 -11497 1510 5327 -8960 -5672 5013 -3902 -7275 2521 -2834 -9208 4364 4836
1439 4836 -12588 -6931 5979 -2982 -6407 4858 -2255 -12891 935 7361 -7330 -5881 4739
1452D739q015l656J1520l398r718Q815K452r444P992R054j6923n487J8607J265
1466G803j2730O256L335j1728M954J3704q777q631R917p69p080R564K954j4462
1480e690L590J1711q718l068J2862n644j4005J0955J3064j2860m409Q535o610
1493b87k890J4762k546j4005O325O840r274K333R908j1675o086J4224J76j2696
1507d891P857P294j4540l28J4123l601j0089P002n86p952J0190O430j5209j356
1521e656J3084o037p187J1294r79j2005O825Q626j2937j01J2861p525r491J1090
1535A862M632j2098J769O270q090K320J0511q930r555J2955K390j2613N040J0013
1549F476j0398m177J0732l752p637J0963Q23j3496N306J1363r712n154J1349l960
$$ plain form
1452 4739 -3276 -6932 4588 1190 -8528 287 2739 -6705 1287 10341 -6582 -12069 6538 7803
1466 7803 -4927 1329 4664 -7064 -2110 11594 2817 -5814 4103 3334 -3746 5818 8772 -5690
1480 -5690 -2100 9611 893 -2175 10687 5043 -8962 1993 15057 2197 -2212 6323 -287
1493 -287 -3177 11585 9039 -4966 1359 8199 -1075 1258 11166 -509 -6595 7629 7805 -4891
1507 -4891 2966 10260 -4280 -4608 9515 5914 -4175 2827 2241 -5711 4479 10909 -4300 -5656
1521 -5656 7428 1391 -5796 5498 4519 -7486 -661 7965 -4972 -5073 7788 263 -9228 1862
1535 1862 6494 -5604 -3835 2435 -5655 -3335 7176 -1754 -11309 1646 4036 -8577 -3537 6476
1549 6476 -3922 -8099 2633 -1119 -8756 2207 3030 -10466 -5160 6203 -3509 -8663 2686 -1274
1563a274p811J0468J634j3212N900J0716j0667m539J3158k997r403O646M106r734
1577g009N100P761j0428l933J3888k541j1334Q060N754j0823K269R317q553l377
1591e849J2283l390j1480R653O724j2255P23R395n807k814R843l539j1158J0532
1605B861O297j2589n2J1587n230p379Q341R71p877P819M176j3564K142J3545p903
1620C145q043J0069J755j0217O045N170j0330J634J0059p394o992J2455Q4j2373
1634d933M296Q696p952k92P435p723m981J2912j36j3833N929Q896r351k684J0074
1649F353n122n798Q288M28j0570P697O351j2041k261J2521k762q463P291j96q793
1664g077O833P591j2033k836J2530m149p191P311K012r135L549P196q668j410
$$ plain form
1563 -1274 -9085 1383 3017 -10195 -4295 6421 -4246 -8785 4373 1376 -8027 -1381 2725 -7009
1577 -7009 -1909 5852 -4576 -8509 5379 2838 -8496 -436 5318 -5505 -3236 6081 -2472 -5849
1591 -5849 6434 3044 -8436 1217 7941 -4314 -3591 5804 -3 -2817 7026 3487 -7671 2861
1605 2861 9158 -3431 -3483 8104 2874 -4505 3836 4807 -3070 4749 8925 -4639 -2497 11048 3145
1620 3145 -4898 5171 6926 -3291 2754 7924 -2406 -772 9287 1893 -5099 7356 7440 -4933
1634 -4933 -637 8059 107 -185 7250 -473 -5454 7458 7322 -6511 -582 8314 -1037 -3721 6353
1649 6353 1231 -4567 3721 4149 -6421 1276 7627 -4414 -6675 5846 3084 -5379 1912 1716 -7077
1664 -7077 -244 7347 -4686 -7522 5008 859 -6332 979 2991 -6144 -2595 4601 -4067 -5477
1678e477J0381n704q909J0364N127j2171J837P223o582j907R575n258q448R831
1692a18N212j1875J349R030o983l264J0026k325r664Q545L975j0999L747R926
1706F582r424n379J0444O52p675N912K044r566K995J1125q565n466R590M16q835
1721e150O727M243j0069J333J0070o247n371J0049j363j0499P746O949j0292o52
1735b526Q142n407k962J0016k167j1300P405O859r544Q26Q524o907n516R491J368
1750F302r152N033M043q146K77J0068n611p316Q772J198q818O024M540j0043L72
1765b457R791m586o750P323Q13q318N917O107r899k235R803l589n864Q048N91
1780D695j0133L994P307p791k249Q373m589o263R419J967r416J398P127o172j057
$$ plain form
1678 -5477 4904 -800 -9709 655 5782 -6389 -4552 2671 -3911 -5818 3757 -1501 -9949 -118
1692 -118 5094 -6781 -5432 3598 -3385 -6649 3377 1052 -8612 -67 3908 -7091 -3344 6582
1706 6582 -2842 -8221 2223 2875 -4800 1112 3156 -6410 -3415 7710 -855 -6321 3269 3685 -5150
1721 -5150 1577 5820 -4249 -2916 7154 907 -4464 5585 4222 -6277 1469 8418 -1874 -2526
1735 -2526 5616 209 -2753 7263 5096 -6204 1201 8060 -1484 -658 7866 959 -4557 4934 6302
1750 6302 -2850 2183 6226 -1920 -1643 8425 2814 -4502 4270 5468 -3350 2674 7214 -2829 -2457
1765 -2457 7334 2748 -4002 3321 4134 -4184 1733 7840 -2059 -4294 5509 1920 -3944 4104 4695
1780 4695 -5438 -1444 5863 -1928 -4177 4196 -393 -6656 2763 4730 -4686 -3288 3839 -2333 -3390
1795c390Q146n704p163R083L453r988K448O876p848k555R722k656o965O019K999
1810B477r015L438P575q483m556J0008q2p767M729K497p961M076Q669q923n088
1825h406R480o00o576O302L239j0323K367Q598n388l818Q531k518r251P840O036
1840E513q382r66O578m651k218Q922k799r228O624O405q957K15P874n618l837
1855d525Q406J74q704N955L650q048J604Q701n103p266P145K321n418L818L261
1870E971r913J815J0666n735o822P189J798q385N417M746p188j199Q040n061n016
1885c677R705M50j1188M174P436n457k359N610m066l695R275l56j0166L255P915
1900F856o644l043Q181l582n810O578J179p157M509M607q476k109J0125k431p682
$$ plain form
1795 -3390 4756 -948 -8111 972 4425 -5563 -3115 3761 -4087 -6642 3080 424 -6541 -522 2477
1810 2477 -6538 -3100 4475 -4008 -8564 1444 1362 -6405 -1676 821 -7140 -3064 5605 -3318 -8406
1825 -8406 1074 474 -6102 200 3439 -6884 -4517 4081 -1307 -5125 3406 888 -8363 -523 5513
1840 5513 -2869 -3835 2743 -1908 -4126 4796 1997 -7231 -607 5798 -3159 -2944 4930 -688 -4525
1855 -4525 3881 4055 -4649 1306 4956 -3092 -1488 7213 2110 -5156 1989 4310 -1108 2710 5971
1870 5971 -3942 -2127 8539 2804 -4018 3171 4969 -3416 2001 6747 -441 -1640 6400 1339 -3677
1885 -3677 6028 6478 -4710 -536 6900 1443 -916 4694 628 -3067 6208 5852 -4314 -1059 6856
1900 6856 212 -2831 5350 1768 -4042 2536 3715 -3442 1067 5674 -2802 -4911 5214 2783 -4899
1915d899M984K665o293M814L862r219k234J0129q38r352N740L959q842K690N716
1930B882n891j224O977l868o043R056K233j0583J075P864m305k550O642k467p656
1945g858P525L721q540R44O969n855l018P836J21p241M123L155p073K870P629
1960E308p887n431R027J299o052L363K973p692J866Q129n449l884P158r08q100
1975f280O332N994p369j560N789l596k425Q162k225q716N365O592o950j073O290
1990D330l874l588O765M85o600L460M098p811P74R307l827p463N542J568m250
2005a084M005K796q534J021Q658l731p116O766K414p516K833N100n800q83O170
2020E099l640m979P672K471r383J737N746m553j010M914l479m170P978O83r370
$$ plain form
1915 -4899 85 2750 -3543 1271 5133 -4086 -6320 3809 2971 -6381 -641 3318 -5524 -2834 2882
1930 2882 -3009 -4233 2744 -1124 -7167 1889 4122 -6461 -5386 2478 -1827 -4377 2265 -202 -7858
1945 -7858 -333 3388 -5152 -4208 2761 -3094 -6112 1724 1845 -5396 -1273 1882 -5191 -2321 5308
1960 5308 -2579 -8010 1017 2316 -3736 -373 2600 -5092 -3226 4903 -546 -4430 2728 1820 -6280
1975 -6280 52 6046 -1323 -2883 2906 -690 -3115 5047 2822 -5894 -529 6063 -887 -1960 4330
1990 4330 456 -3132 3633 4118 -2482 978 5076 -2735 -1961 7346 3519 -3944 1598 3166 -1084
2005 -1084 2921 5717 -2817 -1796 6862 3131 -3985 2781 5195 -2321 512 5612 -188 -1071 5099
2020 5099 1459 -3520 4152 6623 -2760 -1023 4723 170 -840 4074 595 -3575 4403 5086 -4284
2035d284K591Q052o305l782P502k140n591N885Q53p402L284O066o377k657O797
2050B492j842n189N247J339o856L497O040q577k644R505L10q887K555L909m103
2065c204J193N418o198l772P666j231m923M059M074r115J239P855m749l292O633
2080A653j246q343P713N056q499j609M707r9m97M575m204n200M995M103n733N34
2096b094N081m822k918P281m14n332J675N028n648j019P594m090n316N409Q41
2111A256j174K713M42p880J656R028l511o377O003J553o944L953N009n987k484
2126b744O555j744l399N997n90o941K214N417l722m99M271m534l731P925K276
2141F751q741R23O729m412k968N276j920l638M934J314o343L393L837n586k775
$$ plain form
2035 -4284 -1693 6359 54 -3728 3774 1634 -3957 1928 2781 -4621 -1337 4729 -1648 -4305 2492
2050 2492 650 -4539 708 2047 -4809 -1312 4728 -3849 -6493 3012 3322 -5565 -3010 899 -3204
2065 -3204 -2011 3407 -2791 -6563 1103 -128 -5051 -992 3082 -6033 -4794 3061 -1688 -4980 1653
2080 1653 407 -7936 -223 4833 -3666 -5275 -568 -667 -1164 3411 -793 -5993 -998 3105 -2628 -2094
2096 -2094 2987 -1835 -4753 2528 2114 -3218 -1543 3485 -2163 -3182 4412 322 -4994 415 1256
2111 1256 82 2795 3237 -4643 -2987 6041 2530 -3847 2156 3709 -3235 718 5727 -260 -2744
2126 -2744 3811 2067 -1332 4665 4075 -2866 -652 4765 1043 544 4815 281 -3450 4475 6751
2141 6751 -1990 -1067 5662 1250 -1718 3558 1638 -2000 2934 4248 -2095 1298 5135 -451 -3226
2156c226Q357k087m928L741R40o160L756N775o716l436P393q03n750L837J443
2171B136m344K136L906n708k434P603j951o134N892L091o932m06N356l843k158
2186c790N776k090m431M416K927p359P62O208k592l722N155j921m916N082L908
2201C413o332r68N877l840l686O348o8n153L169K886n684R66O124n689l394P456
2217A425J787p299J446L660m800J591M882l038m570N634L58n510N355K436n675
2232b318j540O125k077l335M920m51o149L918O084n289k868M285r68k685N307
2247B959j098m888L382L545n587L32O480k589n887N339K424n480J331L381m211
2262e67m28O245k376o095M991J681m277K651K205m624p46N924k212n451O069K602
$$ plain form
2156 -3226 5131 3044 -1884 1857 2797 -3363 393 6168 -548 -3984 3409 2606 -3144 693 2136
2171 2136 -2208 -72 3834 -1874 -4308 3295 1344 -4790 1102 4193 -2739 -3145 2211 -1632 -3790
2186 -3790 1986 -104 -4535 -119 2808 -4551 -3789 2419 -173 -3895 1260 -661 -5577 -495 3413
2201 3413 -2919 -3887 1990 -1850 -5536 812 744 -4409 -1240 1646 -4038 -3072 3052 -2637 -6031 1425
2217 1425 3212 -4087 -2641 1019 -3781 -2190 2692 -346 -4916 718 1076 -4434 921 3357 -2318
2232 -2318 -3858 2267 190 -3145 1775 1324 -4825 -907 5177 -112 -2980 1305 337 -2348 2959
2247 2959 1861 -3027 355 3900 -1687 -1355 5125 2536 -3351 1988 4412 -1068 263 3644 -567
2262 -567 -995 5250 2874 -3221 1770 3451 -826 1825 4030 -594 -1340 4584 2372 -3079 2990 5592
2278E592p905J668N626l517l184M646q62l215L868O65n732J905M867k739l797
2293b114M951o95n236M269K773o006O10M683l630l108N847r71m959L143K182l351
2309a612O9L928n062n66O391r46p465L148N272n030m09M597l681k310N416l11
2325A429n637L352L459n558M31N260l286k846M883m62m866M221K789o725o46P425
2341C223k208m444L671J115m367K843L108n153p56O192l042m353N818O67n845
2356c531K877L101m234j5M822l470l172N180J579o648J631M310l278p34N049l120
2372C47m030N604J139n731K517L951l959j802M941j058l559L513J412n169K216
2387C32M946n472j306N935j450m685L600J995o088K993M385m327k601O201j774
$$ plain form
2278 5592 -2313 -645 4981 1464 -1720 2926 2064 -1151 2717 3382 -2350 -445 4422 1683 -2114
2293 -2114 2837 2142 -3094 1175 3948 -2058 -1448 3235 -395 -3503 2344 1373 -3586 -443 1739 -1612
2309 -1612 -1543 2385 -2677 -3243 3148 2202 -5263 -2115 3157 -1873 -2282 2315 -1366 -3676 1740 1429
2325 1429 -4208 -856 2603 -2955 -2524 2736 -550 -3396 1487 1025 -3841 380 3169 -3556 -4202 3223
2341 3223 1015 -3429 242 1357 -3010 -167 2941 -2212 -2968 3224 182 -4171 1647 2314 -3531
2356 -3531 -654 2447 -1787 -1802 3020 -450 -3622 1558 3137 -3511 -1880 2430 -848 -1582 3467 347
2372 347 -3683 1921 3060 -2671 -154 3797 -162 -1964 2977 1919 -1640 1873 3285 -1884 332
2387 332 5278 -194 -1500 4435 2985 -1700 1900 3895 -2193 800 5185 858 -1743 4458 2684
2402B684m814M141K545n459J216M452m255j434M570j382n515M390L236n676J007
2417b94L351l534j992M909l90m882K918K970n042M0M928l260k287M787p15m926
2433c419L409K700o268J046M808k125l583M081P5m297K978L308n780N31M949l421
2449a008l205L829Q48m912L448K571l972j22M470l645k870L964K041n555K371
2464a747K821m960J606M179l267k951M162P86m667K243L667m658j125N344k383
2479i50k919M617K21n124K864M522m353k048M682j613k915L760J279n603K827
2494g53L964m905j576N946j993l864M329J254m624K215L500m993j629P076k739
2509A208m153L802J944m475J674K999l728n81M540j095m832L428L168n626L52
$$ plain form
2402 2684 -2130 2011 4556 -903 313 4765 510 -924 3646 2264 -3251 1139 4375 -1301 -294
2417 -294 3057 -477 -2469 2440 2050 -2832 86 3056 -1986 -1946 2982 -278 -2565 2222 1507 -3419
2433 -3419 -10 2690 -3578 -2532 2276 151 -3432 649 724 -3573 -595 2713 -3067 -2536 2413 -1008
2449 -1008 -4213 -384 464 -4448 -1000 1571 -2401 -2523 1947 -1698 -4568 -604 1437 -4118 -1747
2464 -1747 1074 -3886 -2280 1899 -1368 -4319 -157 629 -4038 -1795 1872 -2786 -3911 1433 -950
2479 -950 -3869 748 969 -4155 -1291 3231 -1122 -3170 1512 -101 -3016 744 2023 -3580 -753
2494 -753 3211 -1694 -3270 2676 683 -3181 1148 2402 -2222 -7 3493 -1500 -3129 3947 1208
2509 1208 -2945 857 2801 -1674 0 2999 -729 -1310 3230 2135 -2697 731 3899 -1727 -1375
2524a375N050l474p71M083k515l295M552K207n678J01M699k650k357M526k81m690
2540a868L628J626n145J353M539l017l004M530lm324K288J918k302J13L770m153
2556e1k964N856q65m781K899K508m037K50M379m496j485M946l58n627L156K899
2572B229l879n83M011k692k703M695p31m218L147L300m760j062N119k451l481
2587d059L935P31m886L259K611m400p76N560k404l608L938J340m479J770L342
2602A874m346K08M192k542l438M091J821m395O15L501l112o38M399k350l446M729
2618A163J502n555J748L852l868q26L833j013l860N007L60n578K222M518m155
2633f50k020N262p16l980L365P29l763K006L555m421j292N266j937l214L292J683
$$ plain form
2524 -1375 3675 201 -570 3513 998 -2297 2255 4462 -1216 -1115 3584 934 -1423 3103 2822 -1868
2540 -1868 1760 3386 -1759 -406 4133 1116 -1888 2642 2639 -1685 603 2521 219 332 4102 -51
2556 -51 -3015 2841 1976 -2805 94 2602 -1435 -1185 3194 -1302 -2787 2159 1801 -3826 -670 2229
2572 2229 -1650 -2233 1778 -914 -3617 1078 347 -3871 -724 2576 -2184 -3246 1873 -578 -4059
2587 -4059 -124 607 -4279 -1020 1591 -2809 -3585 1975 -429 -4037 -99 1241 -3238 -1468 1874
2602 1874 -2472 -2264 1928 -614 -4052 39 1860 -2535 -1920 1581 -1531 -2169 2230 -120 -3566 1163
2618 1163 2665 -2890 -1142 2710 -1158 -1984 1849 836 -3024 1983 2343 -3235 -1013 3505 -650
2633 -650 -2670 2592 1876 -2104 1261 1990 -1773 233 3788 -633 -1925 3341 1404 -1810 1482 3165
2649C165l846R07L237l377k114N378o01m385K196K536l597l18M130l081j194M423
2665C459j963m323M471L053n182q00M855k480k689L740n32l822L255K386m372
2680i44Q4L888k271k559L454L68m544K416L239m593O54L846k926l785M614L08
2696A249l602J571K132l319P05L926l503k877M141J679n299K977K194m727O3M741
2712B051k431l033L882Q92n073J754M106l808j352L814j367j849L149J35n124
2727d254K155M225k826j824M073k085l413L746J893m690K59M956m354j23L437
2742A175q66l457L147J714l904J577K576l994j130O271j741l944K419J605l654
2757b206J934M053l775j881L673m71l723M189P62m371J104L271k602j644M264
$$ plain form
2649 3165 -681 226 3463 86 -2028 3350 2749 -1636 560 3096 -501 -819 3311 230 -964 3459
2665 3459 1496 -2827 1644 4697 -485 -1285 3570 1090 -1599 2141 1609 -2213 1042 3428 -944
2680 -944 -860 3028 757 -1802 1652 2020 -2524 -108 3131 -1462 -808 3038 112 -3673 941 1249
2696 1249 -2353 -782 1350 -1969 -1264 2662 -841 -3718 423 2102 -3197 -220 1974 -2753 -2690 2051
2712 2051 -380 -3413 469 1361 -3712 -1958 2148 -1660 -3012 802 -565 -2414 735 870 -4254
2727 -4254 -2099 2126 -700 -2524 1549 -536 -3949 -203 1690 -3000 -2741 2215 -2139 -2262 1175
2742 1175 309 -3148 -1 1713 -2191 -614 1962 -2032 -3162 3109 1368 -2576 -157 1448 -2206
2757 -2206 -272 3781 6 -1875 1798 1327 -2396 1793 2555 -1816 -712 2559 -43 -1687 2577
2772B577p84m706L760L410m737j80L401k235j395L349J59m066J825K228m073R46
2788e21M783m402j329L758L72l561J913K485n145J115M551l127k723L703R9m080
2804b109K956J797l920M35M328k793l616N430q3m377J864K454m049P16K734k566
2820g99j111K529J29k430J644J933l297q87M427k608k772L414J266m524K068L289
2836B271m746k44M109k175j863M032Q28n536K275K216l343k1M585k514l792L227
2852f91K409m324J400K287k348m25L756j932l587M008J044m203J957K826l181
2867a004j735M462j460l217L630J503l806M36L904k655k351L730j254k334L323
2882A172K66m092K008M233l289k424N036p54n063L249K362m010Q46K922k390k686
$$ plain form
2772 2577 1793 -2913 847 4257 -480 -660 2741 506 -889 2460 2619 -1447 378 2606 -1467 -521
2788 -521 4262 -140 -1469 2289 2661 -900 1013 3498 -1647 -532 4019 892 -1831 1872 1971 -2109
2804 -2109 847 2644 -1276 -841 3487 694 -2922 2508 2425 -1952 -88 2366 -1683 -967 1767 -799
2820 -799 -1910 619 748 -1682 -38 1895 -1402 -2289 2138 -470 -3242 172 1438 -3086 -1018 2271
2836 2271 -2475 -2719 1390 -785 -2648 1384 2212 -3324 -1049 1167 -2176 -2197 2388 -126 -3918 -691
2852 -691 1718 -2606 -1206 1081 -1267 -1692 2064 132 -3455 553 1597 -2606 -649 2177 -1004
2867 -1004 -2739 1723 263 -2954 676 2179 -1627 -1191 2713 58 -2293 1437 183 -2151 1172
2882 1172 1438 -2654 -646 3587 298 -2126 2910 2156 -2907 342 2704 -1306 -460 2462 72 -2614
2898b614M980K44m333L087R98l057N77L053k415k892N475j509l550K181L905n100
2914i70M95M413l455o81L252m86l864K725J709l167l59L295j924k942M533M05
2930B979l673O71L439m867J72M713k829k592L300P36l726K214J076l361P02L255
2946B209k336k795L883M44m482K352K840l092j141L140k003k334L761K08l477
2961b823J568L038l796m55L815k523k148L816R31m048Q50L171l648l22L540j054
2977h8l377K697P58k559J153K921l550j416M279m18l515K830J106m124K069L066
2993A832k801k535M344j160l141K919K134m642J290L147k663j306L786j006l993
3008c795L868J668l664k18M350l308j550L615J66l791K562J849l732N24L556l001
$$ plain form
2898 -2614 2366 2610 -1723 1364 2362 -695 -118 2935 520 -2372 3103 1594 -1956 225 4130 -970
2914 -970 -475 3938 483 -198 3054 2568 -1296 1429 3138 -29 -388 2907 983 -1959 2574 2979
2930 2979 -694 -23 3416 -1451 -1279 3434 605 -1987 1313 2049 -1677 537 1613 -1748 -1046 2209
2946 2209 -127 -2922 961 1405 -3077 -725 2115 -977 -2118 1022 -981 -3315 446 654 -2823
2961 -2823 -1255 1783 -2013 -2468 1347 -1176 -3324 492 1423 -2625 -1775 1396 -2252 -2574 966 -88
2977 -88 -3465 -768 -10 -2569 -1416 1505 -2045 -3461 818 400 -3115 -285 821 -3303 -1234 1832
2993 1832 -969 -3504 840 -320 -3461 -542 1592 -3050 -1760 1387 -1276 -2582 1204 198 -3795
3008 -3795 73 1741 -1923 -2141 2209 -1099 -2649 966 1132 -2659 -97 1752 -1980 -1456 2100 -901
3024i01o66L857o83l809K104K590l696p4M040k156k111L174M52l138J720J886
3040B589l680J96M538l396j564L148L25l298K666J088l844J70L525j360k544M056
3056B615p27l604K094K461k987p01K760j108k746L506R62m908J685M239m301N22
3072b38K133k091j360L448N79m309R61K680l204o34M127j453k154K080R22l823
3088b336Q49L624l780j003M799k235k344K513M54l239J618K731l630j140L566
3103D47j17l223L035J115l604J310K968k758j586K969k62l186K938J672l684M5
3119a921L213j722j687K554j38k743L023J224l409L43L467k636j817M318j097
3134I72k760K242J359l204P04K971k257k327L965J128m006J601J403k749J537
$$ plain form
3024 -901 -1567 2290 1607 -2202 -98 2492 -1204 -1278 2762 606 -1505 1669 2121 -1017 703 2589
3040 2589 -1091 -895 3643 247 -1317 1831 2156 -1142 1524 2612 -1232 -1062 2463 1103 -1441 2615
3056 2615 1888 -1716 378 2839 -148 -849 1911 803 -1943 1563 2525 -2383 -698 3541 -760 -238
3072 -238 1895 -196 -1556 1892 2471 -1838 -877 1803 -1401 -2035 2092 639 -1515 565 1487 -2336
3088 -2336 -1487 2137 -1643 -2646 2153 -82 -2426 87 541 -2698 -1080 1651 -1979 -3119 447
3103 447 330 -2893 142 1257 -2347 -1037 1931 -827 -2413 556 294 -2892 46 1718 -1966 -1921
3119 -1921 1292 -430 -2117 437 299 -2444 579 1803 -1606 -1263 2204 -432 -2249 2069 972
3134 972 -1788 454 1813 -1391 -687 2284 27 -2300 1665 2793 -1213 388 1791 -958 579
3149E79K351l146j852L188J049l968K778J924l920p56M327k588j193L823q26l189
3165a419K556J933l327q60K746j185j642L290M06m118J829L001l380k20K939k053
3181D96j744L036O64l895K089J966l547l1L546j261l156K612J293k356M12K314
3197B438l592L57K952j516l094K874J488l319J426J685k235q66K022l98j529K619
3213A312N33m927J804K780k758j624L671j225j998J935J571l831J240L883l197
3228h31j284L097j193k452K896J386l580N38K495k289j286L159m46l041K376P88
3244C33j947k79L503k906r29L167m99k509J182K365k838M81K781k742j892L125
3260C96L72l732K461J638k607p15M170j673j843K942o45k727K548J521m280J80
$$ plain form
3149 579 2930 -216 -2068 1120 2169 -1799 979 2903 -1017 -1773 2554 -34 -1227 2596 1770 -1419
3165 -1419 1137 3070 -257 -1117 1629 444 -1198 2092 2498 -1620 209 3210 -170 -390 2549 496
3181 496 -1248 1788 2452 -1443 646 2612 -935 -966 2580 1319 -1837 775 2068 -288 124 2438
3197 2438 -1154 -797 2155 639 -2455 419 1907 -1412 14 1699 -536 -1402 620 222 -1307 1312
3213 1312 1845 -3082 -1278 1502 -1256 -2880 791 -434 -2432 -497 1074 -2757 -1517 2366 -831
3228 -831 -2115 982 -211 -2663 233 1619 -1961 -1423 1072 -1217 -2503 656 210 -2831 -455 333
3244 333 -1614 -1893 1610 -1296 -2225 942 443 -2066 -884 1481 -1357 -876 1905 -837 -2729 396
3260 396 768 -2964 -503 1135 -1472 -2187 1983 310 -1533 1409 764 -1963 585 2106 -2174 -1994
3276a994L710j584j014K217q03k833K132L321m510J069L259k019k975L693O27
3291B296k959N48K381l137P55K770j640k270K957N82k534Q83J474k819J65L033
3307B485r60l077K963J036l093J142K207k925j61K790j537j803K612K11m145J966
3323b89K783k599o54K289r21j426J369Q63k475Q08K230l813N72K116k72l924L144
3340a99J585k897J564O94j423j062L919j772k582K217J901m705J757K632l402
3355a773q44L325K39l552K758J115l585N49L051j635j615K536n49k971L003J548
3371A600l002o68L167j791j177K613n53k276K065J358k750P38J826k154r50K278
3387C24P32k857J559J472k139l69K873j525k236L117J238l093O59J225k820Q76
$$ plain form
3276 -1994 1716 132 -882 1335 532 -2301 -169 3152 -1358 -289 2970 951 -2024 1669 2296
3291 2296 -663 -115 2266 -871 -116 2654 1014 -1256 1701 2283 -251 632 2106 -713 -548 2485
3307 2485 1525 -1552 1411 2447 -646 496 2703 -222 -383 2407 870 -933 1679 1890 -2255 -289
3323 -289 2494 -105 -759 1530 609 -817 552 1415 -1060 -252 1978 -1835 -1263 853 581 -3343 -199
3340 -199 1386 -1511 53 747 -676 -1738 2181 409 -2173 44 1945 -2760 -1003 1629 -1773
3355 -1773 -2617 708 947 -2605 153 1268 -2317 -1768 1283 -352 -1967 569 20 -2951 52 1600
3371 1600 -1402 -2070 1097 -694 -1871 742 189 -2087 -22 1336 -1414 -676 1150 -1004 -1954 324
3387 324 1056 -1801 -242 1230 -909 -1278 1595 70 -2166 951 2189 -904 -245 980 -1840 -964
3403i64L340k448j968L248j11k106J223J743k368o44K837j226j774K702O2l152
3419a606K148J762k821k84K029q48j277K364O3k869J417J515j982q64L355q78
3435A224k361K672L97l106J542K172k234j538L666r19l059K021J559k588L41K172
3451A961k651L24K298j588k482L099P58k927J769R75k510m65K101j53k106K390
3467G93N92l277J268J898j051j084J835j033k038K559L91l005L39K437k051L08
3483a119K293q58k338J331J314j518J388l45k030K47J936K28k920J823J908l136
3499a796J850Q75k861m73L926p27l173J631J931l061O9K691j341j029J172K33
3515h3j684K286O82l067M01K446j169j895L022k18k769J430J914k714j25K867
$$ plain form
3403 -964 2376 -72 -2040 1208 1097 -1009 214 1957 -411 -1055 1782 556 -1218 1484 1546 -1606
3419 -1606 542 2304 -517 -801 1228 380 -897 1467 1530 -1339 78 1593 -389 -1253 2102 1224
3435 1224 -1137 1535 1932 -1174 368 2540 306 -1232 2434 1515 -1544 477 2036 -552 -211 1961
3451 1961 -690 -366 1932 344 -2138 961 1719 -1208 561 1536 -974 -1439 662 509 -1597 793
3467 793 1385 -1892 -624 1274 223 -861 974 -59 -2097 462 853 -2152 -1813 624 -1427 -1119
3483 -1119 1174 316 -2022 -691 623 -895 493 148 -1882 -1635 301 529 -2391 -568 1340 -1796
3499 -1796 54 929 -1932 -2405 1521 794 -2379 -748 1183 -1878 -1809 882 -459 -1488 -316 -83
3515 -83 -1767 519 1201 -1866 -1465 981 -188 -2083 939 721 -2048 -618 1296 -1418 -1543 1324
3531A324r66k004K261k26j987K065O06j766M27K405j852j975K613Q45k675P82
3547a23J881k115m15K021j83j941K217M10k009R85J168j601m09K018j319j724
3563a139K983J7l093J449K213k041q46J969P6k173Q66Q59j415M35K101k310j132
3580a181K737m30k419K035J007k359k10K507k523o01K457q31j731J541J014j843
3596h30l0K204j861p39L239j420k456J653J266k074J52K265j523j288J886Q8k077
3613a545J736R84k943Q90K150k103r96K203l66j803J312R84k191j54L358r50k169
3630a603R81R86j978J442J434k984L04K092j045j400K003R8j304N77J319k030
3646a108l86J911r33j286K736m84k239J696J197j613o13K920p51k402J372O51
$$ plain form
3531 1324 358 -1646 615 389 -1598 467 1073 -693 -266 2139 287 -1688 925 1770 -905 -123
3547 -123 1758 -357 -772 1249 1066 -875 1342 1752 -257 728 1896 295 -114 1904 585 -1139
3563 -1139 1844 1861 -1232 217 2430 389 -457 1512 1588 -585 281 1140 -275 160 2261 -49 -1181
3580 -1181 1556 1126 -1293 742 1749 -610 -820 1687 -836 -1437 1020 189 -1542 -1 1013 -830
3596 -830 -860 1344 -517 -1256 1983 563 -1893 -240 1026 -1048 -896 1369 -154 -1442 444 532 -1545
3613 -1545 191 1175 -1768 -878 1272 -831 -1827 376 10 -1793 -481 503 -1688 -1842 1516 566 -1603
3630 -1603 -622 364 -1614 -172 1262 -1722 -1418 674 -371 -1771 232 330 -974 -397 922 -1108
3646 -1108 -1494 417 -516 -1802 934 450 -1789 -93 1104 -509 -1122 1798 1047 -1355 17 668
3662F68k197R89K177k196r22K121j84j042J163J51k104J409J733k585j41K274
3678A314m2k313K494m82j973J093J939k064r65K743j007j756K579k72k152J172
3694C08J549j823p85K487r39k535K451J084k089J28J150r01j233K012k03j892
3710a231J663J613k648O56J236j380j206K411m1k298J324R41k419O26K385j508
3726A24j461J633L98k283J169J169j743O4K070j811j139J754M28j936P80J208
3742D24j651N74O88n32j570J959R25l052K128J322k227o7J625q16j695K998r70
3759F3k222J242J951j348j867K840k41k347K126m16j907J709J421k111m70L251
3775A674r78j622J424M11j311M3J480k002m9K423r93j833J799N57j723L01J474
$$ plain form
3662 668 -1529 -540 1637 -559 -1481 640 456 -586 577 728 -1376 33 1766 -819 -960 1314
3678 1314 1272 -1041 1453 971 -1002 91 2030 -34 -999 1744 737 -1019 1560 1288 -864 308
3694 308 1857 34 -751 1736 797 -1738 713 1797 -292 -164 986 85 -1148 864 661 -1231
3710 -1231 432 2045 -603 53 1289 -91 -1297 1114 1073 -1225 99 1040 -1379 -753 1632 124
3726 124 -1337 296 694 -1589 -420 749 -994 -930 1140 -671 -1810 -56 372 -1564 -784 424
3742 424 -1227 -653 35 -497 -2067 -108 817 -2235 -107 1215 -1012 -1079 546 -270 -1965 1033 63
3759 63 -2159 -917 1034 -314 -2181 659 418 -1929 197 -219 -2126 -417 1004 -1107 -1577 1674
3775 1674 696 -926 498 909 -402 -359 1121 -881 -930 1493 500 -1333 466 1023 -700 -399 1075
3792A075j494m00K416j375j526J682J212k682J201J120j397j99J532m16j752J501
3808D98J279k252O26J747j757m89J205O09k112J543J026l020N38K463j854j08
3824e8J137j30j551J186J238j576N49P00j615r84K605o07j565P88J951k268Q0
3841a20J049j149j118K807r41j616J529J52j748P64J969j594j223J839P6j469
3857g93R39R72k088m44K647j008j741J955m02k297J774J421k062jK349j888j421
3874b088K182L84j909Q98J451j510r3J212o74j673K353n6k051J298J033j451j38
3891h32J641j698n25J847P38k491P56J401j341l07J832j249j504K001L48j530
3907i13P24J214k019K9J649o35j147J082J243k134Q34J537j701o04J860n41j101
$$ plain form
3792 1075 -419 -819 1597 222 -1304 378 1590 -1092 109 1229 -168 -367 1165 749 -1003 498
3808 498 1777 -475 151 1898 141 -348 857 1466 -646 897 1923 -1097 -559 1904 50 -58
3824 -58 1079 949 -602 584 1822 246 795 1495 -120 -1104 1501 894 -671 117 2068 -200 -120
3841 -120 929 -220 -1338 1469 528 -1088 441 593 -1155 -391 1578 -16 -1239 600 676 -793
3857 -793 146 1118 -970 -1414 1233 225 -1516 439 37 -2260 -486 935 -1127 -1128 1221 -667 -2088
3874 -2088 94 478 -1431 -533 918 -592 -685 527 -147 -1820 533 477 -1574 -276 757 -694 -832
3891 -832 809 -889 -1414 433 1171 -1320 -564 837 -504 -811 1021 -228 -1732 269 617 -913
3907 -913 -189 1025 -994 -965 684 49 -1098 -16 1227 -907 -73 1464 -237 -841 1019 478 -623
3924f23J150N88j573P91J307j888l18K167j043j407J248J032j537k68J501r30
3940A97o89J635k89k385J635K300k784j78J577j258n21J847q38n40N01J327k526
3957i89P07J908j401q96J345l13j056J505N09k211L97K185j299r39J251n1j539
3974h87J120Q33k244P44J729r40j551K010oj898J117R31j604J85J706j538j102
3991a395K030K17k095P85J538k192K34J209n52m73J211n76r64M11J097j073j66
4008g54J420j415N0J200l59j502M36J345j672k91K231k84j621J238O87j893P64
4025d20Q57n50j660K543j369l95J278oj440K70J545j292o49J810m87j785J722
4042b8Q20j750N03J527j631k79J161j66j449J973O28k000M22J019n59j140K199
$$ plain form
3924 -623 527 1115 -458 333 1640 -248 -566 1601 558 -849 399 1431 -106 -374 1127 197
3940 197 -492 1143 854 -1531 104 2404 -380 -558 1019 -239 -760 1087 249 -291 210 1537 -989
3957 -989 -282 1626 225 -671 674 361 -695 810 1319 -892 -495 1690 391 -548 703 652 -887
3974 -887 233 1066 -1178 -434 1295 355 -1196 814 808 -1090 27 958 -646 -461 1245 -293 -1395
3991 -1395 635 852 -1243 -458 1080 -1112 -878 331 -221 -694 517 -59 -1023 -612 485 -588 -754
4008 -754 666 -749 -699 501 142 -1360 -924 421 -1251 -1542 689 405 -1216 22 709 -1184 -420
4025 -420 437 -113 -1773 770 -599 -994 284 278 -1162 -892 653 -639 -1288 522 35 -1750 -28
4042 -28 792 -958 -455 1072 -559 -838 323 157 -1292 681 1309 -691 -269 750 191 -949 1250
4059A250p97j194R92N72p67j7R23q85r21K292m16j706J924R8k154K43K355j850
4077e8n27K178n90j623Q41J496k079O37J116j328j33J668r20j098O39J319k421
4094h83L85J892q39j383J642L30k064P46J320j601L78Q64L12j556R41O91j493
4111c18M78P14j998J02K086n19j646J516J25r61j12J430j772k74K112j583l93
4128a013O85Q05k114J007J514j772O15O51r05j220J981J66j277M6J436j376m16
4145a187J673p33k24P83j27j147O06Q48j799N98J458r37j244J165P39j806L52
4162i82J797p68m86P31K44j285N28J192j247J85J186j226l23J214r95j418J963
4179C10J62j309O05Q46n56l06J498m04j903M50J861k366P68J161n81o79J656r52
$$ plain form
4059 1250 453 -741 251 823 56 39 962 77 -844 1448 1032 -674 1250 1348 -806 -563 1792 -58
4077 -58 -585 1593 1003 -620 221 1717 -362 275 1391 63 -70 1598 678 -420 219 1538 -883
4094 -883 -498 1394 555 -828 814 1144 -920 -174 1146 -455 -77 787 1099 -457 484 1175 -318
4111 -318 160 874 -1124 -1022 1064 545 -1101 415 540 -421 -533 897 -875 -1149 963 -620 -1013
4128 -1013 -328 477 -1637 -630 884 -888 -273 378 -527 -1747 234 400 -877 -831 605 -771 -1187
4145 -1187 486 -247 -471 312 185 -962 -356 492 -1307 -709 749 -188 -1432 -267 472 -1334 -982
4162 -982 815 47 -439 292 536 -749 -221 971 -276 -91 1095 -131 -454 760 -235 -1653 310
4179 310 472 -837 -232 614 58 -248 1250 846 -1057 -607 1254 -1112 -344 817 236 -443 1213 261
4197B61q94J337L82j362n82K825j773p37J042O64j481J022Q16j847Q5J846j240
4214C64j114J546k38m86J13P28r70n59K262j315j441J609l37j381J735Q99j424
4231ip18J650j014j196J170K70r84J668J158l265P8J977o91m49J613r25r86N55
4249i8O92j759J85K303j060j555J653K51j680J121P70k072N05Q37P09j784J085
4266A03Q75j493r32R98L16j044J588L8p03K68M08q85m06J250o71p86O58o52N24
4285e46Q11M30j681Q36J756j906p91J574l02j493J603R45j684o18K133j335j061
4302a329J983q46m88J622q5r91j6K081k946r3K338j208K66Q52J22j881M06J639
4320A426j595k55R46J542k499J443N76k199J948l11p9j674J365o1q82J170J152
$$ plain form
4197 261 -633 704 1086 -276 -858 1967 194 -543 499 1163 -318 704 1520 -327 -242 1604 364
4214 364 -750 796 558 72 185 913 -57 -616 1646 331 -1110 499 162 -1219 516 1415 -9
4231 -9 -727 923 -91 -1287 -117 153 -831 837 1995 -1270 -1192 785 94 -355 1258 333 -653 -98
4249 -98 594 -1165 -980 1323 263 -1292 361 612 -1068 53 823 -1249 -744 93 802 -982 103
4266 103 978 -515 -1447 -449 -133 -1177 411 449 -254 14 422 -463 -869 381 -290 -1076 -418 -1070 -546
4285 -546 265 695 -986 -150 1606 -300 -1091 483 181 -1312 291 1236 -448 -1066 1067 -268 -1329
4302 -1329 654 -192 -680 942 857 -134 -150 1931 -1015 -1108 1230 22 288 1140 1262 -619 -213 1426
4320 1426 -169 -424 522 2064 -435 1008 1584 -615 1333 1022 943 -731 634 573 -309 861 2013
4337B013j748j74P20l07q89J128L52j840K97J469j216j26J410p10j093J091K29
4354F06j553J201N56r06n70J476l57j370J404Q24j839K09J596j341p11J752p62
4371B15j394J265K03j112M93J191j664n24K325l87j488M02J105r86L2J523j311
4388a12r33J910q75j444J736L61j790L16J421n05j153K069q42j210K515j309j411
4405a256J143l16m65P4J364o18j308J050J324j592o7Q06q65k09J282nj024Q04
4423A22R68j246n59J167j011L74N30L7j542R39O62j203M85J262m68j474J867r81
4441g1j135J848j1j455o45K489j325r59J936k38n92K16R36j727L94J036j87r76
4459d66J057J09r78j90J834j802R2J803j472j28J797m79j206l87J046J8o50Q96
$$ plain form
4337 2013 265 91 811 504 -385 743 1095 -745 -448 1021 -195 -321 1089 379 -714 377 606
4354 606 -947 254 810 -96 -666 810 453 -917 487 1311 -528 -319 1277 -64 -775 977 215
4371 215 -1179 86 289 -823 -330 861 -803 -1327 998 611 -877 -475 630 -356 -324 1199 -112
4388 -112 -1045 865 -10 -1454 282 643 -1147 -831 590 85 -1068 1001 159 -1051 1464 155 -1256
4405 -1256 -113 -429 -894 -820 544 -74 -1382 -332 992 -600 -667 139 -726 -935 347 342 -682 122
4423 122 1090 -156 -715 452 -559 -185 345 382 -1160 -221 441 -762 -277 985 517 -957 910 -71
4441 -71 -1206 642 631 -824 -1469 1020 -305 -1264 672 434 -158 58 994 -733 -339 697 510 -466
4459 -466 591 700 -278 -468 1366 -436 -344 1459 -13 -141 1656 1177 -29 -416 630 648 -2 894
4477H94j186j07J147K50j292J44J193j188p83J253l68l78N66R47k024O85Q21j215
4495f41l04J143Q39k052R19P34j305Q30Q44j020j153J837m7j677O77J000r81J028
4513F71j95j118Q08j62M01j249k92K151j938M91R03p2j520R82q27J81O0J618j949
$$ plain form
4477 894 -292 -399 748 998 -294 -150 1043 -145 -928 325 -43 -421 145 1092 -932 -247 574 -641
4495 -641 -945 198 1037 -1015 -96 638 -667 163 1007 -13 -1166 671 624 -1053 -376 624 -357 671
4513 671 476 -642 166 4 405 -844 -1136 1015 -923 -432 471 399 -1121 -139 -966 -785 -725 893 -1056
$$ [...]
8191E12
##END NTUPLES=NMR FID
##END=
