##TITLE=1H_T-3946
 acetone-d6, 8 sc, 
 6.3.2020
##JCAMPDX= 6.0         $$ Bruker NMR JCAMP-DX V2.0
##DATA TYPE= NMR FID
##DATA CLASS= NTUPLES
##ORIGIN= UXNMR, Bruker Analytische Messtechnik GmbH
##OWNER= root
$$ XWIN-NMR		Version 3.5
$$ Fri Mar  6 17:40:29 2020 Russian Standard Time (UT+4h)  she@DPX200
##.OBSERVE FREQUENCY= 200.1315
##.OBSERVE NUCLEUS= ^1H
##.DELAY= (6, 6)
##.ACQUISITION MODE= SIMULTANEOUS
##.ACQUISITION SCHEME= undefined
##.AVERAGES= 8
##.DIGITISER RES= 18
##SPECTROMETER/DATA SYSTEM= spect
##.PULSE SEQUENCE= zg30
##.SOLVENT NAME= D2O
##.SHIFT REFERENCE= (INTERNAL, D2O, 0, 15.7039)
##AUDIT TRAIL= $$ (NUMBER, WHEN, WHO, WHERE, WHAT)
$$ ##TITLE= Audit trail, XWIN-NMR		Version 3.5
$$ ##JCAMPDX= 5.01
$$ ##ORIGIN= Bruker BioSpin GmbH
$$ ##OWNER= she
$$ F:/spectra/data/she/nmr/H-F/1/audita.txt
$$ ##AUDIT TRAIL=  $$ (NUMBER, WHEN, WHO, WHERE, WHAT)
(   1,<2020-03-06 17:38:39.57 +0400>,<she>,<DPX200>,
      <created by zg, POWCHK disabled, PULCHK disabled
       configuration hash MD5:
       00 E9 B6 7A A2 85 ED C7 34 08 36 98 17 FE 4E 26
       data hash MD5: 16K
       30 97 43 34 0D 0B 0C 7B D7 07 21 76 9F F7 EC 47>)
$$ ##END=
$$ 
$$ hash MD5
$$ 18 C9 CE A4 DC 7C D7 AD 51 3E FE 9B DA 95 3A F8
##$RELAX= 
##$RELAX= 
##$RELAX= 
##$RELAX= 
##$RELAX= 
##$RELAX= 
$$ Bruker specific parameters
$$ --------------------------
##$DU= <F:/spectra>
##$EXPNO= 1
##$NAME= <H-F>
##$PROCNO= 1
##$TYPE= <nmr>
##$USER= <she>
##$AMP= (0..31)
100 100 100 100 100 100 100 100 100 100 100 100 100 100 100 100 100 100 
100 100 100 100 100 100 100 100 100 100 100 100 100 100 
##$AQSEQ= 0
##$AQ_mod= 1
##$AUNM= <au_zg>
##$AUTOPOS= <>
##$BF1= 200.13
##$BF2= 200.13
##$BF3= 200.13
##$BF4= 200.13
##$BF5= 200.13
##$BF6= 200.13
##$BF7= 200.13
##$BF8= 200.13
##$BYTORDA= 1
##$CFDGTYP= 0
##$CFRGTYP= 5
##$CHEMSTR= <none>
##$CNST= (0..31)
1 1 145 1 1 1 1 1 1 1 1 1 1 1 1 1 1 1 1 1 1 1 1 1 1 1 1 1 1 1 1 1 
##$CPDPRG= <>
##$CPDPRG1= <>
##$CPDPRG2= <>
##$CPDPRG3= <>
##$CPDPRG4= <mlev>
##$CPDPRG5= <mlev>
##$CPDPRG6= <mlev>
##$CPDPRG7= <mlev>
##$CPDPRG8= <mlev>
##$CPDPRGB= <>
##$CPDPRGT= <>
##$D= (0..31)
0 1.2 0 0 0 0 0 0 0 0.06 0 0.03 0 0 0 0 0.0002 0 0 0 0 0 0 0 0 0 0 0 0 
0 0 0 
##$DATE= 1583501918
##$DBL= (0..7)
120 120 120 120 120 120 120 120 
##$DBP= (0..7)
150 150 150 150 150 150 150 150 
##$DBP07= 0
##$DBPNAM0= <>
##$DBPNAM1= <>
##$DBPNAM2= <>
##$DBPNAM3= <>
##$DBPNAM4= <>
##$DBPNAM5= <>
##$DBPNAM6= <>
##$DBPNAM7= <>
##$DBPOAL= (0..7)
0.5 0.5 0.5 0.5 0.5 0.5 0.5 0.5 
##$DBPOFFS= (0..7)
0 0 0 0 0 0 0 0 
##$DE= 6
##$DECBNUC= <off>
##$DECIM= 24
##$DECNUC= <off>
##$DECSTAT= 4
##$DIGMOD= 1
##$DIGTYP= 9
##$DL= (0..7)
0 120 120 120 120 120 120 120 
##$DP= (0..7)
150 150 150 150 150 150 150 150 
##$DP07= 0
##$DPNAME0= <>
##$DPNAME1= <>
##$DPNAME2= <>
##$DPNAME3= <>
##$DPNAME4= <>
##$DPNAME5= <>
##$DPNAME6= <>
##$DPNAME7= <>
##$DPOAL= (0..7)
0.5 0.5 0.5 0.5 0.5 0.5 0.5 0.5 
##$DPOFFS= (0..7)
0 0 0 0 0 0 0 0 
##$DQDMODE= 0
##$DR= 18
##$DS= 0
##$DSLIST= <SSSSSSSSSSSSSSS>
$$ [...]
##$SUBNAM2= <"">
##$SUBNAM3= <"">
##$SUBNAM4= <"">
##$SUBNAM5= <"">
##$SUBNAM6= <"">
##$SUBNAM7= <"">
##$SUBNAM8= <"">
##$SUBNAM9= <"">
##$SW= 24.9337058887773
##$SWIBOX= (0..15)
0 0 2 0 0 0 0 0 0 0 0 0 0 0 0 0 
##$SW_h= 4990.01996007984
##$TD= 16384
##$TD0= 1
##$TE= 0
##$TE2= 300
##$TE3= 300
##$TEG= 300
##$TL= (0..7)
0 120 120 120 120 120 120 120 
##$TP= (0..7)
150 150 150 150 150 150 150 150 
##$TP07= 0
##$TPNAME0= <>
##$TPNAME1= <>
##$TPNAME2= <>
##$TPNAME3= <>
##$TPNAME4= <>
##$TPNAME5= <>
##$TPNAME6= <>
##$TPNAME7= <>
##$TPOAL= (0..7)
0.5 0.5 0.5 0.5 0.5 0.5 0.5 0.5 
##$TPOFFS= (0..7)
0 0 0 0 0 0 0 0 
##$TUNHIN= 0
##$TUNHOUT= 0
##$TUNXOUT= 0
##$USERA1= <user>
##$USERA2= <user>
##$USERA3= <user>
##$USERA4= <user>
##$USERA5= <user>
##$V9= 5
##$VALIST= <valist>
##$VCLIST= <CCCCCCCCCCCCCCC>
##$VD= 0
##$VDLIST= <DDDDDDDDDDDDDDD>
##$VPLIST= <PPPPPPPPPPPPPPP>
##$VTLIST= <TTTTTTTTTTTTTTT>
##$WBST= 1024
##$WBSW= 4
##$XGAIN= (0..3)
0 0 0 0 
##$XL= 0
##$YL= 0
##$YMAX_a= 150502
##$YMIN_a= -107746
##$ZGOPTNS= <>
##$ZL1= 120
##$ZL2= 120
##$ZL3= 120
##$ZL4= 120
##$ABSF1= 10
##$ABSF2= 0
##$ABSG= 5
##$ABSL= 3
##$ALPHA= 0
##$AQORDER= 0
##$ASSFAC= 0
##$ASSFACI= 0
##$ASSFACX= 0
##$ASSWID= 0
##$AUNMP= <proc_1d>
##$AZFE= 0.1
##$AZFW= 0.1
##$BCFW= 1
##$BC_mod= 2
##$BYTORDP= 1
##$COROFFS= 0
##$CY= 11.3945322036743
##$DATMOD= 1
##$DC= 2
##$DFILT= <>
##$DTYPP= 0
##$F1P= 16.9975609425685
##$F2P= -3.02152046262296
##$FCOR= 0.5
##$FTSIZE= 0
##$FT_mod= 4
##$GAMMA= 1
##$GB= 0.15
##$INTBC= 1
##$INTSCL= 1
##$ISEN= 128
##$LB= 0.24
##$LEV0= 0
##$LPBIN= 0
##$MAXI= 10000
##$MC2= 0
##$MEAN= 0
##$ME_mod= 0
##$MI= 1.114404
##$NCOEF= 0
##$NC_proc= 0
##$NLEV= 6
##$NOISF1= 3.799351
##$NOISF2= 2.8
##$NSP= 1
##$NTH_PI= 0
##$NZP= 0
##$OFFSET= 15.70392
##$PC= 1
##$PHC0= -9791.373
##$PHC1= 17.60082
##$PH_mod= 1
##$PKNL= yes
##$PPARMOD= 0
##$PSCAL= 0
##$PSIGN= 0
##$REVERSE= no
##$SF= 200.130013532006
##$SI= 16384
##$SIGF1= 3
##$SIGF2= 2
##$SINO= 400
##$SIOLD= 16384
##$SREGLST= <1H.CDCl3>
##$SSB= 0
##$STSI= 0
##$STSR= 0
##$SW_p= 3612.71676300578
##$SYMM= 0
##$S_DEV= 0
##$TDeff= 0
##$TDoff= 0
##$TI= <>
##$TILT= no
##$TM1= 0
##$TM2= 0
##$TOPLEV= 0
##$USERP1= <user>
##$USERP2= <user>
##$USERP3= <user>
##$USERP4= <user>
##$USERP5= <user>
##$WDW= 1
##$XDIM= 8192
##$YMAX_p= 0
##$YMIN_p= 0
$$ End of Bruker specific parameters
$$ ---------------------------------
##NTUPLES= NMR FID
##VAR_NAME=  TIME,          FID/REAL,        FID/IMAG
##SYMBOL=    X,             R,               I
##VAR_TYPE=  INDEPENDENT,   DEPENDENT,       DEPENDENT
##VAR_FORM=  AFFN,          ASDF,            ASDF
##VAR_DIM=   8192,          8192,            8192
##UNITS=     SECONDS,       ARBITRARY UNITS, ARBITRARY UNITS
##FACTOR=    0.0002004,     1,               1
##FIRST=     0,             0,               0
##LAST=      1.6414764,     0,               0
##MIN=       0,             -107746,         0
##MAX=       1.6414764,     150502,          0
$$ Real data points
##PAGE= N=1
##DATA TABLE= (X++(R..R)), XYDATA
0@%%%%%%%%%%qJ6j6J6j6K4l2L3m1M9n7O9q0R2j04J19j39J60j79K02k29K57k89
33a53L25l63M05m52N02n57O17o84P59q41R30j028J140j266J407j568J753j970
51a044K228k536K917l406M052m950O301q584J3459m4637O4399M9292j13881p1356
65a07746N302P2088N3035k1121p8606p573M7094J4118q551K4714r11m1301j3137
78f2595L5570L9266K4933k9361p4501n697R8715N4100o1291o9979J431M5934N0630
91D7155m96o4206l5485M1846L1719j6960n347N116k4100j4050K0392J5939O798
104H321J49l6735l1742M1615N7338j5859m7090j4258J1527L2547L6460j6722n1662
117b6111k397L5976J5875P245J493l3030k5518L1751L7712l850j7580k1929k1522
$$ plain form
0 0 0 0 0 0 0 0 0 0 0 0 -8 8 -8 8 -8 16 -16 17 -24 25 -32 37 -43 49 -55 64 -75 85 -94 108 -121 136 -153
33 -153 172 -191 214 -238 264 -293 324 -360 399 -442 488 -540 600 -666 741 -827 926 -1044
51 -1044 1184 -1352 1565 -1841 2211 -2739 3562 -5022 8437 -36200 28199 77491 -36390 -107746
65 -107746 -102444 -30356 22679 1558 -77048 -84621 -37527 -23409 -31960 -7246 -8157 -49458 -62595
78 -62595 -27025 12241 37174 7813 -66688 -72385 26330 80430 19139 -50840 -49409 -3475 47155
91 47155 46659 -17547 -53032 -11186 20533 3573 -1774 3342 -20758 -34808 -14416 1523 8321
104 8321 8470 -28265 -60007 -18392 38946 23087 -24003 -38261 -26734 5813 42273 25551 -26111
117 -26111 -28508 7468 23343 30588 32081 -949 -26467 5284 42996 39146 21566 -363 -21885
130b1885K3939M9473n292m5905j6611P692J4483L2308Q424m7525l5033K3248L5644
143B2960J6128m961m2607l8226L5637O1840m837m8747k3398N500K9738L3979j4690
156B8316m7694n530K8365O201j057Q971j7342k9305Q052K6073R782j072k2986
169i226l7139J3009N7915R005m8698k7121J5360K7911K2348q989l9611n376L8386
182G774J0693k0107K606J0939j1431n812J1329P676Q328K50k8791j6268L8111
195A5297L0534k7964l3870K436J6391J6444M820k7484k2781J9797J9096j6184
207c468o276J2184r041j5601P420J2383M588J934j8307k3677K1768M2162r032
220A7037l7490n867J7792J7837J2842j2929k8233N517K8469Q94j1351N197m220
$$ plain form
130 -21885 2054 51527 46235 330 -16281 -8589 5894 38202 46626 -899 -35932 -12684 22960
143 22960 39088 34127 -8480 -46706 -11069 50771 45934 -2813 -26211 -20711 9027 43006 28316
156 28316 -19378 -24908 3457 9658 8601 17572 230 -29075 -21023 5050 14832 13760 -9226
169 -9226 -46365 -33356 24559 33564 -15134 -42255 -26895 1016 23364 14375 -25236 -30612 7774
182 7774 18467 -1640 966 11905 474 -5338 5991 13667 21995 22245 -6546 -22814 15297
195 15297 45831 17867 -16003 -13567 2824 19268 24088 -3396 -26177 -6380 12716 -3468
207 -3468 -9744 2440 -6601 -22202 -14782 -2399 2189 4123 -14184 -37861 -16093 26069 17037
220 17037 -20453 -26320 -8528 9309 22151 9222 -19011 -13494 14975 15869 4518 9715 5495
233E495j5660R273J9701l624j0946p527j1741R255K9131n131l6774o768K2392
246b924R419j733p198j8707j646K3794N329j7808K57O812j0063Q44J7685K46j3081
261h774n91Q28K198J6539K924k4353n358K3669P102j2347j989l3k153R963L787
276A1412j4082m04J4984o446j3770J0216J0320r078m846J399l573P438J0626j3585
290F11j4274J5288J0504j2728l243Q255l219k737N826m680k519J2737k483j8805
304a1467N235J9242m270j3109K45R11L619J0849o366j8787P168J7581p348j0768
318g265O815J366n432M932K245p097M439N266j2269j623J8123r14j6754M39R969
333B240J006J620j249j2559K197J8583l293j6775L677J0505l984j637K758o034
$$ plain form
233 5495 -10165 -892 18809 15185 4239 -3288 -15029 -5774 23357 18226 -18548 -25316 -2924
246 -2924 6495 4762 -2436 -21143 -22789 1005 6334 -11474 -11217 -4405 -14468 -13624 4061 4307 -8774
261 -8774 -9365 -8537 -6339 10200 13124 -11229 -16587 7082 14184 1837 -152 -185 -2338 7625 11412
276 11412 -2670 -3074 11910 5464 -8306 1910 12230 3152 -1694 -295 -3868 3570 14196 611
290 611 -13663 1625 12129 -599 -3842 4413 1194 -1543 4283 -397 -2916 9821 7338 -11467
304 -11467 -6232 13010 8740 -4369 -4124 -3213 406 11255 4889 -13898 -6730 10851 3503 -7265
318 -7265 -450 916 -4516 416 2661 -4436 3 5269 -7000 -8623 9500 8586 -8168 -7729 2240
333 2240 3246 4866 3617 -8942 -6745 11838 8545 -8230 -4553 5952 1968 331 3089 -2945
347b945j98R901m727r986J0037O321j3099k234J1271q01o373J928k161j443J0932
362F423N73j6859Q13J6732k008j0837K391J360j270P445n32j2691L100J3731o179
377B192r351Q140L718p567K196M147n174K685N676r751l400J4529J748j4581O98
392d095R414j576o53J324p906p97J3337j365j4438K815J0144n079l760M263l202
407a574k830P180k200r226O826O888j0780l800J1079m27p026K677L00l159P433
422A361K689j2067q98J4354j311r973L707L954l361L969K906r110R30J0722m516
437C356q089P158M106p661M2N318m260K04N326o984n353J0612L511j1835o62Q382
453C171l019k501M071l780k905Q486O84j0941L725R700n642n730N831L71k525
$$ plain form
347 -2945 -3143 6758 2031 -7955 2082 8403 -4696 -6930 4341 3540 -2833 -905 -3066 -4509 6423
362 6423 6996 -9863 -9050 7682 5674 -5163 -2772 -1412 -2682 4763 4231 -8460 -5360 8371 2192
377 2192 -7159 981 4699 -2868 -672 3475 -1699 986 6662 -3089 -6489 8040 9788 -4793 -4095
392 -4095 5319 3743 3090 4414 -3492 -4289 9048 7683 -6755 -3940 6204 1125 -2635 1628 -1574
407 -1574 -4404 2776 576 -8650 -1824 5064 -5716 -9516 1563 1136 -5890 -3213 -2913 -6072 1361
422 1361 4050 -8017 -8915 5439 4128 -5845 -2138 1816 -1545 2424 5330 -3780 -2850 7872 3356
437 3356 -4733 2425 6531 -1130 -1088 4230 -30 174 5500 -1484 -6837 3775 7286 -4549 -5211 3171
453 3171 152 -2349 1722 -2058 -4963 3523 4207 -6734 -3009 6691 1049 -4681 1150 1521 -1004
468a004M960r57q784N105Q764p167n009P372j27o157M235L367o048J333L784o825
484c158J84J1392l201j2164L898P673j456N86J80q599N60J3215m97j0550J681
499b56L976m114L169O450o809o000N288K97k221O689j317j3466n75J2716M73o003
515a703j815n316k085J1677M846j2864n645O155J658P90N848m908r297N328Q120
530G89k185P61K912q334k815J2822N198p300j965l35k642P444R026p687j0728
545e039M706M357j218M506j185j1927j513J0332R11m479M07n372o363Q732P852
560D707p601n641K359k558J164J0713Oj1405j272N904J846N832M983j1126r232
575a1321J1378J1340j683l732n382o148Q707J4559m885j2933O9L281M80O312K717
$$ plain form
468 -1004 3956 2999 -5785 -680 8084 917 -4092 3280 3153 -3004 1231 4598 -1450 -117 3667 -3158
484 -3158 -2974 8418 5217 -6947 -3049 4624 3168 3754 3934 -4665 -4105 9110 8613 -1937 -256
499 -256 3720 -394 2775 9225 2416 -3584 1704 2001 -220 6469 5152 -8314 -8889 3827 4300 -1703
515 -1703 -3518 -8834 -10919 758 5604 -7260 -12905 -6750 -5092 -4302 1546 -3362 -12659 -7331 789
530 789 -1396 -635 2277 -6057 -8872 3950 9148 1848 -117 -452 -3094 4350 13376 5689 -5039
545 -5039 -333 4024 2806 7312 6127 -5800 -7313 3019 3930 -549 -142 -5514 -11877 -3145 4707
560 4707 -2894 -8535 -6176 -8734 -7570 3143 3149 -8256 -9528 -3624 -1778 4054 9037 -2089 -11321
575 -11321 57 11397 9714 5982 600 -5548 3159 17718 12833 -100 -31 3250 3730 10042 12759
590A2759j1835o818N130L634K535M588r143j5537N038J7504K133r043q949o659
604a4663P221J8471M53j9222o948R363P403L841K28j0382o591Q928P199j709J239
619D831r74j1637j201J5179O848p708q826n850K180J6756Q209j7046j5816Q006
633g049J2678L864j247r929j0168Q273J3320k609o427R17l596m041R410Q006n165
648F237o046l949l123R569J5075o893k0280k990J3055R103K170r582j6027J066
662a2615J8600N473j1105o593j263o05P366P904n617q232l2j090K801J3115K515
677A0622j6511r614R080J2668O847l911j8375q449J8595J7863p627j5519n430
690i761K355J1200R850q323j5075P03O756J106L039K081j0422j0059N995Q786
$$ plain form
590 12759 924 -5894 -764 2870 5405 9993 850 -14687 -9649 7855 9988 945 -8004 -14663
604 -14663 -7442 11029 11482 -7740 -14688 -5325 2078 5919 6147 -4235 -10826 -1898 5301 3592 4831
619 4831 3857 -7780 -8981 6198 13046 5338 -3488 -9338 -7158 9598 17807 761 -15055 -7049
633 -7049 5629 9493 8246 -1683 -11851 -3578 9742 7133 706 1623 -1973 -6014 3396 11402 6237
648 6237 191 -3758 -6881 2688 17763 10870 -9410 -12400 655 9758 11928 2346 -13681 -12615
662 -12615 5985 11458 353 -6240 -7503 -8108 -742 7162 1545 -6687 -6719 -7809 -5008 8107 10622
677 10622 -5889 -15503 -6423 6245 13092 9181 -9194 -17643 952 18815 11188 -4331 -9761
690 -9761 -7406 3794 13644 5321 -9754 -9051 -2295 -1189 1850 3931 -6491 -16550 -10555 -1769
704a769L783q12j0926j3988Q779K1441J793j6957j0450K381J2527J4546l827j9291
718a2770l913J5006Q440j699j554n110m962O641Q217n64q07q04r793j971J5132
733I489Q923j0071j1831l377N666J4054N546j7272j5449R184J4474J139n797p009
747b331o675N902J1386j610o524M67k412m540Q254R986l879r680k993P79R803
762E933J1809o753j9467j064J5653R133k919r274j1335K695J6063M732j1585p339
776c718J415N83M542O662m476r399n63K217K409P926N76j5346p453J1613J1208
791H196r94p219j0380l513J4376J2445r590j3443K71N633N727M817n330j0791
805i795J284P787P05K06K147o468p596N951Q657M4l496n353n746O019J3768j439
$$ plain form
704 -1769 2014 1202 -9724 -23712 -14933 6508 8301 -8656 -19106 -16725 -4198 10348 6521 -12770
718 -12770 -16683 -1677 6763 5064 3510 -1600 -6562 79 8296 7732 6925 6121 -3672 -5643 9489
733 9489 18412 8341 -3490 -6867 -1201 12853 18399 1127 -14322 -5138 9336 10475 4678 -2331
747 -2331 -9006 -3104 8282 6672 148 615 -1797 -6337 1917 11903 8024 -1656 -4649 -3870 5933
762 5933 17742 10989 -8478 -9542 6111 15244 12325 3051 -8284 -5589 10474 15206 3621 -3718
776 -3718 -2303 -1720 2822 9484 5008 -4391 -4954 -2737 -328 7598 8174 -7172 -14625 -3012 8196
791 8196 7202 -17 -10397 -13910 466 12911 3321 -10122 -9851 -4218 1509 6326 996 -9795
805 -9795 -8511 -724 -19 187 2334 -4134 -11730 -5779 2878 2922 -574 -5927 -11673 -5654 8114 6675
821F675j3224l001N580M795N474j124j0633l005R970L805k958P2j455n755K791
836a993P502j07l571j179m569j133R966M752r185p394K338L273N104K803p957
851a350r030N592Q700j146l363j091m600R33Q878J252n949j389L98j612N308O571
867H102n472p811K208M201K314L910l668r779J443J0256J741n255k415k612o83
882c520P607L420p715m174L067L55J254M049k975p093K122M921j059N22J053n880
898d046k458P585L689n207j475M31j777L505N532m220n905L566K769j765K246
913B470J216n465p61N212k01k001K049j121m870L344M951l193k660K120k257j045
929b212N861l03n982L28L686j856M57L195l342m069L989K654l007Q89J153m478
$$ plain form
821 6675 -6549 -9550 -3970 825 6299 5175 -5458 -8463 1507 5312 2354 2426 971 -4784 -1993
836 -1993 5509 5402 1831 652 -3917 -5050 4916 9668 483 -6911 -4573 -1300 3804 6607 -1350
851 -1350 -10380 -4788 3912 2766 -597 -1688 -6288 -5355 3523 4775 -1174 -2563 -2165 -3777 1531 8102
867 8102 2630 -5181 -2973 1228 3542 7452 3784 -5995 -4552 5704 7445 2190 -225 -2837 -3520
882 -3520 4087 7507 -208 -4382 -1315 -960 294 4343 1368 -5725 -3603 1318 259 781 1834 -4046
898 -4046 -6504 1081 4770 -437 -1912 -1481 -3258 247 5779 1559 -4346 -780 1989 224 2470
913 2470 3686 -1779 -2540 2672 2471 470 2519 1398 -3472 -128 4823 1630 -1030 1090 -1167 -2212
929 -2212 3649 3346 -2636 -2308 1378 -478 -21 3174 -168 -4237 -248 2406 -601 288 1441 -3037
945c037L90N657r20m181J552N88k388L052L204n241k381M279L52k112K672n48
961I38m946K089M976k666k126K292j814j804N036J072n243J35L624j623o09L131
977B462k072l823L998K297l897L85K664k969o62M198p07l783K429J298k886J206
993A38L167l860j576M589m74l350K209J272l427J119L292l414j712L476N3l773
1009b271K509J444l308N75K986k758k125M158q67k916K454J613l784R20L154k375
1025e91j665L120n42k610K687J830m179K05M041k035j729K843o16k925K859K154
1041B847m143j00L458k171k010L273l16l499J975K233l655J2L180k458k126M122
1057F22j14l994J984K214l029N70K823k510j709M150K00l872J986K663k842l96
$$ plain form
945 -3037 -2647 3010 2090 -2091 -539 49 -2339 713 3917 -1324 -3705 574 926 -1186 1486 938
961 938 -4008 -1919 3057 391 -1735 557 -1257 -3061 1975 3047 -2196 -2061 1563 -60 -669 2462
977 2462 390 -3433 565 2862 -1035 -650 2014 -955 -1617 2581 1874 -1909 520 1818 -1068 138
993 138 3305 -555 -2131 2458 1984 -1366 843 2115 -1312 -193 3099 -315 -2027 1449 1502 -2271
1009 -2271 238 1682 -1626 -1051 1935 -823 -2948 1210 343 -2573 -119 1494 -2290 -1370 1784 -591
1025 -591 -2256 864 322 -2288 399 2229 -1950 -1745 2296 261 -1468 1375 759 -2166 693 2847
1041 2847 -1296 -1396 2062 -109 -2119 1154 838 -2661 -686 1547 -2108 -2096 1084 -1374 -3500 622
1057 622 508 -3486 -1502 712 -2317 -1747 1076 -1434 -3143 1007 1207 -2665 -679 1984 -858 -1254
1073a254L624j852k013L260J81k925J878K266l202m43L508j138k964K935Q9l141
1089a191K388J615l306o71L483j524k633K522O73l033J707J842l361qL632j440
1105F95l039K664M35k296J455K346l431o78L678j262k074K995N9l939J581L338
1121B527k204j361K301j798j366L526J018m726J39L558j485p44K813k315k874
1136b991L777J856l273K23J899l258K58M754j074m143J121J436j584K022J921
1151B944m804j658M366L24k143J066p42k718J716M087k713k736K259r21j688M167
1167H06J355m626o35K912m70P48K602l038l766M243L345k629k69N03k282L44M602
1184C745m54l772J137L99k148K417L551l733l820K395P31J6K119j534n737J213
$$ plain form
1073 -1254 2370 518 -1495 1765 1946 -979 899 3165 -37 -480 3028 1890 -1074 1861 1950 -1191
1089 -1191 1197 2812 -494 -1165 2318 794 -1839 683 1356 -1677 30 1872 -1489 -1497 2135 695
1105 695 -2344 320 755 -1541 -86 2260 -1171 -1849 1829 567 -1507 1488 1547 -2392 -811 2527
1121 2527 323 -1038 1263 -535 -1901 1625 2643 -2083 -1944 1614 129 -615 2198 -117 -2991
1136 -2991 786 2642 -631 -408 1491 -1767 -1509 3245 2171 -1972 -851 585 -999 1023 2944
1151 2944 -1860 -3518 848 1172 -971 95 -647 -3365 -1649 2438 -275 -3011 -752 -1673 -3361 806
1167 806 2161 -2465 -3100 -188 -658 90 2692 -346 -4112 131 3476 847 578 1081 -1201 -857 3745
1184 3745 3291 -481 656 1055 -1093 1324 4875 1142 -2678 -283 448 464 2583 1049 -4688 -3475
1200c475N674l87l075L81j415j425M376K161m254j790K349o09J96M433j208n127
1216c195O55L697M10J241L55n464j209O169L299m026j894n32j584M062M560m405
1232B139n252J974K220j17K423j027n671o01M891J091j707Q81l089l329M029N319
1248D174k824l547n17j018K573N774j662p393n61M761J735J033l57n480j426N836
1264A101L142l453r36n50k188J715M810l71m278o18m41K71N406J825o904m522
1280e991M047M584M54k31n126m028N234O469k867m361o7n73R97M309L70m488r88
1297b256J129q33K479M435l643p094J421N250K258L96m171o540K465R470R20o898
1313a212l083J010K030M421R89n642k684L376J390L3K832j164n607m97M940K246
$$ plain form
1200 -3475 2199 1812 -1263 -882 -2297 -3722 654 2815 -1439 -3229 -880 -1489 -1293 3140 1932 -3195
1216 -3195 -2540 1157 1567 2808 3163 -2301 -3510 2659 5958 1932 38 -494 -2078 1984 6544 2139
1232 2139 -3113 -1139 1081 964 3387 2360 -3311 -3912 979 2070 363 1244 -1845 -5174 -1145 4174
1248 4174 1350 -2197 -2714 -3732 -1159 4615 2953 -4440 -5001 -240 1495 2528 2171 -3309 -4735 1101
1264 1101 4243 790 -146 -696 -2884 -1169 3641 3270 -1008 -1626 -2067 -1796 3610 5435 -1469 -5991
1280 -5991 -1944 2640 3094 2863 -2263 -6291 -1057 5412 2545 -1816 -1883 -2456 -1459 2850 3220 -1268 -2256
1297 -2256 -1127 -1960 519 4954 1311 -5783 -4362 888 3146 3542 -629 -7169 -4704 4766 5686 -1212
1313 -1212 -4295 -3285 -1255 3166 4155 -1487 -4171 -795 595 628 3460 2296 -3311 -3808 1132 3378
1329C378L27j701o120j912Q657N859o523o013m48L044M963K543o214o269L536
1344b893N120m58q17o23l757m73M500K120j772k61k544l635M443O922j819o656
1360b603j891K053M223N109l094q796n3P637K812k805j636k839r34N219K641l598
1376A445j174K76k223q1O001N82n303k575N20K105M925J036p604n517N931O069
1392D413q34k687m043k345N395N545l257n100O93J108J45L362J025m312k300J999
1408a193O81J779L333l932o914K742P042J253k959l589l469K555P721L76p627
1423b201k725L277J754J988J147m368l164L528J562p32J371M7n511k17N499J967
1439C222k163k038l091l20O511L476o030m667K527K884J875J088l416m549K733
$$ plain form
1329 3378 3705 2004 -4116 -6028 2629 8488 1965 -4048 -4496 -1452 3511 6054 -160 -6429 -2893
1344 -2893 2227 1769 952 329 -3428 -3901 599 2719 947 686 -1858 -5493 -1050 5872 4053 -2603
1360 -2603 -4494 -2441 1782 6891 3797 -4999 -5052 2585 5397 2592 956 -1883 -2817 2402 5043 1445
1376 1445 271 547 -1676 -1757 4244 4826 -477 -3052 -2532 -427 4498 5534 -2070 -7587 -1656 4413
1392 4413 3579 892 -3151 -5496 -101 5444 2187 -2913 -2220 -1112 -967 2395 3420 -892 -3192 -1193
1408 -1193 -512 1267 4600 668 -6246 -3504 3538 4791 1832 -1757 -5226 -2671 5050 5426 -2201
1423 -2201 -4926 -1649 105 2093 3240 -1128 -4292 -764 798 66 1437 1484 -4027 -4244 1255 3222
1439 3222 1059 -979 -4070 -4390 2121 5597 -433 -5100 -2573 311 2186 3274 -142 -4691 -1958
1454a958M433o19k158J088k334j461L729J988j598j334n31k116K269N818k334
1469B882o039K00L155J242J960j410n335L8N295J323k639m78j097j440K863K909
1485C429k340k124N74j152M48M036M48n127j408K872J391Q05L30l877k742M217
1501b20L881k491j731j97j598J717M116j878l954R43J629q97J973J391l491k342
1517c149K995J231m03J304j630l789J954M856j656k346l97k39k20L823M62m059
1533a263q44K444Q2m60K071k190k601J968K565j419k78O42k182p15M159K5k588
1550e84LM49r01J355K462l125k184K066J732j358J056K12k946K70L129n46k121
1567a031J522p78j892K454K140k792q07J498j136J00K478m08l341Q82K473j381
$$ plain form
1454 -1958 2475 1856 -302 786 -1548 -3009 720 2708 1110 -224 -755 -2871 -602 5216 2882
1469 2882 -3157 -2957 198 1440 3400 1990 -3345 -3307 1988 3311 672 194 -903 -2343 520 3429
1485 3429 1089 -1035 -461 -1613 -1165 2871 3319 -1808 -3216 -344 1047 1852 2182 -1695 -4437 -220
1501 -220 3661 1170 -561 -758 -2356 -639 3477 1599 -2355 -1412 217 -680 1293 2684 -807 -3149
1517 -3149 -154 1077 674 1978 348 -3441 -1487 3369 1713 -633 -1030 -1269 -1489 2334 2796 -1263
1533 -1263 -2107 337 419 -41 2030 -160 -2761 -793 1772 353 75 717 -1465 -2180 1979 2004 -584
1550 -584 -581 -132 -1033 322 2784 -341 -2525 -459 1273 -85 971 1183 -1763 -1493 1636 1090 -1031
1567 -1031 491 -287 -2179 275 2415 -377 -1184 314 -822 -722 1756 1348 -1993 -1111 1362 -19
1583a9r4J494k197j420L047O61j975N21O96k311J314K369j570k280J583L72r83
1600g92J224J274k993n00K806l18j467J241j11k017J524J934k215n37J839r07
1616a5j303K270J25k522Q64J705j614k22J965j325j625J950Q30k259R03J442j559
1633c90l66J965j225j365J739P23k293Q54J689k042L6J737q33j408J910K46k306
1650a329M94K064j602q59K250n80j916K008M65k347Q65J996k053n93K392q16j808
1667a369J818Q21k657J199J717j459j187K204p20j451J448O79k051P51J694j762
1683c25p49J997n03j602J896K85j829L16J702j336o51J687k8k209J765P16j785
1700f53M63J438j198j226K001l44j431J462N63k009J12K121j549n17J436n98j737
$$ plain form
1583 -19 -113 1381 -816 -2236 811 1472 -503 18 714 -1597 -283 2086 516 -1764 -181 191 -792
1600 -792 432 1706 -1287 -1787 1019 701 -766 475 364 -1653 -129 1805 -410 -947 892 -15
1616 -15 -1318 952 1077 -1445 -581 1124 -490 -712 1253 -72 -1697 253 1083 -1176 -273 1169 -390
1633 -390 -756 1209 -16 -1381 358 1081 -1212 -358 1331 -711 -675 1062 229 -1179 731 977 -1329
1650 -1329 -835 1229 -373 -1232 1018 438 -1478 530 995 -1352 -487 1509 -544 -1137 1255 439 -1369
1667 -1369 449 1270 -1387 -188 1529 70 -1117 1087 367 -1084 364 1043 -1008 -257 1437 -325
1683 -325 -1074 923 420 -1182 714 999 -830 -514 1188 -148 -799 888 860 -1349 416 1132 -653
1700 -653 -190 1248 50 -1176 825 481 -950 512 1075 -934 -822 1299 -250 -767 669 71 -1666
1717a666K029P74j867O6J753j378r32K095k16j690N30J366j605L87J581j555j040
1734a368K325R3j902Q46J195j886L93J901j625j139K059j95j905J396R55j923
1750g80j85K136j329q30J479j38j707J467J150k304j68K043k88j225J313r8j767
1767a231J177J382j782l08J914j151r23J678J04j631L16J314j087L46R40q97j602
1784a441K462O57k190J87Q96j124L43J470j444j381J855L44j645R28J375k069
1800g77n58J801p3p48R05k18j852J564J651j588j235J459p0n52J117K52k190N05
1818f07J641j158j79J403j052j602J399J220j369L41N28k216M47K593k32k509
1834a352N66R44q18J056R31k163n51J967k38p92J148j74k246P87K431r04q30M88
$$ plain form
1717 -1666 363 1137 -730 -664 1089 -289 -1221 874 658 -1032 -502 864 -741 -354 1227 -328 -1368
1734 -1368 957 1050 -852 -6 1189 -697 -304 1597 -28 -1167 892 697 -1208 188 1143 -780
1750 -780 -965 1171 -158 -988 491 353 -1354 113 1263 -1041 -1209 834 546 -679 634 536 -1231
1767 -1231 -54 1328 -454 -762 1152 1 -922 756 860 -771 -455 859 -228 118 1058 161 -1441
1784 -1441 1021 1678 -512 -325 571 -553 -210 1260 -184 -1565 290 634 -1011 -83 1292 -777
1800 -777 -1335 466 393 -355 550 332 -1520 44 1695 107 -1128 331 261 -291 826 1078 -1112 -607
1818 -607 1034 -124 -303 1100 48 -1554 -155 1065 -304 37 565 -1651 -1204 1389 1157 -1352
1834 -1352 -786 158 -660 396 1327 -836 -1387 580 342 -450 698 524 -1722 -935 1496 592 -238 250
1852B50q71l85K486O49l051q19K176k80j17R89j284j830J560J455j100J07R86
1869I21k033j049L134Q11k017m25j04o18K455J568k630j999K109J313q05R2j23
1886F00j691P16J794m52q40Q56q59j759K229J635j827j413L23pR45K379k110l350
1904b831J512K419l70m84k07j307l36K664K89j705L01K2j628J078K210m64k022
1921h59j33M27N93J814j2l423o64K965Q26j096K5j408j579K864J600j335j660
1938a055N89o45Q9K757k90l001n49J926K85L77R72k623j326K431J410q76q8p42
1956c59j731R17L327J37k851o48Q6N92K639L36l765j524K597J889n99l47j224
1973e28j419J663J932j085j172J170j392j529L197J900k262k018L2O82K774J205
$$ plain form
1852 250 -621 -1006 1480 2129 -922 -1741 435 155 38 1027 -257 -2087 -527 928 -172 -65 921
1869 921 -1112 -2161 973 1784 -233 -658 -762 -1380 1075 2643 13 -1986 123 1436 631 723 600
1886 600 -1091 -375 1419 967 127 983 124 -1635 594 2229 402 -1011 -688 -695 250 2629 519 -2831
1904 -2831 -1319 1100 730 246 39 -1268 -1604 1060 1349 -356 -55 -33 -1661 -583 1627 1163 -859
1921 -859 -992 -565 28 1842 1830 -1593 -2257 708 1534 438 463 -945 -2524 340 1940 605 -1055
1938 -1055 -466 -1111 -1022 1735 1445 -1556 -2105 -179 106 483 1455 -1168 -2494 -63 1347 471 383 -359
1956 -359 -2090 -1173 2154 2291 -560 -1208 -1122 -530 2109 2445 -1320 -2844 -247 1642 1043 696 -528
1973 -528 -1947 -284 1648 563 -609 561 -831 -2360 837 2737 475 -1543 -1511 -829 1945 3150
1989C150l192l596K830L406q40j422o79j105J704K006j496j808J366J55j930Q19
2005f32K563o98k228p41K65J812K657j630n015Q78M480P11k000j781j050J352
2021a057K882k0l139J67J562q20o89K519L31k666m11L51J152K425l60m050j702
2038c525M310K405j832k172j175L30K572J993k745j846J055Q11q08J260P08j996
2054f55j220J236Q42P47P97k508k448K825L296j573j690p59k54J385K482r21k720
2071a138J01J320J8R68Q13k405j750J749J608k81k62j175j740J639K673n37k574
2088i73M35k0l87J825P19k376r19J094p6R94J233j776k871J521L195m0j611p68
2106h01o39O07K753p84k076P7J374q02k9J586o94j723K72L93P11J310r3l757n95
$$ plain form
1989 3150 -42 -3638 -808 2598 1758 336 -343 -1448 256 2262 766 -1042 324 479 -1451 -632
2005 -632 1931 1233 -995 -1736 -1471 341 2998 1368 -3647 -2769 1711 2422 422 -1359 -2409 -1057
2021 -1057 1825 1805 -1334 -1167 395 -425 -1114 1405 1736 -930 -1341 -990 162 2587 2227 -1823 -3525
2038 -3525 785 3190 1358 -814 -1989 -1659 913 2906 161 -1685 -630 181 -627 633 1341 -655
2054 -655 -1875 -639 203 950 1747 -761 -3209 -384 2912 1339 -351 -1110 -1364 21 2503 1582 -1138
2071 -1138 -1037 283 301 1269 2082 -323 -2073 -324 1284 1003 741 -434 -2174 -535 2138 1601 -973
2088 -973 -538 -558 -945 880 1599 -777 -1696 -602 -678 316 1549 -227 -3098 -1577 1618 1578 -33 -801
2106 -801 -1440 -833 1920 1136 -940 -863 511 -291 -320 1266 572 -1151 -879 -486 225 1535 1442 -2315 -2910
2125b910M302J148k250j665K0O03K420k02k582o96K484J91j279N25J177j503m08
2142f25K83J09J323O59k509j953L087K652j802k479l6N79J615J387k662j764K148
2159A2J327j501K38Q24p59p94M11M7N99J108j735k018J401L511j362k263k80O61
2177e73J269Q34j154k026R55K212j352j178J523J93j575R0J006r5J032l92k449
2194a680N88K781n4k787J6J352J50N31m06j362k00J960n46j352J161P91j639k05
2212i01J168L16p4m78j215l01K689R23k904q17J751O29r11J70k33l16J165J70
2230H31j693N03K030j529j512J388J259p42n25l17r90J619J201j499j561J546
2246IJ252j491l8K89m89L54J036j352l37J703l70k074O02K276j124q50K6kP00
$$ plain form
2125 -2910 1392 2540 290 -1375 -1355 -752 1668 1466 -1116 -1812 672 863 -416 109 1286 -217 -625
2142 -625 -342 -233 1090 1749 -760 -2713 374 3026 1224 -1255 -1291 -712 903 2290 -372 -2136 12
2159 12 1339 -162 76 900 141 -653 -242 -195 404 1512 -223 -2241 -840 2671 1309 -954 -1234 -573
2177 -573 696 1530 376 -1650 -695 1517 165 -1013 510 703 -872 -782 224 129 1161 769 -1680
2194 -1680 -1092 1689 1635 -1152 -1136 216 366 897 491 -871 -1071 889 343 -1009 152 943 -696 -901
2212 -901 267 583 509 31 -1184 -1485 1204 2127 -777 -1594 157 786 -125 45 -188 -504 661 831
2230 831 -862 -359 1671 142 -1370 18 1277 535 10 -307 -1297 322 1523 24 -1537 9
2246 9 1261 -230 -268 21 -468 -114 922 -430 -767 936 566 -1508 -906 1370 246 -604 -578 -580 120
2265A20J277j210k005J346J834j442p33O10N87j66j96m54l05J464L97k021k59
2282a156K094j47j138n4lN21P39n25j743O93K148n60j913Q31J134n05k85K20p50
2301c99P96P55j481r55J971J268j952o96J121J37r4k3j364J07J955K17k548kK214
2320A027o46j111L6L38L54N04o64j552J301J890j845j172J188Q28m39N9k59q95
2338a058J664M97j750p73K312K63j606n42Q75o1O45j67j629L44K130o97k218N08
2356a263K031o91p62M60p01M76J269j561j231K105Q84j814o08J201N72k06L6p54
2374e57k58J728K94j996j98K372m1j400M4O20k01Q16r08j093J287J569j508j529
2392i59J320J108p45n87k24l44J186Q20j748r87K002N43j848J05Q66m10K89Nr33
$$ plain form
2265 120 1397 187 -1818 -472 1362 -80 -813 -203 384 218 22 -432 -737 727 1124 -897 -1156
2282 -1156 938 791 -347 -401 -404 117 856 331 -1412 -719 1429 869 -1044 -213 921 416 131 351 -399
2301 -399 397 1152 -329 -1284 687 1955 3 -693 428 565 471 448 -916 -809 1146 1363 -1185 -1187 1027
2320 1027 381 -730 -694 -356 -2 502 -162 -1714 -413 1477 -368 -1540 -352 476 37 96 -163 -1058
2338 -1058 606 1103 -647 -1420 892 1155 -451 -993 -118 -179 466 299 -1330 -986 1144 447 -1771 -1263
2356 -1263 768 77 -685 -225 -926 -450 819 -742 -1973 132 1016 -798 -1406 -205 367 161 197 -557
2374 -557 -815 913 1207 -789 -987 1385 1344 -56 -12 608 407 1223 315 -778 509 2078 570 -959
2392 -959 361 1469 724 137 -87 -431 755 1575 -173 -1160 842 1385 -463 -358 508 98 387 392 -541
2411e41O7J953o87j707Q14J820j173p78J83J88J58P24m97j827J072J554j507o08
2429g92J080J00l66k7j93n46R97L77j946K41J880l54j618L69N64N8K68k5j083
2448a016J83J847j141j194J274M44r82j14P05m51L82M78j194o01K054N16k276
2465a086l31J433M52p51L45j162J89J779k30j754P75J222j042n99Q41L41j31K31
2483E22p85m19J324J201j947j166J632R46p94k15l42k97J262L10j500k11J148
2500F69J00j396P33M94l85n11J68o57P49J094j075k194J654J784j087o07J95j64
2518d36N63J203j133p67J074O75j485L83J188o15p83M73j54L10J106p29k029O20
2536e36K084o89j073j8L39p39J093k9j363L28J030p32o89J690k29j382m44R89
$$ plain form
2411 -541 -474 1479 792 -915 -101 1719 546 -232 -49 139 297 1021 524 -1303 -231 1323 -184 -792
2429 -792 288 388 22 -5 -198 -744 253 630 -1316 -1075 805 451 -1167 -798 -234 -176 92 67 -1016
2448 -1016 -833 1014 -127 -1321 -47 397 -585 -699 6 -445 -63 415 -779 -1380 674 1190 -1086
2465 -1086 -1417 16 468 -283 62 -1100 -911 868 638 -1116 -341 881 -161 -760 81 422 291 522
2483 522 -263 -682 642 1843 -104 -1270 362 1308 514 299 -43 -340 922 1232 -268 -479 669
2500 669 769 -627 106 600 215 -296 -128 -785 -36 1058 -17 -2211 -557 1227 140 -467 -272 -436
2518 -436 127 1330 197 -570 504 1179 -306 77 1265 650 -133 340 186 496 1602 873 -1156 -536
2536 -536 1548 859 -214 -232 107 -632 461 432 -931 -603 427 -305 -994 696 467 -915 -1359 -370
2554c70L04O45m02j702n7K374M60j922m54J287j79J43P77j127j83P68jj024J210
2573E47P79j705r03J526L42j61Q2j555k92J984J052k186q59O77O69J40J50n87
2591c00p17N42J006j245O40J154j378j033J027J387m03n37m10p33J030J871j114
2608G87k056O48J339n60K08J32j281L29J134n50k50R43n52j487R35J381k48q43
2626In7o02K52J733J64k479Q3J322J29l27O61j023j077J005J128p33J08J81j384
2645i07MK248n01j516p8L97j23J095K95j243j162J424J44k08M93q4j420J49J453
2664D60j6Nm08r75l61K043Q81k114n51P92N83M66J50j179q38J425O54j432O43
2683B28P14j541m60J351M38n32L6p95o88J478J371j847j505J315O38J3L30p13
$$ plain form
2554 -370 -66 579 177 -1525 -1582 792 1252 -670 -1124 163 -16 127 904 -223 -406 362 361 -663 547
2573 547 1326 -379 -1282 244 586 425 507 -1048 -1340 644 1696 -490 -1349 -672 -3 137 287 -300
2591 -300 -1017 -475 531 -714 -74 1080 -298 -1331 -304 1083 680 143 -267 -1000 30 1901 787
2608 787 -1269 -621 718 158 366 498 -783 -454 680 130 -120 823 271 -1216 -281 1100 852 9
2626 9 -48 -650 -398 1335 1499 -980 -897 425 554 227 888 -135 -1212 -207 921 188 296 477 -907
2645 -907 -903 1345 844 -672 -750 -353 -476 619 914 -329 -1491 -67 77 -131 362 278 -1142 -993 460
2664 460 444 449 41 -934 -1295 748 1629 -485 -1036 -244 339 805 955 -224 -1062 363 1017 -415 228
2683 228 942 -599 -1059 292 730 198 234 -561 -1249 229 1600 -247 -1752 -437 201 214 544 -169
2701a69j242Q00J343p81k83P72l52j073Q97R93o20n5m03j048R00K096m56k751
2719a432Q3J964L61o11k8j192P9J702m39r88M54L49q99j5J349m47m52Lr10K45
2739h24J555N30k102p14J787O3M0l4r54l72J103J270j311m51P65l69l25J331k47
2758G41j117j03O10m76P82P35j044j184P13J272p12J60j53j248M50J621k35j443
2776f31O27q5k30P97L60j349k82J041j02p8Q12k67j630P37J362r43l52P29j044
2795e28l70J164Q22j192J08p4m59M84J177j115j117R21J88k99L33J63p06l74J584
2814G10k55j049O20n0o51N28R10p69n25O51l12l17J440k55j666K91J363l31l12
2833B1L13n81m69J266K68j512K47J020l76p88J111J00j066M43J75l97P55M68j317
$$ plain form
2701 -169 -1411 -611 732 -49 -332 440 88 -985 -88 905 285 230 -173 -1221 -321 1775 1319 -1432
2719 -1432 -1349 615 976 365 337 -855 -776 926 487 -501 -47 302 -597 -612 737 290 -162 -159 -1069 -824
2739 -824 731 1261 -841 -1555 232 295 335 301 -653 -1025 78 1348 37 -414 351 -18 -343 988 741
2758 741 -376 -479 131 -345 437 1172 128 -1056 -343 929 217 377 224 -1024 -574 1047 812 -631
2776 -631 -4 -89 -319 478 838 -511 -793 248 146 68 880 613 -1017 -280 1082 139 -213 516 -528
2795 -528 -898 266 1088 -104 4 -70 -529 -45 1132 17 -1100 -179 9 -290 43 206 -500 -874 710
2814 710 455 -594 26 -24 -675 -147 763 -6 -531 120 -192 -509 931 676 -990 -699 664 333 21
2833 21 334 -247 -716 550 818 -694 -447 573 197 -591 520 620 -446 -3 172 -225 530 998 -319
2852c19m65J087L49o17K89k10p77Q52Q80j132m13Q99k64o05Q98K56j136J83Q43
2871E98q63K34Q70n96r77J276L97q08Q4J49p97J74J148m75j245N76P12r77j45
2890f65J133m39n99P76o06k19P83M82j345J23R69m03n96N31R6j076P64O60j302
2909i33K65R30l58q36J007K28j404Q79P91q49j51J243q93q64J100K23j060M86
2927a96Q65j192K66J088o62q09R42K96j160Q68M62j158L26M05j65o37O98L7p27
2946d53O69m3l74Q7Q28p97l29Q71J26j119N32O07n74l43P77m74q42J122K20r62
2966d71N2P93o92jP03k44n30Q82l43o18J79Q39p24j17N27j57k47L40M11r52L01
2987f9L72l84l24J166n13r19P41K87q60K56P42m00m36Q05l36p30O90K67p29l5
$$ plain form
2852 -319 -784 303 652 35 324 114 -663 189 1069 -63 -476 423 159 -446 452 708 -428 -245 598
2871 598 -265 -31 839 243 -734 542 939 131 215 364 -433 -259 889 414 -831 -255 457 -520 -665
2890 -665 468 29 -570 206 -400 -619 164 646 -699 -576 393 -10 -606 -75 21 -1055 -291 369 -933
2909 -933 -668 262 -96 -932 75 303 -1101 -222 569 -280 -431 812 -81 -945 155 378 -682 -196
2927 -196 669 -523 -257 831 169 -640 302 598 -562 306 768 -390 -64 341 176 -461 237 274 -453
2946 -453 216 173 -201 -114 714 -83 -412 459 585 -534 -2 605 31 -312 465 -9 -851 271 491 -471
2966 -471 -419 374 -318 -319 384 140 -390 492 149 -469 -290 549 -175 -292 235 78 -169 171 582 -370 -69
2987 -69 303 -81 -405 761 248 -671 70 357 -503 -247 495 95 -341 464 128 -602 88 355 -374 -409
3007d09Q81p11k65P90j23o76Q08J00m49K9Q76r69n2P41k79m84P87M76q91L73K18
3028G71n26p6O69k13j116Q98P36j047P1N04m02p84J014q0n57J98N29j350K76R03
3048D18o67l03M98l9l63L24M98j072J7R45l05m08L95n5p77N54O27p43NO89m39
3069b01m11Q80k31r25L83Q65j014J27O61q25l15O59M99q33O5O07n81j27Q01n31
3089d47l93N58L72p59L07M25n58j47P44o8l25K94O9n55L90O94l31n79Q44l20l26
3110a11P53k00q42M56N54p42L3N26l37l92P71J24q27L93P02r86p3J201m28q11
3130b36N43K70l61L20N57j151m94J254R0j133O88p2l85J75J109j158k06M08k55
3149c7k57P00mr49M06K65k41j95J225p93p57O73J92n43L28N23r25M9Q90l42n82
$$ plain form
3007 -409 472 -239 -504 286 163 -513 295 395 -54 -25 851 -118 -170 571 292 -192 595 1071 180 553 771
3028 771 245 169 838 625 -491 407 1143 96 167 671 269 -515 499 419 -138 60 589 -761 -485 418
3048 418 -249 -552 -54 -93 -456 -132 366 -706 -689 256 -49 -457 -62 -117 -894 -340 287 -456 -451 238 -201
3069 -201 -612 268 37 -888 -505 360 -654 -527 134 -691 -1006 -347 152 -681 -616 -9 -590 -717 84 -447
3089 -447 -840 -282 90 -669 -362 63 -495 -642 102 34 -291 3 72 -483 -93 601 270 -309 535 215 -111
3110 -111 642 442 -400 56 610 -132 -99 427 90 -302 469 593 -234 159 861 -125 -198 1003 575 -236
3130 -236 307 577 216 536 1093 -58 -552 702 792 -341 347 275 -110 65 1174 16 -190 218 -37
3149 -37 -294 406 402 -547 -141 124 -117 -312 913 120 -637 36 228 -315 13 536 -389 -340 550 208 -374
3170c74N64J9p52O09L86m96j82O86q8p93O37p4j035N84O21m96k87Q23p97m58J007
3191A04L27j012k32Q10j73J09J08l84k83M40O98o29l36P96n09k59Q15K98j266
3210e78R21j0n61K06O90r44K5L62M8k38M21J52j095K43Q78j76p34P98l29l78O53
3231C54J54q86j47Q48l00l8O28n58n41M44N82n48R2M51p24n93R68L95r18N05K48
3252D16o67M8N71Pp45M57k40q4J038k37j130J19J084m55m5J79m12m02Q08Q8q19
3273d21l8N28m13k46J076l92o33L26M63m07J93N08p20m89Q90J95m63k31K3m26
3293f77N38P66n10o84N05K78p76N92O05r27m33Q80Rl22M45j02j135P27R32q45
3313a34M5K81n41j16R27R1r35j48P25j41r9N56n57o47P96M85o28K82j04n97P2
$$ plain form
3170 -374 190 209 -543 66 452 -44 -226 460 372 -421 216 142 -893 -309 312 -184 -471 352 -445 -903 104
3191 104 431 -581 -813 -3 -176 -67 41 -343 -626 -186 512 -117 -453 343 -166 -425 390 688 -578
3210 -578 343 333 -228 -22 668 -276 -251 111 159 -79 342 494 -601 -358 520 344 -390 408 79 -299 354
3231 354 508 -378 -525 323 23 -15 613 55 -486 -42 540 -8 84 535 -189 -782 186 581 -337 168 416
3252 416 -251 -203 368 375 -370 87 -153 -237 801 564 -566 -447 637 182 137 316 -96 -498 310 398 -421
3273 -421 -459 69 -344 -590 486 94 -539 -213 250 -157 36 544 -176 -665 225 420 -43 -274 -251 -677
3293 -677 -139 627 117 -567 -62 216 -560 32 637 -290 -723 157 166 -156 289 187 -948 -221 711 -134
3313 -134 -89 192 -349 -465 462 553 -382 -530 195 54 -45 511 -46 -693 103 588 -40 242 138 -459 -387
3334c87O74j17n69J49L39m56M39O45j037j78M90K24k49J02M12j201K76J264q57
3353c7k51N45k51o92Q77L22n50j1L80n57j1J122n76j035N77M43l82K67L24r30
3373d26k36J147j23q83O45p5m26P6O79m48o58J337n15m41L23P13j223K73P78k28
3393B89p5L09o97o79J086P61j105L6K23k41r3P28j41r71Q50K19m33j82O41l70
3413A55p45P58M3l74K61n8r23N57J145n80n98J41K23kr2M70o97l64J070n17j67
3434b94N57K23j002L41Q42o58j19K46m29l18R29J7n29j38k2O7N74K11p51k63O27
3455A11L79p57K33O63j067K3M91L3m35O14n1q29M39J030p31p22R65m73J24P30
3475G70l58r55O80M61n74o1K88l04l33N30L17o24m2O22l52j27O50o23k20L19J58
$$ plain form
3334 -387 287 170 -399 -250 89 -367 72 717 -320 -498 -8 216 -33 69 481 -720 -444 820 -37
3353 -37 -288 257 6 -686 191 513 -37 -48 332 -225 -236 886 310 -725 -148 295 -87 180 504 -426
3373 -426 -662 485 362 -521 124 49 -377 -301 378 -70 -728 609 94 -347 -24 689 -534 -261 517 289
3393 289 214 523 -174 -853 233 994 -111 -75 148 -93 -186 542 401 -570 280 499 66 -116 525 155
3413 155 -590 168 211 -163 98 40 -883 -326 819 239 -359 -218 5 3 -89 381 -316 -680 390 -127 -294
3434 -294 263 486 -516 -175 667 9 -110 136 -293 -611 318 335 -194 -332 -354 -287 287 498 -253 -516 111
3455 111 490 -267 -34 629 -438 -415 76 109 -326 288 237 -592 -153 877 146 -576 389 -84 40 770
3475 770 412 -543 137 598 24 -37 251 -53 -386 144 461 -163 -205 417 65 -62 588 -35 -255 64 222
3496B22k91J57M03r25M7Q24l08n07L91K93p21N7N33j76p30P61L3j19M71k91k68
3517a44J24K85m65k62Q56m8p59L12K16o09K29K96o44PR08k04o40K88M00l27K1
3538a60%l98k8O37P9q16O89J46o92J32K90J84k24J60l8j77M42L5m32j93M77K95
3560D08n21J94j46m8J77L91m97l58J029m69l33N05k43n7J58J14k41J20M86o61
3580Hk04L79p3J38j5N33q59J23O06l37l72P38k8j008P72J8m40R5L77l83m62P38
3602C44J98p14R9P61o33Q6K27o29j61M84N6m17L77L07l93k80P59m78o27Q35l80
3623a79k42O00L58o24k53M35k24l17P52j86o85K39P62o10k5L85n1n12N30k39n04
3644e90N57J05j24m34R13j10q92L46N53r09M11Q05r42p3O66l78j47N02l0m42L52
$$ plain form
3496 222 -69 88 491 -434 -387 437 129 -378 13 306 -415 -358 175 -1 -731 30 63 -56 415 124 -144
3517 -144 -20 265 -200 -462 394 346 -413 -101 115 -494 -265 31 -613 -606 302 98 -542 -254 146 -181 -160
3538 -160 -160 -558 -586 51 130 -686 3 149 -543 -411 -121 63 -161 -1 -39 -216 226 261 -171 -364 113 408
3560 408 -113 81 -65 -113 64 455 -42 -400 629 160 -173 332 89 32 190 304 63 183 669 8
3580 8 -196 183 110 248 233 766 -93 30 636 299 -73 665 637 -371 401 419 -21 74 451 68 -394 344
3602 344 542 -172 -73 688 55 141 368 -261 -422 62 118 -299 78 385 -8 -288 471 -7 -634 201 -179
3623 -179 -421 179 537 -87 -340 95 -129 -446 306 120 -565 -326 436 -174 -199 186 135 -377 153 -86 -590
3644 -590 -33 72 -52 -486 427 317 -575 -229 324 -585 -174 631 -311 -384 282 -96 -243 259 229 -213 139
3665A39L73p01K08J35k5l61O88l48k30l84P83m65K6M84l54l05L89R5m50K11L69
3686B77n48k79J078n68l17lN20m88K31L39k29l85N78l35m7K40J06n89L58N66o06
3707a01m76J046n77j14M7M04m14k80N97k8q05J082j79n15M36K73n99K21L08o49
3727c23K5P82j05m78K03q9N4m8O24l36n60M95O4p11O94J14l88j53P17m50l11O46
3749D66P4o22L97L66o46J5L52k82j5K02K01r25N92J92o59L26N09m84j58L50j6
3770B35l84K06J93j95j83M09j66m55N87p1m31M53M4n73J84N45k6p81P50m29l63
3791d51L14N26p50j49P32q7n52M84k3n24K99M03m37k05Q51o27q4J03M60o24K44
3812i7J65o44J48P02k15p83O04o1k32N20J50o70J86J63k1q4K24L9n11K77K82l25
$$ plain form
3665 139 512 -189 19 154 129 -232 456 108 -122 -506 277 -188 -162 322 -32 -337 52 147 -303 -92 277
3686 277 -271 -550 528 -40 -357 -360 160 -328 -97 242 13 -372 206 -129 -176 64 170 -419 -61 505 -101
3707 -101 -577 469 -108 -222 -175 229 -185 -465 132 104 -701 381 202 -313 123 396 -203 18 326 -323
3727 -323 -298 484 379 -99 104 15 69 21 645 309 -251 244 308 -403 291 405 17 -136 581 131 -180 466
3749 466 540 -82 315 681 35 50 402 120 105 307 508 -417 175 367 -292 34 543 59 -99 251 235
3770 235 -149 57 250 55 -128 281 115 -340 247 176 -255 198 242 -331 -147 398 372 -409 341 -88 -451
3791 -451 -137 389 -361 -510 222 135 -417 67 44 -480 -181 222 -215 -420 431 -196 -280 -177 283 -341 -97
3812 -97 68 -576 -428 274 59 -724 -120 -181 -413 107 257 -413 -227 -64 -85 -169 55 94 -417 -140 142 -183
3834a83L8J74l07j51O80j13n01K56J39K56k47M82l24l89J19N39n66k14R17q51
3854b46J73M40k45m59K07K96m72J35P41p06o9L94J34k98L14l45k50o5O64k39q8
3875A6k2l4k16K48J99o28L88K47J59o21N16j33n21O00M4k0o0o3o9k89P39j31n56
3898b07N07mn00L41J55k62n75L64K16j91K25L72q61L05O07k23k32k4K82o38M72
3919A29L41l57l48M86k01k75K33L05n76L97n2j48m5P87o09o62O38K36p77O47K1
3940A70m22J77L12k89l71K30K74k18J9M87o33P4L42k52l11P34k3p84M49O12n23
3961E4l32M47k88l05O99J98p03L4N81l75l70N78k81k39O10k86l50J51P83o82l7
3982a13N32k33m75M91k02k82J69K48j68j51K68n4m71M19M00p77K96K76l83K1M67
$$ plain form
3834 -183 -145 29 -278 -429 251 138 -363 -107 32 288 41 523 199 -190 -71 468 -98 -312 605 -246
3854 -246 -73 367 122 -337 -130 166 -306 -171 570 -136 -205 189 323 25 339 -6 -256 -321 343 104 16
3875 16 -6 -40 -256 -8 191 -437 -49 198 357 -264 252 119 -402 198 242 222 162 99 30 -259 480 349 -207
3898 -207 300 296 -204 137 292 30 -545 -181 35 -156 69 441 -420 -115 492 269 37 13 295 -343 129
3919 129 470 113 -235 251 50 -225 8 313 -263 134 82 -66 -111 676 67 -595 43 279 -498 149 170
3940 170 -252 -75 237 -52 -423 -193 81 -137 -118 369 -264 -190 152 -100 -411 323 300 -484 -35 577 54
3961 54 -278 169 -119 -424 275 473 -230 -196 385 10 -360 218 -63 -302 308 22 -328 -177 606 -76 -113
3982 -113 419 186 -289 202 0 -282 -113 135 -33 -184 84 30 -441 -22 378 -399 -103 173 -210 -189 278
4003B78j72k52K71K29o21M7K74l11j0P95n04l21K40K25k61N3K78l37o0N40l77
4024Dl52K18J24m7O2J3j8k75L14k1o8J83r6l82L12o6p6J28N18l51o06O39L56o36
4048a23R6L71p71M1M92Q2l70L2L98k87n82N93r1j26K57j31q4J66P1n19M12O51
4070E78n61l11L00J89m38J89L47n87r2P04l01k99M74j73j82K62J24o72O55J66
4090C72m02k30N16k3k66J52M3k84j33O36o33j18K22N24l79r7J55j13J05K42o86
4111c97J46M74Q9n35k88Q69n41K88l5Q5k13L42o6m46L84K83m70l23O03j67k22
4132a40M88l92l64K59M23o28J08N83J55p82L40nk96M21M6o00m9P26k43q7J69J98
4154C30m28J36M3m24K40M41j79l27N20r7o52K95N01o98JO38m62l94L40L38k79
$$ plain form
4003 278 106 -146 125 354 -267 -220 54 -257 -267 528 24 -297 -57 168 -93 -40 238 -99 -159 381 4
4024 4 -348 -130 -6 -53 9 22 4 -271 43 22 -46 137 41 -341 -29 -95 -171 -43 475 124 -482 157 513 -123
4048 -123 -27 344 -427 -386 106 188 -182 -150 248 -39 -621 -28 -119 -245 12 -119 -203 -37 34 -485 -73 578
4070 578 17 -294 6 195 -243 -54 293 -294 -386 318 17 -282 192 19 -163 99 223 -449 206 372
4090 372 -30 -260 256 233 -33 119 162 -122 -255 381 -252 -370 -148 376 -3 -100 55 -58 47 289 -397
4111 -397 -251 223 312 -223 -511 358 -183 105 70 155 -58 284 218 -228 156 439 -31 -354 249 82 -140
4132 -140 348 -44 -408 -149 274 -354 -246 337 492 -290 50 45 -251 170 216 -384 -433 293 50 -37 132 330
4154 330 -98 38 81 -343 -103 338 159 -168 352 255 -397 -102 399 -299 -298 340 -122 -516 -176 162 -117
4175a17k73P07m43m0O88n46j84N09o9j94j62N30p93K90M13L6o88M19l0j77L42
4196B18j52k3l80L94J90p02P25m1j92k21NJ22JR82o41q30O22M00j44m71L79l87
4218a46K33J32j24l21N47K9o87L22M75k88k93K70j67k8K92j10n48M66L10k12n31
4239c79K01R9k37N35K1o45J54K97j82l53K80J64l55K92J24j71r2O90p22k98Q59
4260B82J51m99k03L00j6M20l73m42R6L90L9n80J85N38m20l48M83k27J1K17oo04
4282f06L88N68n35k11K79j08k01N22j06j22J26N82n90l89O60Ro92K85Q5J4l4K55
4304A79m19r7Q79k59o05J01L62j69p6M62m55o5N95m73m31Q56l7l70j34J34O3j98
4326a57K30k55j15O29j7o98K23L50j26n7K1J06l15K74K2r74O28P50m69l64J90
$$ plain form
4175 -117 -390 317 -126 -166 522 -24 -208 301 232 38 -124 406 -387 -97 316 352 -336 83 53 -124 218
4196 218 66 43 -337 57 247 -455 270 229 37 -184 -179 -57 -56 926 285 -545 77 477 333 -138 241 -146
4218 -146 87 219 95 -226 321 350 -337 -15 460 172 -121 149 -18 -46 246 136 -412 54 364 152 -379
4239 -379 -178 -79 -316 219 240 -405 -251 46 -136 -489 -209 -45 -400 -108 16 -155 -247 443 -279 -577 282
4260 282 433 -66 -269 31 15 435 62 -380 -284 106 145 -435 -250 288 -132 -480 3 -224 -213 4 -2 -606
4282 -606 -218 350 -185 -396 -117 -225 -426 96 -10 -132 -6 576 -14 -403 257 266 -426 -141 -56 -42 -76 179
4304 179 -240 -337 542 283 -322 -221 141 -28 -104 358 -97 -162 433 -40 -471 385 348 -22 -156 -22 41 -157
4326 -157 73 -182 -297 332 315 -383 -160 190 64 7 28 134 -181 93 115 -859 -231 519 50 -314 -124
4347a24M63k45J24k1l26K96L80q31j27N05J03j71J12n4k41K07K68p71K34N62j3
4368C30o74K21L91j89l41K05j25J70M10k30p74Q33K4l9k61L93n85J54J95n59K86
4389a65K82M86r22L59J11l08L3K64j75KRK42n43M25J84k78k77L67k31k7j00N14
4411B52o14P46j56n14j82O40K02o80K63K31k92L03j27m31M25K16N7p92L13L62
4431B22k45k64N46l07P3K87k72l97M54L40q88J67K93Q5J5M8k41l20O23j18l77
4452b76R4P02k91n05J72J98Q9J1n7n62L49M89l16q77N67N19l51jro4J49M93n35
4475a2m50R87j28j61l45M57l05K33J5n09L1N47j99n75L52L41k99K93J24m69p5
4496a47N18j30q54P25J66m20r5M07n8k80O3J22m3J27M25o60k60M82K3m08K40M8
$$ plain form
4347 -124 339 94 218 197 -129 167 547 -284 -411 94 197 26 138 84 -157 50 318 -453 -219 343 330
4368 330 -344 -123 268 79 -262 -57 -182 -12 398 168 -606 227 251 212 -49 344 -241 -87 108 -451 -165
4389 -165 117 603 -319 40 151 -157 -124 140 -35 -33 -24 218 -325 100 284 6 -271 96 -135 -162 -262 252
4411 252 -362 384 228 -286 -468 172 374 -306 -43 188 -104 199 72 -359 66 282 339 -453 -140 222
4431 222 -23 -287 259 -48 25 312 40 -357 97 437 -451 -284 9 94 109 157 -84 -404 219 101 -276
4452 -276 -182 520 229 -276 -104 94 183 194 137 -425 -76 413 97 -780 -213 306 -45 -46 -55 -119 30 523 -12
4475 -12 -462 525 397 236 -109 348 43 276 291 -218 -187 360 161 -414 -62 279 -20 273 397 -72 -147
4496 -147 371 241 -613 112 278 -142 -237 170 112 -168 -105 17 -26 101 526 -134 -394 88 111 -297 -57 -9
4518ik31L96K0l10p3O34m66j80J35M06l78J36k70L52J0K74n41j5M79j8l29l03
4540b81J79Q3qm37K58J79L90j81l59j73N91np88O96P1k54L95k88m65M07M01m40
4562b9m33M43O02m16k45J00L4k36L05n54J31R08m18k10j71N23k17NJ27l49p1M47
4584B76P9p63N23j5k44j97K58J38m0L21n10p3M46J89l42m23Q06j71j12k60l2k29
4606c75L30M44n38k94Q58k49k78R2K35m68K10q4k32L84J68k36K1j7L29l68L9J34
4628A05k38J93K67o50pM22L62p06l6N86k39j32J03N9m81O93j24n53N62M52r46
4649c08j03M17J18l16L82k45j73L02K47m93n34J041k09m48K11J87k57K95O0m61
4669b87J72L93k19m19J78L22o0K3M0p25L99M09j92m41L19Q8k07L60L3k6Mk0l72
$$ plain form
4518 -9 -240 156 176 -134 -207 427 -39 -219 -84 322 -56 80 -190 162 172 446 -95 -110 369 351 22 -281
4540 -281 -102 -19 -27 -464 -206 -27 363 182 -177 -350 241 236 -552 144 215 -39 356 68 -397 10 411 -29
4562 -29 -462 -19 583 167 -78 22 56 -180 125 -429 -298 610 192 -18 -189 334 117 122 249 -100 -171 276
4584 276 355 -408 115 100 -144 -341 -83 55 15 336 -174 -247 199 388 46 -377 429 258 146 -114 -146 -375
4606 -375 -45 399 -139 -433 425 176 -102 -10 225 -243 -33 -117 -349 35 203 -33 -12 -29 300 -68 -29 105
4628 105 -133 60 327 -323 -330 92 454 -252 -288 298 59 -73 30 89 -392 301 177 -376 186 638 -308
4649 -308 -411 6 124 -192 190 -55 -228 74 321 -172 -706 335 126 -322 -111 76 -181 114 174 -287
4669 -287 -115 278 59 -360 -182 140 80 103 143 -582 -183 226 34 -407 -88 0 -207 153 186 160 164 144 -228
4692b28K16J68l8m16j8M96Q7k09k44J00j48K97j12n06N09N66l75q58O77K93m06
4713a49P0J69k76O9P09o05m35N90K10o77J60N11n64N25o0n28K30K34K44r82O04
4734D9L63m7q76N49j93r1R17p10m4j31M85m52K36L36n91J57k9K7m51N24M92j025
4756e05L48M58j36k74J32K26r6N8j21j31j68L78k54m74Q11k08k12k98O23k38L7
4777d4L25m95L3N88J3m62r3K93j10L74l49l19K62M65m23l53J96M26l76L5k03J90
4799b7o4L29l07l32M30J25n67J69K8N43m62K53m64P4K53O46j216J2Q35n9m28J65
4821f4J14Q1l56L46l16N9N45l62m21L34K74j31J36k27m0oR2n1l21M69K93o11J55
4844hJ37m8Q8j62o2o22R05J47l70j32O0J98m44N35o01K73P8J44l07J31J75J56
$$ plain form
4692 -228 -12 156 118 -298 -316 180 267 58 -186 -86 -234 63 -49 -555 -46 520 145 -713 -36 257 -149
4713 -149 -79 90 -186 -117 592 -13 -448 142 352 -325 -165 346 -218 307 247 -281 -51 183 427 -555 49
4734 49 412 365 -511 38 -155 -246 671 -39 -83 -214 271 -181 55 391 -200 -43 -72 -45 -496 28 520 -505
4756 -505 -157 301 165 -109 23 249 153 211 90 -41 -209 169 -85 -559 252 44 -168 -466 157 -81 -44
4777 -44 281 -214 -181 407 420 -42 -135 158 48 422 73 -246 16 481 58 -295 -99 327 -49 -14 -217 -27
4799 -27 -91 238 -69 -401 29 154 -413 -244 -216 327 -135 118 -346 -272 -19 627 -589 -577 258 199 -229 -64
4821 -64 50 131 -225 121 -195 -136 409 47 -374 -40 234 103 239 12 -28 -34 58 7 -314 155 448 -163 -8
4844 -8 129 81 169 7 -55 -677 228 375 5 -127 -67 131 -313 222 -379 -106 -28 116 -191 -60 115 271
4866B71o83N79j40r7J61O6m75m8P94l09k26M01j23l58J78Q8k60O2N65o29kL09
4888A24j2l17K76L61n35rK92j07j59M13l70m92N65J42m07L3M05q1j41N74l93l42
4910a80L29J09m39j84P03m6m39L48r2J23k58J10l85L16J85l30j1K43M25n14J28
4931A41j22j25l03P95l03m02L00K65m34k0M63k66j10O49n93m2J31K46p44L54J77
4952E7K5O9j34J59k05J30m7m55N03R9n26L26k7L39k70L18k75k07%K04j26n3P10
4975F14m78r5m1R2k05K15j7k48Q0N64m31k4J22N8j42j24R1j42J08K61L9o10M93
4998A80J6k42n9L42k60j64M13l04l01M60J68o45M95p9n6rm3R4k63J21R3l07K70
5021h0J99k77K4J64L14m08K6j7l76J42M26k75k03M61q5n07N70j25N1mj5j6j92
$$ plain form
4866 271 -412 167 27 -70 91 157 -318 -366 428 119 -107 294 171 -187 -9 79 -181 -119 446 -183 -185 124
4888 124 112 -205 71 432 -103 -112 180 73 -86 327 -43 -535 30 172 -235 -202 203 122 -19 555 162 -180
4910 -180 149 258 -181 -365 338 292 -147 201 109 232 -26 84 -301 15 200 -130 -141 102 527 13 141
4931 141 19 -106 -409 386 83 -319 -19 246 -188 -208 255 -11 -121 528 -65 -107 24 270 -474 -120 57
4952 57 82 151 17 176 -29 101 54 -401 102 201 -325 1 -26 313 43 361 86 -121 -121 83 -43 -96 614
4975 614 136 41 0 92 -113 102 85 -163 -83 481 50 26 148 206 64 -60 31 -111 -3 258 297 -313 180
4998 180 196 -46 -105 237 -23 -187 226 -78 -379 81 249 -396 99 20 -36 -45 -88 6 -257 -136 -43 -350 -80
5021 -80 119 -158 -134 30 344 -64 -38 -55 -431 -289 137 -138 -341 120 35 -472 98 -27 24 20 5 -11 -203
5044b03J37l6l99P69K60p16RL70k48J7J28k0Mj22J79n0K3j32M6m6M55k00n15J50
5068a40L27l71L6M01m22p4L86Q1k35p8OP9j46M00k92l78M56ro46P89L59q33K52
5091e2l4QQ7Q6k11o0K85J19j06j43K80o3k80L02j01j21L9J33l44j73O02j12l87
5114b46L11l4j46k6K38j54k62O57n00j13L48kj87j32M06j22k98M27nj87L95l42
5136B6j46PN2K36j35j14lJK18o8k39K61j81J02Q2lR4m24K38J32k65N5J91l27q
5161b18L87J57l29J72J20n56M40M28o99j89N80l6k71J54k58k24O30k08l77J24
5181a73K15k00R8J61L00p35J48M80m83k58M57K69m17j99N28l77L03p9L4k23L47
5202A96k43q0J47J10j56l05N54j96k36K58k33r7L80j80J5j50K63m11N74M7j42
$$ plain form
5044 -203 -66 -102 -501 268 528 -188 -179 191 -57 -40 88 68 72 -50 129 79 102 -30 16 -30 425 225 -290 -140
5068 -140 187 -184 -148 253 -169 -243 143 224 -11 -89 -83 -4 -150 250 -42 -420 36 27 -619 170 529 -304 -52
5091 -52 -86 -78 9 95 -116 -176 109 228 122 -21 259 196 -84 218 117 -4 35 168 -176 -349 253 141 -246
5114 -246 65 31 -115 -141 97 -57 -319 338 -162 -275 73 71 -116 -248 158 36 -262 165 160 -27 368 26
5136 26 -120 -113 -61 175 40 -74 -77 -76 142 74 -165 96 -85 17 99 96 190 -234 4 136 -129 -74 117 -210 -218
5161 -218 169 326 -3 169 289 -267 173 601 -98 -287 293 257 -14 140 -118 -342 288 80 -297 -173
5181 -173 42 -158 -60 101 401 -334 -186 294 -189 -447 10 279 -138 -337 191 -186 117 38 72 -151 196
5202 196 -47 -127 20 130 -26 -331 223 27 -209 49 -184 -281 99 -81 -66 -216 47 -364 210 257 115
5223A15l92L03L82o23j6K75j83L02j74K75o22M22R9j60J39om51J96L53p9l07K15
5245F3L23q1j47j5n6j68J65K73n60q7L77m0k60K71j30Q0J96K68p12L89q0M4k90
5268a77L68p9k50K22k49J5J70O5r3j36L34m37l3R1L87j47j18J03k58M14r4M7l86
5291b41L57m31M17p5P1p8j91J27R4l97L95L24o13M30J98o49L48Q9o9m94J36N22
5313B70K57m73K75k06j46L6L15k79R4K5o65O14j9l11O09l10K29o41L88J91k84
5334c1K65Q3k72k27M42j91k11l7N21l57l01N48m75m6M33j89j94L75J99l96j23
5355a84J46j25j17K04L7J03R3k10l87L46N25q56N80j15k50K66j22M2l22L90K8
5376G2l94M16L90j96m55L85k36l18K56J20R0k8J41k41p8L55l69m9J18j4k26K39
$$ plain form
5223 115 -277 26 408 -215 -231 44 -139 163 -11 264 -358 64 163 3 142 136 -315 -119 234 155 -152 63
5245 63 386 305 158 143 87 -81 84 357 -203 -290 87 47 -213 58 -72 8 204 472 -240 149 69 113 -177
5268 -177 191 112 -138 84 -165 -150 20 85 -8 -144 190 -247 -280 -189 198 51 -67 36 -222 192 98 145 -241
5291 -241 116 -315 102 27 98 20 -171 -44 50 -347 48 372 -241 189 387 -262 86 175 106 -388 -252 270
5313 270 527 54 329 123 -23 13 328 49 143 168 -497 117 98 -213 396 86 315 -326 62 253 -31
5334 -31 234 317 45 -182 260 69 -142 -179 342 -15 -316 232 -243 -289 144 -45 -239 136 335 -61 -184
5355 -184 -38 -163 -280 -76 -39 64 157 -53 -440 -94 431 -425 155 40 -210 56 -66 -24 -346 44 72
5376 72 -322 94 484 288 -167 218 -18 -336 -80 40 130 102 243 2 -76 279 -90 -139 -21 -35 -261 -22
5398b2k3J9N9J18j14k82K48K21n20L49J79J15l54J31K56n10N7K96m13J55Or8J00
5421b7QJ50m10J44J05R5k45L17j87j59K14P5j50r4L65k36j5J48l2j39K64j30k16
5444a55m3L75r8j04K2k12O9J32M0k43m0O36k16l15J51K1l90J44N96p26M82j66
5466d0LJ47n4j77R0o8N48n58j29L44K01q27M45J59k98L24L2r0j51L81l90j13J58
5489f3L08m65L48j74n6J53m6J57q8K44k55l11N00j90n1p1O5k89n4L17J83k80%
5512a18M99n48j2J50P2j28j8K06m08M85L6j72p2L57n39K02L96no80K92J44J5k11
5535e7J36k11j5J59K1j49J9N5M8K8j50L44j28k25J13j20L19j59o2J45j25j08j35
5558b57L30L2J6KL3l08j91M22l31K06L3j23o5K05J20j74m59O59l14K05m8L42o30
$$ plain form
5398 -22 -45 -26 33 151 37 -245 3 224 -296 53 232 347 -7 124 380 -130 -73 223 -190 -35 -29 -127 -27
5421 -27 -19 131 -279 -135 -30 65 -180 137 -50 -209 5 80 -70 -164 201 -35 -50 98 66 -73 191 61 -155
5444 -155 -198 177 79 -25 -3 -215 -146 -14 26 -217 -257 379 163 -152 -1 20 -370 -226 370 -356 126 -40
5466 -40 -37 110 56 -121 -31 -99 449 -109 -238 106 307 -520 -75 84 -214 110 142 52 -99 282 -108 -221 -63
5489 -63 245 -220 128 -46 -102 51 5 162 74 318 63 -248 252 62 11 -60 5 -284 -338 -21 162 -118 -118
5512 -118 381 -167 -179 -29 43 -85 -103 103 -305 180 216 44 -28 329 -210 -8 388 383 -297 -5 139 154 -57
5535 -57 79 -132 -147 12 33 -116 -97 -42 6 34 -116 228 100 -125 -12 -132 187 28 -34 111 -14 -122 -257
5558 -257 73 105 121 123 156 -152 -343 79 -252 -46 -13 -136 -201 4 124 -50 -509 150 -164 41 -7 335 -295
5581b95J40J46m9J8L08R5o54K45J50K68o84N56j61j87N09k54m44J23M04l93J88
5602B9K02m34J96M32m27j96r2O29n00L28p7p6k20L83l34j57M47J72k51q2L58l59
5624b9j08L13j19l13M20m08J98r8N6K68k69K39m6k16r3K85m08L66K49k75k40N83
5646C55l22j90N43j67l25m05Q38m00l77O11l18j08L26q8j06l42P15k74M1n0J77
5667A34m38m8L99k70R7l9k9K39Q7J64l77M8Q6j21j72N03m08J03j04J56j01J07
5689A6j31m3k59M67N6l67K86P1k06K23ol85j14M59k13l21M30N0l32M55j91J80
5711A25j25J22L0m56M10n3k40l4K20J88l62K84k60m5J07L61m14j9L93k62J68K82
5733D20m42P1n1J52j35m3L63m62R9K26j74j00M2K42l07L18j64j08NP1K10j04m57
$$ plain form
5581 -295 -155 -9 -58 -40 268 363 -291 -46 104 372 -312 244 83 -104 405 151 -293 -170 234 -159 29
5602 29 231 -203 -7 425 -2 -198 -290 339 -161 167 90 14 -206 177 -157 -314 133 305 54 -28 330 -29
5624 -29 -137 176 57 -256 164 -244 -46 -144 -88 180 -89 150 104 -112 -205 80 -328 38 287 12 -228 355
5646 355 33 -157 386 219 -106 -511 327 -73 -450 161 -157 -265 61 -27 -133 -475 240 -34 7 -43 134
5667 134 -304 -352 47 -223 -126 -165 -194 45 132 296 -81 -33 53 -68 -240 263 -145 -42 -146 10 -91 16
5689 16 -115 -158 -417 50 106 -261 25 96 -110 113 107 -278 -392 67 -146 -467 -37 13 -319 136 -55 125
5711 125 0 122 152 -304 106 53 -187 -221 -1 187 -175 109 -151 -196 -89 272 -142 -161 232 -30 138 420
5733 420 -22 49 -2 150 15 -28 335 -127 -28 198 24 -76 -34 208 -99 219 55 -53 -48 23 233 129 -328
5756c28L00k53L86j99K02n89K12N42m22J66j21j40J52L37m59K61L61k52n03N31
5776A84l25M8J78J3j67o0L57k14j14J40J47j37L18m94L74l56K97J95m71K2Q0R3
5798A08m15O34k77l26M31J89p27K37J9j11J10M1J39j93M38K5m68J51n5j43P6L78
5820B61n42K24M55j79n91M20MK2l0K2q2k27rM40k65J08R4l18LM82n05J24J55O4
5844A30p4k71J74J33k18M28m01q1J27n4J44l5Q3j94K12M7j25m9J33j25j28J81
5866C7J35l66K33Q1j8m74R9L01k25J73n6l4J2L65j19k06P2qj31jL15j23k7k8k5
5891a8k93N06j15k24J76J63l95o1M69l37j94L27K19l56L66J23l99j56K88l02J1
5912b02L44q8L5M0r4j04o6K90n7l47L98j80j88L83k55j29pK05K10l40L54L2k00
$$ plain form
5756 -328 -28 -281 105 -94 108 -481 -269 273 -149 17 -104 -244 -92 245 -214 47 408 156 -347 184
5776 184 -141 -93 85 98 -69 -129 228 14 -100 40 187 50 368 -126 248 -108 189 384 -87 -65 15 108
5798 108 -307 327 50 -276 155 344 -383 -146 -127 -238 -128 -87 52 -141 297 322 -146 5 -50 -193 -117 261
5820 261 -281 -57 398 219 -372 48 52 74 44 66 -16 -243 -252 188 -77 31 125 -193 -190 292 -213 -89 66 130
5844 130 56 -215 -41 92 -126 302 -99 -180 -53 -107 37 2 85 -109 103 150 25 -24 109 -16 -144 37
5866 37 172 -194 39 120 102 -372 -273 28 -197 -24 -80 -114 -102 263 144 -62 10 2 -129 -130 185 62 35 7 -18
5891 -18 -311 195 80 -144 32 195 -200 -261 208 -129 -323 4 223 -133 233 356 -43 -199 89 -213 -202
5912 -202 142 54 89 129 35 -69 -135 155 98 -249 149 -31 -219 164 -91 -220 -227 -22 188 -152 202 234 34
5935C4j19L67j48l9L53l51k09J3M79m04K0L32j96m03K70J46r8K63ll07j65J58
5957gj73O5K9L31p62M21L09m36L84j35k68P9K27jk70o2L44j38j9L70l05k61L55
5980G7j26j8J77j37O9J49J25l89R7J04m4j43J78l24O4j10L23j1l07M70J5n99K62
6003i8K56j91OM1k55J12K33M0m33K55J51j76k77J66K85j14k15L87l33J85J15m68
6025c28L30K14j96k20K38k02J92j05ok24K92n1K51j55Q5j66r9L22k71J04pJ83
6047A81l30J9L80j14p4k69oP1L00N3J55m67R0J43l22J77Q1p4k38M04M7l38L17
6070A86J12m02J79j9k43J76J47r8l36M99k47j73J52K86l7n3k2J40o72N20L5m27
6092b97J53j5M20k83J98K57n51P2J66n72L79J80lJ38O2j06k11L5J25l85J53J49
$$ plain form
5935 34 -85 282 134 95 448 97 -112 -99 380 -24 -4 328 132 -271 -1 145 47 310 307 0 -165 -7
5957 -7 -180 -115 -86 245 -517 -96 213 -223 161 26 -242 -163 64 63 -207 -269 75 -63 -82 288 -17 -278 77
5980 77 -49 -67 110 -27 42 191 316 -73 24 128 84 -59 119 -205 -141 -251 72 61 -246 224 239 -360 -98
6003 -98 158 -33 -27 14 -241 -129 104 144 -289 -34 117 -59 -336 -170 115 1 -214 173 -160 25 140 -328
6025 -328 2 216 20 -200 38 -164 28 -77 -83 -307 -15 -66 185 30 115 -51 -150 172 -99 5 -2 181
6047 181 -149 -130 250 136 62 -207 -213 -142 158 211 366 -101 -11 132 -190 -13 68 -6 -244 160 207 -131 186
6070 186 298 -104 75 56 -187 -11 136 38 -298 201 -46 -219 -67 219 182 129 107 247 -425 95 130 -297
6092 -297 -144 -159 261 -22 176 433 -118 -46 120 -452 -73 107 104 242 304 198 -13 22 147 -238 -85 64
6114F4O3j32j00J69n9K5J37k38k32N42j70l25K86J20j79J7K04l05K9K20L8oR2
6137B60K6n26N81k34l08K55k9o3KL50m48J12j34J08k11P8K81j38p2P8J78m30L54
6160G0J25j87M2l23L52k42K88m7o5J9J22k10K24j22K2o8L1R5o4L63l82l59J91
6183a25K53rn20N10O3l02K98K85o47OL68k30l62M50j90J23M6p4J13o31O44l97
6205c28J74L46m08j57N63j61j99J97J46l49J62J09o7k05L26k19j70qL37M0k15
6226h6J50P5m07M71o1l37L87m06L81m10J63L68k86l37Q83l36l9k13Q1N6RK00j62
6249A44k59L68n12P5J35j1K03o8Po7n7K28k31p9k7K16j97P4M40p37J98K54m15
6272c18M4K86R5r3M41l85l34K05K43k16R5L38l10k09R7K90j48j60K98o42L31K91
$$ plain form
6114 64 127 -5 -105 64 5 30 167 -71 -303 239 69 -256 30 150 -29 -12 192 -113 -84 136 174 168 260
6137 260 286 -240 341 107 -201 54 25 -38 -36 314 -134 -22 -156 -48 -259 -181 100 -38 -110 -32 146 -284 70
6160 70 195 8 50 -273 79 -163 125 78 13 32 154 -56 168 46 68 0 31 126 62 425 43 -316 -125
6183 -125 128 119 -401 109 172 -130 168 453 -194 -188 180 -50 -412 38 -152 -29 17 -57 56 -575 69 -328
6205 -328 -154 192 -216 -373 190 29 -170 27 173 -176 -14 95 28 -177 149 -70 -240 -248 89 129 -86
6226 -86 64 139 -268 203 142 -195 192 -214 167 -243 -80 288 2 -335 548 212 173 -40 41 97 106 306 144
6249 144 -115 253 -259 -184 -49 -60 143 75 82 15 -42 186 -45 -124 -151 65 -132 -58 382 -355 -157 97 -318
6272 -318 -274 12 107 14 455 70 -264 -59 184 -32 63 401 91 -118 -21 269 121 -39 259 -383 -52 239
6294B39j64k5J98N7m63N0J31k05jJ90J6J51j70J96o18J80N08j22k52J55j93P2
6316g0L2J98o5J36pk01q0n4L45n14M17k09k13j07K66O7k28M61r5j48P3qk02N6
6340a50J95r5O7N5p1j55J35M33k75J3J19k21k81K55k0J1p5K05M7r9J25j28m89
6363c99K21L88j79P7mj57J87k0pl95J91j51L19N1j93K04n6j3k6k31J73J82l33
6386a71P1K34r7j2M22o53j38O02j68j62P9j2K12k40J44J8l77N33n76J54Q9J59
6408A11k31o0L37l07k8K41J89r5n1nl12J47J93j51j07K51J09j44j64J39k03j62
6430c03K71j17k2l9K50l3K80l96K14k52L67k91k95O22l30J21l6j05J00n7J69K3
6452A41j29K51k08k78K98o3Qk12K24r0j2J20P2k61K8K4K05j69J66r2m4l5Q3J45
$$ plain form
6294 239 75 50 248 305 -158 -108 23 -182 -183 7 23 174 4 200 -418 -238 270 148 -104 51 -142 -70
6316 -70 -38 160 95 231 224 23 -57 -111 234 -280 137 -72 -285 -392 -126 -59 -287 174 79 -69 4 -4 -206 -150
6340 -150 45 -50 17 72 1 -154 -19 414 139 152 271 50 -231 24 4 15 -60 145 192 93 218 90 -399
6363 -399 -178 210 31 108 104 -53 134 114 107 -288 -97 -248 71 122 -71 133 77 64 38 -193 -20 162 -171
6386 -171 -100 134 37 25 447 -206 -344 258 90 -72 7 -5 207 -33 111 129 -248 285 -291 -137 -48 111
6408 111 -120 -180 157 -150 -178 63 252 157 106 101 -211 -64 129 -22 -129 122 231 87 -77 62 -141 -303
6430 -303 -32 -149 -171 -210 40 7 287 -109 105 -147 220 -71 -366 256 -74 47 11 -94 6 -51 118 141
6452 141 12 263 55 -223 75 12 20 -192 32 -58 -70 50 122 -139 -111 -87 118 -51 115 23 -21 -56 27 172
6476A72j67M8k48k9L9R5K80j97jn2k1K59j43j42P3J63j59JL44m35K08J60k38K1
6500C1P6n5m46K37J62k72k30O68l42O5J15m29N22q9k4j24k68O84j72j6l83J71
6522a19L9K0J72j00mr6M53l98K86j50O3O6l35j88M43l02j5j65P8M04k16J96k07
6545g5oJ72K21l95n5L84L7j38k0J12j77j33P3k7q6J99J37k64j29J91q4L01l74
6568a36K63j35J08j10J1J96j92K52j89J42m7j95r3J99k35K60J60q6k89N8j18k8
6590b04K53L0l00l3J53L22m19L42Q1k37n8K26m16K19J06k17K68O7j93k9J01l12
6612b50K30r5L21j08r2O8K8j76J45L27l50m0L67p8o33K40O9O2L1p6K8j65L74O2
6636B89m15N80j79l25K47j85j67K62K3k08J71Q5Q1k91K16K6Jo06L32k33K18L01
$$ plain form
6476 172 5 53 -195 -224 -185 -90 190 -7 -8 -60 -81 178 35 -107 -34 129 -30 -29 315 -120 88 248 10 31
6500 31 107 52 -394 -157 5 -267 -497 171 -171 -106 9 -420 102 13 -11 -135 -403 281 109 93 -290 -119
6522 -119 -80 -60 112 12 8 -88 365 -33 253 103 166 232 -103 -291 152 -150 -165 -330 -252 152 -64 132 -75
6545 -75 -81 91 312 -83 -138 246 283 145 125 237 60 -73 0 -27 -113 86 223 -41 -170 21 -63 238 -136
6568 -136 127 -8 100 -10 1 197 5 257 68 210 163 -32 -125 74 -161 99 259 173 -116 -58 -176 -204
6590 -204 49 79 -221 -254 -101 221 -198 144 225 -12 -70 156 -260 -41 65 -152 116 183 -10 -39 62 -250
6612 -250 -20 -115 206 98 6 74 102 -74 71 398 48 8 375 297 -336 -96 -27 35 66 -10 18 -147 227 289
6636 289 -126 454 275 -50 197 12 -155 107 130 -78 93 178 259 -32 184 210 211 -395 -63 -296 -78 223
6658B23l24k7P8j07K73l6l9l8K28k45Q2l13L13j85N0K2J04M5n5j48K5J23J08k0
6682A37q0m78M18j34m9J67Q0j00m1k72L70l07N60m94L09o1Q0l9M4m0k57K10K46
6705B69k66K2m5K77r5o00N07J81m60J93R4k6K7J20l44J61J73N8m57M97j96j69
6727g9R3K52l67J64R7n69M58j82J00k94O43m25J75j97L74l72M5L0j1k40P25l63
6749E7k9%j25O5P3L5om76M73o5J32l97M76k97K8J39l58M82l18J24k59M24q7K5
6773A16r1K27k95J02J06M9m54M18k18M4J63J12k42l19K14K22n31M28j47k81J46
6794b31M87J2k91l64O14m10L12k54N1J24J93Mm44L04k33P5j71K5L71k21M47n33
6816a33J46K27k9l51Q3L91k37k28L1O9L32j00k32j32K28K30m52J60L2o8j14J10
$$ plain form
6658 223 -101 -128 -50 -157 116 80 41 3 231 -14 68 -245 68 -117 -67 -45 59 104 49 -99 -74 49 157 137
6682 137 57 -421 -3 -137 -186 -19 61 -39 -80 -352 18 -289 271 -223 86 25 105 66 110 70 -187 23 269
6705 269 3 25 -20 257 162 -438 69 250 -210 -17 77 51 78 198 -146 15 188 246 -211 286 90 -79
6727 -79 14 266 -101 63 160 -409 49 -133 -33 -327 316 -109 66 -131 243 -129 -84 -54 -65 -305 420 57
6749 57 28 28 -97 -32 41 76 70 -406 67 2 134 -263 213 -84 -56 83 -275 207 -111 13 -246 178 91 116
6773 116 25 252 -43 59 165 214 -240 178 -40 4 167 279 37 -282 -68 154 -377 51 -96 -377 -231
6794 -231 256 268 -23 -387 227 -183 129 -125 -74 50 243 247 -197 107 -126 -51 -222 -197 174 -47 400 -133
6816 -133 13 240 211 -140 -57 334 97 -131 -100 -31 301 201 -31 -163 65 295 -157 3 35 -33 -147 -37
6838c7K5q6J76m6j41nK48k77P3k12L81k51k2N73m07n5N91n50Q2k70K11n6J80m1
6862H4J2O6M3k10k5J66j6Q1j60O5j78K58Q9k52l86O39j61jj80P6K24m48M77m96
6886b33J83J8K33n87Q8O24l84O2J13LJ49l98O5k28J82P2Jj52P7K46r5np6J77O1
6911A96q9k81J95K71l55L6k50K91j82K76k74L09j08K68m04j4k90P55n30q7M31
6932A64k75L63ok20k91L82p2M1l5J64j43K9k27K74n40M89J48m52J93L14m79j00
6954b79L55M3j53l9Q1j81K70Lln41O02j52L4O5j4j41J35l1o8j03M04J07o02J88
6978b0m9j93n2O47k52n4J26j5k68LM53o47K08J26K54l18J90o5j31M7J58p0j38
7001f0K81k17l45N00l19K09oQ8k01l6M55k70k65j22M78k75M7J4m9P7r3J30j29
$$ plain form
6838 -37 -12 -98 78 32 -109 -114 134 -143 -70 -282 99 -152 -174 399 -8 -63 528 -22 60 -210 1 -55 125 84
6862 84 96 162 205 -5 -30 136 120 201 41 106 -72 186 275 23 -363 276 115 114 -66 10 234 -214 263 -233
6886 -233 -50 -32 201 -386 -298 326 -58 4 117 120 269 -129 -64 -292 -110 -38 -37 -189 -112 134 39 34 -42 135 196
6911 196 107 -174 21 292 -63 -27 -277 14 -168 108 -166 143 35 303 -101 -115 -405 350 -180 -267 164
6932 164 -111 252 246 26 -265 117 45 86 51 215 72 101 -126 148 -392 97 245 -207 -14 300 -179 -279
6954 -279 76 119 -34 -73 8 -173 97 100 97 -444 158 6 40 105 91 -50 85 54 -14 -117 287 394 -208 -20
6978 -20 -69 -262 -314 333 81 27 153 138 -130 -127 326 -321 -113 13 267 -51 139 74 -57 -10 148 78 -60
7001 -60 221 4 -341 159 -160 49 43 131 -70 -106 349 79 -186 -308 170 -105 -58 -44 -93 -16 -109 21 -108
7024a08j36RM58m86J42K6l0J29p3l0r1N11l82J66O2p0k18Qj8J43l7j20j0K13j73
7049a15P1J96j28J78m00L86l14N6n4R0L6k40N08r5l71n6L09j65J80K4r1r2j8M66
7073C61k51oM5k74L2j42K91K29l26j71J75N9q9j73L38r3N7j54J02j56K3R8j34
7096a59J76k85M82lk97q6J91j21q3N6K81m36N83k08j20j40K91J32m75J60r1j80
7118c32M17l53J87M6pK09j59J42k51n2K48j62j63J75o1L8J94J38k79k79P27l93
7140C0J01N4k25r3M5K33j41j31M6K56k09J17j80p2J52rQ2k07K41k22J37o7J69
7163A07j14J98p6P5n8Q0l34P7M11k10m6k56J50r3o4K60%l01L43j9k64K33q5J95
7187B09m56J21J77j52j23K34on2j28OP9J51o5p9K03r5q2j24L06j05l42L97l1J5
$$ plain form
7024 -108 -244 -235 223 -263 -121 -95 -125 4 -69 -99 -190 321 -61 105 167 97 -121 -113 -131 12 -25 -145 -155 58 -115
7049 -115 -44 152 24 202 -198 188 -126 -70 -124 -34 2 -238 270 175 -196 -252 57 -108 72 96 5 -87 -105 361
7073 361 110 104 149 -125 -93 -235 56 285 -41 -212 -37 22 -67 -240 98 5 62 -92 10 -146 -123 -25 -159
7096 -159 17 -268 214 211 -86 -172 19 -102 -185 -129 152 -284 299 91 -29 -169 122 254 -221 -61 -152 -332
7118 -332 85 -268 -81 -35 -42 167 8 150 -101 -153 95 -67 -230 -55 -116 -78 116 254 -25 -304 423 30
7140 30 131 185 -40 -133 -88 145 4 -127 -81 175 -34 83 -97 -169 -17 -26 56 -151 90 -132 5 -62 107
7163 107 -7 191 115 190 132 212 -122 -45 366 156 110 -146 4 -89 -153 107 107 -194 149 130 -134 99 14 209
7187 209 -247 -126 51 -101 -224 10 4 -48 -176 -170 -91 60 -5 -84 119 24 -58 -182 124 19 -323 74 43 58
7211E8p7k11K86K8j11pl7J43m7m8O6OK04l38J09M3K7k84L40l23L60p9j99J59j37
7236f9K5PL02n21K90K99k3j43j20o2k1jJ98r4k03N66k72n0j21K1K5j94M38j04
7260A73l32K86p3p3j43L37m42K89p1lJ26k29p8%L29k87L57m50L11k25N8L6J41
7283C7k44j55M91K0m74J34K65J0r5qR7J00M2m13K99r2J8j45J44J77m30L70o0r4
7307fk69L70N4k56L62n67N21NJ91m61N3R3j10P1j05K21j47M0rk98L75l38M49k61
7331b2N1J07m1k42M29p14M32J32l5k8m0q7K53l94JK03J8J1P9j6j38J40k52k41
7355c94M61K2J03k86K0K83k77L09k09j98L60Nl65J33P4k9n9L4J2q2P5j1O0O2j79
7380g6j51O7M94l55R3Kj12q8NJ57j18R5o3Jo5N42k40k07j05J23J9l70M80l95M15
$$ plain form
7211 58 -19 -230 56 84 -27 -34 -71 72 25 -23 43 49 253 -85 24 67 94 -190 150 -173 187 108 -91 68 -69
7236 -69 -44 -37 265 -256 34 333 310 167 47 -15 -36 -37 161 67 -136 430 158 108 -13 8 33 -161 277 173
7260 173 -159 127 54 -19 -162 175 -267 22 -49 -52 74 -155 -233 -233 96 -191 166 -284 27 -198 -140 -104 37
7283 37 -207 -362 129 149 -325 -191 74 84 -11 -19 78 178 220 -193 106 14 32 -113 31 208 -222 148 88 -6
7307 -6 -275 95 149 -107 255 -312 209 214 405 -56 -3 90 -20 51 -54 167 20 60 51 -247 128 -210 239 -22
7331 -22 29 136 95 -147 282 -432 0 132 97 69 29 -58 195 -199 -198 5 23 34 113 97 -41 99 -153 -394
7355 -394 67 89 192 -94 -74 209 -68 241 32 -166 194 199 -166 -33 41 12 -47 -13 -1 -83 -8 -19 41 103 -76
7380 -76 -227 -160 334 -21 72 74 -38 -126 -121 36 -82 13 -50 -49 -114 428 188 -19 -124 -1 18 -352 128 -267 148
7405A48l09K90j1j68j14L34k77n1l9R4J75J13k56J05m4K09l06K01j15L8k7J12
7427A02j6q8J07j24nJ00k70rK04p3j4lL53l68j82M14j81J96km5l3p6J32k53m8
7452a82J70J36L4L3j00K16l79L81m62J21J40l12r5K55L35p52M88p1o2J2Q2j02
7474a14l0K25l3L0r2rK5j52K47j82j54J3J71j42M50j45j04O9R0R8m64J27L5m09
7498d50O04q3P7j6k8K40l24K46q9l30j17L30k90j4L44j04K38j43k53J08J19J96
7520B61k77j75K95j22m0p9L00j36K06q7jk7k01Q5j38J94Q5l66K00O7j46k54M22
7543F6j94K50j16r1p0K81o8p6n0L2J26k29L43j66n9J66K57l54j94L7K29j05K51
7566B66j27j37p3j48K55k45L71j85j33K07n3p9J59k28K66n07M28o1J05k96K47
$$ plain form
7405 148 -161 129 118 -50 -164 170 -107 -158 -197 -103 72 185 -71 34 -10 199 -107 94 -21 17 -10 102
7427 102 86 -2 105 -19 -24 76 -194 -203 1 -72 -86 -89 264 -104 -286 128 -53 143 141 96 63 -13 119 -134 -182
7452 -182 -12 124 158 191 91 307 -72 309 -153 -32 108 -204 -299 -44 291 -461 27 -44 -106 -94 -12 -114
7474 -114 -144 81 48 78 -14 -23 2 -150 97 -85 -239 -226 -55 -197 253 108 4 73 163 261 -203 -76 -41 -450
7498 -450 154 71 148 132 104 344 20 266 177 -153 -270 60 -230 -244 100 -4 234 91 -162 -54 65 261
7520 261 -16 -191 104 -18 -58 -137 163 27 233 146 145 118 -83 2 -136 58 143 -223 -23 44 -102 -356 66
7543 66 -128 122 6 -85 -155 126 58 -18 -68 -36 90 -139 204 38 -21 145 402 48 -146 -109 120 15 266
7566 266 139 2 -71 -219 36 -209 162 -23 -156 51 -2 -81 78 -150 116 -391 37 -24 81 -215 32
7587C2k81J64o8K11r8M22l26k62M11P8l26j30M69l10j21P2L60m43K54k21j17O1
7609a69M22l4k24L8J04l1J05j9k30K27k73O9m2j1J50k97M1J49q9QJ06J8k20L75
7633A73jo29N70j34j55j3K50R1k41J93l07J34L05K67p00J42k3j2r0JQ1j73N75
7656C04k06J0j72J12k65J62K80r8k30K46k29K74m20O94m42k26o2L50R1j93j32
7677a52R9j38J05K30PJ96l70J34LJj33j22R8n6k72J85L2K18Mj07q1L3K69J5l31
7702a33OJ05J74k16k1M1J04j10qR2K6J01k09K24j01j62J10k3K14k72L01k37J9
7725B5k80L92k08O8J26j28P4q7K74o09M77J40m45J97J78m05J18j22K90k09J67
7746C3P2j40k1R7M5L0k26K60j86m50N47R5q8k31Q6k20K09J1K46l39J89l61L78
$$ plain form
7587 32 -249 -85 -153 58 -40 382 56 -206 205 283 -43 -173 296 -14 -135 -63 297 -146 108 -113 -230 -169
7609 -169 253 219 -5 33 137 106 211 192 -38 189 -84 -15 -57 -68 82 -215 -174 -25 -114 -106 0 18 -202 173
7633 173 172 -457 113 -21 -176 -189 61 152 -89 104 -203 -69 236 503 -197 -55 -78 -90 -180 -179 -98 -271 304
7656 304 98 108 -64 48 -217 -55 225 127 -103 143 -86 188 -232 462 20 -206 -268 82 173 -20 -152
7677 -152 -53 -191 -86 144 151 347 -23 111 114 115 -18 -140 -42 -98 -370 -185 -153 65 69 -38 -119 -86 183 198 -133
7702 -133 -127 -22 152 -64 -85 -44 60 -50 -58 34 60 161 -48 176 75 -87 23 0 214 -58 243 6 25
7725 25 -255 137 -71 -3 123 -5 69 -18 256 -353 124 264 -181 16 194 -211 -93 -215 75 -134 33
7746 33 105 -35 -56 41 86 116 -110 150 -36 -486 61 156 68 -163 -77 -297 -88 -77 169 -170 19 -342 36
7769C6J04J33m35J68J28p5j50J42J38n06J61K09J49k94L01j68k15K23j60K33J03
7790B25k49o3L91l33K72l08R4k10J50l1N2j21m9J93j91M34n1o8j50J60k2l60J93
7813d2K13q2j60P1J0K10J56m92J02n2J51k05k8M05m03j79L62j15L71j92m7l28
7835b74J02L86o57J91L60j91K81l63L29k71J60l13N79m37J0K74k80K39K11l75
7855c9n7K22j15j25J86K85q4j78J99l85j8j50K57Q6N0P3r7j08L6L04l31p8l65
7878d32N35l74K87J13l35K75j67J97Pk10r3L67k67j9K17j52J09jL01l66R6p2l6
7901b0j04J82R6k67K29L5J7O3m87M9M38k41mP4j67K86j84k11R5K56J07Km70N8
7925a68j39L13j15k6M8qR7K66j19j69J97n5K14j85k24j29K22l37M37N0m01K23
$$ plain form
7769 36 140 273 -162 6 134 59 -91 51 189 -317 -156 53 202 -92 209 41 -174 49 -111 122 225
7790 225 -24 -87 304 -29 243 -65 29 -181 -31 -62 -10 -131 -180 13 -178 256 205 137 -13 147 125 -235 -42
7813 -42 171 89 -71 0 10 220 376 -116 -14 -66 85 -120 -148 257 -146 -325 37 -78 293 101 54 -274
7835 -274 -172 214 -443 -252 108 -83 198 -165 164 -107 53 -260 319 -118 -108 166 -114 125 336 -39
7855 -39 -96 126 11 -114 72 357 273 95 294 -91 -109 -259 -2 84 134 207 110 2 38 342 11 -67 -432
7878 -432 103 -271 16 129 -206 69 -98 99 106 -104 -197 170 -97 -116 101 -51 58 57 358 -8 88 16 -20
7901 -20 -124 58 154 -113 116 151 168 231 -256 -207 231 -10 -14 60 -107 179 -5 -216 -121 135 242 244 -226 -168
7925 -168 -307 6 -109 -135 -87 -95 2 268 149 -20 177 122 336 151 -73 -202 20 -317 120 170 -231 -8
7947hJ61k12jJ48L0l84N17j62l0l65K55k27L98K4j05J43l5j91J65j66L10l53J1
7970g7N6M01k70k37j01J45J93%o3J26l59L79l05M0R4k00jL03k33J11R7j60k00
7993b61N61r7p0N5j89J24j83m4R3j73M06l47J41L5j42J34Rm0n0j07L15J03l74
8016a01J08J94k32N1P4n2l37K47J3J40j42L13k28k6O8k35rJ47L12m7P3l62J41
8039A10O4nk08j29M3J13P8J39j60rp0K1j94K16J39k59N6R1K15l03k3L94j56m0
8063A23k70J34m8J03J06l03R6q0K51N8N8k17k68K43j00K39l24J11m2J98j09M0
8085aj0j5K80k40N9j55j35P1J31P1k63L8L70k72M69j69l51J60p5k4k72q1K70J9
8109a25J79k41L4J11j20n3L81l40K47j46o8J11J24m4j02N1OJ7J29J30lm07n6J80
$$ plain form
7947 -8 153 -59 -60 88 118 -266 251 89 59 -306 -51 -278 120 144 39 182 147 -44 121 -45 265 -88 -77
7970 -77 -21 380 110 -127 -228 -83 110 110 47 173 -186 193 -112 -72 22 -178 -179 124 -109 2 99 -61 -261
7993 -261 300 203 133 188 -1 123 -60 -104 -11 -184 222 -125 16 51 -91 43 52 12 -38 -145 170 273 -101
8016 -101 7 201 -31 20 94 42 -295 -48 -35 105 -37 276 48 22 90 -145 -154 -7 305 258 331 -31 110
8039 110 174 169 -39 -168 -125 -12 66 205 45 36 -34 -13 -207 9 148 -111 -55 36 251 -52 -75 319 163 123
8063 123 -147 -13 -61 42 148 -155 -59 -139 112 170 228 11 -257 -14 -114 125 -199 -88 -130 68 -41 -1
8085 -1 -11 -26 254 14 73 -82 -217 -146 -15 56 -207 -169 201 -71 398 229 -122 38 -37 -61 -333 -414 -144 -125
8109 -125 54 -187 -153 -42 -162 -215 166 -174 73 -73 -141 -30 94 50 -52 -1 5 22 151 281 278 -129 -185 -5
8133eqJ66j16k7j02L43m85J11K09j46j16J01O0K54k30j17K29k18j94L92k92Q3
8155a08k23O63j59j76j43kK07J77r1k38j20K9O1j20J92K76l72K04n00O15m93p5
8177c96N88m05j27L69K02k78m4L82q0m20M10k87J53J9
$$ plain form
8133 -5 -13 153 37 10 -92 251 -234 -123 86 -60 -176 -75 -15 239 9 -108 121 -97 -291 101 -191 -108
8155 -108 -331 332 173 -3 -146 -148 59 236 145 -93 -213 -184 -123 -243 -51 225 -147 57 -443 172 -321 -396
8177 -396 192 -213 -340 29 231 -47 -91 291 211 -209 201 -86 67 86
8191H6
$$ Imaginary data points
##PAGE= N=2
##DATA TABLE= (X++(I..I)), XYDATA
0@%%%%%%%jRj6J6j6J7k5L2m0M8n6O5p4R0j06J22j38J61j87K13k44K76l10L48l91
32b07M38m91N49o11O80p55Q39r32J032j142J264j399J550j719J909k124K370k656
50a405K991l393L885m495N285o354P888j0287J4601k4780R2425P4141j58134n1639
64e9271M4331Q2052J6495m7441q3070K666N8125J4985l3635K625n783l6828p206
77e1955M4478K6405p872l9685n0180J5064R5297L2720q3031o5510L5200O4120
89A5051L1376k2750o0528j9773N7219L8978k7842k0542Q315j2317q735K4923J5416
102A8791j0425j2513k5626j7098M1319M5786l2973n8578j319L0632K5880J3286
114A7162k7881m8478P226M8300J3295j3931q439k2087j2525L8269L6756j7661
$$ plain form
0 0 0 0 0 0 0 0 0 -1 8 -8 8 -8 9 -16 16 -24 24 -32 33 -41 49 -57 65 -73 88 -99 114 -130 146 -164 184 -207
32 -207 231 -260 289 -322 358 -397 442 -490 542 -600 664 -735 815 -904 1005 -1119 1251 -1405
50 -1405 1586 -1807 2078 -2417 2868 -3486 4402 -5885 8716 -16064 76361 150502 -7632 -59271
64 -59271 -14940 67112 83607 36166 -46904 -44238 13887 28872 -4763 -2138 -7921 -44749 -51955
77 -51955 -7477 18928 11056 -28629 -78809 -63745 31552 64272 -18759 -84269 -49069 15051
89 15051 46427 23677 -36851 -56624 595 39573 11731 -8811 -496 -12813 -21548 3375 18791
102 18791 8366 -4147 -29773 -46871 -5552 40234 7261 -51317 -52636 -22004 3876 17162
114 17162 -10719 -59197 -51971 -3671 9624 -4307 -12746 -34833 -47358 -9089 27667 10006
126A0006k9424r628M91K7803M0259j5116n1485o632K9938J9688J4349m711m3886
139a8348k3603L9390L9617l874k3226l3373j6680M2979N4636k1588n9858j0265
151c4193K9776L0234J6402k3324m4480L558M2009Q972j4163Oj1016j9824J4730
164a313L0338K33j6706j9606j9461J9632M9180l867n8943k1111L2034K8556L896
177B2862k1174l5184K58M0440J0030k9643n212J4775p482o716J4425Q377j352
190D404l859j7357n590L6986K6190l3856l3054J6986K8563R424n453k3128j5579
203a5323K4648K2620j7938j4467J2154l166j5602Q750J4239m241q533j3294j4386
216b4539K1172L3069j7714m3465P51K9466J2948k565j6041k2092R660L1595k66
$$ plain form
126 10006 -19418 -29046 -28555 -752 39507 24391 -27094 -33726 -3788 15900 30249 25538 -18348
139 -18348 -41951 -2561 37056 33182 9956 -23417 -40097 2882 57518 35930 -23928 -34193
151 -34193 -4417 25817 42219 18895 -25585 -22027 19982 28954 14791 14797 3781 -16043 -1313
164 -1313 29025 29258 12552 -7054 -26515 -6883 42297 38430 -20513 -41624 -9590 18966 22862
177 22862 1688 -33496 -33238 7202 17232 -12411 -17623 -2848 -10330 -17046 -2621 5756 4404
190 4404 545 -16812 -22402 14584 40774 6918 -26136 -9150 19413 28837 23384 256 -15323
203 -15323 9325 31945 14007 -460 11694 8528 -7074 1676 15915 11674 3141 -10153 -24539
216 -24539 -3367 29702 11988 -31477 -30726 -1260 11688 9123 -6918 -29010 -19350 12245 11979
229A1979j9761K014L870r348J0251J9995o457j5972j290R96J0630K1997q005l5534
243a4635q27L0981Q855j2828j0564j0583K073K1755L515k2980m862J1010n492
256d582l543J4143j951j7918m18P512J834P641J80k1575m107K5849O792j8230
270h373m142O776l05O201M775j2368k388J5413k298j4837R533J3015j0645p445
284g088N525P59K981P895j1380j3112J5300J2395j4395p282J1050p18n330N571
298B171j267m597R138J65j6161M608K0032m910j7437K858P995J450N249n135j5590
313a1431O659J9377p597j4940O963O021o875K179M240o923P38N891q259l317J5469
328H195j88j7994N08J4553m86l813j314p816K318J6514k336j9096L517J4955l850
$$ plain form
229 11979 -7782 -5768 -1898 -11246 -995 19000 12543 -3429 -4719 -3723 6907 28904 20899 -14635
243 -14635 -15462 15519 24374 11546 982 -9601 -7528 14227 17742 -5238 -10100 910 -4582
256 -4582 -8125 6018 4067 -13851 -14269 -6757 -4923 2718 2898 -18677 -22784 3065 9857 -8373
270 -8373 -12515 -5739 -6044 157 4932 -7436 -9824 5589 3291 -11546 -2013 11002 357 -7088
284 -7088 -1563 -804 2177 10072 -1308 -14420 880 13275 -1120 -8402 2648 1930 -3400 2171
298 2171 904 -3693 5445 5610 -10551 -5943 14089 9179 -8258 -5400 2595 4045 9294 4159 -11431
313 -11431 -4772 14605 7008 -7932 -969 5052 -1823 356 4596 -2327 -1589 4302 -3957 -7274 8195
328 8195 8007 -9987 -9479 5074 4588 775 -539 -8355 -6037 10477 8141 -10955 -7438 7517 3667
343C667o185L656k063k120Q885j947j0690P581Q383j1672m731J3098P42r952J782
358a566K091k441P359J180j4742O5J7404j838j3926J599O284j717K954M84j0659
373g469J664J3902m800j2113P304O282p982m82N966l920j013N880n993m744J2679
388E161K756j5096m13J2713r28n024K390l976j156J1645L05j4628K617J3088m245
403E209p136N438J35m517N846O29q845L824Q360r347n789J1356J074j0256J627
418b392L507l750L284L030j0708j715J2941K71j2845K204P277l895R32K912o716
433e663p54J0822k168j0063O160P061p844j524P289k023k823N073l342n442Q981
448C740M729j2195j994J0563j502n599L260j128m366O703K034j0113J101J0450
$$ plain form
343 3667 -2518 1138 -925 -3045 5840 3893 -6797 784 9167 -2505 -7236 5862 6604 -3348 -1566
358 -1566 525 -1916 5443 6623 -8119 -8054 9350 7512 -6414 -4815 1469 -248 2706 3190 -7469
373 -7469 -5805 8097 3297 -8816 -1512 4770 -3212 -3694 2272 -1648 -2661 3219 -2774 -7518 5161
388 5161 7917 -7179 -7592 5121 4193 -831 1559 -2417 -3573 8072 8377 -6251 -3634 9454 5209
403 5209 -1927 3511 3646 -871 4975 5604 -3241 583 8943 -404 -6193 5163 6237 -4019 -2392
418 -2392 1115 -2635 649 3679 -7029 -8744 4197 4468 -8377 -6173 1104 -2791 -1859 1053 -5663
433 -5663 -6417 4405 2237 -7826 -1666 5395 -2449 -3973 3316 1293 -1530 3543 201 -5241 3740
448 3740 8469 -3726 -5720 4843 3341 -2258 1002 -126 -4492 2211 4245 -5868 -4767 5683
462E683m651p824N738L422m721K536J202p251L027R675o507p359P987K576p041
477c508K846M985n655j443N510m346j456R134k172j2196L693J0425k817m169J083
492h6n133M49J2027m68j2638J377P643k037O02N615n210o159O917M051l632L687
508G005Q25j0821O50J4141M40r870j774R6n17R404K684j3854o382R559L344l683
524A247J448m102r235N144R002m250m528K159n328k521J1334M410j0413l884M482
539e035M07M975O913p885r750P427Q394j734P88M06q999R1J2860J601q002r54
555A503j061l130O780P209r424q467L911J325j104O233j517j2775j926R586J114
570a743o43J647j0072p142J2462J1593o372p802k078p32Q815J2098o295j4344
$$ plain form
462 5683 1032 -6792 -1054 2368 -2353 183 1385 -5866 -2839 6836 329 -7030 957 3533 -3508
477 -3508 -662 4323 -1332 -2775 2735 -1611 -3067 6067 3895 -8301 -4608 5817 3000 -1169 -86
492 -86 -5219 -4770 7257 6789 -5849 -4472 3171 1134 1736 7351 2141 -4018 2899 6950 3318 7005
508 7005 7830 -2991 -2341 11800 12240 2370 596 692 175 9579 12263 -1591 -7973 1586 4930 1247
524 1247 2695 -1407 -10642 -5498 3504 -746 -5274 -3115 -8443 -10964 370 4780 -5633 -9517 -5035
539 -5035 -4628 347 7260 -625 -10375 -2948 5446 3712 4500 4906 -4093 -4002 8858 10459 2457 1503
555 1503 442 -2688 4092 11301 1877 -6590 -2679 -1354 -2458 3775 2258 -10517 -12443 -2857 -1743
570 -1743 -2386 -739 -10811 -17953 -5491 6102 -270 -8072 -10150 -10882 -2067 10031 3736 -10608
584a0608K962R595J756K755J254r524m860J0085O061j300J10o785j0893Q003J7630
599A6241j944j4951o925R69Q695J3156m374k1206m175J4948P576k946m302p951
613g189m616J0840Q352n621m058M49o650R00J4819M108j2153q701J137O356J2515
628A0488L207j8730j2630J3101J5446j490p573q803m787J0201J2909n663j0659
641d983J513R93k028P845O744q048q049J246K482P760R899r299j8318K740J8249
656H746O689n383j0393r836O012J8647K595j6208o996M197K639N479M756q485
670B459r596K469L972J845P204j022j6590o337J4374J1781j147r209j3404j856
684a5057K0562J4860j3740j7597J170J0589R843M511r937j3532M087J2652K035
$$ plain form
584 -10608 -7646 1949 3705 6460 7714 -1810 -6670 3415 9476 8176 8286 1501 -9392 -1389 16241
599 16241 14297 -654 -7579 -6610 2085 15241 10867 -10339 -14514 434 8010 5064 762 -7189
613 -7189 -11805 -965 7387 1766 -2292 -1843 -8493 -7593 7226 11334 -819 -9520 -8383 -2027 10488
628 10488 13695 -5035 -17665 -4564 10882 9392 1819 -6984 -11771 -1570 11339 5676 -4983
641 -4983 -3470 -2477 -4505 3340 10084 2036 -6013 -4767 -2285 5475 15374 6075 -12243 -9503 8746
656 8746 15435 10052 -341 -10177 -4165 14482 17077 869 -6127 -1930 709 6188 10944 2459
670 2459 -7137 -4668 -696 1149 8353 7331 -9259 -15596 -1222 10559 9412 203 -13201 -15057
684 -15057 5505 20365 6625 -10972 -9802 787 10630 15141 5204 -8328 -4241 8411 10446
697A0446k286m52p865o906Q905R650j516o299r219p426J0098J8363m940k2199
711a1646p404R507J1826O261r450j9112r71J8036P111q061n695k774j231P338
725f265P948l439m940J92m331J354J4454O011j3782j0585M492J0124J0125n65
739A0793j6477j0887J3887J6110l810j1006n182j329P255R937m173j0232K0J736
753c358j714N931P483p441j0824O20O422P726N456q828j6660L658J9787N903r512
768D649r936m253O566J5475K435j4866o480O603M734K450L411n422q948J847P023
783E288K147K573k622j2201l885J4417R921p319r988n867K259J3716Q142j2898
797C683j4240M955J0470L023m61n834q662K724J0111J97m307J77m067n110P049
$$ plain form
697 10446 8160 7708 -157 -7063 1842 11492 9976 3677 -5542 -12968 -2870 15493 10553 -11646
711 -11646 -19050 -9543 2283 8544 -906 -20018 -20989 -2953 4158 -3903 -9598 -12372 -13603 -6265
725 -6265 1683 -1756 -6696 -6504 -10835 -9481 4973 10984 -2798 -13383 -8891 1233 11358 10793
739 10793 -5684 -16571 -2684 13426 9616 -1390 -6572 -7901 -646 9291 5118 -5114 -5094 -3358
753 -3358 -5072 859 8342 901 -9923 -9303 -2881 4845 10301 1473 -15187 -11529 8258 14161 4649
768 4649 -5287 -9540 -2974 12501 14936 70 -6410 193 4927 7377 10788 5366 -3582 -1735 5288
783 5288 7435 10008 7386 -4815 -8700 5717 15638 8319 -1669 -7536 -5277 8439 16581 3683
797 3683 -10557 -5602 4868 7891 7430 1596 -7066 -4342 5769 5966 1659 1836 -2231 -7341 -292
812b92Q508l619p241l474r26O047J0738m784j4539j337R673M480M59l833q764
827h904j266J1124M592o541k260O37k939K606P585j030n788l63n98J74Q352L552
843H933j0737o313O336N750J826p44p355o853P425R602l470o905p53r90J184P175
859D111M19q658j856L319K62K704M141n780p698M440O451N62J01l295p324K866
875e235J1386K09p595k264J045J229N712K742q408m096N589K763j029K105k612
890A541o043K056O565j246k778O54l687j687P219L072p175k889K568j60K186L743
906C939m488o066M341M706k880k72K060m568o43N918L41l898J516N03l641K864
922b68N218l479l991K825M13j651M198K17o115kN419j302j636K780k213l894M042
$$ plain form
812 -292 8216 4597 -2644 -6118 -7044 -997 9741 4957 -9582 -10919 -1246 3234 3693 -140 -8904
827 -8904 -10170 954 5546 -995 -3255 -2618 -5557 -2951 4634 3604 -2184 -2547 -3145 -2971 5381 8933
843 8933 -1804 -8117 -1781 3969 5795 5051 -2304 -9157 -1732 7870 4400 -2505 -3258 -4248 -3064 4111
859 4111 4530 -4128 -5984 -2665 -2403 301 4442 -1338 -9036 -4596 1855 2417 2518 -777 -8101 -5235
875 -5235 6151 6360 -1235 -3499 -2454 -1225 4487 7229 -1179 -5275 314 3077 2048 4153 1541
890 1541 -4502 -2446 4119 2873 95 749 -2938 -4625 2594 5666 -1509 -4398 -1830 -1990 196 3939
906 3939 -549 -6615 -2274 2432 -448 -720 1340 -3228 -3871 2047 2388 -1510 6 509 -3132 -268
922 -268 4950 1471 -2520 305 718 -933 3265 3482 -2633 -2635 2784 1482 -154 2626 413 -3481 561
939E61L555l929j180K118k452k88N172k58n665J024K677j665J164K507l981l115
955c755M839J386l240J235R90m573J769M805k440l625K516J82k135L368J647n488
971b519m97M577r19j651K233j433l343L009L329l818j271K980j200j732M095l06
987A534m220J740K861l151K12L351k765k624M468Q00m090J642K287k891K17L483
1003B854k194k384L608O14l867J910K392l406j52L487k359k312L508L91l803J772
1019E9K628l694p00M058j783k888K786R41l393J626K462l755r55M213r38k508
1035a841K331R68l402J812K681l050j361M175j156k901K906R34l485J251L248
1050C110l067j076L556j747k780L301Q58l995M21K915k440q94K747k051k292L520
$$ plain form
939 561 4116 187 -993 1125 -1327 -1615 3557 3299 -2366 -1342 1335 -330 834 3341 -640 -3755
955 -3755 1084 2470 -770 465 1455 -3118 -1349 3456 1016 -2609 -93 89 -2046 1322 2969 -2519
971 -2519 -3016 1561 642 -1009 1224 -209 -3552 -543 2786 -1032 -2303 677 -523 -2255 1840 1534
987 1534 -2686 -946 1915 -1236 -1024 2327 -438 -3062 1406 2206 -1884 -242 2045 -846 -629 2854
1003 2854 660 -1724 1884 2498 -1369 541 2933 -473 -625 2862 503 -1809 1699 2090 -1713 59
1019 59 2687 -1007 -1707 2351 568 -2320 466 1407 -1986 -360 2102 -1653 -2608 1605 667 -1841
1035 -1841 490 1458 -1944 -132 2549 -501 -1862 2313 1157 -1744 1162 2096 -1389 -138 3110
1050 3110 43 -1033 2523 776 -2004 1297 2155 -1840 -1419 1496 -944 -1838 909 -1142 -3434 86
1066H6R49l829O33K926k739r00L406j207k511K684J008k951J040K944k696j314
1082b471M039p37k469K240J353l434J305L030l173j418L964o97l210K347J633
1097B302l119N48K601k727j165L912r97l682K372J721k879O91K405k653j840L910
1113A400L2l501K242J689l951J123M037k339k560K624n14j614L110P00m488l36
1129b346M297p40j767J657p51k715K932K599l529r42K484k039m46L960m32m538
1145b316J252K953j404N06J883l790k205N193J442l708J16J100k711J422L951
1160C684k759l331K248K49k055K827J396m893j245L713L34j052J035j903l119
1175d871L622M031l669k063J970q18n2M033n28m077Q00K414j353Q71L543l295
$$ plain form
1066 86 1035 -2794 -2161 765 -1974 -2874 532 -675 -3186 -502 506 -2445 -1405 1539 -1157 -2471
1082 -2471 1568 831 -1638 602 1955 -1479 -174 2856 -317 -1735 2229 1532 -1678 669 2302
1097 2302 -817 -269 2332 -395 -1560 2352 1355 -2327 45 1766 -1113 -422 1983 -670 -2510 1400
1113 1400 1432 -2069 173 1862 -2089 -966 3071 732 -1828 796 282 -1332 1778 2478 -2010 -2346
1129 -2346 1951 1211 -556 1101 350 -2365 567 3166 -363 -1305 1179 -860 -1306 2654 2222 -2316
1145 -2316 -1064 1889 485 991 2874 -916 -3121 2072 3514 -194 -78 1022 -1689 -267 3684
1160 3684 925 -2406 -158 91 -1964 863 2259 -2634 -3879 -166 168 -884 151 -1752 -4871
1175 -4871 -1249 2782 -887 -2950 -980 -1798 -1850 2183 1655 -2422 -1622 792 -561 310 3853 558
1191E58l851L167L115j126k34k47m318J613O040j059m659k45O40q40L432J522
1207C508n060k318L523M11j064K589j132n408J343N198o59j334j74l233q46O755
1223B099K425n380k602J646Q80L063K857m210n193L615M372q54o2l90m493J79
1239b048N755P91l397o75j022k206M512M291m442m745R99J459J391L561j816p801
1255e393O14O505J434j862j657l349m28O022K792m974k317J555o71J478M123j410
1271B462m910l32K466N52L017R34o744l473O061M557j245k666l508k375O179N414
1287F389m286n728J201K062Q17K614k66m737j015K978N25P92K521l598o248L014
1303b965O825L62k899l305l710L756Q216r80q928k308L918K852K546m44o030k617
$$ plain form
1191 558 -3293 -126 2989 1863 1629 1382 -2936 -1323 4717 3658 -1001 -1246 -606 -1446 1986 3508
1207 3508 -1552 -3870 -347 64 -1000 1589 457 -4951 -3608 1590 931 -403 -577 -3810 -4656 2099
1223 2099 4524 -856 -3458 -1812 -932 2131 4988 778 -4415 -800 3572 2718 2656 2266 -2227 -2048
1239 -2048 3707 4498 1101 426 -596 -2802 1710 6001 1559 -3186 -2187 -728 663 4224 2408 -5393
1255 -5393 -4779 1726 3160 1298 -359 -3708 -4136 1886 4678 -296 -2613 -1058 -1729 -251 3872 2462
1271 2462 -2448 -2780 -314 238 3255 4189 -2555 -6028 33 4590 3345 679 -2829 -5204 975 6389
1287 6389 2103 -3625 -2424 -362 455 3069 2803 -1934 -2949 29 554 1346 3867 269 -5979 -2965
1303 -2965 3860 4222 1323 -1982 -5692 -1936 6280 5300 -3628 -5936 -2018 834 3380 2936 -3094 -5711
1319e711N132K844j932Q66q63m771M55O303J309k318k603l383O24Q045L669p727
1335f1o414K939N568K776r3o104n197N178O487k025l334n44j733j17M941J379
1351C646l751j535q86j510L945N503l731p361K10M588L495J774m392o709J179
1366e535R025J765n241k766j89L68M852K228m702k251J838K3P22L916j14o097
1382b158j721L683K543J911j89p186k957O847O380l583n043k018O11M925M107
1397F152m264n920J578L380j90J114Q84m467k001L456K059p3J382l874m733L165
1413b352P681o79n221k783k08L636O148j396q455j561N819K622o84n48l753j949
1429c683L960K955k174n28r0l317j71O176R06m260k256l75Q00N018K420o745m674
$$ plain form
1319 -5711 -579 2265 333 1199 336 -4435 -3980 2323 3632 1314 -1289 -4672 -4048 3997 7666 -61
1335 -61 -6475 -3536 2032 4808 4715 -1389 -6586 -1408 5079 3054 -280 -824 -2557 -2674 2267 3646
1351 3646 -105 -1640 -2526 -4036 -91 5412 1681 -5680 -5470 -882 2613 4387 -5 -6714 -5535
1366 -5535 3490 5255 14 -2752 -2941 -2573 2279 4507 -195 -2446 -608 -585 137 4053 3939 -2158
1382 -2158 -3879 -196 2347 4258 4069 -3117 -6074 773 7153 3570 -1473 -3491 -2880 2045 6152
1397 6152 1888 -4032 -2454 926 736 1850 2734 -1733 -3734 -278 1781 1708 3090 -784 -5517 -2352
1413 -2352 5329 4650 -571 -3354 -3562 74 6222 4826 -3629 -5190 629 3251 2567 2019 -1734 -3683
1429 -3683 277 3232 1058 530 440 -2877 -3048 3128 4034 -226 -2482 -2857 -2057 2961 5381 -1364 -6038
1446f038L992M430j99r10k804l122L396M784j539l543P90l69j293L262K064l190
1462b89j714K91j86K041L880k890n636J024M689J082n76j544m143P97O102J122
1478D050m519j332P83m91K427K454k877l051J684R63k71K587q0n009o04M064J785
1495B563j116n94k739k115M723L635l703k937Q88M04R91L136j811m295P83K946
1511G59j38K1J266l275j895L537K149j864l35k10k877K037M508j608m183N28J374
1528b06n3K193M45m405m33L217O15j106N70p17k464J869K985j571j764J037j357
1545a145n90L460O88l756k59K136p74P82J633k301k784K784K051k060K93L84k466
1562a924O55L170m98k744J308L89j827K257J897l156j438J981J59o51K064m84
$$ plain form
1446 -6038 -2046 2384 2185 1275 -1529 -4651 -1255 3529 1990 -1553 -763 -1132 -2425 837 2901 -289
1462 -289 -2003 -1712 -1898 143 4023 1133 -4503 -3479 1210 2292 1716 172 -3971 -3174 2928 4050
1478 4050 -469 -1801 -1018 -1509 918 3372 495 -2556 -872 91 -180 2407 2327 -2682 -3286 778 2563
1495 2563 1447 853 -1886 -4001 722 4357 654 -2283 -1395 -991 0 3136 1325 -2970 -2187 759
1511 759 621 642 1908 -1367 -3262 275 2424 560 225 15 -2862 -825 3683 2075 -2108 -1580 -206
1528 -206 -259 1934 2379 -2026 -2459 758 1373 267 837 120 -2344 -475 2510 939 -825 212 -1145
1545 -1145 -1735 1725 2413 -1343 -1602 534 -240 542 2175 -126 -2910 -126 1925 -135 158 542 -1924
1562 -1924 -1269 1901 1403 -1341 -33 356 -1471 786 2683 -473 -1911 70 229 -422 1642 1158
1578A158l211J200K536p02j281R59q42j552K728J050k513o02J743j429R3K692
1594B027j371k442J809J101j517N93R28k138n06L039m46j937O91Q36j895J311
1610H3J748k069j539K519m45j422J853N51k624J19K383j092p25J390o38j906K223
1627D09J417k778L77J675j341n92J934m60j960J204J451k308J72K279j554j218
1643a293K604o39k016J694Q62k097n1K177j130j250J877m48j271Q54J300k015
1659h42k84K114r99j264K013j69j710J046J028j972L74J983j483j018J678N69
1675A064k058J033J196j939k54K234j205j288J905M00k008P84J311j963j39K013
1691A086j017j019J554K37j928J084J156j684k40K108r10j632J775M65j950P81
$$ plain form
1578 1158 -2053 -853 1683 981 -300 659 -183 -1735 993 2043 -470 -1072 671 -758 -665 2027
1594 2027 656 -1786 23 1124 -393 200 1128 -1010 -1516 1523 1077 -860 -169 667 -1228 83
1610 83 1831 -238 -1777 742 297 -1125 728 1279 -1345 -1226 1157 65 -660 730 92 -1814 409
1627 409 1826 -952 -575 1100 -241 -833 1101 641 -1319 -115 1336 -972 -800 1479 -75 -1293
1643 -1293 1311 672 -1344 350 1212 -885 -936 1241 111 -1139 738 290 -981 -127 1173 -842
1659 -842 -1126 988 -11 -1275 738 569 -1141 -95 933 -1039 -665 1318 -165 -1183 495 1064
1675 1064 -994 39 1235 -704 -958 1276 71 -1217 688 1088 -920 -136 1175 -788 -927 1086
1691 1086 69 -950 604 841 -1087 -3 1153 -531 -771 1337 427 -1205 570 1035 -915 -134
1707a34J461j796k77K020r65j143J033O01j946O97J574j774m62K030p90j172J586
1724E43M93k249Q50J437j517l22J858j233j154J942O29k201M10J560j345m71J659
1741H89n25j756J929O57k114P43J698j947m32J952o31j431J027P35j564P03J538
1758A471j880j010K405k93j728J034O50j687P99J864k196q04J865n6j827J990
1774E97O34k433O2K160j024o27J641r75j644K342J242k477j14J278o60o54J618
1791I66j05k114J514O25j387J74J596j534r78J863k7j065M09N18j690Q97K357
1808B019k007j778J776M35q68R35M53k170M20J944r04j171J355p0k025J672J513
1825A529j467l49Q09j094k92K346l06k942P50J754r26l5Q64j539q25K506J59j654
$$ plain form
1707 -134 1327 -469 -746 1274 309 -834 199 800 -1146 -449 1125 -649 -1111 919 129 -1043 543
1724 543 1036 -1213 -363 1074 -443 -765 1093 -140 -1294 648 1277 -924 -514 1046 -299 -770 889
1741 889 364 -1392 537 1194 -920 -177 1521 -426 -858 1094 463 -968 59 794 -770 -67 1471
1758 1471 -409 -1419 986 693 -1035 -1 649 -1038 -239 1625 -571 -1375 490 434 -1393 597
1774 597 1231 -1202 -1140 1020 -4 -631 1010 35 -1609 733 1975 -502 -616 662 2 -652 966
1791 966 861 -1253 261 886 -501 -327 1269 -265 -1243 620 593 -472 -63 455 -1235 -338 2019
1808 2019 12 -1766 10 445 -423 512 965 -1205 -785 1159 255 -916 439 369 -1656 16 1529
1825 1529 62 -287 522 -572 -864 1482 1176 -1766 -1016 738 -188 -223 641 -898 -1723 783 942 -712
1843g12O56P66k119L15K368p96j484N77R4m71J863J015l592n48K977K4r45M35
1861D23o10j570J821J209j361k31P10j318r23K543J126k673q55R96K31R26J220
1878A664k661j953K468K169j507q09N54j293O95K323p71j653Q96O7j393J917J537
1895B250k028j851J327M33Q41J236j446l358J643L269n77j805Q7r11k59K480M06
1912A737k630L0J195j224L96K409j210k656R54J410L17M63k00k804k5L141R00
1929B203j854q32l30l05J852K029k093k139O97M74K48J796k53l302k53K886L12
1946A136o31M0j793j270K719J715j538j304J01p10J096K721o13l307k72J362J121
1963E73J181j36l317j302L300K054j707j216m14n89J638K124j694j717J069n59
$$ plain form
1843 -712 -56 710 -1409 -1094 1274 478 -1006 -429 -335 -806 1057 2072 -1520 -2068 909 933 -12 423
1861 423 -187 -1757 64 1273 -88 -319 391 -927 -1850 693 1819 -854 -1709 -713 -482 444 1664
1878 1664 -997 -2950 -482 1687 180 -629 -75 -1368 -673 1650 879 -774 122 189 -1204 713 2250
1895 2250 222 -1629 -302 131 972 2208 762 -2596 -953 2316 1739 -66 21 -890 -1149 1331 1737
1912 1737 -893 -863 332 -892 -496 1913 703 -1953 -999 411 728 1191 991 -1813 -1838 1303 2203
1929 2203 349 -483 -813 -1118 734 2763 670 -1469 -772 -298 -50 1746 1493 -1809 -2062 824 1136
1946 1136 505 545 -1248 -2518 201 1916 378 -926 -825 -1535 -439 2282 1669 -1638 -1910 -548 573
1963 573 1754 1618 -1699 -3001 299 2353 646 -570 -984 -1573 65 2189 495 -1222 -153 -712
1979g12r46K402J559k560k362J472J420J344M86l123l085L495L779j415k522r49
1995a717O74J317J897j605j932J108J206j885P59K345j279k374K91J472J167J655
2011C099k698l758J329M787L77l777j376M72J486J980n38l232j16K492l51r80
2027h04J746J52k480p45J951P81J294p73l514o07M415K318l141k540K38J562J677
2044A530P87k743j895J943J458r29M02M33j923r45K096Q14k21r4k074j854L062
2061a53K907k224k411L54R55O72J836j169k902M11K297J96q8R4j471j135K248
2078D17J691j270r45k37q75J294K486j124k682K41J509j92Q78K99k206j206K021
2095I9J033q0J41j480k129J476L028o45k612m15P30J030J564k89k821nK344p26
$$ plain form
1979 -712 -1658 744 2303 -257 -2619 -1147 273 1617 2103 -1020 -4105 -610 3169 1754 -768 -1717
1995 -1717 -1043 274 2171 566 -1366 -258 948 -937 -178 2167 888 -1486 -1195 277 1444 3099
2011 3099 401 -3357 -2028 2759 3136 -641 -2017 -1545 -59 1921 1383 -1849 -1965 527 176 -804
2027 -804 942 1094 -1386 -2131 -180 601 1895 1122 -2392 -2999 1416 3734 593 -1947 -1709 -147 1530
2044 1530 2317 -426 -2321 -378 1080 151 553 986 -937 -1882 214 1028 807 713 -1361 -3215 -153
2061 -153 2754 530 -1881 -1527 -572 100 1936 767 -2135 -1724 573 769 681 775 -696 -1831 417
2078 417 2108 838 -107 -344 -1219 75 2561 1437 -1245 -1004 505 313 1191 1490 -716 -1922 99
2095 99 1132 1052 1193 -287 -2416 -940 2088 1443 -1169 -1584 -854 176 1740 1451 -1370 -1375 969 243
2113B43l78J241p41j629L94J306K22O15o66k632j03L876O29l206j203R83J081
2130C2J500j9l253k86K339O40j740N58R58j211r21J266L16M51J78k186r80K959
2148F01K180k403k516J072J257J325M3k234j445K207K071k287o85J568o72j028
2164i46R65O48P9j01q16j697K000K539j533k859M19J526R46j02r71j926J287K112
2182A570j212j626J451M44j479L47J416j61l19o81j110P00K616k64l386J11K343
2199G60K37o89j70r33NJ787j62j727P68J307j612r55J706O25r45l77n44k33K282
2218A130P13k669j235K556M42r92k08J12m18O95L62j344K44J595r37j546J229
2235b71J311q41p18J67l18J244Q14j633j761K177J673j722p14M45o2M38L52r08
$$ plain form
2113 243 -135 1106 365 -1264 -870 436 658 1273 607 -2025 -2128 1748 2377 -829 -2032 -1049 32
2130 32 1532 1513 -1740 -2026 313 953 -787 -229 729 -482 -1403 -137 179 630 808 -1378 -2358 601
2148 601 2781 378 -2138 -1066 191 1516 1559 -675 -2120 87 2158 -129 -814 754 82 -946
2164 -946 19 667 746 645 -171 -1868 132 2671 1138 -1721 -1302 224 1170 1068 97 -1829 -542 1570
2182 1570 358 -1268 183 627 -852 -505 911 750 431 -250 -1360 -660 1956 1692 -1694 -1583 760
2199 760 997 308 138 -795 -790 997 835 -892 -124 1183 -429 -1384 322 947 2 -375 -919 -1152 1130
2218 1130 1843 -826 -2061 495 937 -55 -263 -151 -569 126 488 -856 -612 983 46 -1500 -271
2235 -271 1040 199 -519 -352 -670 574 1388 -245 -2006 171 1844 122 -592 -147 -209 229 581 -327
2253c27m87J398J01j972O65K303j004j448L7N61L30J129j249j569J388K054j982
2270g2j433J633K20n09Q4j46k07Q04Q12k128l00K228M04k236j40J125O8J68k24
2289A51j456O18K084q85k180Q57K163j196m92K61k04M36Q41j334j374K192J252
2306A734j966o52J353M82o18J86r46j74J898K01k368J55K061l72j581L75Q27l00
2324B95P95p15j516R60J429j091j780J436J307r99m29j8J8R13O74k102o35K411
2342I53K92j827k82J207J79j01j77j035K43K055m54k323O04J780n17j239O96J08
2360A62p5N79r52j318J596J209k204q54J331P74o84j15k95k62J355K90k165m2
2378a670K036j76j323P2R48j7j00J76p72M97J578j136j885J562J652j092q32L04
$$ plain form
2253 -327 -814 584 685 -1287 -622 1681 677 -771 -734 -173 157 1286 37 -1532 -144 1910 -72
2270 -72 -1505 128 348 -161 -77 -223 -430 374 1186 -942 -1242 986 1390 -846 -986 139 207 375 151
2289 151 -1305 -687 1397 512 -1668 -811 1352 156 -336 -75 -279 157 998 -336 -1710 482 1734
2306 1734 -232 -884 469 951 333 519 -427 -601 1297 1498 -870 -715 1346 974 -607 -232 595 295
2324 295 1090 375 -1141 -181 1248 157 -1623 -187 1120 121 -308 -326 -308 605 1279 -823 -1458 953
2342 953 1245 -582 -864 343 522 421 244 -791 -548 1507 1053 -1270 -666 1114 597 -642 54 162
2360 162 87 666 -286 -1604 -8 1201 -1003 -1857 -526 248 -436 -551 -846 -1108 247 537 -1628 -1670
2378 -1670 366 190 -1133 -1061 -113 -130 -230 -54 -826 -329 1249 113 -1772 -210 1442 350 -482 -178
2396a78J69K69R52j528r59J614J202k009p8J158l94j87O9l66mJ290n14j774O59
2415f09J982r39j212P47J70r1J034m89j373J155J530j348j016J061N21j099L60
2432C84n1m13P91N49j657r1K098n43j756L80J190k87k56R7j148M21J437n22j744
2451a121J189J027q63o09O80k68l40P18p84o09J739L05j912n92K060J1p44L9n30
$$ plain form
2396 -178 -9 260 1212 -316 -1275 339 1541 -468 -546 612 218 31 100 -266 -270 1020 506 -1268 -609
2415 -609 1373 434 -778 -31 139 48 1082 593 -780 375 1905 557 -459 602 1123 24 384
2432 384 333 -80 711 1260 -397 -488 1610 1067 -689 -309 881 594 338 435 -713 -292 1145 623 -1121
2451 -1121 68 1095 232 -377 303 35 -305 413 -371 -980 759 1064 -848 -1440 620 631 -113 -74 -604
$$ [...]
8191C36
##END NTUPLES=NMR FID
##END=
