##TITLE=1H_T-3945
 aceton-d6, 8 sc, 
 28.2.2020
##JCAMPDX= 6.0         $$ Bruker NMR JCAMP-DX V2.0
##DATA TYPE= NMR FID
##DATA CLASS= NTUPLES
##ORIGIN= UXNMR, Bruker Analytische Messtechnik GmbH
##OWNER= root
$$ XWIN-NMR		Version 3.5
$$ Fri Feb 28 16:30:23 2020 Russian Standard Time (UT+4h)  she@DPX200
##.OBSERVE FREQUENCY= 200.1315
##.OBSERVE NUCLEUS= ^1H
##.DELAY= (6, 6)
##.ACQUISITION MODE= SIMULTANEOUS
##.ACQUISITION SCHEME= undefined
##.AVERAGES= 8
##.DIGITISER RES= 18
##SPECTROMETER/DATA SYSTEM= spect
##.PULSE SEQUENCE= zg30
##.SOLVENT NAME= D2O
##.SHIFT REFERENCE= (INTERNAL, D2O, 0, 15.7039)
##AUDIT TRAIL= $$ (NUMBER, WHEN, WHO, WHERE, WHAT)
$$ ##TITLE= Audit trail, XWIN-NMR		Version 3.5
$$ ##JCAMPDX= 5.01
$$ ##ORIGIN= Bruker BioSpin GmbH
$$ ##OWNER= she
$$ F:/spectra/data/she/nmr/H-F/1/audita.txt
$$ ##AUDIT TRAIL=  $$ (NUMBER, WHEN, WHO, WHERE, WHAT)
(   1,<2020-02-28 16:29:18.04 +0400>,<she>,<DPX200>,
      <created by zg, POWCHK disabled, PULCHK disabled
       configuration hash MD5:
       00 E9 B6 7A A2 85 ED C7 34 08 36 98 17 FE 4E 26
       data hash MD5: 16K
       C8 30 9C E6 D5 14 24 E8 D0 6D 0B 79 D5 E5 12 EF>)
$$ ##END=
$$ 
$$ hash MD5
$$ B4 1E AD 7F 93 98 B0 9D 3E 6D 2D 34 BC 08 A6 B5
##$RELAX= 
##$RELAX= 
##$RELAX= 
##$RELAX= 
##$RELAX= 
##$RELAX= 
$$ Bruker specific parameters
$$ --------------------------
##$DU= <F:/spectra>
##$EXPNO= 1
##$NAME= <H-F>
##$PROCNO= 1
##$TYPE= <nmr>
##$USER= <she>
##$AMP= (0..31)
100 100 100 100 100 100 100 100 100 100 100 100 100 100 100 100 100 100 
100 100 100 100 100 100 100 100 100 100 100 100 100 100 
##$AQSEQ= 0
##$AQ_mod= 1
##$AUNM= <au_zg>
##$AUTOPOS= <>
##$BF1= 200.13
##$BF2= 200.13
##$BF3= 200.13
##$BF4= 200.13
##$BF5= 200.13
##$BF6= 200.13
##$BF7= 200.13
##$BF8= 200.13
##$BYTORDA= 1
##$CFDGTYP= 0
##$CFRGTYP= 5
##$CHEMSTR= <none>
##$CNST= (0..31)
1 1 145 1 1 1 1 1 1 1 1 1 1 1 1 1 1 1 1 1 1 1 1 1 1 1 1 1 1 1 1 1 
##$CPDPRG= <>
##$CPDPRG1= <>
##$CPDPRG2= <>
##$CPDPRG3= <>
##$CPDPRG4= <mlev>
##$CPDPRG5= <mlev>
##$CPDPRG6= <mlev>
##$CPDPRG7= <mlev>
##$CPDPRG8= <mlev>
##$CPDPRGB= <>
##$CPDPRGT= <>
##$D= (0..31)
0 1.2 0 0 0 0 0 0 0 0.06 0 0.03 0 0 0 0 0.0002 0 0 0 0 0 0 0 0 0 0 0 0 
0 0 0 
##$DATE= 1582892957
##$DBL= (0..7)
120 120 120 120 120 120 120 120 
##$DBP= (0..7)
150 150 150 150 150 150 150 150 
##$DBP07= 0
##$DBPNAM0= <>
##$DBPNAM1= <>
##$DBPNAM2= <>
##$DBPNAM3= <>
##$DBPNAM4= <>
##$DBPNAM5= <>
##$DBPNAM6= <>
##$DBPNAM7= <>
##$DBPOAL= (0..7)
0.5 0.5 0.5 0.5 0.5 0.5 0.5 0.5 
##$DBPOFFS= (0..7)
0 0 0 0 0 0 0 0 
##$DE= 6
##$DECBNUC= <off>
##$DECIM= 24
##$DECNUC= <off>
##$DECSTAT= 4
##$DIGMOD= 1
##$DIGTYP= 9
##$DL= (0..7)
0 120 120 120 120 120 120 120 
##$DP= (0..7)
150 150 150 150 150 150 150 150 
##$DP07= 0
##$DPNAME0= <>
##$DPNAME1= <>
##$DPNAME2= <>
##$DPNAME3= <>
##$DPNAME4= <>
##$DPNAME5= <>
##$DPNAME6= <>
##$DPNAME7= <>
##$DPOAL= (0..7)
0.5 0.5 0.5 0.5 0.5 0.5 0.5 0.5 
##$DPOFFS= (0..7)
0 0 0 0 0 0 0 0 
##$DQDMODE= 0
##$DR= 18
##$DS= 0
##$DSLIST= <SSSSSSSSSSSSSSS>
$$ [...]
##$SUBNAM2= <"">
##$SUBNAM3= <"">
##$SUBNAM4= <"">
##$SUBNAM5= <"">
##$SUBNAM6= <"">
##$SUBNAM7= <"">
##$SUBNAM8= <"">
##$SUBNAM9= <"">
##$SW= 24.9337058887773
##$SWIBOX= (0..15)
0 0 2 0 0 0 0 0 0 0 0 0 0 0 0 0 
##$SW_h= 4990.01996007984
##$TD= 16384
##$TD0= 1
##$TE= 0
##$TE2= 300
##$TE3= 300
##$TEG= 300
##$TL= (0..7)
0 120 120 120 120 120 120 120 
##$TP= (0..7)
150 150 150 150 150 150 150 150 
##$TP07= 0
##$TPNAME0= <>
##$TPNAME1= <>
##$TPNAME2= <>
##$TPNAME3= <>
##$TPNAME4= <>
##$TPNAME5= <>
##$TPNAME6= <>
##$TPNAME7= <>
##$TPOAL= (0..7)
0.5 0.5 0.5 0.5 0.5 0.5 0.5 0.5 
##$TPOFFS= (0..7)
0 0 0 0 0 0 0 0 
##$TUNHIN= 0
##$TUNHOUT= 0
##$TUNXOUT= 0
##$USERA1= <user>
##$USERA2= <user>
##$USERA3= <user>
##$USERA4= <user>
##$USERA5= <user>
##$V9= 5
##$VALIST= <valist>
##$VCLIST= <CCCCCCCCCCCCCCC>
##$VD= 0
##$VDLIST= <DDDDDDDDDDDDDDD>
##$VPLIST= <PPPPPPPPPPPPPPP>
##$VTLIST= <TTTTTTTTTTTTTTT>
##$WBST= 1024
##$WBSW= 4
##$XGAIN= (0..3)
0 0 0 0 
##$XL= 0
##$YL= 0
##$YMAX_a= 140909
##$YMIN_a= -101411
##$ZGOPTNS= <>
##$ZL1= 120
##$ZL2= 120
##$ZL3= 120
##$ZL4= 120
##$ABSF1= 10
##$ABSF2= 0
##$ABSG= 5
##$ABSL= 3
##$ALPHA= 0
##$AQORDER= 0
##$ASSFAC= 0
##$ASSFACI= 0
##$ASSFACX= 0
##$ASSWID= 0
##$AUNMP= <proc_1d>
##$AZFE= 0.1
##$AZFW= 0.1
##$BCFW= 1
##$BC_mod= 2
##$BYTORDP= 1
##$COROFFS= 0
##$CY= 11.3945322036743
##$DATMOD= 1
##$DC= 2
##$DFILT= <>
##$DTYPP= 0
##$F1P= 16.9975609425685
##$F2P= -3.02152046262296
##$FCOR= 0.5
##$FTSIZE= 0
##$FT_mod= 4
##$GAMMA= 1
##$GB= 0.15
##$INTBC= 1
##$INTSCL= 1
##$ISEN= 128
##$LB= 0.24
##$LEV0= 0
##$LPBIN= 0
##$MAXI= 10000
##$MC2= 0
##$MEAN= 0
##$ME_mod= 0
##$MI= 1.114404
##$NCOEF= 0
##$NC_proc= 0
##$NLEV= 6
##$NOISF1= 3.799351
##$NOISF2= 2.8
##$NSP= 1
##$NTH_PI= 0
##$NZP= 0
##$OFFSET= 15.70392
##$PC= 1
##$PHC0= -9789.681
##$PHC1= 15.60082
##$PH_mod= 1
##$PKNL= yes
##$PPARMOD= 0
##$PSCAL= 0
##$PSIGN= 0
##$REVERSE= no
##$SF= 200.130013532006
##$SI= 16384
##$SIGF1= 3
##$SIGF2= 2
##$SINO= 400
##$SIOLD= 16384
##$SREGLST= <1H.CDCl3>
##$SSB= 0
##$STSI= 0
##$STSR= 0
##$SW_p= 3612.71676300578
##$SYMM= 0
##$S_DEV= 0
##$TDeff= 0
##$TDoff= 0
##$TI= <>
##$TILT= no
##$TM1= 0
##$TM2= 0
##$TOPLEV= 0
##$USERP1= <user>
##$USERP2= <user>
##$USERP3= <user>
##$USERP4= <user>
##$USERP5= <user>
##$WDW= 1
##$XDIM= 8192
##$YMAX_p= 0
##$YMIN_p= 0
$$ End of Bruker specific parameters
$$ ---------------------------------
##NTUPLES= NMR FID
##VAR_NAME=  TIME,          FID/REAL,        FID/IMAG
##SYMBOL=    X,             R,               I
##VAR_TYPE=  INDEPENDENT,   DEPENDENT,       DEPENDENT
##VAR_FORM=  AFFN,          ASDF,            ASDF
##VAR_DIM=   8192,          8192,            8192
##UNITS=     SECONDS,       ARBITRARY UNITS, ARBITRARY UNITS
##FACTOR=    0.0002004,     1,               1
##FIRST=     0,             0,               0
##LAST=      1.6414764,     0,               0
##MIN=       0,             -101411,         0
##MAX=       1.6414764,     140909,          0
$$ Real data points
##PAGE= N=1
##DATA TABLE= (X++(R..R)), XYDATA
$$ plain form
0 0 0 0 0 0 0 0 0 0 0 0 -8 8 -8 8 -8 14 -16 16 -24 24 -30 33 -41 46 -53 61 -71 79 -90 102 -114 129 -145 163
34 163 -182 204 -224 249 -278 307 -341 378 -418 464 -513 569 -631 703 -784 878 -991 1122
52 1122 -1283 1486 -1743 2093 -2591 3365 -4743 7970 -35535 27208 72215 -35135 -101411 -94477
66 -94477 -27389 20741 -244 -72542 -79167 -35567 -22647 -30617 -6842 -8759 -47730 -59786 -25381
79 -25381 11210 34647 6753 -64158 -69024 25364 76473 17422 -48935 -47525 -3016 45266 44649
92 44649 -17159 -51244 -10587 19710 3949 -770 2551 -21185 -34446 -13891 2253 8125 6971
105 6971 -29206 -59123 -16892 38139 21245 -25247 -39148 -26745 6737 42502 23175 -28209
117 -28209 -29592 7999 24022 30053 29633 -3474 -26315 7270 43394 38135 20159 -1515 -21608
$$ packed form
0@%%%%%%%%%%qJ6j6J6j6K2l0L2m0M8n4O3p4Q7r9J14j32J50j69J92k16K43k74L08
34A63l45L86m28M73n27N85o48P19p96Q82r77J082j200J334j487J662j869K113
52A122k405K769l229L836m684N956q108J2713m3505O2743M5007j07350o6276O934
66i4477O7088M8130k0985p2298o625M3600J2920p970K3775j917l8971j2056L4405
79b5381L6591K3437k7894p0911m866R4388N1109n9051o6357J410M4509M8282o17
92D4649o1808l4085M0657L0297j5761m719L321k3736j3261K0555J6144N872j154
105F971l6177k9917M2231N5031j6894m6492j3901J2403L3482L5765j9327n1384
117b8209j383L7591J6023O031m20l3107k2841L3585L6124n259j7976k1674k0093
$$ plain form
130 -21608 4217 52806 45010 -1361 -16832 -7585 7697 39593 45450 -3082 -36114 -10466 24888
143 24888 39172 32266 -10271 -46362 -8369 52737 44391 -4858 -26496 -18418 10881 43574 27737
156 27737 -20383 -24383 4732 9982 9438 17720 -136 -29308 -20449 5561 15799 13445 -10867
169 -10867 -47803 -32196 26482 33713 -17165 -43815 -26731 1712 24436 13305 -27215 -31321
181 -31321 7925 18225 -2021 910 11663 -708 -6046 7004 15204 23056 22005 -8479 -23054
194 -23054 17984 48756 17598 -17703 -13565 4294 22028 25385 -4276 -27500 -5719 14189
206 14189 -2733 -9662 1829 -7982 -23446 -13941 -1272 1761 2617 -16372 -39776 -15339 28317
219 28317 16034 -23671 -28525 -7453 10940 22622 8162 -21421 -13801 17127 17208 4241 9978
$$ packed form
130b1608K5825M8589p796m6371j5471R247J5282L1896N857m8532l3032K5648L5354
143B4888J4284o906m2537l6091L7993O1106q346m9249k1638Q078K9299L2693j5837
156B7737m8120m000K9115N250n44Q282j7856k9172Q859K6010J0238k354k4312
169a0867l6936J5607N8678P231n0878k6650J7084K8443K2724j1131m0520m106
181c1321L9246J0300k0246K931J0753j2371n338J3050Q200P852j051l0484j4575
194b3054M1038L0772l1158l5301M138J7859J7734L357k9661k3224K1781J9908
206A4189j6922o929J1491r811j5464R505J2669L033Q56j8989k3404K4437M3656
219B8317j2283l9705m854K1072J8393J1682j4460k9583P620L0928Q1j2967N737
$$ plain form
232 9978 5208 -10433 799 20944 15824 4137 -3669 -15242 -4640 25759 18983 -19993 -26279
245 -26279 -2355 7604 5339 -3343 -23052 -23900 1734 6457 -13101 -12809 -4953 -15562 -14717 4541
259 4541 3870 -9998 -10352 -9468 -7233 10597 13758 -12858 -18024 8119 14942 1583 -103 -331 -2795
274 -2795 7791 12721 -2910 -3110 13042 5666 -9318 2590 13682 2905 -2199 -511 -3797 4392
288 4392 15661 -50 -15037 2092 13677 -452 -4266 4765 846 -1667 5079 -199 -3282 10151
302 10151 7688 -12424 -6043 15042 9445 -5619 -4633 -2878 1000 12570 5006 -15443 -7138 12843
316 12843 3990 -8431 -394 1151 -5154 856 2843 -5398 -325 5704 -7749 -9678 10306 9178
330 9178 -9651 -7989 3172 3453 5046 3723 -10019 -7197 13549 9893 -9720 -5263 7074 1918
$$ packed form
232I978m770j5641J1232K0145n120j1687p806j1573J0602L0399o776l8976o286
245b6279K3924R959k265q682j9709q48K5634M723j9558K92P856j0609Q45J9258
259D541o71j3868l54Q84K235J7830L161k6616n166K6143O823j3359j686k28k464
274b795J0586M930j5631k00J6152p376j4984J1908J1092j0777n104J688l286Q189
288D392J1269j5711j4987J7129J1585j4129l814R031l919k513O746n278l083J3433
302A0151k463k0112O381K1085n597j5064R86J755L878J1570p564k0449Q305J9981
316A2843q853j2421Q037J545o305O010J987q241N073O029j3453j929J9984j128
330I178j8829J662J1161K81J593j323j3742K822K0746l656j9613M457J2337n156
$$ plain form
344 1918 31 3448 -3443 -3243 7878 2413 -9412 2099 9305 -5301 -7952 5173 3980 -3130
358 -3130 -469 -2855 -5610 7087 7669 -11168 -9605 8691 6103 -6097 -3093 -1259 -2717 5538
372 5538 4738 -9876 -5501 9911 2665 -8375 1220 5254 -3077 -613 3811 -2132 1118 7380 -3225
387 -3225 -7494 9286 10947 -5906 -4843 6336 3995 2913 5017 -3437 -4948 10656 8548 -8208
401 -8208 -3743 7732 1340 -3195 2026 -1803 -4671 3960 661 -10235 -1841 6320 -6738 -11017
415 -11017 1673 1271 -6866 -3690 -2919 -7535 1005 4348 -9517 -9938 6226 4456 -7185 -2551 2111
430 2111 -2252 2732 5625 -5028 -3297 9363 4042 -6237 2602 7464 -1567 -1104 4724 -91 25
445 25 6680 -1267 -7815 4501 8272 -5702 -5868 4003 233 -3072 2165 -2163 -5632 3841 4091 -8370
$$ packed form
344A918j887L417o891K00J1121n465j1825J1511P206j4606k651J3125j193p110
358c130K661k386k755J2697N82j8837J563J8296k588j2200L004J834j458Q255
372E538q00j4614M375J5412p246j1040R595M034q331K464M424n943L250O262j0605
387c225m269J6780J661j6853J063J1179k341j082K104q454j511J5604k108j6756
401h208M465J1475o392m535N221l829k868Q631l299j0896Q394Q161j3058m279
415a1017J2690m02q137L176P71m616Q540L343j3865m21J6164j770j1641M634M662
430B111m363M984K893j0653J731J2660n321j0279Q839M862r031M63N828m815J16
445B5O655p947o548J2316L771j3974j66R871l770l305N237m328l469R473K50j2461
$$ plain form
461 -8370 -3521 8306 521 -5890 1254 1740 -1356 4904 3394 -6867 -924 10067 1381 -5187 3781
476 3781 3425 -3896 2316 5703 -2216 -654 3871 -3803 -3208 10031 5671 -8808 -3171 6033 3962
491 3962 4347 4267 -6163 -4100 11691 10345 -2652 -480 4677 171 4222 11264 2297 -4495 2646
506 2646 3253 344 7844 6290 -10409 -9527 5480 5515 -2355 -4363 -10453 -12772 2096 6750 -9666
521 -9666 -16089 -7414 -5971 -5141 1588 -4536 -16371 -9166 882 -1869 -1333 2037 -7832 -10937 5114
536 5114 11303 1680 -825 -171 -3602 5728 16964 6062 -6197 -66 5417 4069 9361 8072 -7583
551 -7583 -9081 4529 5860 -628 -1021 -7677 -14638 -3231 6342 -3630 -11238 -8623 -11142 -9262 4037
566 4037 3317 -11832 -13056 -3979 -1735 5364 9975 -4555 -15088 478 15298 11798 6076 -129
$$ packed form
461h370M849J1827p785o411P144M86l096O260j510j0261N943J0991q686o568Q968
476C781l56p321O212L387p919J562M525p674N95J3239m360j4479N637R204k071
491C962L85q0j0430K063J5791j346j2997K172N157m506M051P042q967o792P141
506B646O07k909P500j554j6699Q82J5007L5p870k008o090k319J4868M654j6416
521i666o423Q675J443Q30O729o124j1835P205J0048k751N36L370r869l105J6051
536E114O189r623k505O54l431R330J1236j0902j2259O131N483j348N292j289j5655
551g583j498J3610J331o488l93o656o961J1407R573r972p608K615k519J880J3299
566D037p20j5149j224R077K244P099M611j4530j0533J5566J4820l500n722o205
$$ plain form
580 -129 -6745 5215 23071 15625 -1199 -683 5144 5739 13633 15741 550 -7522 656 5356 7936
595 7936 12411 561 -18392 -10429 11594 12766 -72 -11729 -18343 -8062 14988 13810 -12219
608 -12219 -19406 -5270 3620 7370 6691 -6101 -14217 -1932 7537 4366 5769 3850 -10211 -11203
622 -11203 8923 17132 5740 -4954 -11891 -7992 13657 22951 -734 -19519 -8180 8413 12703
635 12703 10006 -3645 -15326 -3557 13409 8642 450 1638 -3008 -6966 5161 15248 8002
648 8002 -971 -5362 -8339 5152 23861 12645 -14143 -15043 3003 14655 15055 1758 -18347 -15206
662 -15206 9994 15410 -530 -9092 -9696 -9725 -84 9603 1188 -9886 -9136 -9568 -5423 10631 12961
677 12961 -9237 -20660 -6600 9817 16571 9511 -13410 -22198 3693 25837 13539 -7775 -12834
$$ packed form
580a29o616J1960J7856p446j6824N16N827N95P894K108j5191q072Q178M700K580
595G936M475j1850j8953P963K2023J172j2838j1657o614J0281K3050j178k6029
608a2219p187J4136Q890L750o79j2792q116J2285R469l171J403j919j4061r92
622a1203K0126Q209j1392j0694o937L899K1649R294k3685j8785J1339J6593M290
635A2703k697j3651j1681J1769J6966m767q192J188m646l958J2127J0087p246
648H002q973m391k977J3491J8709j1216k6788r00J8046J1652M00j3297k0105L141
662a5206K5200N416j5940q562o04k9R641R687q415j1074P50m32M145J6054K330
677A2961k2198j1423J4060J6417O754p060k2921q788K5891K2144j2298k1314n059
$$ plain form
690 -12834 -7270 6906 17990 6364 -13358 -11565 -1914 -595 2745 4933 -9053 -21268 -12934
703 -12934 -1194 2392 395 -14079 -31013 -18785 9635 9729 -13176 -26418 -21124 -4253 12939
716 12939 6775 -18554 -22345 -1944 8778 5447 3186 -3333 -9342 -56 11307 9861 8402 6177
730 6177 -5752 -7048 14247 24335 9263 -6297 -8830 62 18503 23780 -328 -19338 -5800
743 -5800 14085 13930 5191 -4794 -12202 -3246 11559 8594 -580 -378 -3216 -7734 3245 16630 9627
758 9627 -3460 -7130 -3720 9445 23419 12781 -12358 -11978 10598 21517 15485 2282 -10759
771 -10759 -6034 15622 20677 3766 -5303 -1840 -332 4919 12530 6014 -6716 -6675 -2291 1110 10648
786 10648 9716 -10554 -18996 -2264 11950 8875 -1574 -14745 -17201 2539 17282 3240 -14677
$$ packed form
690a2834N564J4176J1084j1626j9722J793R651J319L340K188j3986j2215Q334
703a2934J1740L586j997j4474j6934J2228K8420R4k2905j3242N294J6871J7192
716A2939o164k5329l791K0401J0722l331k261o519o009R286J1363j446j459k225
730F177j1929j296K1295J0088j5072j5560k533Q892J8441N277k4108j9010J3538
743e800J9885j55q739r985p408Q956J4805k965r174K02k838m518J0979J3385p003
758I627j3087l670L410J3165J3974j0638k5139L80K2576J0919o032j3203j3041
771a0759M725K1656N055j6911r069L463J508N251P611o516j2730M1M384L401R538
786A0648r32k0270q442J6732J4214l075j0449j3171k456J9740J4743j4042j7917
$$ plain form
799 -14677 -12357 -4089 2840 7806 705 -13317 -11147 11 194 -337 2467 -6149 -15719 -7104 5547
814 5547 4066 -1727 -8740 -15515 -6705 11785 8424 -10232 -13727 -5181 1990 8396 6103 -8533
828 -8533 -11798 2129 7994 2936 2722 821 -6573 -2383 8320 7130 1770 187 -5104 -6382 7665
843 7665 13122 -764 -10017 -5925 174 6006 8555 -3016 -14479 -5570 6382 3873 -664 -3045
857 -3045 -8515 -6591 5142 6293 -3030 -4712 -3174 -4768 2459 10259 2578 -7527 -4198 2480 5103
872 5103 9358 4572 -8444 -5851 8646 10138 2299 -886 -3741 -4172 6259 10415 -561 -6276
886 -6276 -1406 -151 556 5730 1787 -7846 -4979 2010 876 698 1965 -5764 -8913 1845 6721
901 6721 -756 -3441 -2622 -4373 775 7999 1543 -6677 -1397 2671 612 3578 4558 -2921 -3371 3957
$$ packed form
799a4677K320Q268O929M966p101j4022K170J1158J83n31K804q616r570Q615J2651
814E547j481n793p013o775Q810J8490l361j8656l495Q546P171O406k293j4636
828h533l265J3927N865n058k14j901p394M190J0703j190n360j583n291j278J4047
843G665N457j3886r253M092O099N832K549j1571j1463Q909J1952k509m537k381
857c045n470J924J1733J151r323j682J538j594P227P800p681j0105L329O678K623
872E103M255m786j3016K593J4497J492p839l185k855m31J0431M156j0976n715
886f276M870J255P07N174l943r633K867O989j134j78J267p729l149J0758M876
901F721p477k685Q19j751N148P224o456q220N280M068k059K966R80p479m50P328
$$ plain form
917 3957 3874 509 3573 1505 -4716 428 7271 2023 -1815 693 -1265 -2084 5155 4864 -3694 -3416
933 -3416 2237 209 44 3683 -572 -5677 309 3964 -652 -165 1326 -4151 -3507 4733 3005 -3507
949 -3507 -1068 279 -2780 1257 4824 -2261 -5647 1003 1397 -1292 1654 924 -5272 -2103 4311 653
965 653 -2612 838 -1246 -3807 2405 3964 -3167 -3174 2316 -106 -1194 3417 438 -4616 635 3899
981 3899 -1173 -843 2861 -1074 -2241 3991 2581 -2914 785 2932 -1672 335 4590 -378 -2786
996 -2786 2836 2887 -1927 1251 2891 -1891 -479 3767 -61 -2880 2457 1852 -3106 382 2504 -2513
1012 -2513 -1376 2730 -1158 -3892 1321 783 -4214 -493 2624 -3144 -2507 2309 -817 -3556 1222
1027 1222 566 -3427 681 3066 -2589 -2617 3263 242 -2405 2034 1422 -2637 634 3752 -1802 -2315
$$ packed form
917C957q3l365L064k068o221N144O843n248l838K508j958q19P239k91q558K78
933c416N653k028j65L639m255n105N986L655m616M87J491n477O44Q240j728o512
949c507K439J347l059M037L567p085l386O650L94k689K946p30o196L169O414l658
965F53l265L450k084k561O212J559p131pN490k422j088M611k979n054N251L264
981C899n072L30L704l935j167O232j410n495L699K147m604K007M255m968k408
996b786N622N1m814L178J640m782J412M246l828k819N337o05m958L488K122n017
1012b513J137M106l888k734N213n38m997L721L117n768O37M816l126k739M778
1027A222o56l993M108K385n655k8N880l021k647M439o12m059L271L118n554n13
$$ plain form
1043 -2315 3022 74 -3099 1646 1539 -3768 -1005 1853 -2541 -2692 1561 -2017 -4863 391 961 -4443
1059 -4443 -2558 947 -3207 -3056 1737 -1406 -4496 1005 1979 -3621 -723 2755 -1549 -1662 3227 801
1075 801 -1771 2731 2968 -1528 1177 5143 132 -873 4117 2144 -1308 3011 3173 -2156 777 4299
1091 4299 -608 -1652 3514 1312 -2749 1083 2215 -2044 -263 2419 -2353 -2616 3016 1140 -3376
1106 -3376 268 2179 -2136 203 3280 -1542 -2920 2626 1693 -2222 1669 2256 -2865 -708 3826
1121 3826 619 -1906 1435 -271 -2850 2727 3889 -3169 -2756 2423 550 -575 3014 -354 -4172
1136 -4172 973 3847 -939 -732 1758 -1873 -2284 4062 2961 -3100 -1355 726 -1510 1164 3834
1151 3834 -2439 -5468 813 2551 -1543 -244 -323 -5209 -2477 3347 -556 -3807 -1035 -2028 -4409 1048
$$ packed form
1043b315N337k948l173M745j07n307K763K858m394j51M253l578k846N254N70n404
1059d443J885L505m154J51M793l143l090N501R74n600K898L478m304j13M889k426
1075H01k572M502K37m496K705L966n011j005M990j973l452M319J62n329K933L522
1091D299m907j044N166k202m061L832J132m259J781K682m772k63N632j876m516
1106c376L644J911m315K339L077m822j378N546r33l915L891N87n121K157M534
1121C826l207k525L341j706k579N577J162p058M13N179j873j125L589l368l818
1136d172N145K874m786K07K490l631m11O346j101o061J745K081k236K674K670
1151C834o273l029O281J738m094J299p9m886K732N824l903l251K772r93k381N457
$$ plain form
1167 1048 3429 -3530 -4839 -171 -137 -292 3604 -286 -5967 -288 5148 1455 -262 1573 -1299 -1502
1183 -1502 5211 4887 -712 367 2095 -1006 1723 6896 1522 -4380 -858 1680 1280 3533 1501
1198 1501 -5982 -4709 3727 2882 -2377 -1697 -3391 -4703 1305 4111 -2341 -4827 -996 -1587 -1034 4462
1214 4462 2232 -5224 -3580 2323 2431 3897 3897 -2974 -5191 4244 8708 2512 -666 -993 -2207 3195
1230 3195 9082 3125 -4684 -1922 1821 1558 4079 3406 -4504 -5638 1755 3039 394 936 -2783 -7690
1246 -7690 -1408 6336 1906 -3809 -4078 -4767 -1696 6390 4011 -6791 -7174 204 2960 3350 2414 -4517
1262 -4517 -6985 1779 6403 1180 -1015 -396 -4005 -1615 5853 4510 -1910 -2828 -2829 -2339 4921 7706
1278 7706 -2672 -9161 -2423 4489 4850 3506 -3478 -9218 -1352 8241 3910 -3357 -3195 -2848 -1899 4300
$$ packed form
1167A048K381o959j309M668L4j55L896l890n681N679N436l693j717J835k872k03
1183a502O713l24n599J079J728l101K729N173n374n902L522K538m00K253k032
1198A501p483J273Q436q45n259O80j694j312O008K806o452k486L831n91N53N496
1214D462k230p456J644N903J08J466%o871k217R435M464o196l178l27j214N402
1230C195N887n957p809K762L743k63K521o73p910j134P393J284k645N42l719m907
1246g690O282P744m430n715k69o89L071Q086k379j0802l83P378K756L90r36o931
1262d517k468Q764M624n223k195O19l609K390P468j343o420r18jM90P260K785
1278G706j0378o489O738O912L61j344o984n740P866R593m331p267J62L47R49O199
$$ plain form
1294 4300 4422 -2576 -3861 -1196 -2112 1257 6988 1215 -8814 -6339 2248 5270 4234 -1626 -10240
1309 -10240 -6117 7254 8284 -2303 -6746 -4437 -1263 4749 6165 -2297 -6900 -847 1908 806
1323 806 4355 3491 -4965 -5671 2577 5220 4537 1948 -6336 -8175 4502 12226 2762 -6848 -5979 -820
1339 -820 5595 8573 -652 -9411 -3984 4195 3050 842 284 -4672 -5949 1003 4073 1278 95
1354 95 -3080 -8006 -1387 8862 5519 -4762 -6816 -2985 3248 9695 4524 -7736 -7288 4483 8219
1369 8219 3647 731 -2720 -3715 3585 7396 1942 -562 505 -2291 -1736 6493 7179 -1434 -5191 -2801
1385 -2801 105 6261 7417 -4022 -10934 -1793 7355 5327 -317 -5026 -7117 -194 8104 2920 -4856
1400 -4856 -3455 -1005 -1182 2923 5106 -1382 -5180 -1945 93 2546 6169 721 -8888 -4963 5896
$$ packed form
1294D300J22o998j285K665r16L369N731n773j0029K475Q587L022j036n860q614
1309a0240M123J3371J030j0587m443K309L174O012J416q462m603O053K755j102
1323H06L549q64q456p06Q248K643o83k589q284j839J2677P724r464r610Q69N159
1339h20O415K978r225q759N427Q179j145k208n58m956j277O952L070k795j183
1354I5l175m926O619J0249l343j0281k054L831O233O447n171j2260M48J1771L736
1369H219m572k916l451r95P300L811n454k504J067k796N55Q229O86q613l757K390
1385b801K906O156J156j1439o912R141R148k028n644m709k091O923Q298n184p776
1400d856J401K450j77M105K183o488l798L235K038K453L623n448r609L925J0859
$$ plain form
1415 5896 6972 1616 -3335 -7120 -3498 7766 7467 -4048 -7015 -1644 1233 2934 3581 -2500 -6517
1430 -6517 -1322 1945 203 1589 1337 -5651 -6280 2103 5258 1372 -2228 -5705 -5813 3154 8446 -188
1446 -188 -7888 -4405 1026 3441 4073 -463 -7206 -2892 4354 2594 -567 640 -2014 -4336 1311
1461 1311 5150 1011 -935 -1708 -4223 17 7442 3821 -5303 -4650 747 2842 4539 2358 -4957
1476 -4957 -5135 3723 5526 510 -770 -1346 -3214 547 5419 1181 -2448 -891 -1369 -1503 4097 4837
1492 4837 -2920 -5168 -363 2139 2741 3147 -2654 -6243 335 5826 1898 -1523 -1111 -3039 -974 4673
1508 4673 2770 -3279 -2578 760 -142 1553 4002 -1123 -4573 -345 2387 1279 1967 219 -4708 -2085
1524 -2085 4605 3102 -1686 -1317 -1374 -1620 3061 3621 -2283 -3693 836 817 373 2489 444 -3937 -922
$$ packed form
1415E896J076n356m951l785L622J1264k99j1515k967N371K877J701O47o081m017
1430f517N195L267j742J386k52o988o29Q383L155l886l600l477j08Q967N292q634
1446a88p700L483N431K415O32m536o743M314P246j760l161J207k654k322N647
1461A311L839m139j946p73k515M240P425l621r124O53N397K095J697k181p315
1476d957j78Q858J803n016j280n76j868L761M872m238l629J557m78j34N600P40
1492D837p757k248M805K502O02M06n801l589O578N491l928l421M12j928K065N647
1508D673j903o049P01L338r02J695K449n125l450M228K732j108O88j748m927K623
1524b085O690j503m788L69n7k46M681N60n904j410M529j9m44K116k045m381L015
$$ plain form
1541 -922 2702 497 -212 913 -1888 -2887 2654 3620 -1139 -1514 87 -1433 392 4065 -151 -3892
1557 -3892 -214 2055 -222 1211 1503 -2423 -2272 2528 1801 -1264 483 102 -2745 709 3685 -408
1573 -408 -2194 418 -424 -1002 3108 1599 -3113 -1881 2272 621 -180 1765 -689 -2828 1533 2357
1589 2357 -1121 -632 804 -1503 -961 2919 738 -2867 -395 1003 -1391 807 2066 -1812 -2677 1582
1605 1582 962 -1707 293 288 -2286 -631 2373 -455 -2170 913 -77 -2022 1313 1836 -1897 -1290 1550
1622 1550 -509 -1183 1663 403 -2670 811 1963 -1061 -824 1469 -789 -1296 1706 407 -2305 453
1638 453 1805 -1593 -276 2097 -637 -1436 1463 532 -1779 884 1722 -1895 -1112 1850 -191 -1656
1654 -1656 971 389 -2030 250 1297 -1486 -1009 2065 -401 -1690 1351 945 -1588 318 1465 -1538
$$ packed form
1541i22L624k205p09J125k801r99N541R66m759l75J601j520J825L673m216l741
1557c892L678K269k277J433K92l926J51M800p27l065J747l81k847L454K976m093
1573d08j786K612q42n78M110j509m712J232M153j651q01J945k454k139M361Q24
1589B357l478M89J436k307N42L880k181l605K472J398k394K198J259l878q65M259
1605A582o20k669K000nk574J655L004k828j715L083r90j945L335N23l733O07K840
1622A550k059o74K846j260l073L481J152l024K37K293k258n07L002j299k712K758
1638D53J352l398J317K373k734p99K899r31k311K663Q38l617P83K962k041j465
1654a656K627n82k419K280J047k783M77L074k466j289L041m06k533J906J147l003
$$ plain form
1670 -1538 -673 1855 -423 -1628 1399 968 -1931 372 1470 -964 -779 1826 -201 -1452 1475 861
1686 861 -1625 257 1729 -1150 -769 1913 165 -1791 1470 1106 -1613 -14 1688 -1010 -1114 1685
1702 1685 -65 -1805 1202 1110 -1482 512 1769 -1714 -1295 1652 285 -1914 901 667 -1959 132
1718 132 1984 -1242 -1435 1637 -44 -1676 953 1240 -1856 -379 1419 -900 -898 1954 45 -1942
1734 -1942 1573 1596 -1732 -248 1507 -748 -671 1672 418 -1893 1032 1468 -1541 -134 2083 -865
1750 -865 -1423 1462 685 -1585 632 594 -1781 -74 1806 -1283 -2229 1529 502 -1270 271 791 -1706
1767 -1706 59 1950 -503 -1491 1684 730 -1299 610 1717 -1133 -413 1807 -263 -389 2293 292
1783 292 -2084 1009 2239 -568 -737 1308 -778 -746 2119 339 -2066 374 1080 -1260 -469 1657
$$ packed form
1670a538Q65K528k278j205L027m31k899K303J098k434J85K605k027j251K927o14
1686H61k486J882J472k879L81K682j748j956L261l64k719J599J702k698j04K799
1702A685j750j740L007r2k592J994J257l483M19K947j367k199K815k34k626K091
1718A32J852l226j93L072j681j632K629K87l096J477J798k319KK852j909j987
1734a942L515K3l328J484J755k255P7K343j254k311K925M36l009J407K217k948
1750h65n58K885p77k270K217l8k375J707J880l089r46L758j027j772J541N20k497
1767a706J765J891k453r88L175r54k029J909J107k850P20K220k070j26K682k001
1783B92k376L093J230k807j69K045k086L2K865j780k405K440P06k340P91K126
$$ plain form
1799 1657 -579 -1996 866 998 -944 681 436 -2334 -670 2555 335 -1836 90 516 -751 1494
1815 1494 1430 -1915 -918 1597 178 -928 1251 338 -2420 -225 1681 -276 -155 836 -2102 -1614 2410
1832 2410 1414 -2366 -1604 419 -904 199 1636 -1295 -2218 769 1066 -1246 461 1288 -2340 -1415
1848 -1415 2333 1578 -974 65 -1235 -1621 2026 3216 -1389 -2859 548 743 32 1496 -344 -2583
1864 -2583 -341 1926 -242 -501 1016 -1637 -2615 1203 2717 -241 -1187 -651 -1581 1451 3550 -305
1880 -305 -3678 -168 2515 1164 929 821 -2007 -702 2708 1336 -553 1039 167 -2190 432 3531
1896 3531 1212 -1753 -916 -914 475 3573 979 -4188 -2530 2087 1537 126 -193 -2257 -2440 1455 2177
1913 2177 -1055 -831 20 -1932 -633 3130 1510 -2126 -1589 -451 148 2956 2657 -2718 -3384 1365
$$ packed form
1799A657k236j417K862J32j942J625k45k770J664L225k220k171J926M26j267K245
1815A494o4l345R97K515j419j106K179r13k758K195J906j957J21R91k938M88M024
1832B410r96l780P62K023j323J103J437k931r23K987K97k312J707Q27l628R25
1848a415L748p55k552J039j300l86L647J190m605j470L407J95p11J464j840k239
1864b583K242K267k168k59J517k653r78L818J514k958r46N36r30L032K099l855
1880c05l373L510K683j351k35j08k828J305L410j372j889J592q72k357K622L099
1896C531k319k965Q37KJ389L098k594n167J658M617n50j411l19k064j83L895P22
1913B177l232K24Q51j952J299L763j620l636N37J138N99K808k99n375o66M749
$$ plain form
1929 1365 2861 481 237 -1211 -3314 409 3791 608 -2086 -1002 -1126 -984 2357 2126 -2975 -3032
1945 -3032 -112 288 1059 1403 -1606 -4267 -59 2759 681 -126 -847 -2835 -1029 3774 2966 -1481
1961 -1481 -2196 -1357 242 2834 3670 -2071 -4023 171 2769 1129 638 -610 -2649 -309 2729 848
1977 848 -885 198 -1270 -2401 1413 3822 250 -2732 -2123 -484 2670 4499 -484 -5516 -1365
1992 -1365 4142 2620 -108 -1182 -2225 108 3499 1723 -1449 131 696 -1633 -186 3123 1895
2007 1895 -1707 -2520 -1425 1297 4030 1359 -5250 -4263 3165 4056 -54 -2871 -3415 -905 3311 2647
2023 2647 -2308 -2252 1099 103 -1079 1814 1991 -1134 -2015 -698 954 3213 3127 -3108 -5072 1448 5208
2040 5208 1781 -1577 -2716 -1789 2341 3961 -439 -3840 -1105 685 -272 728 1431 -1308 -2472 -421
$$ packed form
1929A365J496k380k44j448k103L723L382l183k694J084j24J42L341k31n101n7
1945c032K920M00P71L44l009k661M208K818k078q07p21j988J806M803q08m447
1961a481p15Q39J599K592Q36n741j952M194K598j640m91j248k039K340L038j881
1977H48j733J083j468j131L814K409l572k982O09J639L154J829m983n032M151
1992a365N507j522k728j074j043K333L391j776l172J580N65k329J447L309j228
2007A895l602q13J095K722K733k671o609R87P428Q91m110k817n44K510M216o64
2023B647m955N6L351r96j182K893J77l125q81J317J652K259q6o235j964O520L760
2040E208l427l358j139R27M130J620m400l401K735J790r57J000P03k739j164K051
$$ plain form
2056 -421 747 1012 2222 -1184 -4515 -518 4259 2053 -1306 -2044 -1639 602 3995 1854 -2621 -1725
2072 -1725 1298 1157 1306 2144 -437 -2805 125 2366 1285 1131 -351 -2698 -906 3615 1850 -1937
2088 -1937 -1312 -693 -840 1469 2379 -1143 -3016 -603 231 597 2203 -202 -4297 -2005 2548 2146 -580
2105 -580 -1377 -2407 -886 2669 1975 -2043 -2111 403 106 -153 1501 479 -2057 -1246 46 309 1727
2122 1727 1228 -3448 -3681 2164 3617 78 -2302 -2105 -1005 2210 2590 -1760 -2951 835 1709 -928
2138 -928 44 1305 -901 -968 14 279 1345 2328 -1412 -3639 491 4601 1025 -2561 -1927 -300 2003
2155 2003 3133 -599 -3361 205 2431 38 -796 1025 -74 -951 -151 479 264 1658 -167 -3347
2171 -3347 -885 4025 1931 -1903 -2080 -45 1380 2489 278 -2780 -1202 2026 840 -1285 592
$$ packed form
2056d21J168K65J210l406l331L997M777k206l359p38M05K241L393k141m475Q96
2072a725L023j41J49Q38k581k368K930K241j081j54j482k347J792M521j765l787
2088a937O25O19j47K309R10l522j873K413Q34L66J606k405m095K292M553m02k726
2105e80p97j030J521L555o94m018o8K514k97k59J654j022k536Q11J292K63J418
2122A727m99m676k33N845J453l539k380J97J100L215L80m350j191L786Q74k637
2138i28R72J261k206o7R82K65J066R83l740k227M130M110l576l586O34J627K303
2155B003J130l732k762L566K226k393q34J821j099q77Q00O30k15J394j825l180
2171c347K462M910k094l834j77K035J425J109k211l058J578L228j186k125J877
$$ plain form
2186 592 989 -1288 -796 741 376 972 684 -2182 -1875 2778 2552 -1462 -2330 305 1041 921 813 -1729
2204 -1729 -1642 1487 1127 -1625 -283 1414 -604 -1693 455 800 462 -40 -1219 -2027 1374 2694 -1267
2221 -1267 -2753 610 1482 190 308 -576 -1510 978 1318 -1267 -590 1745 338 -1889 -129 1673
2237 1673 339 -201 -242 -1110 717 2584 -384 -2777 -173 1953 326 -329 -269 -743 357 1179 -793
2254 -793 -1660 1095 950 -1914 -1213 1213 604 -955 -617 -462 -169 1495 467 -2433 -655 2117 394
2271 394 -1450 -274 319 -162 417 -256 -1173 795 1666 -1151 -2206 1459 1515 -560 -663 -300 31 1214
2289 1214 1215 -1828 -1245 2292 1408 -1738 -636 1708 235 123 69 -418 540 2324 -177 -2056 887
2306 887 2642 -188 -1189 54 858 835 737 -842 -1087 1463 1807 -1762 -1328 1327 818 -486 -659 -390
$$ packed form
2186E92L97k277M92J537l65N96k88k866L07M653k26m014q68K635P36j20j08k542
2204a729Q7L129l60k752J342J697k018j089K148L45l38n02j179q08L401J320l961
2221a267j486L363Q72j292J18q84r34K488L40k585O77K335j407k227J760J802
2237A673j334n40m1q68J827J867k968k393K604K126j627o55O0m74J100Q22j972
2254g93q67K755j45k864P01K426o09j559L38J55K93J664j028k900J778K772j723
2271C94j844J176N93m81N79o73r17J968Q71k817j055L665N6k075j03L63L31J183
2289A214Jl043N83L537q84l146J102K344j473j12n4m87R58J784k501j879K943
2306H87J755k830j001J243Q04k3r8j579k45K550L44l569M34K655n09j304j73K69
$$ plain form
2324 -390 -340 1104 -140 -2577 -739 2049 90 -2283 -289 664 236 -75 -728 -1484 394 1915 -932
2341 -932 -2424 1120 1777 -1050 -1218 -209 7 697 282 -1624 -1361 1567 609 -2342 -1368 675 122
2358 122 -909 -1014 -1687 -387 700 -760 -2749 -397 1451 -981 -2572 -252 37 53 325 -1133 -1247
2375 -1247 1395 1946 -1220 -1449 1526 1228 -431 142 930 444 1696 1172 -1088 518 2822 1273 -1420
2392 -1420 399 1763 686 616 381 -484 839 2249 -306 -1910 801 1893 -317 -899 320 354 421
2409 421 364 -467 -408 1991 1146 -1639 -464 2428 1031 -319 193 272 602 1808 553 -1480 92 2285
2427 2285 538 -980 485 619 231 78 -79 -448 919 719 -1714 -1330 1482 1066 -1531 -1375 -19
2444 -19 -291 -188 -69 -2007 -1347 1666 407 -1860 -592 985 -641 -810 62 -789 -163 599 -1338 -1705
$$ packed form
2324c90N0J444j244k437J838K788j959k373J994R53m28l11o53p56J878J521k847
2341i32j492L544O57k827j68J009K16O90m15j906K63K928r58k951R74K043n53
2358A22j031j05o73J300J087j460j989K352J848k432j591K320K89J6K72j458j14
2375a247K642N51l166k29K975k98j659N73P88m86J252n24k260J606K304j549k693
2392a420J819J364j077p0k35q65J323J410k555j604K711J092k210n82J219L4O7
2409D21n7q31N9K399q45k785J175K892j397j350N12P9L30J206j255k033J572K193
2427B285j747j518J465J34l88j53j57l69J367k00k433L84K812m16k597J56J356
2444a9k72J03J19j938O60L013j259k267J268J577j626j69Q72q51O26P62j937l67
$$ plain form
2462 -1705 696 1262 -1423 -2229 74 486 -73 -515 -1363 -1453 634 721 -1911 -1529 1057 -351 -1212 140
2480 140 203 61 330 -195 -1158 656 2415 -537 -2081 725 1991 888 218 -66 -289 991 1900 -452
2498 -452 -1037 1245 1275 -854 -354 1230 87 -385 -78 -927 -112 1593 -64 -2610 -493 1834 602
2515 602 -1029 -626 -716 -5 1895 -48 -1431 215 1369 -330 -390 1549 564 -434 422 512 692 1936
2533 1936 1144 -1327 -836 2344 1608 -551 -629 -303 -87 1140 710 -1449 -1134 562 9 -1437 168
2550 168 646 -1624 -1710 -78 -47 91 166 -1912 -2209 1266 1659 -1167 -1536 -11 280 423 1310 -374 -1159
2569 -1159 970 756 -840 265 1643 -502 -1487 349 987 475 423 -1234 -1879 753 2441 -405 -2359
2586 -2359 -325 430 16 596 -598 -1753 -303 704 -534 -841 1316 -356 -1656 -222 1429 551
$$ packed form
2462a705K401N66k685q06K303M12n59m42q48r0K087Q7k632L82K586j408q61J352
2480A40O3j42K69n25r63J814J759k952j544K806J266j103o70k84k23J280R09k352
2498d52n85K282L0k129N00J584j143m72L07q49Q15J705j657k546K117K327j232
2515F02j631M03r0P11J900j943j383J646J154j699o0J939r85r98Q56R0J80J244
2533A936p92k471M91L180p36k159p8L26K16J227m30k159L15J696n53j446J605
2550A68M78k270q6J632L1J38P5k078k97L475L93k826l69J525K91J43Q87j684p85
2569a159K129k14j596J105J378k145r85J836O38n12n2j657o45K632J688k846j954
2586b359K034P55m14N80j194j155J450J007j238l07K157j672j300J434J651q78
$$ plain form
2602 551 198 -668 -1320 232 2650 753 -1956 -662 962 1034 542 536 -1087 -715 978 1009 -602 636
2620 636 368 -1241 -541 1520 988 -545 -83 -965 25 2188 1793 -1120 -1226 767 867 448 941 -178
2638 -178 -1314 349 1402 559 22 290 -951 -235 1714 1617 -991 -1008 -183 -292 896 1413 -891 -1669
2656 -1669 278 666 -309 371 97 -1667 -1111 899 568 -423 -247 -999 -1334 1582 1969 -901 -1752 -191
2674 -191 468 842 1025 -260 -1565 381 1490 72 -73 903 -506 -1259 781 1082 -122 -93 -951 -1479
2692 -1479 470 2273 -124 -2604 -1140 664 664 275 -644 -1544 -551 1413 -60 -885 427 175 -1649
2709 -1649 -78 1232 472 -170 -153 -1141 31 2330 773 -2049 -1434 1340 1020 495 226 -1795 -892
2726 -892 1524 1308 -1056 -292 751 -535 -721 640 359 -663 -491 -382 -544 1083 1385 -1538 -2150
$$ packed form
2602E51l53q66o52J552K418j897k709J294J624P2m92oj623L72J693L1j611J238
2620F36k68j609P00K061n32j533M62q82R90K163l95k913j06J993J00m19M93j119
2638a78j136J663J053q43n37K68j241P16J949r7k608j7Q25j09J188N17k304p78
2656a669J947L88r75O80k74j764N56K010l31r91J76p52l35K916L87k870q51J561
2674a91O59L74J83j285j305J946J109j418j45R76j409p53K040L01j204K9q58n28
2692a479J949J803k397k480J464J804%l89r19r00R93J964j473q25J312k52j824
2709a649J571J310p60o42J7r88J172K299j557k822O15K774l20n25k69k021R03
2726h92K416k16k364P64J043j286j86J361k81j022J72J09j62J627L02k923o12
$$ plain form
2743 -2150 304 1253 377 192 -985 -1210 733 1763 0 -1099 464 68 -568 911 1078 -800 -451
2760 -451 445 -122 364 1595 -149 -1883 -84 1372 218 70 -289 -1119 -369 1601 569 -1104 -460
2777 -460 57 -475 557 1200 -550 -1204 289 432 -395 1027 393 -1661 -375 1289 763 -411 224
2794 224 -510 -1000 630 1113 -695 -828 223 -350 10 1269 -32 -1417 -341 733 -44 97 177 -1086
2812 -1086 -858 904 716 -1218 -125 30 -897 -67 1043 -29 -992 -240 -251 -211 802 564 -1385 -1042
2830 -1042 890 316 -115 180 -181 -827 624 1114 -442 -484 743 -134 -519 1085 704 -708 -123 801
2848 801 -328 459 1233 -394 -1016 793 895 -210 4 268 -453 184 1152 -130 -695 276 594 -577
2866 -577 503 993 -390 -406 789 17 55 1032 413 -756 148 1248 299 -340 241 5 -160 780 615
$$ packed form
2743b150K454R49q76j85j177k25J943J030j763j099J563l96o36J479J67j878L49
2760d51Q96n67M86J231j744j734J799J456j154j48l59q30P50J970j032j673O44
2777d60N17n32J032O43j750o54J493J43q27J422o34k054J286J664n26j174O35
2794B24p34m90J630M83j808j33J051n73L60J259j301j385J076J074p77J41Q0j263
2812a086K28J762j88j934J093J55r27Q30J110j072r63P52j1M0J013k38j949L43
2830a042J932n74m31K95l61o46J451M90j556m2J227q77l85J604l81j412N85R24
2848H01j129P87P74j627o22J809J02j105K14K64p21O37R68j282n65R71L18j171
2866e77J080M90j383j6J195p72L8R77o19j169R04J100r49o39N81k36j65R40j65
$$ plain form
2885 615 -715 44 724 -292 -473 486 13 -675 285 183 -847 165 250 -759 -725 462 255 -891
2903 -891 -175 -200 -632 -162 405 -1215 -918 447 -417 -1004 -21 104 -878 3 644 -791 -503 698 -538
2922 -538 -1062 182 846 -603 -104 154 -554 -443 659 -271 -779 326 452 -427 -6 752 -453 -683
2940 -683 1030 131 -512 706 812 -685 53 896 -120 -347 646 66 -419 340 564 -395 -298 482 -247
2959 -247 -532 503 50 -901 408 494 -500 -261 424 -291 -453 362 -9 -680 21 448 -780 -216 864
2978 864 -156 -684 405 324 -999 319 861 -386 -203 700 -119 -350 586 218 -545 269 761 -675
2996 -675 -170 279 -410 -798 333 591 -557 -68 498 -637 -162 347 -701 -962 315 539 -457 -278
3014 -278 639 -176 -344 1014 171 -263 1028 597 -466 320 1139 158 62 988 476 166 1248 1029 -201
$$ packed form
2885F15j330P59O80j016j81R59m73o88R60j02j030J012Q5j009L4J187k07j146
2903h91P16k5m32M70N67j620K97J365q64n87R83J25r82Q81O41j435K88J201j236
2922e38n24J244O64j449M99K58p08J11J102r30n08J105J26q79M21P58j205k30
2940f83J713q99o43J218J06j497P38Q43j016k27R93n80m85P59K24r59R7P80p29
2959b47k85J035m53r51J309Q6r94K39O85p15j62Q15l71o71P01M27j228N64J080
2978H64j020n28J089q1j323J318N42j247J83R03q19k31R36l68p63Q14M92j436
2996f75N05M49o89l88J131K58j148M89N66j135M75N09j048k61J277K24r96J79
3014b78R17q15j68J358q43m34J291m31j063P86Q19r81r6R26n12l10J082k19j230
$$ plain form
3033 -201 727 1290 157 -128 890 296 98 937 415 -377 31 562 -532 -398 628 94 -439 122 152
3052 152 -681 97 519 -722 -389 632 74 -891 278 419 -848 35 306 -672 -465 539 -309 -564
3070 -564 326 154 -836 -224 51 -806 -637 221 -807 -1270 0 93 -1269 -777 -230 -795 -656 378 -495
3089 -495 -1400 139 262 -1031 -421 180 -715 -843 93 -100 -735 88 29 -825 -148 737 -527 -648 253
3108 253 -56 -580 231 429 -868 -53 756 -19 -298 589 131 -398 449 911 -342 -105 700 -1 19 957
3128 957 628 -179 308 646 210 576 742 18 -721 1188 856 60 474 683 -148 311 1203 247 -399 347
3148 347 573 -386 316 671 -345 -278 419 -248 -231 673 -257 -988 269 778 -561 -358 391 -252 -47 821
3168 821 205 -521 171 385 -471 176 831 -375 -835 214 272 -394 224 -63 -829 -210 608 284 -767
$$ packed form
3033b01R28N63j133k85J018n94j98Q39n22p92M08N31j094J34J026n34n33N61L0
3052A52q33P78M22j241L33J021n58r65J169J41j267Q83K71r78K07J004q48k55
3070e64Q90j72r90O12K75q57J69Q58j028m63J270R3j362M92N47n65J39J034q73
3089d95r05J539J23j293O10O01q95j28R36j93o35Q23n9q54O77Q85j264j21R01
3108B53l09n24Q11J98j297Q15Q09p75k79Q87m58n29Q47M62j253K37Q05p01K0R38
3128I57l29q07M87L38m36L66J66p24p39J909l32p96M14K09q31M59Q92r56o46P46
3148C47K26r59P02L55j016O7O97o67J7R04r30p31J257N09j339K03P49o43K05Q68
3168H21o16p26O92K14q56O47O55j206m60J049N8o66O18k87p66O19Q18l24j051
$$ plain form
3187 -767 119 -65 -707 102 440 -704 -1088 227 -280 -205 222 -350 -974 15 529 -644 -428 453 -587
3206 -587 -699 858 633 -247 -117 309 -132 533 746 106 -772 423 687 -34 148 471 -1038 -346 770
3225 770 319 -935 7 -23 -748 392 661 -574 -825 71 -205 -277 304 415 -954 148 619 -140 -398
3244 -398 509 -388 -676 626 300 -461 57 323 14 94 638 74 -411 45 451 216 648 444 -602 -635
3264 -635 911 404 -366 280 49 -577 93 611 -382 -552 306 102 -248 436 487 -769 -422 420 195 -167
3284 -167 575 -301 -951 561 734 -371 -97 -85 -324 -231 602 168 -646 73 208 -156 362 319 -403 -853
3304 -853 385 536 -297 301 79 -1225 9 915 118 -552 -52 85 -28 349 519 -749 -610 395
3322 395 210 -151 509 -107 -952 -35 710 -249 120 509 -430 -421 672 289 -600 -332 -27 -35 249 397 -731
$$ packed form
3187g67Q86j84o42Q09L38j144l84J315n07P5M27n72o24R89N14j173K16Q81j040
3206e87j12J557k25q80J30M26m41O65K13o40q78J195K64p21J82L23j509O92J116
3225G70m51j254R42l0p25J140K69j235k51Q96k76p2N81J11j369J102M71p59k58
3244c98R07q97k88J302l26p61N18K66l09Q0N44n64m85M56M06k35M32k04j046l3
3264f35J546n07p70O46k31o26O70N18r93j70Q58k04l50O84N1j256L47Q42k25l62
3284a67P42q76o50J512J73j105K74J2k39R3Q33m34q14P19J35l64N18m3p22m50
3304h53J238J51q33N98k22j304J234R06p97o70N00J37j13L77J70j268J39J005
3322C95j85l61O60o16q45R17P45r59L69L89r39RJ093l83q89K68L05qK84J48j128
$$ plain form
3343 -731 -927 102 295 87 -198 30 -581 -136 715 51 -368 253 116 -423 124 559 -354 -484 394 -383
3363 -383 -86 659 417 -644 40 714 103 -242 3 -471 -482 939 472 -449 -183 -126 -271 -145 530 85
3383 85 -663 377 -70 -314 142 476 -647 -755 440 196 -125 148 -390 -883 239 806 -143 -486 -9
3402 -9 32 56 466 38 -488 -55 315 -203 53 614 -6 -726 62 190 -135 340 -36 -700 -253 751 -53
3423 -53 -813 -204 198 -51 208 743 -407 -283 521 122 -312 298 193 -369 -36 447 47 -55 231 -294
3443 -294 -214 643 714 -735 -293 139 133 145 447 -120 -667 238 790 -296 -10 462 -797 -45 583 -86 -270
3464 -270 116 227 -587 -19 535 -32 -838 226 131 30 522 296 -676 -137 712 -37 20 340 102 -207
3484 -207 647 546 -393 -248 567 -49 -121 648 193 -467 129 569 42 70 409 -175 -439 397 541 -54 -18
$$ packed form
3343g31j96J029J93k08k85K28o11M45Q51o64m19O21j37n39N47M35r13j30Q78p77
3363c83K97P45k42j061O84O74o11l45K45m74j1J421m67r21K66N7j45J26O75m45
3383H5p48J040m47k44M56L34j123j08J195k44l21K73n38m93J122N67r49l43M77
3402iM1K4M10m28n26M33L70n18K56N61o20p20P88J28l25M75l76o64M47J004q04
3423e3p60O09M02k49K59N35j150J24Q04l99m34O10j05n62L33M83m00j02K86n25
3443b94Q0Q57P1j449M42M32oJ2L02n67n47R05N52j086K86M72j259P52O28o69j84
3464b70L86J11q14N68N54n67q06J064r5j01M92k26r72N39Q49p49N7L20k38l09
3484b07Q54j01r39J45Q15o16p2P69m55o60N96M40n27K8L39n84k64Q36J44n95L6
$$ plain form
3505 -18 415 -427 -23 461 -134 -496 164 375 -520 -15 248 -550 -363 511 -186 -152 356 328 -461 195 576
3526 576 -202 -36 190 -618 -348 244 -26 -525 -480 78 -257 -456 34 -323 -789 104 -78 -478 -34 188
3546 188 -349 -626 166 -293 -421 -381 -81 -484 62 564 -433 -231 -64 138 -420 375 133 -651 -18 472
3566 472 -352 -284 609 -59 -79 153 184 -134 5 109 -3 -39 557 336 -153 8 335 -33 384 449 -140 205
3588 205 821 133 -349 660 551 -156 107 484 -87 35 624 99 104 657 456 -476 23 562 -230 -142 421
3609 421 -42 -294 452 346 -326 30 365 -84 122 279 483 -205 257 29 -363 135 427 -409 -174 326
3629 326 274 -308 347 112 -9 140 380 -16 -317 213 115 -582 313 38 -499 -86 311 -139 -269 302 -75
3650 -75 -361 -45 3 -567 59 139 -91 -596 424 160 -356 -122 330 -213 -64 329 -111 -237 -17 277 -246
$$ packed form
3505a8M33q42M04M84n95l62O60K11q95N05K63p98J87Q74o97L4N08k8p89O56L81
3526E76p78J66K26q08K70N92k70m99M5N58l35j99M90l57m66Q93j82m00M44K22
3546A88n37k77P92m59j28M0L00m03N46N02r97K02J67K02n58P95k42p84O33M90
3566D72q24O8Q93o68k0K32L1l18J39J04j12l6N96k21m89J61L27l68M17O5n89L45
3588B05O16o88m82J009j09p07K63L77n71J22N89n25NN53k01r32M99N39p92Q8N63
3609D21m63k52P46j06o72L56L35m49K06J57K04o88M62k28l92M98K92q36K35N00
3629C26n2n82O55k35j21J49K40l96l01N30r8o97Q95k75n37M13L97m50j30N71l77
3650g5k86L16M8n70O26Q0k30n05J020k64n16K34M52n43J49L93m40j26K20K94n23
$$ plain form
3671 -246 101 219 -205 -98 339 -114 -181 479 -28 -368 46 454 -130 -424 -18 -149 -460 311 -47 -607
3691 -607 163 215 -47 23 169 59 -598 92 -141 -623 -40 -60 -677 -349 597 -288 -153 -89 24 -543 35
3712 35 345 -501 -346 235 -347 -310 250 170 -373 -6 316 -186 -22 183 -51 -395 341 436 -206 40 356
3733 356 -317 35 328 -240 -500 347 592 -179 15 215 -157 88 391 346 -195 400 26 -143 312 357 30
3754 30 -146 155 206 78 620 303 -396 406 438 246 31 697 101 -24 485 223 -240 -17 518 194 48
3775 48 693 4 -108 225 464 235 206 72 -275 -158 515 -40 -297 124 -163 -223 46 440 -29 -407 84
3796 84 -313 -245 -286 143 -224 -96 186 -308 -541 201 -370 -742 -217 -102 -511 -179 -84 -444 -305 292 -99
3817 -99 -485 61 -190 -247 -404 335 -183 -140 219 166 -366 -67 120 -531 16 318 -104 -381 110 -78 -472
$$ packed form
3671b46L47J18m24J07M37m53o7O60n07l40M14M08n84k94M06j31l11P71l58n60
3691f07P70N2k62P0J46j10o57O90k33m82N83k0o17L28R46q85J35O4J13n67N78
3712C5L10q46J55N81n82L7N60q0n43L67L22n02J64K05k34l44P36R5o42K46L16
3733C56o73L52K93n68k60Q47K45p71J94K00l72K45L03m5n41N95l74j69M55M5l27
3754C0j76L01N1j28N42l17o99Q02L2j92k15O66n96j25N09k62m63K23N35l24j46
3775D8O45o89j12L33K39k29k9j34l47J17O73n55k57M21k87o0K69L94m69l78M91
3796H4l97O8m1M29l67J28K82m94k33P42n71l72N25J15m09L32R5l60J39N97l91
3817i9l86N46k51n7j57P39n18M3L59n3n32K99J87o51N47L02m22k77M91j88l94
$$ plain form
3838 -472 -27 18 -666 -249 253 -210 -16 211 -130 -649 129 369 -115 141 84 -202 -292 539 330 -247 136
3859 136 352 -203 13 104 -71 -605 165 107 -330 160 94 -355 90 452 61 -469 187 168 -159 228 151 -64
3881 -64 -219 219 11 -7 229 140 -398 -247 186 119 -35 241 -84 -138 85 375 -555 61 65 -47 -56 383 -70
3904 -70 -430 82 232 -81 83 206 -371 -346 306 484 -105 53 199 -733 132 514 -301 -461 361 -179 -102
3925 -102 179 140 -547 232 384 -172 -54 266 -127 -597 306 69 -192 -42 39 -396 -17 457 193 44 165
3946 165 364 -449 -240 327 -187 -244 395 304 -99 32 4 -476 247 283 60 -267 106 -8 -362 475 409 -257
3968 -257 -3 389 -108 -77 296 181 -399 119 312 -161 176 212 -220 -75 312 140 126 80 469 -472 8
3989 8 624 -111 -520 315 416 -252 16 80 -406 95 390 -83 -332 298 107 -219 252 419 -179 -119 82
$$ packed form
3838d72M45M5o84M17N02m63J94K27l41n19P78K40m84K56n7k86r0Q31k09n77L83
3859A36K16n55K16R1j75n34P70n8m37M90o6m49M45L62l91n30O56j9l27L87p7k15
3881f4j55M38k08j8K36q9n38J51M33o7j54K76l25n4K23K90r30O16Mj12rM39m53
3904g0l60N12J50l13J64J23n77K5O52J78n89J58J46r32Q65L82q15j60Q22n40P7
3925a02K81l9o87P79J52n56J18L20l93m70R03k37k61J50Q1m35L79M74k64j49J21
3946A65J99q13K09N67n14n7O39r1m03J31k8m80P23L6k23l27L73j14l54Q37o6o66
3968b57K54L92m97L1L73j15n80N18J93m73L37L6m32J45L87j72j4m6L89r41M80
3989HO16p35m09Q35J01o68K68O4m86N01K95m73k49O30j91l26M71J67n98O0K01
$$ plain form
4010 82 -165 -154 280 44 -511 -200 204 38 211 273 -15 -198 221 360 -484 -305 115 -362 -206 436 58
4031 58 -192 316 110 -326 393 -205 -223 -338 249 87 -97 -88 -48 -52 112 422 -298 -8 491 -292 -336 207 14
4054 14 -91 -154 41 -105 -445 269 -357 -196 409 43 -170 189 8 -91 51 109 -76 -286 -19 173 -246
4075 -246 147 226 -128 -436 575 198 -132 47 379 -339 -44 256 -131 -89 232 -180 -118 310 89 -215 -85
4096 -85 259 -247 13 279 -93 -326 64 470 -81 -15 -77 -566 151 246 -81 -534 159 353 -249 -450 369
4117 369 -80 -247 203 -36 148 400 161 -489 88 345 62 -250 78 -27 -101 411 200 -138 98 320
4137 320 179 -92 84 -152 -24 342 -10 -297 373 181 -181 -278 372 112 -242 -134 280 -355 78 343
4157 343 -287 -73 129 144 -129 59 154 58 -194 196 -94 -102 171 -166 -482 313 356 -514 -194 285 -45 256
$$ packed form
4010H2k47J1M34k36n55L11M04j66J73O2k88j83M19J39q44J79M20m77J56O42l78
4031E8k50N08k06m36P19n98j8j15N87j62j84RM0mJ64L10p20K90M99p83m4N43j93
4054A4j05o3J95j46l40P14o26J61O05l66k13L59j81r9J42N8j85k10K67J92m19
4075b46L93P9l54l08J011l77l30J79L32p18K95L00l87M2L21m12O2M28k21l04J30
4096h5L44n06K60K66l72k33L90M06n51O6o2m89P17R5l27m53O93J94o02k01Q19
4117C69m49j67M50k39J84K52k39o50N77K57k83l12L28j05p4N12k11l38K36K22
4137C20j41k71J76k36J28L66l52k87O70j92l62r7O50k60l54J08M14o35M33K65
4157C43o30K14K02J5k73J88R5r6k52L90k90qK73l37l16P95M3q70L20M79l30L01
$$ plain form
4179 256 355 -276 -310 150 347 -215 -259 387 -17 -328 -83 101 -112 252 -138 -30 212 414 -270 -26 217
4200 217 -5 -276 206 279 -299 -392 447 -158 -202 93 235 -199 -112 342 -220 66 360 -87 -198 356 82
4221 82 -222 220 232 -305 296 418 -1 -7 195 36 -127 394 314 -108 17 667 32 -152 -71 120 -57 132
4243 132 299 -315 -11 218 -246 -276 199 103 -316 20 -190 -5 213 289 -76 -382 97 -61 77 -174 -105
4264 -105 150 75 307 -176 -494 87 316 -216 -216 143 74 -117 145 -78 9 107 -125 -489 24 60 -114 -281
4286 -281 66 -145 -241 219 -126 -537 84 387 47 -207 159 47 -366 -32 94 26 40 74 -399 -93 319
4307 319 308 -534 311 33 43 -77 -190 -191 -317 331 -151 -311 306 413 -60 41 -101 -193 -178 -125 -72 -96 422
4330 422 419 -491 -57 297 300 86 -182 295 -148 412 102 -301 307 509 -49 -366 413 319 -98 173 -172 -201
$$ packed form
4179B56R9o31l4M60J97n62m4O46m04l11K45J84k13L64l90J08K42K02o84K44K43
4200B17k22k71M82P3n78r3Q39o05m4K95J42m34Q7M54n62K86K94m47j11N54k74
4221H2l04M42J2n37O01J22m19oK02j59j63N21q0m22J25O50o35j84Q1J91j77J89
4243A32J67o14L04K29m64l0M75r6m19L36k10J85K18P6l65l06M79j58J38k51O9
4264a05K55p5K32m83l18N81K29n32%L59o9j91K62k23Q7R8k32l64N13L6j74j67
4286b81L47k11r6M60l45m11O21L03l40k54L66j12m13L34J26o8J4L4m73L06M12
4307C19j1q42Q45k78J0j20j13jj26O48m82j60O17J07m73J01j42r2J5N3N3k4N18
4330D22lr10M34L54Lk14k68M77m43N60l10m03O08K02n58l17P79r4m17K71l45k9
$$ plain form
4352 -201 -72 398 -19 -175 483 486 -45 -73 32 -11 215 307 51 -217 541 259 -407 66 271 31 -218 160
4374 160 -18 5 315 92 -207 230 357 149 18 264 40 80 41 -43 -299 167 235 -199 -255 486 29 -55
4396 -55 176 -66 -116 251 247 -437 88 353 235 -302 1 151 142 -63 141 -193 -154 264 -217 -132 136 -85 -233
4419 -233 -309 -43 -126 -272 260 -325 -303 125 264 -175 -232 85 -202 -121 129 -30 25 -3 -57 -119 -227 337 -410
4442 -410 -125 -184 123 9 87 -536 -419 115 398 -42 -327 301 34 -65 286 526 72 -10 -196 -509 -103
4463 -103 306 -20 -273 95 448 -161 43 -228 -363 -12 303 -220 -10 344 499 -199 -358 184 54 -346
4483 -346 204 177 -22 595 238 -432 -58 280 132 -143 -229 -201 -199 212 174 -220 80 301 -11 -178 302 181
4505 181 29 -103 -4 -312 335 310 -115 -575 65 377 -145 58 -56 -177 -60 16 -57 -105 440 -1 32 -119
$$ packed form
4352b01J29M70m17j56O58Ln31k8J05m3K26R2k56k68P58k82o66M73K05k40k49L78
4374A60j78K3L10k23k99M37J27k08j31K46k24M0l9q4k56M66O8m34n6P41m57q4
4396e5K31k42n0L67mo84N25K65j18n37L03J50rk05K04l34L9M18m81Q5K68k21j48
4419b33p6K66q3j46N32n85K2M28J39m39n7L17k87Q1K50j59N5k8n4o2j08N64p47
4442d10K85n9L07j14P8o23J17N34K83m40k85O28k67r9L51K40m54q2j86l13M06
4463a03M09l26k53L68L53o09K04k71j35L51L15n23K10L54J55o98j59N42j30m00
4483c46N50k7j99O17l57o70L74L38j48k75q6K8KM11l8l94L00K21l12j67M80j21
4505A81j52j32R9l08O47k5m25m60O40L12n22K03j14j21J17P6p3m8N45m41L3j51
$$ plain form
4527 -119 311 -177 -88 -102 -38 29 236 -105 -212 109 433 -3 -353 174 68 -52 320 -71 -226 361 109
4548 109 -115 100 127 71 -233 -120 189 103 224 -143 -448 56 132 -185 -395 18 94 -684 -124 10 -257 -52
4570 -52 -5 -497 -11 272 354 -275 -289 249 101 93 49 -104 140 227 217 -412 117 325 -235 -107 212 -162 112
4593 112 263 -127 -132 263 389 -307 -393 21 -117 -88 -217 -115 -79 -159 283 -272 -126 -42 142 -425 -4 -2 -142
4616 -142 185 173 -258 -284 425 -184 -363 -40 -44 -257 -411 -34 -268 103 -43 -157 -331 244 194 -325 -63 418
4638 418 65 -239 -52 -97 -90 169 148 -296 125 271 48 -408 -78 254 -50 247 187 -100 -68 514 -135 -373
4660 -373 93 319 -254 -21 145 -224 -82 175 -355 -93 451 221 -297 -253 26 37 86 91 -151 -214 330 -268
4682 -268 -361 300 361 -72 -16 100 -189 -16 51 -233 -97 363 435 -158 -221 253 -251 -92 73 -93 5 185
$$ packed form
4527a19M30m88Q9j4O4O7K07l41j07L21L24m36l50N27j06j20L72l91j55N87k52
4548A09k24K15K7n6l04J13L09q6J21l67l05N04P6l17k10M13P6p78N60J34k67K05
4570e2M7m92M86K83Q2o29j4N38j48qm4j53K44Q7j0o29N29K08n60J28L19l74K74
4593A12J51l90nL95J26o96q6M14j38K9j29J02L6q0M42n55J46Q4J84n67M21Kj40
4616a42L27j2m31k6P09o09j79L23mk13j54L77k34L71j46j14j74N75n0n19K62M81
4638D18l53l04J87m5PK59k1m44M21J46k23m56L30L32l04K97o0k87L2N82o49k38
4660c73M66K26n73K33J66l69J42K57n30K62N44k30n18M4K79J1M9Nk42o3N44n98
4682b68r3O61O1m33N6J16k89J73O7k84J36M60P2n93o3M74n04J59J65j66R8J80
$$ plain form
4704 185 142 -308 -240 385 -36 -495 -141 206 5 289 -17 -351 121 89 -123 -399 107 173 45 -119 -56 -49
4726 -49 -81 377 207 -391 484 138 -389 -256 34 -283 420 315 -284 36 73 87 -73 -271 259 -81 -90 -68
4748 -68 -21 -48 -104 -346 -49 -106 48 -78 -115 217 298 -242 -368 174 -108 -17 193 -67 -82 2 -137 -105 327 147
4772 147 -10 -87 54 -77 -103 353 -242 -83 300 24 -140 26 -66 77 -70 -14 -438 -106 46 307 67
4793 67 -394 148 -233 52 18 -141 -93 153 44 -164 112 326 -118 -539 59 73 67 133 -228 -196 75 123 -156
4816 -156 -490 137 131 -265 -214 169 -57 33 68 -205 -167 292 155 -57 -102 -41 90 174 39 -118 -241 313 -62
4839 -62 -387 -70 254 -257 -228 102 -197 156 156 50 36 275 216 -254 -110 70 -233 53 30 95 27 274 159
4862 159 27 15 132 -51 -73 -30 155 -164 -90 -5 -379 100 80 -82 -13 328 217 66 -39 173 52 84 12
$$ packed form
4704A85m3m50O8O25m21m59L54L47k01K84l06l34M72l2k12k76N06O6j28j64O3P
4726d9l2M58j70n98Q75l46n27J33K90l17P03j05n99L20L7J4j60j98N30l40rK2
4748f8M7k7n6k42K97n7J54j26l7L32Q1n40j26N42k82R1K10k60j5Q4j39L2M32j80
4772A47j57p7J41j31k6M56n95J59L83k76j64J66r2J43j47N6m24L32J52K61k40
4793F7m61N42l81K85l4j59M8K46j09k08K76K14m44m21N98J4oO6l61L2K71M8k79
4816a56l34O27ol96N1L83k26R0L5k73L8M59j37k12m5O1J31Q4j35j57j23N54l75
4839f2l25L17L24n11K9L30k99L53%j06j4K39n9m70J44J80l03K86k3O5o8K47j15
4862A59j32j2J17j83k2M3J85l19P4Q5l74M79k0j62O9L41j11j51j05K12j21L2p2
$$ plain form
4885 12 -167 -181 25 190 271 -172 -40 120 -174 -29 31 0 368 101 -112 -51 124 -62 41 -51 -228 -124
4907 -124 179 -271 -181 -108 41 -153 194 326 -3 -394 -60 433 -100 104 97 -173 21 182 -304 -365 -208 -74
4929 -74 -53 126 -16 -102 -311 190 -199 18 172 251 -406 -246 -27 -19 88 -18 -159 101 455 44 -23 176
4951 176 -2 -100 -20 -180 -106 -62 -74 -59 88 131 125 -223 6 8 59 -15 228 -86 -140 166 127 16 -55 212 -29
4976 -29 -206 -49 20 122 -174 -179 -23 -371 132 -60 -20 -220 -59 -93 63 270 -230 -171 420 -168 -156 25 138
4999 138 151 65 151 -30 -129 -17 -203 -218 342 63 -246 67 601 -117 -323 64 -70 114 255 212 -223 -121
5021 -121 77 -59 -188 281 105 16 113 153 -443 184 -29 -41 -164 303 -30 -178 124 12 -181 -314 231
5042 231 36 58 222 230 -86 -32 162 -204 -156 71 109 110 396 89 -221 -16 162 -263 -350 214 -3 -8 319 -44
$$ packed form
4885A2j79j4K06J65Q1m43J32J60k94J45O0l1L68k67k13O1J75j86J03r2j77J04
4907a24L03m50R0P3J49j94L47J32l29l91L34M93n33K04pk70J94J61m86o1J57J34
4929g4K1J79j42q6k09N01l89K17J54P9o57J60K19QJ07j06j41K60L54m11o7J99
4951A76j78r8Q0j60P4M4j2J5J47M3ol48K29KN1p4K43l14n4L06l9j11p1K67k41
4976b9j77J57O9J02k96nJ56l48N03j92M0k00J61l4J56K07n00N9N91n88J2J81J13
4999A38J3q6Q6j81r9J12j86j5N60k79l09L13N34p18k06L87j34J84J41m3m35J02
5021a21J98j36j29M69j76q9R7M0n96O27k13j2j23M67l33j48L02j12j93j33N45
5042B31j95K2J64Ql16N4J94l66M8K27L8JK86l07l10K05J78m25q7N64k17nL27l63
$$ plain form
5066 -44 31 -220 -251 -98 -486 110 70 -389 136 211 -184 -37 -93 71 -329 454 1 -472 82 -45 10 174
5088 174 -62 -182 -100 177 278 -38 -73 -89 -128 51 95 82 -198 351 115 -186 132 311 -266 121 355 298
5110 298 -97 128 74 -125 115 -90 14 31 176 -330 -48 -6 47 73 155 54 258 222 -42 159 -268 17
5132 17 -4 -221 54 218 -100 -153 -18 -114 42 205 -37 84 -149 110 -94 -170 167 -67 -119 115 151 -151
5154 -151 74 95 -176 -100 214 -98 -280 278 273 63 20 -30 -57 -81 510 -37 -104 -102 105 -278 216 258 -61 110
5178 110 107 149 34 217 -65 9 84 -55 -145 -176 171 14 44 -147 20 -131 -153 176 -127 -332 -85 -62 222
5201 222 -104 136 -87 130 270 10 117 92 14 -173 -98 -182 122 -119 -130 78 -126 -7 69 -296 141 -346
5223 -346 -128 241 178 -147 -38 53 19 -217 161 -13 351 341 219 -225 -314 -36 -72 -45 50 145 28 63 15 201
$$ packed form
5066d4P5k51l1J53l88N96m0m59N25P5l95J47n6J64m00P83m53m73N54j27N5J64
5088A74k36j20Q2K77J01l16l5j6l9J79M4j3k80N49k36l01L18J79n77L87K34n7
5110B98l95K25n4j99K40k05J04J7J45n06K82M2N3K6Q2j01K04l6k64K01m27K85
5132A7k1k17K75J64l18n3J35r6J56J63k42J21k33K59k04p6L37k34n2K34L6l02
5154a51K25K1k71P6L14l12j82N58nk10m3n0k7k4N91n47o7KK07l83M94M2l19J71
5178A10lM2j15J83k82P4P5j39r0l1L47j57L0j91J67j51k2L29l03k05K47K3K84
5201B22l26K40k23K17J40k60J07k5p8j87P5q4L04k41j1K08k04J19P6l65M37m87
5223c46K18L69o3l25J09R1l4k36L78j74L64j0j22m44q9K78l6K7R5R5j17L5m8J86
$$ plain form
5247 201 -1 114 -125 -82 204 -126 -190 -74 279 -107 -194 106 -60 -277 87 -47 -165 174 62 87 -82
5268 -82 -159 201 -357 104 154 -365 159 119 151 -297 167 -273 -176 30 -30 -96 -188 140 -146 -270 169 -152 -207
5291 -207 14 159 -29 116 83 -189 -118 158 44 37 -182 -70 -129 -62 -283 -81 20 24 -84 0 35 207 -266
5314 -266 21 -194 -141 246 -6 64 -3 9 40 -110 69 334 -300 65 -40 179 -251 230 266 -69 -71 267 66
5337 66 -97 72 -301 186 -81 38 -30 -181 -94 -84 -358 -163 -104 -55 97 -101 -122 125 148 -53 -125 252 79
5360 79 -48 30 77 -275 -135 -71 -111 -96 -21 -94 -345 69 293 -318 83 -30 -111 -219 52 -102 59 4 -206
5383 -206 -39 -211 -97 176 -32 57 -248 -155 -15 122 -49 89 46 -314 -128 18 88 139 109 -17 -71 -132 -176
5406 -176 -194 -240 -28 -97 -226 -152 301 224 5 -64 237 -98 57 164 25 127 -5 312 -3 100 114 -259
$$ packed form
5247B01k02J15k39M3K86l30o4J16L53l86q7L00j66k17L64j34j18L39j12K5j69
5268h2p7L60n58M61N0n19N24m0L2m48M64m40R7K06o0o6r2L28k86j24M39l21n5
5291b07K21J45j88J45l3k72P1K76j14pk19J12n9O7k21K02J01Mj08Q4L5J72m73
5314b66K87k15N3L87k52P0o7J2L1j50J79K65o34L65j05K19m30M81L6l35kL38k01
5337F6j63J69l73M87k67J19o8j51Q7J0k74J95N9M9J52j98k1K47K3k01p2L77j73
5360G9j27P8M7l52J40O4m0J5P5p3k51M14K24o11M01j13q1j08K71j54J61n5k10
5383b06J67j72J14K73k08Q9l05R3J40J37j71J38m3l60J86J46P0N1l0j26n4o1m4
5406a76j8m6K12o9j29P4M53p7k19o9L01l35J55J07j39J02j32L17l15J03J4l73
$$ plain form
5428 -259 315 -293 105 190 24 166 -239 -57 -150 -126 59 545 -13 40 14 15 265 -12 -153 -164 -7 -18 -182
5451 -182 27 31 52 -186 143 -26 -218 -110 275 -105 185 80 -147 37 137 -147 15 84 256 -230 35
5472 35 -94 27 -32 254 371 -19 192 83 56 38 -51 53 -28 168 240 -106 -46 131 167 28 405 -59 -45
5495 -45 306 111 -365 112 55 -199 31 -316 74 29 362 -25 -37 128 269 -229 -240 -156 189 -71 5 -2 -172
5518 -172 169 211 -106 -25 20 -106 144 231 -194 31 53 -67 154 104 12 8 -68 -29 -73 32 126 220 -12 -16 60 24
5544 24 -348 10 243 -22 156 -102 -96 331 -148 -52 -91 331 234 -4 212 271 70 -20 34 -42 -20 -229 199 9
5568 9 263 -27 33 -132 -94 201 72 -127 -38 -199 157 177 -318 -175 156 125 -66 138 -55 -11 104 206 -335
5591 -335 116 164 -195 -114 148 59 -253 127 -29 -89 71 82 -5 -160 78 23 -125 106 25 82 59 25 -51 -228
$$ packed form
5428b59N74o08L98Q5j66J42m05J82r3K4J85M86n58N3k6JK50k77j41j1J57j1j64
5451a82K09MK1k38L29j69j92J08L85l80K90j05k27J84J00k84J62O9J72m86K65
5472C5j29J21n9K86J17l90K11j09k7j8q9J04q1J96P2l46O0J77L6j39L77m64J4
5495d5L51j95m76M77n7k54K30l47L90m5L33l87j2J65J41m98j1Q4L45k60P6pj70
5518a72L41M2l17Q1M5j26K50Q7m25K25K2j20K21n0r2mp6L9m4J05R4R4k32mP6l6
5544B4l72L58K33k65J78k58OM27m79R6l9M22r7k38K16N9k01r0N4p6K2k09M28j90
5568IK54k90O0j65L8K95j29j99Q9j61L56K0m95J43L31l1j91K04j93M4J15J02n41
5591c35M51M8l59Q1K62q9l12L80j56o0J60J1q7j55K38n5j48K31q1N7k3l4p6j77
$$ plain form
5615 -228 19 -124 -17 22 261 -50 -358 -28 205 175 286 196 -128 7 -279 28 -163 38 130 69 175 -173
5637 -173 -121 220 308 104 32 -130 86 236 17 -153 -90 290 89 -70 170 44 -55 -100 63 -90 -155 71
5659 71 0 -216 -174 76 95 -141 -125 -116 -284 51 -138 38 -55 -68 -174 256 -49 144 -32 51 -189 -39 -17 -11
5683 -11 115 -108 -257 21 21 217 112 17 -37 -182 -100 -6 163 52 -146 83 48 146 135 -69 -17 -238 57 105
5707 105 180 178 -11 -206 30 127 -225 -188 -50 -121 110 -117 297 -28 -29 -154 150 -66 -208 150 -38 39 6
5730 6 89 -168 168 -198 -152 -54 178 -113 -165 58 153 -171 99 -13 -313 8 285 99 -119 -117 -51 -39 -50 145
5754 145 -256 288 149 98 54 127 -111 -47 -6 169 -150 -181 -55 -80 -18 -30 -83 175 -109 96 -58 -19 -5 -217
5778 -217 63 115 34 19 62 60 102 -12 4 -86 118 -48 134 221 -142 -269 6 158 -148 36 -45 124 280 -154
$$ packed form
5615b28K47j43J07L9K39l11l08L30K33l0J11r0l24J35k86L07j91K01R2o1J06l48
5637a73N2L41Q8k04p2j62K16J50k19j70O3L80k01j59K40j26r9m5J63j53o5K26
5659G1p1k16M2K50J9k36J6Rj68L35j89J76r3j3j06M30l05J93j76Q3k40J50K2O
5683a1J26k23j49K78%J96j05r5n4j45Q2R4J69j11j98K29l5R8j1k04N2k21K95M8
5707A05P5kj89j95K36R7l52L7J38p1K31k27M14l25jj25L04k16j42L58j88P7l3
5730FQ3k57L36l66M6R8K32k91n2K23R5l24K70j12l00L21K77j86k18KO6J2j1J95
5754A45m01N44j39n1m4P3k38O4M1J75l19l1J26k5O2j2n3K58k84K05j54L9J4k12
5778b17K80N2q1j5M3kM2j14J6r0K04j66J82Q7l63j27K75J52l06J84q1J69J56m34
$$ plain form
5802 -154 79 235 301 -182 64 379 -101 217 -75 6 -128 95 219 79 162 -110 127 36 -48 74 17 -2
5824 -2 63 -22 264 -62 -142 286 18 3 77 194 -28 324 87 2 54 -12 117 -94 286 40 122 -128 191 215
5848 215 6 24 -247 20 -125 4 -18 -173 197 -150 92 -136 -11 -237 341 45 -222 -74 -248 -6 202
5869 202 -224 -121 69 -429 -168 -35 -301 -85 62 -66 80 -62 -89 -1 57 -204 -189 63 -45 146 -90
5890 -90 181 -104 43 104 -7 -303 48 29 55 172 -104 -194 -13 -141 -155 -121 148 -247 170 -4 -16 -136 100
5913 100 0 -62 -170 149 18 -83 37 -58 68 -54 406 45 309 153 -173 -218 82 57 3 -71 221 209
5935 209 -158 -50 139 -215 64 -25 25 -76 -4 -208 48 203 -17 -13 116 4 192 141 60 197 -96 296
5957 296 -163 69 173 -61 -5 -72 -14 -88 56 -278 -185 -72 134 -3 39 -289 36 -183 -332 75 49 33 119
$$ packed form
5802a54K33J56O6m83K46L15m80L18k92Q1j34K23J24j40Q3k72K37r1q4J22n7j9
5824bO5q5K86l26q0M28k68j5P4J17k22L52k37q5N2o6J29k11L80k46Q2k50L19K4
5848B15k09J8k71K67j45J29k2j55L70l47K42k28J25k26N78k96k67J48j74K42K08
5869B02m26J03J90m98K61J33k66K16J47j28J46j42k7Q8N8k61J5K52j08J91k36
5890i0K71k85J47O1j11k96L51j9K6J17k76r0J81j28j4L4K69l95M17j74j2j20K36
5913A00j00o2j08L19j31j01J20r5J26j22M60l61K64j56l26m5L00k5n4p4K92j2
5935B09l67J08J89l54K79q9N0j01P2k04K56J55k20MJ29j12J88n1q1J37k93L92
5957B96m59K32J04k34N6o7N8p4J44l34R3J13K06j37M2l28L25k19j49M07k6j6Q6
$$ plain form
5980 119 -233 -177 92 118 113 -54 180 -108 270 -46 213 -46 126 89 47 -241 2 20 139 270 -10 -19 86
6003 86 -76 263 -247 165 -55 -200 180 217 104 -339 132 12 83 56 -248 133 88 118 95 -156 85 79 -246
6026 -246 47 56 -125 46 -16 166 -23 -43 -116 -4 39 82 -269 53 293 57 102 32 -323 -303 130 -188 -43
6049 -43 255 230 -50 -197 211 239 67 149 200 -76 -123 -144 -68 39 79 -143 304 249 34 -39 -148 6 -523 -313
6073 -313 224 -98 231 294 58 -1 141 73 -85 -384 -15 123 65 65 -186 -118 302 193 -45 -71 -112 232 95
6096 95 240 140 85 -218 -214 -145 52 97 -15 -112 -38 172 -42 -17 128 -26 -76 97 -217 -32 -19 96 68 -89
6120 -89 203 -3 17 -118 56 -115 124 37 -96 7 -248 79 186 69 -12 -102 -4 -18 -50 -37 164 33 158
6143 158 -208 -79 -144 -113 -104 -89 -226 48 32 -271 -71 12 7 -145 94 -84 -72 82 188 -29 59 263 -271 -53
$$ packed form
5980A19l52N6K69K6nj67K34k88L78l16K59k59J72l7m2k88K43J8J19J31k80rJ05
6003H6j62L39n10M12k20j45L80L7j13m43M71j20P1k7l04L81m5L0k3k51K41ol25
6026b46K93Rj81J71o2J82j89k0p3J12M3M3l51L22K40k36M5p0l55K0M33l18J45
6049d3K98k5k80j47M08K8j72Q2N1k76m7k1P6J07M0k22M47n5k15p3j09J54n29K10
6073c13N37l22L29O3k36n9J42o8j58k99L69J38n8%k51O8M20j09k38k6m1L44j37
6096I5J45j00n5l03MO9J97M5j12r7P4K10k14K5J45j54n0J73l14J85J3J15k8j57
6120h9K92k06K0j35J74j71K39q7j33J03k55L27J07j17q1r0R8j4l2J3K01j31J25
6143A58l66J29o5L1RJ5j37K74j6l03K00Q3nj52K39j78J2J54J06k17Q8K04n34K18
$$ plain form
6167 -53 204 99 209 248 -200 -69 -71 -98 7 247 68 -235 153 275 287 12 -19 9 17 -9 -45 -86 -149 28 -139
6192 -139 -22 143 -270 111 101 -93 33 -27 73 -130 77 -81 66 103 -141 122 -122 -172 -46 -136 60 155
6214 155 -167 256 -11 -66 208 135 157 7 -112 -16 59 -3 139 173 90 3 155 154 -4 209 52 -185 -7 -46
6238 -46 -155 15 76 -59 206 58 -143 -65 82 20 -194 -293 66 230 90 -4 261 289 241 117 -83 -79 136
6261 136 -131 143 -78 -4 -290 -134 -80 133 -127 -262 134 -254 -48 214 59 -11 80 203 -191 161 203 -35
6283 -35 -213 49 74 -46 -8 283 -14 77 -141 -171 156 331 78 -10 137 13 127 -119 187 -4 86 -89
6305 -89 -61 284 225 27 -73 -28 167 -111 -299 37 -334 -18 65 -256 -248 5 8 -137 104 193 39 101 97 -59
6329 -59 -11 241 77 -111 20 -116 87 -84 122 -126 36 9 186 70 150 173 243 120 -64 -50 29 261 106
$$ packed form
6167e3K57j05J10L9m48J31kk7J05K40j79l03L88J22J2k75l1K8Qk6l6m1o3J77j67
6192a39J17J65m13L81j0j94J26o0J00k03K07j58J47L7k44K63k44n0J26r0J96R5
6214A55l22M23k67n5K74p3K2j50j19R6P5o2J42L4q3q7J52jj58K13j57k37J78l9
6238d6j09J70O1j35K65j48k01P8J47o2k14r9L59J64j40r4K65K8m8j24k00MK15
6261A36k67K74k21P4k86J56N4K13k60j35L96l88K06K62j55p0R1J23l94L52M2k38
6283c5j78K62K5j20L8K91k97R1k18l0L27J75k53q8J47j24J14k46L06j91R0j75
6305h9K8L45n9j98j00M5J95k78j88L36l71L16Q3l21QK53Lj45K41Q9j54O2mj56
6329e9M8K52j64j88J31j36K03j71K06k48J62k7J77j16Q0K3P0j23j84J4P9K32j55
$$ plain form
6352 106 -197 77 245 31 -155 56 226 126 -135 231 -73 15 328 -339 -148 -14 -76 -59 -56 -157 2 53
6374 53 41 -226 57 141 -94 97 -182 62 -195 170 25 -77 16 -96 12 -68 -292 -25 74 -87 -218 -116
6396 -116 -387 36 38 90 -75 -72 -35 -107 -205 -4 -88 58 278 253 157 29 3 -141 -117 26 223 38 70 45 285
6421 285 82 -260 -365 290 -248 12 309 19 -429 32 -187 -114 78 0 -26 6 92 30 -72 193 -6 -363
6443 -363 -149 -65 90 -407 -379 -206 6 -214 -224 73 -240 -172 -178 -133 45 -188 -85 30 -55 -148 225 167 5
6466 5 -100 10 -111 -52 303 203 -99 -100 208 229 72 79 -298 -141 203 31 61 135 -328 46 2 300 -5 -312
6490 -312 -18 216 46 -128 -69 -290 17 -25 15 -103 33 214 134 -102 84 75 225 -106 -239 140 106 134 -98
6513 -98 -42 283 -54 20 218 88 -18 101 227 6 -172 89 198 -87 -224 134 -150 217 120 60 73 -123
$$ packed form
6352A06l03K74J68k14j86K11J70j00k61L66l04Q8L13o67J91J34o2J7Lj01J59N1
6374E3j2k67K83Q4k35J91k79K44k57L65j45j02R3j12J08q0k24K67R9j61j31J02
6396a16k71M23KN2j65LL7p2r8K01q4J46K20k5r6j28k6j44K4J43J97j85L2k5K40
6421B85k03l42j05O55n38K60K97k90m48M61k19P3J92p8k6L2Q6o2j02K65j99l57
6443c63K14Q4J55m97K8J73K12k20j0K97l13O8oM5J78k33J03J15q5r3L73n8j62
6466Ej05J10j21N9L55j00l02jL08K1j57Pl77J57L44j72L0P4m63L74m4K98l05l07
6490c12K94K34j70j74N9k21L07m2M0j18J36J81q0k36J86rJ50l31j33L79l4K8k32
6513i8N6L25l37P4J98j30j06J19J26k21j78K61J09k85j37L58k84L67r7o0J3j96
$$ plain form
6535 -123 243 -242 -63 152 -67 11 -36 49 14 158 17 -61 86 80 -106 -235 105 118 -57 -121 -78 30 -32 -187
6559 -187 -294 -29 -30 -147 -195 -278 -54 -13 -70 122 31 181 73 8 -207 -22 1 10 235 117 -159 -350 132 -90
6583 -90 -1 160 -337 118 -188 -35 -222 -37 -15 -303 201 -16 61 -67 120 129 26 -12 250 210 -178 43 -82
6606 -82 149 -189 -64 132 -55 -132 -187 49 256 -99 0 -206 -35 168 -157 -38 -113 166 35 -2 -93 -10 140
6629 140 57 -164 42 58 109 -85 574 -130 199 -89 -230 81 34 60 -92 157 129 -119 12 60 -228 -242 12
6652 12 297 121 -178 -81 55 39 -46 -401 -138 -30 9 -120 312 -345 -13 -32 105 -6 -78 -158 92 -284 -79
6675 -79 262 201 65 109 -89 125 351 73 168 -162 165 -118 -446 101 476 -111 143 -100 82 -32 -288
6696 -288 -164 129 68 -131 32 -20 -245 111 -337 53 88 112 -466 -64 71 177 131 107 98 -137 190 -49 -122
$$ packed form
6535a23L66m85J79K15k19P8m7Q5l5J44j41p8J47oj86j29L40J3j75o4M3J08o2j55
6559a87j07K65jj17m8q3K24M1n7J92r1J50j08o5k15J85K3RK25j18k76j91M82k22
6583i0Q9J61m97M55l06J53j87J85K2k88N04k17P7j28J87Rj03l8K62m0l88K21j25
6606h2K31l38J25J96j87p7n5K36K07l55R9k06J71K03l25J19p5K79j31l7r1Q3J50
6629A40q3k21K06J6N1j94O59p04L29k88j41L11m7K6j52K49k8k48J31M8k88j4K54
6652A2K85j76k99R7J36j6q5l55K63J08L9j29M32o57L32j9J37j11p2q0K50l76K05
6675g9L41o1j36M4j98K14K26k78R5l30L27k83l28N47L75n87K54k43J82j14k56
6696b88J24K93o1j99J63n2k25L56m48L90L5K4n78M02J35J06m6k4rk35L27k39p3
$$ plain form
6719 -122 -25 89 0 -257 10 197 163 -275 -39 -150 115 40 315 328 -114 182 -40 -135 -113 -154 442 140 77
6742 77 158 146 93 280 -18 -1 324 121 -337 261 28 -231 119 2 3 -68 -72 -148 165 -58 110 -434 311 13
6766 13 -54 303 330 -81 67 43 108 -75 -23 -118 -28 64 -17 162 77 217 -66 -43 34 177 -117 -136 86 -167 -146
6791 -146 151 -96 -192 -157 209 251 104 18 154 212 336 -47 -196 10 -150 -116 -171 -208 197 52 -83 -140 -89
6814 -89 -74 111 -161 -20 145 -214 -218 174 62 -44 125 0 -39 -120 40 -16 -17 -258 -107 -147 183 -12 -4 -50
6838 -50 -261 -358 -8 -254 -149 286 -59 -32 117 -46 -97 196 85 193 -27 152 126 43 -45 62 67 342 -26
6861 -26 -277 74 173 -242 181 157 99 90 -224 112 -61 182 -342 222 -82 129 -231 134 -134 -23 226 142
6883 142 -60 146 -68 35 126 12 -171 132 -51 29 -58 -254 53 -33 219 50 -61 -117 -139 -100 44 -285
$$ packed form
6719a22R7J14q9k57K67J87l4m38K36j11K65p5K75J3m42K96k22r5K2m1N96l02o3
6742G7Q1j2n3J87k98J7L25k03m58N98k33k59L50j17Jp1mp6L13k23J68n44P45k98
6766A3o7L57K7m11J48k4O5j83N2r5R0R2q1J79q5J40k83K3P7J43k94j9K22k53K1
6791a46K97k47r6L5L66M2j47q6J36N8J24l83j49K06j60L4n5l7M05j45j35n7N1
6814h9J5J85k72J41J65l59mL92j12j06J69j25l9q1J60n6jk41J51m0L30j95Qm6
6838e0k11r7L50k46J05M35l45K7J49j63n1K93j11J08k20J79k6q3q8J07NK75l68
6861b6k51L51R9m15M23k4n8rl14L36j73K43n24N64l04K11l60L65k68J11K49q4
6883A42k02K06k14J03R1j14j83L03j83Q0q7j96L07q6K52j69j11n6k2L9J44l29
$$ plain form
6905 -285 -106 133 68 -193 -13 119 -197 88 -112 39 255 -46 48 -217 -51 -309 -262 -41 -182 -329 -85
6926 -85 -168 89 153 -11 -345 87 27 -225 66 78 -121 -223 -99 -86 13 25 49 -4 106 127 86 -124 -72 -116 -285
6951 -285 39 39 -92 104 -160 30 48 -15 -25 141 -91 -184 30 53 154 -156 -129 -237 138 147 -89 104 -194
6974 -194 -109 -180 70 -177 181 -22 68 -110 179 224 -130 -25 233 12 183 -56 43 -117 57 -220 39 26
6996 26 182 -10 49 159 110 -62 -45 96 -4 75 -72 192 -98 -171 -141 276 -90 111 -50 205 85 -82
7018 -82 38 40 -57 -18 78 82 -160 268 -214 158 193 -186 -39 155 81 109 58 -168 53 44 -179 -13 171 83 129
7043 129 -272 179 86 0 -99 47 113 84 43 -76 45 -3 -192 81 32 213 148 87 2 -152 145 -170 113 -161
7067 -161 2 35 187 18 -51 -95 167 176 24 52 -157 -171 -36 148 -135 94 29 9 -77 -20 -388 -87 -173 -55
$$ packed form
6905b85J79K39o5k61J80J32l16K85k00J51K16l01R4k65J66k58M7K21j41j47K44
6926h5q3K57O4j64l34M32o0k52K91J2j99j02J24J3R9J2K4n3J10K1m1k10N2m4j69
6951b85L24%j31J96k64J90J8o3j0J66k32r3K14K3J01l10K7j08L75Rk36J93k98
6974a94Q5p1K50k47L58k03R0j78K89M5l54J05K58k21J71k39R9j60J74k77K59j3
6996B6J56j92N9J10m9j72J7J41j00P9j47K64k90p3L0M17l66K01j61K55j20j67
7018h2J20Kr7L9R6Mk42M28m82L72L5l79J47J94p4K8n1k26K21rk23J66J84q8M6
7043A29m01M51r3q6r9J46O6k9m1j19J21m8j89K73m9J81o5o1q5j54K97l15K83k74
7067a61J63L3J52j69o9m4K62Rj52K8k09j4J35J84k83K29o5k0q6N7l68L01q6J18
$$ plain form
7091 -55 -152 -21 -236 -290 -75 -114 -32 -19 -102 67 -67 417 148 186 31 -133 14 218 9 36 -2 103 -174
7114 -174 -35 22 44 15 -189 79 -189 -8 -11 -200 166 41 -105 -67 13 111 -186 1 170 -69 -105 227 -29
7137 -29 -140 76 148 39 -17 -45 -134 -191 260 88 148 24 -112 -338 88 161 2 27 185 -63 216 302 89
7160 89 -254 -259 -215 142 -193 33 54 52 167 28 -141 -91 275 -151 -92 -36 161 95 -48 -155 58 39 115 -103
7184 -103 -151 -71 98 -128 -88 -121 29 181 -113 117 122 -18 -79 148 -8 -269 -198 73 342 -27 69 -9 334
7207 334 206 7 143 18 -34 124 271 155 97 93 -264 -281 278 174 -231 -239 70 66 -39 209 139 -193 148
7230 148 84 -69 14 112 27 -176 -180 -268 53 239 -381 1 -88 -4 79 119 212 -106 304 -38 100 29 -54 110 -347
7255 -347 -70 -244 94 148 -100 -103 -330 -49 -58 -131 -59 72 37 48 -275 8 -192 -178 366 31 82 -178 -86 -98
$$ packed form
7091e5r7J31k15n4K15l9Q2J3q3J69j34M84k69L8j55j64J47K04k09K7l8J05k77
7114a74J39N7K2k9k04K68k68J81lj89L66j25j46L8Q0R8k97J87J69k39l6L32k56
7137b9j11K16P2j09n6k8q9n7M51j72O0j24j36k26M26P3j59K5J58k48K79Q6k13
7160H9l43nM4L57l35K26K1kJ15j39j69N0L66m26N9N6J97o6j43j07K13j9P6k18
7184a03m8Q0J69k26M0l3J50J52k94K30Nj40o1K27j56k61P1K71K69l69R6p8L43
7207C34j28j99J36j25n2J58J47j16n8ml57j7N59j04m05qL09mj05K48p0l32L41
7230A48o4j53Q3R8q5k03mq8L21J86o20L82q9Q4Q3M0R3l18M10l42J38p1q3J64m57
7255c47K77j74L38N4k48lk27K81rp3P2J31l5J1l23K83k00J4N44l35N1k60R2j2
$$ plain form
7279 -98 99 -148 -290 -33 378 -155 363 -265 -144 -100 201 117 93 71 -83 -167 165 111 -281 47 -193 -96 -215
7302 -215 -159 -9 72 160 -116 -32 -285 10 86 80 -245 134 -162 14 -140 69 10 -152 -161 -179 43 -71 232 -260
7326 -260 155 168 -128 80 54 53 -69 -3 -236 12 295 172 86 15 57 9 -255 237 210 -192 -243 -185 -131 201
7350 201 154 -30 443 191 -244 -174 178 51 -191 -121 -120 23 -5 285 30 26 191 237 -126 -115 -2 -77 -35 -42 -173
7375 -173 -87 -118 20 -96 -200 -139 -59 124 -161 -52 224 144 -31 79 45 240 -56 -134 -134 73 22 61 -170 -50
7399 -50 9 117 -182 -102 15 192 -104 42 -158 5 61 -7 -1 60 -192 182 -120 -131 48 -402 -30 28 -107
7422 -107 -226 -19 90 55 -155 -95 12 -56 16 20 -19 -132 86 -28 -13 -168 5 70 -90 62 -17 -182 -63
7445 -63 -98 171 42 24 137 -292 -56 -12 294 -100 83 13 264 -205 4 -245 -220 -106 72 -31 -224 -85
$$ packed form
7279i8J97k47j42K57M11n33N18o28J21M4L01q4k4k2j54q4L32n4l92L28k40R7j19
7302b15N6J50Q1Q8k76Q4k53K95P6ol25L79k96J76j54K09n9j62rj8K22j14L03m92
7326b60M15J3k96K08k6jj22O6k33K48K83j23q6p1M2m8k64M92k7m02n1N8N4L32
7350B01m7j84M73k52m35P0L52j27k42P0JJ43k8K90k55mJ65M6l63J1J13p5M2pj31
7375a73Q6l1J38j16j04O1Q0J83k85J09K76q0j75J10l4J95k96p8%K07n1L9k31J20
7399e0N9J08k99Q0J17J77k96J46k00J63N6o8OO1k52L74l02j1J79m50L72N8j35
7422a07j19K07J09l5k10O0J07o8P2Ml9j13K18j14J5j55J73O5j60J52p9j65J19
7445f3l5K69j29j8J13m29K36M4L06l94J83p0K51m69K09k49K5J14J78j03j93J39
$$ plain form
7467 -85 -143 -16 -84 36 -20 -54 -40 4 104 71 93 161 -83 151 114 144 80 304 36 46 -191 -51 -79 36 29 -128
7493 -128 -28 -22 -193 269 182 29 26 156 140 -111 -178 -164 -38 6 8 138 -146 -92 34 -170 -112 149 -27 371
7517 371 -131 341 -88 -265 39 -176 -43 -192 -153 -206 -194 -139 160 304 41 -91 257 -17 -198 -215 -181 -368
7539 -368 -215 61 49 -283 36 -68 191 358 -19 -96 -51 306 -88 -17 -142 -130 47 416 -82 -166 58 -234
7561 -234 233 -266 119 203 -193 46 -39 97 234 123 230 -123 260 -200 178 -19 15 -124 -86 199 39
7582 39 59 -114 227 249 -11 45 -455 144 -503 213 188 156 -141 135 51 -9 20 -223 131 -195 8 119 78
7605 78 106 132 253 121 25 -321 125 160 -100 355 -60 -9 2 -75 18 144 -214 140 182 48 -66 32 -80 -105
7629 -105 8 9 -100 228 28 -19 222 -67 62 -167 122 -75 -53 213 18 -256 -34 74 -195 -54 57
$$ packed form
7467h5n8J27o8J20n6l4J4M4J00l3K2O8k44K34l7L0o4K24k68J0k37J40k8J15pj57
7493a28J00Oj71M62q7j53lJ30j6k51o7J4J26M4KJ30k84N4J26k04N8K61j76L98
7517C71n02M72m29j77L04k15J33j49L9n3J2N5K99J44k63j32L48k74j81j7L4j87
7539c68J53K76j2l32L19j04K59J67l77p7M5L57l94P1j25J2J77L69m98q4K24k92
7561b34M67m99L85Q4l96K39q5J36J37j11J07l53L83m60L78j97L4j39L8K85j60
7582C9K0j73L41K2k60N6n00N99o47P16k5l2k97K76q4o0K9k43L54l26K03J11m1
7605G8K8K6J21j32r6l46M46L5k60M55m15N1J1p7R3J26l58L54M2j34j14R8j12k5
7629a05J13Jj09L28k00m7K41k89J29k29K89j97K2K66j95k74K22J08k69J41J11
$$ plain form
7650 57 -47 -16 247 -220 -264 323 108 74 -97 -135 158 312 -109 113 -247 -194 76 227 -15 53 -82 -115 -78
7673 -78 -69 -124 8 -13 -51 32 44 78 51 196 15 43 340 189 188 90 311 -1 -53 -101 63 46 -155 -62 66 85
7699 85 -23 -9 -127 15 96 249 41 253 -25 -213 -33 -68 -4 -67 -225 293 87 -286 -245 -146 -157 -99 56
7722 56 202 -45 -119 17 63 129 -131 59 206 -40 113 150 -159 -77 -198 -257 -119 285 143 -90 50 296
7744 296 -161 -9 115 -80 -53 -154 -24 168 -177 31 292 -158 102 -7 84 167 -276 -17 -99 -194 193 23
7766 23 110 121 -260 -167 43 -158 -205 -11 -244 317 99 -155 178 230 -198 -51 -437 258 -311 161 39 -53
7788 -53 -199 298 -141 74 107 -54 -244 -73 268 95 52 242 -26 -105 -87 183 313 -127 7 32 173 -45
7810 -45 478 185 124 20 198 -37 64 -106 -128 259 122 -85 217 119 -11 183 161 -3 -110 -103 -240 -56
$$ packed form
7650E7j04L1K63m67m4N87k15l4j71l8K93J54m21K22l60N3K70J51k42O8j35l3L7
7673g8Rn5J32k1l8Q3J2L4k7J45j81K8K97j51jr8K21l12n2m8J64j7k01R3J28J9
7699H5j08J4j18J42Q1J53k08K12k78j88J80l5O4o3j58N18k06l73M1R9j1N8J55
7722E6J46k47p4J36M6O6k60J90J47k46J53L7l09Q2j21n9J38M04j42k33J40K46
7744B96m57J52J24j95K7j01J30J92l45K08K61m50K60j09R1Q3m43K59q2r5L87j70
7766B3Q7J1l81R3K10k01m7J94k33N61k18k54L33N2m28J47l86O95n69M72j22r2
7788e3j46M97m39K15L3j61j90J71L41j73m3J90k68p9J8K70J30m40J34K5J41k18
7810d5N23k93o1j04J78k35J01j70k2L87j37k07L02r8j30J94k2j64j07Pj37J84
$$ plain form
7832 -56 -274 -19 117 -11 150 -165 -325 96 -126 -46 -241 -65 -81 60 -114 288 107 -132 -144 -84 160 121
7854 121 41 -78 148 191 -113 221 196 -162 -177 81 72 270 -129 113 225 7 79 -165 -25 -87 -314 -363 69
7877 69 42 233 287 121 -228 63 56 19 108 -190 -29 212 -226 -59 43 -198 -4 -27 44 -80 41 -89 -39
7900 -39 39 68 43 -25 64 -265 16 -91 61 195 -278 328 -107 -129 57 -87 179 88 -102 -73 52 440 6
7923 6 219 5 21 -30 35 11 -15 41 172 -102 329 -49 -15 -183 -31 134 -314 204 41 141 49 32 415 289
7947 289 -210 59 34 123 327 31 -302 76 5 24 -75 39 -364 -244 -31 -251 -285 -120 -84 8 -227 -8 54
7970 54 116 147 175 195 127 163 151 180 -68 190 3 359 137 315 90 -106 -158 117 -119 -164 95 -285 181 -212
7994 -212 83 -32 147 42 -339 -302 -24 -304 -123 169 65 27 66 -109 -11 -26 -165 139 240 -83 150 94
$$ packed form
7832e6k18K55J36j28J61l15j60M21k22Q0j95J76j6J41j74M02j81k39j2O0K44l9
7854A21q0j19K26M3l04L34k5l58j5K58rJ98l99K42J12k18P2k44J40o2k27m9M32
7877F9k7J91N4j66l49K91pl7Q9k98J61K41m38J67J02k41J94k3P1j24J21j30N0
7900c9P8K9k5o8Q9l29K81j07J52J34m73O06m35k2J86j44K66r1j90K9J25L88m34
7923FK13k14J6n1O5k4k6N6J31k74M31l78L4j68J52J65m48N18j63J00r2j7L83j26
7947B89m99K69k5Q9K04k96l33L78p1J9r9J14m03J20K13k20l4J65L6R2k35K19O2
7970E4O2L1K8K0o8L6j2K9k48K58j87L56k22J78k25j96n2K75k36m5K59l80M66l93
7994b12K95j15J79j05l81L7K78k80J81K92j04l8L9j75R8j5j39L04J01l23K33n6
$$ plain form
8016 94 -371 -64 -143 -6 -96 223 -15 -26 338 -78 159 38 119 101 -86 79 1 109 -146 -28 -113 -3 136
8039 136 72 -95 114 -48 -268 145 0 54 55 -11 173 -248 73 -60 -34 213 -189 -138 -25 142 104 -11 197
8062 197 133 -65 -31 22 -20 218 2 -182 107 143 -158 -334 -230 320 22 5 -75 117 -28 -31 -198 34 -55
8085 -55 -101 -31 108 -204 154 44 -20 16 185 175 -156 -106 314 -159 64 83 -63 -49 -82 59 59 3 165 95 -85
8110 -85 127 40 -117 -226 -8 -341 -33 -193 -257 86 -15 -17 -71 126 249 154 236 -34 21 215 23 91 13 240
8134 240 -44 48 235 -3 -272 -82 -9 -92 154 -190 -59 221 47 92 3 121 265 -21 139 8 70 147
8156 147 82 82 227 -30 11 102 176 201 -143 22 203 135 -13 -330 55 169 -105 123 -9 208 100 -17 76
8179 76 -74 -215 164 146 51 -6 -65 83 197 341 235 -174
$$ packed form
8016I4m65L07p9J37r0L19k38j1L64m16K37j21Q1j8j87J65p8J08k55J18q5J10J39
8039A36o4j67K09j62k20M13j45N4Jo6J84m21L21j33K6K47m02N1J13J67l8j15K08
8062A97o4j98L4N3m2K38k16j84K89L6l01j76J04N50k98j7q0J92j45lj67K32q9
8085e5m6P0J39l12L58j10o4L6J69j0l31N0M20m73K23J9j46J4l3J41%n6J62p0j80
8110h5K12q7j57j09K18l33L08j60o4L43j01kn4J97J23r5Q2k70N5J94j92O8p8K27
8134B40k84R2J87k38k69J90P3q3K46l44J31K80j74M5q9J18J44k86J60j31O2P7
8156A47o5%J45k57M1R1P4K5l44J65J81o8j48l17L85J14k74K28j32K17j08j17R3
8179G6j50j41L79j8r5n7n9J48J14J44j06m09
8191a74
$$ Imaginary data points
##PAGE= N=2
##DATA TABLE= (X++(I..I)), XYDATA
$$ plain form
0 0 0 0 0 0 0 0 0 0 6 -8 8 -8 8 -16 16 -18 24 -28 33 -40 47 -54 62 -73 82 -96 107 -122 138 -156 177 -199
32 -199 221 -250 277 -309 342 -382 422 -469 518 -575 638 -704 782 -867 963 -1075 1198 -1348
50 -1348 1522 -1732 1990 -2316 2746 -3338 4208 -5621 8312 -15291 72794 140909 -7912 -55206
64 -55206 -12061 64774 78044 33004 -43370 -39765 13534 26701 -3962 -1112 -7490 -42542 -48431
77 -48431 -5988 17729 10145 -27376 -75411 -60379 31173 60816 -18921 -81091 -46757 14811
89 14811 44377 22684 -35725 -54406 1174 38083 11820 -7442 -691 -13303 -20825 4444 19482
102 19482 8397 -4774 -29704 -44944 -3520 40097 6140 -50981 -51588 -20512 5434 17505
114 17505 -11783 -60855 -51113 -2107 10209 -5518 -15306 -36401 -46314 -7250 27073 7909 -21231
$$ packed form
0@%%%%%%%%Oj4J6j6J6k4L2l4M2n2O1p3Q7j01J16j35J55j78K03k29K60k94L33l76
32a99M20m71N27n86O51p24Q04q91R87j093J213j342J486j649J830k038K273k546
50a348K870l254L722m306N062o084P546r829J3933k3603Q8085O8115j48821m7294
64e5206M3145P6835J3270m5040p6374L605N3299J3167l0663K850o378l5052n889
77d8431M2443K3717p584l7521m8035J5032R1552K9643p9737o2170L4334O1568
89A4811K9566k1693n8409j8681N5580L6909k6263j9262O751j2612p522K5269J5038
102A9482j1085j3171k4930j5240M1424M3617l3957n7121o07L1076K5946J2071
114A7505k9288m9072R742M9006J2316j5727r788k1095r913L9064L4323j9164k9140
$$ plain form
127 -21231 -29577 -27921 616 39115 21815 -29392 -33677 -2582 16667 29889 23354 -21017 -41597
140 -41597 -16 38070 31996 7398 -24550 -39215 5666 58162 33142 -26032 -33880 -2836
152 -2836 26878 41701 17551 -26621 -20830 21406 29062 14625 14589 3690 -16339 -243 30496
165 30496 29989 12405 -7925 -27057 -5745 44442 37993 -22309 -42578 -7870 20715 23404 1051
178 1051 -34618 -33509 8161 17269 -13072 -18003 -3238 -11488 -17915 -1945 6539 3741 -1081 -18945
192 -18945 -22862 17150 42121 4692 -28549 -9023 21029 30321 23611 -1354 -16645 10456 34211
205 34211 14784 -611 11848 8230 -6206 3832 17623 11312 2719 -10670 -24202 -1761 31711
218 31711 10920 -34351 -31545 359 13323 8905 -9013 -31549 -19698 13949 12330 -9435 -6957
$$ packed form
127b1231q346J656K8537L8499j7300n1207m285L1095J9249J3222o535m4371k0580
140d1597M1581L8086o074k4598l1948j4665M4881N2496k5020n9174p848L1044
152b836K9714J4823k4150m4172N791M2236P656j4437l6j0899k0029J6096L0739
165C0496n07j7584k0330j9132K1312N0187o449o0302k0269L4708K8585K689k2353
178A051l5669J109M1670R108l0341m931J4765q250o427J5970Q484k798m822j7864
192a8945l917M0012K4971l7429l3241J9526L0052R292o710k4965j5291K7101K3755
205C4211j9427j5395J2459l618j4436J0038J3791o311q593j3389j3532K2441L3472
218C1711k0791m5271K806L1904J2964m418j7918k2536J1851L3647j619k1765K478
$$ plain form
231 -6957 -2282 -11281 -399 20721 12359 -4652 -4628 -2944 7635 30792 21302 -15853 -15664 18245
245 18245 26565 12426 854 -9858 -7128 16523 19300 -6038 -10406 1920 -4608 -8294 7001
258 7001 4697 -14491 -15368 -7245 -5310 2894 2698 -20638 -24781 3360 10401 -9178 -14022 -6613 -6647
273 -6647 -129 4957 -7782 -10620 5975 3087 -12213 -1842 11723 66 -8466 -1653 -499 2580
287 2580 10678 -1899 -16011 917 15093 -1226 -9069 2471 2105 -3651 2367 913 -4447 5444
301 5444 5917 -11376 -6379 15714 9226 -9761 -5771 3046 4778 9985 3954 -12751 -4520 16475
315 16475 7835 -9171 -913 5631 -1638 616 5052 -2827 -2290 5299 -4051 -8023 8971 9032 -11517
330 -11517 -10269 5904 5020 327 -372 -8879 -6723 11960 8763 -12424 -8164 8845 4033 -2917
$$ packed form
231f957M675q999J0882K1120q362j7011K4J684J0579K3157r490l7155J89L3909
245A8245Q320j4139j1572j0712K730K3651K777k5338m368J2326o528l686J5295
258G001k304j9188q77Q123J935Q204j96k3336m143K8141P041j9579m844P409l4
273f647O518N086j2739k838J6595k888j5300J0371J3565j1657q532O813J154L079
287B580Q098j2577j4112J6928J4176j6319p843J1540l66n756O018j454n360R891
301E444M73j7293M997K2093o488j8987L990Q817J732N207o031j6705Q231K0995
315A6475q640j7006Q258O544p269K254M436p879N37P589r350l972J6994O1k0549
330a1517J248J6173q84m693o99q507K156J8683l197k1187M260J7009m812o950
$$ plain form
344 -2917 1061 -1279 -3030 6929 3971 -8095 1010 10551 -2935 -7758 6497 6888 -3859 -1611
358 -1611 1066 -2315 5718 7213 -9547 -8887 10507 8559 -7977 -4954 2091 -359 3124 3407 -8575
373 -8575 -6442 9296 3555 -10525 -1797 5729 -3777 -4108 2740 -2119 -2823 3788 -3549 -8831 5945
388 5945 8800 -8473 -8585 6356 4870 -1195 1593 -2506 -3664 9487 9316 -7286 -4074 10940
402 10940 5723 -2825 3864 3825 -447 6613 6332 -3941 1318 10906 -253 -6868 5853 7123 -4285
417 -4285 -2457 1642 -2766 912 4119 -8236 -10022 5733 4467 -9840 -6857 1530 -3018 -2989 881
432 881 -6753 -7204 4982 1654 -9460 -1818 6416 -2698 -4256 3469 906 -1744 4361 383 -6570
447 -6570 4222 9444 -4698 -6442 5931 3634 -3303 1428 444 -4605 2522 4638 -7201 -5181
$$ packed form
344b917L978k340j751R959k958j2066R105R541j3486m823J4255L91j0747K248
358a611K677l381Q033J495j6760O60J9394j948j6536L023P045k450L483K83j1982
373h575K133J5738n741j4080Q728P526r506l31O848m859p04O611p337n282J4776
388E945K855j7273j12J4941j486o065K788m099j158J3151j71j6602L212J5014
402A0940n217q548O689l9m272P060k81j0273N259R588j1159o615J2721J270j1408
417d285J828M099m408L678L207j2355j786J5755j266j4307K983Q387m548K9L870
432H81p634m51J2186l328j1114P642Q234r114j558P725k563k650O105l978o953
447f570J0792N222j4142j744J2373k297o937M731r84n049P127K116j1839K020
$$ plain form
461 -5181 7210 826 -8741 -1076 2550 -2794 278 994 -7508 -3175 8065 373 -8282 776 3905
476 3905 -4154 -533 5018 -2366 -3499 3266 -1636 -3531 7299 3720 -10679 -5151 7470 3356
490 3356 -1981 -1028 -5977 -4875 9121 7755 -7499 -5958 4233 1513 1845 8078 1837 -5620 3730
505 3730 8564 3541 7930 8671 -3693 -1940 14996 15343 2402 517 1167 1317 12354 15040 -2732
520 -2732 -9417 2937 6366 1562 3370 -1805 -12669 -5945 5083 -928 -6638 -4274 -10379 -13432
534 -13432 769 5903 -7623 -12277 -6467 -6229 193 8496 -1556 -13490 -3577 7352 4710 4993
548 4993 5086 -5356 -4240 11517 13428 2785 1393 633 -2973 6211 14758 2672 -8424 -2669 -927
563 -927 -1813 5624 2672 -14039 -15044 -2917 -887 -2313 -2407 -14616 -22596 -5733 8062 -1812 -12535
$$ packed form
461e181J2391o384r567P665L626n344L072P16q502M333J1240p692q655R058L129
476C905q059L621N551p384j133O765m902j895J0830l579j4399N528J2621m114
490C356n337R53m949J102J3996j366j5254J541J0191k720L32O233o241p457R350
505C730M834n023M389P41j2364J753J6936L47j2941j885O50J50J1037K686j7772
520b732o685J2354L429m804J808n175j0864O724J1028o011n710K364o105l053
534a3432J4201N134j3526m654N810K38O422Q303j0052j1934R913J0929k642K83
548D993R3j0442J116J5757J911j0643j392p60l606R184Q547j2086j1096N755J742
563i27q86P437k952j6711j005J2127K030j426r4j2209p980J6863J3795r874j0723
$$ plain form
578 -12535 -14055 -12814 -2107 12231 2879 -15325 -10109 3135 4932 7710 8745 -3922 -8625 5272
592 5272 12765 10542 9522 915 -10936 98 22072 17625 -2257 -9728 -6907 4418 19651 12264
606 12264 -14246 -18215 2166 11215 5469 -26 -10076 -14437 -290 9740 1782 -3061 -3223 -10975
620 -10975 -9276 9672 14286 -2773 -13047 -10194 -1131 13981 16615 -7656 -23008 -4429 14964
633 14964 11987 1351 -9387 -14701 -1058 15384 6873 -7171 -4900 -3167 -5362 4652 12629
646 12629 1716 -8555 -6697 -2451 8535 19656 6266 -17592 -11648 13254 21103 11710 -2407
659 -2407 -13314 -4310 20038 22333 -223 -9139 -2341 2890 9105 13957 2812 -9801 -5367 475
673 475 3101 11095 8298 -13155 -19617 309 15316 11292 -2075 -17631 -17710 9126 26488 6714
$$ packed form
578a2535j520J241J0707J4338r352j8204N216J3244J797K778J035j2667m703J3897
592E272P493k223j020q607j1851J1034K1974m447j9882p471K821J1325J5233p387
606A2264k6510l969K0381R049n746n495j0050m361J4147J0030p958m843j62p752
620a0975J699J8948M614j7059j0274K853R063J5112K634k4271j5352J8579J9393
633A4964k977j0636j0738n314J3643J6442q511j4044K271J733k195J0014P977
646A2629j0913j0271J858M246J0986J1121j3390k3858N944K4902P849r393j4117
659b407j0907R004K4348K295k2556q916O798N231O215M852j1145j2613M434N842
673D75K626P994k797k1453o462J9926J5007m024j3367j5556p9K6836J7362j9774
$$ plain form
687 6714 -16691 -12310 2947 14813 18822 5135 -11385 -4393 12469 13426 9909 9684 -761 -8210
701 -8210 4370 16808 12794 3704 -7353 -15875 -1927 21265 12996 -16208 -24685 -10542 4684
714 4684 10864 -2511 -26654 -26414 -2207 6247 -6229 -13469 -16249 -18182 -8534 2186 -2756 -9901
728 -9901 -10558 -14734 -11821 6964 13391 -5666 -19280 -11104 3161 15186 13029 -9689 -22594 -2186
742 -2186 19254 12098 -3301 -9711 -10155 444 12623 6375 -7509 -7510 -4207 -6134 1671 10601 -73
757 -73 -14296 -11905 -2233 6812 12686 -319 -21003 -14219 12299 18585 3826 -9393 -12511 -2214
771 -2214 17506 18963 -1956 -9532 979 7839 9841 13517 6400 -5021 -1617 8087 10557 12839
785 12839 9216 -6785 -10705 9356 21292 10294 -3858 -9455 -5065 12508 21854 3584 -14701
$$ packed form
687F714k3405M381J5257J1866M009j3687j6520O992J6862R57l517k25j0445p449
701h210J2580J2438m014r090j1057q522J3948K3192q269k9204q477J4143J5226
714D684O180j3375k4143K40K4207Q454j2476p240k780j933R648J0720m942p145
728i901o57m176K913J8785O427j9057j3614Q176J4265J2025k157k2718j2905K0408
742b186K1440p156j5399o410m44J0599J2179o248j3884jL303j927P805Q930j0674
757g3j4223K391R672R045N874j3005k0684O784K6518O286j4759j3219l118J0297
771b214J9720J457k0919p576J0511O860K002L676p117j1421L404R704K470K282
785A2839l623j6001l920K0061J1936j0998j4152n597M390J7573R346j8270j8285
$$ plain form
798 -14701 -6599 8045 11116 9304 1105 -9591 -4690 8593 8444 2080 2178 -3040 -9707 385 12492
813 12492 5938 -4367 -7921 -8841 66 13150 6224 -14388 -15140 -400 5434 4766 -862 -12390
827 -12390 -13463 2257 7934 -1903 -5793 -4310 -7228 -3356 6975 4580 -3998 -4285 -3843 -2349 8027
842 8027 11460 -3231 -11387 -1402 7034 8127 5796 -3718 -12001 -1011 11874 5697 -3874 -4724 -5273
857 -5273 -2992 6050 5656 -6385 -8359 -2758 -2260 780 5533 -2641 -12656 -6208 3229 3571 2104
872 2104 -2062 -10848 -6658 8635 8747 -3314 -5715 -2626 -399 6780 9112 -1594 -7549 1199 4945
887 4945 3047 5052 1776 -6176 -2811 5978 4017 -4 930 -3881 -6093 3823 7624 -1946 -6993
902 -6993 -2533 -2267 651 4974 -1210 -9186 -3419 3345 -525 -846 855 -4519 -5459 3115 3792 -2084
$$ packed form
798a4701Q102J4644L071j812q199j0696M901J3283j49o364R8n218o667J0092J2107
813A2492o554j0305l554r20Q907J3084o926k0612p52J4740N834o68n628j1528
827a2390j073J5720N677r837l890J483k918L872J0331k395q578k87M42J494J0376
842H027L433j4691q156R985Q436J093k331r514q283J0990J2885o177r571q50n49
857e273K281R042l94j2041j974N601M98L040M753q174j0015O448R437L42j467
872B104m166q786M190J5293J12j2061k401L089K227P179K332j0706n955Q748L746
887D945j898K005l276p952L365Q789j961m021R34m811k212R916L801r570n047
902f993M460K66K918M323o184p976N767O764l870l21J701n374r40Q574O77n876
$$ plain form
918 -2084 -470 847 -4284 -471 6846 1569 -4097 -133 1064 -749 4467 4679 -3945 -3673 3897 2888
934 2888 -408 3185 448 -4520 1066 5511 395 -1608 1695 -1812 -1914 5231 3798 -4235 -1846
949 -1846 2353 -459 1078 4408 -1434 -5261 2096 3851 -1027 216 1325 -3908 -1591 4973 1335
964 1335 -3659 -418 737 -2786 1860 3813 -3471 -4436 2206 1039 -2086 1047 -78 -4956 -273
979 -273 4094 -1544 -3014 1372 -655 -3387 2463 2075 -3839 -1441 2814 -1361 -1329 3208 -248 -3813
995 -3813 2128 3322 -2051 -622 3330 -1042 -1182 4111 909 -2894 2371 3400 -1789 314 3889
1010 3889 -284 -1257 3357 1154 -2714 2187 3094 -2252 -185 3394 -972 -2593 2897 902 -3229
1025 -3229 876 2181 -2761 -657 3160 -1908 -3092 2736 1282 -3078 720 2039 -2402 -100 4026
$$ packed form
918b084J614J317n131L813P317n277n666L964J197j813N216K12q624K72P570j009
934B888l296L593k737m968N586M445n116k003L303l507j02P145j433q033K389
949a846M199k812J537L330n842l827P357J755m878J243J109n233K317O564l638
964A335m994L241J155l523M646J953p284r65O642j167l125L133j125m878M683
979b73M367n638j470M386k027k732N850l88n914K398M255m175L2M537l456l565
995c813N941J194n373J429L952m372j40N293l202l803N265J029n189K103L575
1010C889m173r73M614k203l868M901R07n346K067L579m366j621N490j995m131
1025c229M105J305m942K104L817n068j184N828j454m360L798J319m441K302M126
$$ plain form
1040 4026 -930 -2518 3302 1828 -1930 1876 3478 -1911 -425 4077 197 -1495 3200 1336 -2769
1055 -2769 1486 3008 -2735 -2134 2616 -848 -2927 1321 -806 -4871 -396 1504 -4283 -3535 1072
1070 1072 -2260 -4520 463 -409 -4776 -860 1282 -3809 -2424 2260 -1564 -3906 1743 1500 -2837
1085 -2837 511 2858 -1739 -907 4036 -174 -2087 2986 2384 -2131 879 3417 -488 -591 2773 -726
1101 -726 -2143 3141 2171 -3443 -566 2683 -1365 -1063 2765 -1091 -3262 1880 1869 -2520 -39 2564
1117 2564 -2549 -1621 3584 861 -2959 383 1181 -1716 1730 3513 -3076 -3022 3003 1702 -1330 1489
1133 1489 308 -3358 971 4594 -438 -2524 1610 -237 -1754 3950 3228 -3115 -1708 2893 989
1148 989 1160 3684 -953 -4055 2387 5101 -221 -439 1385 -1995 -117 4994 1480 -3456 -313 823
$$ packed form
1040D026m956j588N820j474l758L806J602n389J486M502l880j692M695j864m105
1055b769M255J522n743O01M750l464k079M248k127m065M475J900n787P48M607
1070A072l332k260M983q72m367L916K142n091J385M684l824k342N649k43m337
1085b837L348K347m597Q32M943m210j913N073o02m515L010K538l905j03L364l499
1101g26j417N284r70n614K877L249m048L02L828l856k171N142j1m389K481K603
1117B564n113R28N205k723l820L342P98k897L446J783o589N4O025j301l032K819
1133A489j181l666M329L623n032k086M134j847j517N704p22o343J407M601j904
1148I89J71K524m637l102O442K714n322k18J824l380J878N111l514m936L143J136
$$ plain form
1164 823 -2275 1047 3502 -3482 -5775 231 919 -1654 198 -1985 -6790 -2019 4006 -893 -4971
1179 -4971 -1778 -1972 -2969 2848 2636 -3731 -3097 1427 -274 478 5181 790 -4613 167 4769 2699
1195 2699 2634 1875 -3743 -1667 6901 5302 -2143 -1875 -274 -1324 2739 5000 -2528 -5718 -580 637
1211 637 -1210 1707 123 -7254 -5382 2081 1906 -1138 -1351 -5140 -6105 3119 6680 -1160 -5428 -1896
1227 -1896 -523 2808 6935 1064 -6098 -1328 5474 4001 3335 2747 -2834 -2944 5687 6860 1244 305
1243 305 -441 -3450 1838 8543 2363 -4909 -3272 -415 1740 5836 2402 -7764 -6921 2985 5064
1258 5064 1223 -1040 -5118 -5824 3145 6815 -490 -4280 -1779 -1742 -400 5276 3188 -4308 -3957 -440
1274 -440 716 4752 5469 -4055 -8966 645 7614 4228 -142 -4281 -6540 1567 9638 3204 -5919
$$ packed form
1164H23l098L322K455o984k293O006O88k573J852k183m805M771O025m899m078
1179d971L193j94r97N817k12o367O34M524j701P52M703m391n403M780M602k070
1195B699o5p59n618K076Q568j599p445K68J601j050M063K261p528l190N138J217
1211F37j847K917j584p377J872P463j75l044k13l789r65R224L561p840m268L532
1227a896J373L331M127n871p162M770O802j473o66n88n581j10Q631J173n616r39
1243C05p46l009N288O705o180p272J637K857K155M096l434j0166Q43R906K079
1258E064l841k263m078p06Q969L670p305l790K501L7J342N676k088p496L51L517
1274d40J156M036P17r524m911R611O969l386m370m139k259Q107Q071o434r123
$$ plain form
1289 -5919 -3793 367 1205 4595 3741 -3502 -4820 606 1376 2204 5109 -252 -8510 -3610 6362 6493
1305 6493 1033 -4104 -8121 -2892 9348 7522 -5526 -9034 -2189 2389 4311 3258 -4974 -7972
1319 -7972 -172 3854 315 643 228 -6278 -5594 3696 5782 1138 -2537 -6591 -5364 6265 11266
1334 11266 -712 -10276 -4306 3339 7094 5956 -2549 -9372 -1319 7950 4334 -1056 -1165 -2998 -3552
1349 -3552 2916 5210 34 -2966 -3401 -5337 223 7966 2147 -8642 -7864 -566 4296 5517 -600
1364 -600 -10865 -7942 5705 7825 -677 -4928 -4443 -2912 3263 6253 -166 -4463 -861 -155 154
1379 154 5570 5669 -3175 -5588 203 4675 6406 4884 -4490 -8716 2245 11109 4968 -3187 -5056
1394 -5056 -3116 3434 9143 2373 -6994 -3795 1887 1714 2804 3571 -2540 -5829 -122 3173 3211 3561
$$ packed form
1289e919K126M160Q38L390q54p243j318N426P70Q28K905n361q258M900R972J31
1305F493n460n137m017N229J2240j826j3048l508O845M578J922j053q232k998
1319g972P800M026l539L28m15o506O84R290K086m644l675m054J227J1629N001
1334A1266j1978r564N970P645L755j138q505o823Q053R269l616n390j09j833n54
1349c552O468K294n176l000m35j936N560P743n819j0789P78P298M862J221o117
1364f00j0265K923J3647K120q502m251M85J531O175K990o419m297L602P06L09
1379A54N416R9q844k413N791M472J731j522r374m226J0961Q864o141q155j869
1394e056J940O550N709o770r367L199N682j73J090P67o111l289N707L295L8L50
$$ plain form
1410 3561 -1024 -8067 -2790 8419 6841 -1816 -5366 -4414 1060 9204 6819 -5726 -7694 1197 5302
1425 5302 3458 2055 -2547 -5312 866 5331 1395 86 564 -3964 -4176 4421 6540 -668 -4312
1440 -4312 -3738 -1965 4598 7553 -2210 -9301 -2851 4449 3692 1497 -2760 -7014 -1563 5989 2463
1455 2463 -2716 -2179 -1538 -3269 1817 4364 -421 -4174 -2677 -2124 396 5817 1551 -7337 -5066 2818
1471 2818 3979 1890 -574 -5660 -4297 4865 5743 -1520 -3392 -1239 -1437 1221 4675 512 -4037
1486 -4037 -1281 959 66 3179 3234 -3765 -5455 1558 4245 1732 269 -3007 -5553 1535 6702 821
1502 821 -4038 -2193 -463 554 4010 1692 -4487 -3028 1774 1116 503 2109 -1892 -4989 705 3744
1518 3744 830 -228 -635 -3607 -1233 4984 2881 -3377 -2473 432 213 2817 2911 -3001 -4097 1216
$$ packed form
1410C561m585p043N277J1209j578q657l550R52N474Q144k385j2545j968Q891M105
1425E302j844j403m602k765O178M465l936j309M78m528k12Q597K119p208l644
1440d312N74J773O563K955r763p091O450P300p57k195m257m254N451P552l526
1455B463n179N37O41j731N086K547m785l753J497N53K520N421m266q888K271P884
1471B818J161k089k464n086J363R162Q78p263j872K153j98K658L454m163m549
1486d037K756K240q93L113N5o999j690P013K687k513j463l276k546P088N167n881
1502H21m859J845J730J017L456k318o179J459M802o58o13J606m001l097N694L039
1518C744k914j058m07k972K374O217k103o258R04K905k19K604R4n912j096N313
$$ plain form
1534 1216 2730 -245 755 -319 -3483 -515 4155 1116 -1767 87 -1160 -1981 2780 3515 -1828
1549 -1828 -2610 216 187 466 2725 -344 -4154 -172 3360 -230 -787 979 -1769 -2039 2984 2275 -1797
1566 -1797 -327 472 -1724 626 3338 -355 -3087 557 1271 -370 1550 1669 -3148 -1730 2940 1373
1582 1373 -1174 807 -212 -2322 1475 2936 -1147 -1699 1189 -657 -899 2614 990 -2977 -503
1597 -503 2016 -16 6 1825 -1607 -2194 1922 2266 -1265 -87 1321 -1463 -291 2499 -251 -2517
1613 -2517 614 976 -1411 796 1838 -1510 -1359 1896 363 -1630 1052 460 -2242 321 2380 -1154
1629 -1154 -1548 1349 -18 -1408 1296 1099 -2173 -164 1756 -929 -1065 1604 -196 -2039 1537 958
1645 958 -2106 49 2274 -1501 -1278 2020 72 -1684 700 1115 -1696 47 1874 -1010 -1390 1787
$$ packed form
1534A216J514k975J000j074l164K968M670l039k883J854j247q21M761P35n343
1549a828p82K826k9K79K259l069l810L982L532l590n57J766k748k70N023p09m072
1566a797J470P99k196K350K712l693k732L644P14j641J920J19m817J418M670j567
1582A373k547J981j019k110L797J461m083n52K888j846k42L513j624l967K474
1597e03K519k032K2J819l432n87M116L44l531J178J408k784J172K790k750k266
1613b517L131L62k387K207J042l348J51L255j533j993K682n92k702K563K059l534
1629a154l94K897j367j390K704j97l272K009J920k685j36K669j800j843L576n79
1645I58l064K155K225l775K23L298j948j756K384M15k811J743J827k884l80L177
$$ plain form
1661 1787 17 -2100 793 1508 -1893 -610 1303 -1249 -1555 1849 82 -2450 769 1360 -1592 -458
1677 -458 1760 -949 -1447 1607 94 -1840 752 1276 -2085 -479 2117 -733 -1526 1761 185 -1790
1693 -1790 1070 1512 -1530 -440 1825 -722 -1456 1602 292 -1680 935 1522 -1376 -154 1892 -1244
1709 -1244 -1479 1890 626 -1913 594 1169 -1552 -167 2069 -295 -1521 1527 771 -1703 613 1344
1725 1344 -1686 -773 1840 -238 -1205 1064 64 -1818 698 1778 -1684 -902 1523 -307 -974 1438
1741 1438 476 -1965 709 1907 -1132 -560 1941 -115 -1430 1685 1171 -1681 238 1568 -1103 -356
1757 -356 2156 -876 -1984 934 1199 -1522 -91 1158 -1569 -760 1882 -720 -2107 1036 970 -1769
1773 -1769 56 1311 -1491 -1290 1304 39 -1208 1225 30 -2090 651 2683 -454 -1671 1351
$$ packed form
1661A787j770k117K893P15l401J283J913k552l06L404j767k532L219N91k952J134
1677d58K218k709m98L054j513j934K592N24l361J606K596k850p93L287j576j975
1693a790K860M42l042J090K265k547p34L058j310j972K615N87k898J222K046l136
1709a244k35L369j264k539K507N75k721J385K236k364j226L048p56k474K316P31
1725A344l030R13K613k078r67K269j000j882K516J080l462P82K425j830o67K412
1741A438r62k441K674J198l039N72K501k056j315L115n14k852J919J330k671P47
1757c56K512l032j108K918K65k721J431J249k727Q09K642k602j387L143o6k739
1773a769J825J255k802K01K594j265j247K433j195k120K741K032l137j217L022
$$ plain form
1788 1351 87 -348 1562 1123 -1871 156 2131 -685 -922 1613 -158 -1817 799 1276 -910 197
1804 197 870 -1822 -686 2679 273 -2656 -244 1221 -635 441 1380 -1439 -1485 2116 1039 -1346
1820 -1346 738 957 -1630 46 2432 180 -838 649 -606 -1161 2255 2003 -2384 -1507 1400 166
1836 166 27 1127 -883 -2591 1009 1767 -1016 -330 677 -1980 -1820 2099 1486 -1789 -658 -171 -1074
1853 -1074 1729 2629 -2047 -3096 1146 1708 -179 436 -81 -2500 206 2679 152 -1368 562 -760
1869 -760 -2181 1637 2888 -1431 -2500 -641 -472 884 2153 -1633 -4482 -481 2844 286 -1144
1884 -1144 -446 -2024 -1286 2285 1461 -1732 -50 621 -1362 734 3548 378 -2427 -700 986 1479
1900 1479 3203 953 -3515 -1247 3621 2614 -560 -307 -1272 -1468 1945 2878 -1259 -1655 405 -747
$$ packed form
1788A351j264m35J910m39k994K027J975k816k37K535j771j659K616M77k186J107
1804A97O73k692J136L365k406k929K412J465j856J076R39k819m6L601j077k385
1820a346K084K19k587J676K386k252j018J487j255n55L416k52m387Q77K907j234
1836A66j39J100k010j708L600P58k783O86J007k657J60L919o13l275J131M87r03
1853a074K803R00m676j049M242N62j887O15n17k419K706K473k527j520J930j322
1869g60j421L818J251m319j069J859J69J356J269l786k849M001L325k558j430
1884a144O98j578P38L571q24l193J682O71j983K096K814l170k805J727J686M93
1900A479J724k250m468K268M868j007l174K53r65j96L413R33m137l96K060j152
$$ plain form
1916 -747 -236 2552 1251 -3139 -1741 1024 977 1766 1363 -2956 -3184 2448 3630 -76 -1110 -919 -1306
1933 -1306 1542 3959 533 -2841 -540 764 498 2307 1659 -2848 -2638 1439 1972 834 187 -1786
1949 -1786 -3396 684 3311 -101 -1781 -1119 -1937 -462 3267 1820 -3060 -3254 -320 912 2261 1788
1965 1788 -2756 -4221 1129 3702 342 -1290 -1495 -2002 252 3306 479 -1774 -780 -418 -1665 1540
1981 1540 3356 -1253 -3737 -1492 1080 2196 2329 -2126 -5676 -630 5020 2176 -2230 -2390 -1310
1996 -1310 817 3625 1254 -2443 -1107 1483 -298 207 2832 1256 -2555 -1805 1101 2464 3325 464
2012 464 -4832 -2715 4842 4826 -1464 -3690 -1790 563 3169 1806 -2950 -3107 1096 864 -961 1106
2028 1106 1192 -2100 -2726 66 1424 1964 1109 -3494 -4188 2352 5665 432 -3739 -2374 331 3033
$$ packed form
1916g47N11K788j301m390J398K765m7P89m03m319k28N632J182l706j034J91l87
1933a306K848K417l426l374K301J304k66J809o48m507K10M077N33j138o47j973
1949a786j610M080K627l412j680O62q18J475L729j447m880j94K934J232J349m73
1965A788m544j465N350K573l360j632k05n07K254L054k827k253R94L62j247L205
1981A540J816m609k484K245K572J116J33m455l550N046N650k844m406j60J080
1996a310K127K808k371l697J336K590j781N05K625j576l811P50K906J363Q61k861
2012D64n296K117P557j6o290k226J900K353K606j363m756j57M203k32j825K067
2028A106Q6l292o26K792J358N40q55m603o94O540L313n233m171J365K705K702
$$ plain form
2044 3033 3599 -1141 -3726 189 2726 633 148 1147 -1354 -2210 389 1792 801 459 -1688 -3987
2060 -3987 153 4632 1081 -3543 -2544 -430 1206 2664 493 -3688 -2679 1711 1607 355 757 -1004
2076 -1004 -2568 704 3458 1041 -618 -754 -1714 -111 3792 2168 -2189 -1470 613 954 1723 1856
2092 1856 -1454 -2725 610 2007 1095 871 -422 -3303 -850 3528 2248 -1848 -2148 -1152 354 2527
2108 2527 1497 -2664 -2434 1194 1119 -385 919 260 -2169 -1097 1225 1114 968 634 -3086 -2416 2748
2125 2748 3686 -1166 -3258 -1500 469 2535 2050 -2484 -3507 1184 2146 -1074 -874 823 -995 -1404
2141 -1404 558 518 717 712 -1701 -3265 1323 4252 123 -3510 -1792 844 1867 1644 -1332 -3423 220
2158 220 2936 190 -1816 536 193 -1137 311 949 197 733 -230 -2497 -469 3832 1594 -2940
$$ packed form
2044C033N66m740k585L915K537k093m85R99k501q56K599J403r91l42k147k299
2060c987M140M479l551m624R99K114J636J458k171m181J009M390j04j252M02j761
2076a004j564L272K754k417j659j36r60J603L903j624m357P19K083L41P69J33
2092A856l310j271L335J397r12k24j293k881K453M378j280m096l00R96J506K173
2108B527j030m161K30L628p5j504J304o59k429J072K322j11j46l34l720O70N164
2125B748R38m852k092J758J969K066m85m534j023M691R62l220K00J697j818m09
2141a404J962m0J99nk413j564M588K929m129l633J718K636J023k23k976k091L643
2158B20K716k746k006K352l43j330J448O38p52N36r63k267K028M301k238m534
$$ plain form
2174 -2940 -1942 555 1753 1213 -199 -2884 -655 2559 1070 -1893 76 1078 -766 -647 1035 711
2190 711 21 72 -1649 -1297 2731 2459 -2149 -2176 1323 1468 556 378 -1215 -1194 1553 1680 -1535 -670 1480
2209 1480 -180 -1420 871 1654 -196 -365 -745 -1439 1392 2400 -1703 -2966 314 2513 -131 -878
2225 -878 -791 -1011 738 1550 -887 -1237 1294 463 -1724 174 1879 172 -813 -451 -301 573 2454 -301
2243 -301 -2887 5 2552 274 -1201 210 156 221 903 -197 -1200 1035 1281 -1676 -1315 1708 829
2260 829 -1720 -404 -19 36 1324 108 -2244 -716 2674 351 -2147 -326 736 -242 -315 -145 -996
2277 -996 -20 1395 -1151 -1875 882 1781 -1612 -1425 89 336 656 256 -1726 -1015 1852 987 -2243
2294 -2243 -937 1362 321 -782 -172 -121 69 1531 35 -2323 547 2707 -253 -1764 576 1191
$$ packed form
2174b940R98K497J198n40j412k685K229L214j489k963J969J002j844J19J682l24
2190G11o90N1j721L52M028k72m608k7L499J45r12j78j593K1K747J27l215Q65K150
2209A480j660j240K291P83j850j69l80o94K831J008m103j263L280K199k644p47
2225h78Q7k20J749Q12k437l50K531q31k187J898J705j707r85L62J50Q74J881k755
2243c01k586K892K547k278j475J411n4O5O82j100j003K235K46k957L61L023q79
2260H29k549J316L85N5J288j216k352J528L390k323k498J821J062r78p3J70q51
2277i96R76J415k546p24K757Q99l393J87J514K47L20m00j982P11K867q65l230
2294b243J306K299j041j103O10N1J90J462j496k358K870K160k960j511K340O15
$$ [...]
8191g2
##END NTUPLES=NMR FID
##END=
