##TITLE=1H_T-3943
 aceton-d6, 8 sc, 
 30.12.2019
##JCAMPDX= 6.0         $$ Bruker NMR JCAMP-DX V2.0
##DATA TYPE= NMR FID
##DATA CLASS= NTUPLES
##ORIGIN= UXNMR, Bruker Analytische Messtechnik GmbH
##OWNER= root
$$ XWIN-NMR		Version 3.5
$$ Mon Dec 30 14:19:41 2019 Russian Standard Time (UT+4h)  she@DPX200
##.OBSERVE FREQUENCY= 200.1315
##.OBSERVE NUCLEUS= ^1H
##.DELAY= (6, 6)
##.ACQUISITION MODE= SIMULTANEOUS
##.ACQUISITION SCHEME= undefined
##.AVERAGES= 8
##.DIGITISER RES= 18
##SPECTROMETER/DATA SYSTEM= spect
##.PULSE SEQUENCE= zg30
##.SOLVENT NAME= Acetone
##.SHIFT REFERENCE= (INTERNAL, Acetone, 0, 15.7039)
##AUDIT TRAIL= $$ (NUMBER, WHEN, WHO, WHERE, WHAT)
$$ ##TITLE= Audit trail, XWIN-NMR		Version 3.5
$$ ##JCAMPDX= 5.01
$$ ##ORIGIN= Bruker BioSpin GmbH
$$ ##OWNER= she
$$ F:/spectra/data/she/nmr/H-F/1/audita.txt
$$ ##AUDIT TRAIL=  $$ (NUMBER, WHEN, WHO, WHERE, WHAT)
(   1,<2019-12-30 14:18:28.81 +0400>,<she>,<DPX200>,
      <created by zg, POWCHK disabled, PULCHK disabled
       configuration hash MD5:
       00 E9 B6 7A A2 85 ED C7 34 08 36 98 17 FE 4E 26
       data hash MD5: 16K
       76 09 06 A8 0B 17 1E 65 AB FC BE 64 B8 25 CD F6>)
$$ ##END=
$$ 
$$ hash MD5
$$ 0A 16 87 5A 4C FC B3 17 DF CB 6D FA F3 B3 A9 B5
##$RELAX= 
##$RELAX= 
##$RELAX= 
##$RELAX= 
##$RELAX= 
##$RELAX= 
$$ Bruker specific parameters
$$ --------------------------
##$DU= <F:/spectra>
##$EXPNO= 1
##$NAME= <H-F>
##$PROCNO= 1
##$TYPE= <nmr>
##$USER= <she>
##$AMP= (0..31)
100 100 100 100 100 100 100 100 100 100 100 100 100 100 100 100 100 100 
100 100 100 100 100 100 100 100 100 100 100 100 100 100 
##$AQSEQ= 0
##$AQ_mod= 1
##$AUNM= <au_zg>
##$AUTOPOS= <>
##$BF1= 200.13
##$BF2= 200.13
##$BF3= 200.13
##$BF4= 200.13
##$BF5= 200.13
##$BF6= 200.13
##$BF7= 200.13
##$BF8= 200.13
##$BYTORDA= 1
##$CFDGTYP= 0
##$CFRGTYP= 5
##$CHEMSTR= <none>
##$CNST= (0..31)
1 1 145 1 1 1 1 1 1 1 1 1 1 1 1 1 1 1 1 1 1 1 1 1 1 1 1 1 1 1 1 1 
##$CPDPRG= <>
##$CPDPRG1= <>
##$CPDPRG2= <>
##$CPDPRG3= <>
##$CPDPRG4= <mlev>
##$CPDPRG5= <mlev>
##$CPDPRG6= <mlev>
##$CPDPRG7= <mlev>
##$CPDPRG8= <mlev>
##$CPDPRGB= <>
##$CPDPRGT= <>
##$D= (0..31)
0 1.2 0 0 0 0 0 0 0 0.06 0 0.03 0 0 0 0 0.0002 0 0 0 0 0 0 0 0 0 0 0 0 
0 0 0 
##$DATE= 1577701108
##$DBL= (0..7)
120 120 120 120 120 120 120 120 
##$DBP= (0..7)
150 150 150 150 150 150 150 150 
##$DBP07= 0
##$DBPNAM0= <>
##$DBPNAM1= <>
##$DBPNAM2= <>
##$DBPNAM3= <>
##$DBPNAM4= <>
##$DBPNAM5= <>
##$DBPNAM6= <>
##$DBPNAM7= <>
##$DBPOAL= (0..7)
0.5 0.5 0.5 0.5 0.5 0.5 0.5 0.5 
##$DBPOFFS= (0..7)
0 0 0 0 0 0 0 0 
##$DE= 6
##$DECBNUC= <off>
##$DECIM= 24
##$DECNUC= <off>
##$DECSTAT= 4
##$DIGMOD= 1
##$DIGTYP= 9
##$DL= (0..7)
0 120 120 120 120 120 120 120 
##$DP= (0..7)
150 150 150 150 150 150 150 150 
##$DP07= 0
##$DPNAME0= <>
##$DPNAME1= <>
##$DPNAME2= <>
##$DPNAME3= <>
##$DPNAME4= <>
##$DPNAME5= <>
##$DPNAME6= <>
##$DPNAME7= <>
##$DPOAL= (0..7)
0.5 0.5 0.5 0.5 0.5 0.5 0.5 0.5 
##$DPOFFS= (0..7)
0 0 0 0 0 0 0 0 
##$DQDMODE= 0
##$DR= 18
##$DS= 0
##$DSLIST= <SSSSSSSSSSSSSSS>
$$ [...]
##$SUBNAM2= <"">
##$SUBNAM3= <"">
##$SUBNAM4= <"">
##$SUBNAM5= <"">
##$SUBNAM6= <"">
##$SUBNAM7= <"">
##$SUBNAM8= <"">
##$SUBNAM9= <"">
##$SW= 24.9337058887773
##$SWIBOX= (0..15)
0 0 2 0 0 0 0 0 0 0 0 0 0 0 0 0 
##$SW_h= 4990.01996007984
##$TD= 16384
##$TD0= 1
##$TE= 0
##$TE2= 300
##$TE3= 300
##$TEG= 300
##$TL= (0..7)
0 120 120 120 120 120 120 120 
##$TP= (0..7)
150 150 150 150 150 150 150 150 
##$TP07= 0
##$TPNAME0= <>
##$TPNAME1= <>
##$TPNAME2= <>
##$TPNAME3= <>
##$TPNAME4= <>
##$TPNAME5= <>
##$TPNAME6= <>
##$TPNAME7= <>
##$TPOAL= (0..7)
0.5 0.5 0.5 0.5 0.5 0.5 0.5 0.5 
##$TPOFFS= (0..7)
0 0 0 0 0 0 0 0 
##$TUNHIN= 0
##$TUNHOUT= 0
##$TUNXOUT= 0
##$USERA1= <user>
##$USERA2= <user>
##$USERA3= <user>
##$USERA4= <user>
##$USERA5= <user>
##$V9= 5
##$VALIST= <valist>
##$VCLIST= <CCCCCCCCCCCCCCC>
##$VD= 0
##$VDLIST= <DDDDDDDDDDDDDDD>
##$VPLIST= <PPPPPPPPPPPPPPP>
##$VTLIST= <TTTTTTTTTTTTTTT>
##$WBST= 1024
##$WBSW= 4
##$XGAIN= (0..3)
0 0 0 0 
##$XL= 0
##$YL= 0
##$YMAX_a= 148475
##$YMIN_a= -89659
##$ZGOPTNS= <>
##$ZL1= 120
##$ZL2= 120
##$ZL3= 120
##$ZL4= 120
##$ABSF1= 10
##$ABSF2= 0
##$ABSG= 5
##$ABSL= 3
##$ALPHA= 0
##$AQORDER= 0
##$ASSFAC= 0
##$ASSFACI= 0
##$ASSFACX= 0
##$ASSWID= 0
##$AUNMP= <proc_1d>
##$AZFE= 0.1
##$AZFW= 0.1
##$BCFW= 1
##$BC_mod= 2
##$BYTORDP= 1
##$COROFFS= 0
##$CY= 11.3945322036743
##$DATMOD= 1
##$DC= 2
##$DFILT= <>
##$DTYPP= 0
##$F1P= 16.9975609425685
##$F2P= -3.02152046262296
##$FCOR= 0.5
##$FTSIZE= 0
##$FT_mod= 4
##$GAMMA= 1
##$GB= 0.15
##$INTBC= 1
##$INTSCL= 1
##$ISEN= 128
##$LB= 0.24
##$LEV0= 0
##$LPBIN= 0
##$MAXI= 10000
##$MC2= 0
##$MEAN= 0
##$ME_mod= 0
##$MI= 1.114404
##$NCOEF= 0
##$NC_proc= 0
##$NLEV= 6
##$NOISF1= 3.799351
##$NOISF2= 2.8
##$NSP= 1
##$NTH_PI= 0
##$NZP= 0
##$OFFSET= 15.70392
##$PC= 1
##$PHC0= -10151.32
##$PHC1= 17.0008
##$PH_mod= 1
##$PKNL= yes
##$PPARMOD= 0
##$PSCAL= 0
##$PSIGN= 0
##$REVERSE= no
##$SF= 200.130013532006
##$SI= 16384
##$SIGF1= 3
##$SIGF2= 2
##$SINO= 400
##$SIOLD= 16384
##$SREGLST= <1H.CDCl3>
##$SSB= 0
##$STSI= 0
##$STSR= 0
##$SW_p= 3612.71676300578
##$SYMM= 0
##$S_DEV= 0
##$TDeff= 0
##$TDoff= 0
##$TI= <>
##$TILT= no
##$TM1= 0
##$TM2= 0
##$TOPLEV= 0
##$USERP1= <user>
##$USERP2= <user>
##$USERP3= <user>
##$USERP4= <user>
##$USERP5= <user>
##$WDW= 1
##$XDIM= 8192
##$YMAX_p= 0
##$YMIN_p= 0
$$ End of Bruker specific parameters
$$ ---------------------------------
##NTUPLES= NMR FID
##VAR_NAME=  TIME,          FID/REAL,        FID/IMAG
##SYMBOL=    X,             R,               I
##VAR_TYPE=  INDEPENDENT,   DEPENDENT,       DEPENDENT
##VAR_FORM=  AFFN,          ASDF,            ASDF
##VAR_DIM=   8192,          8192,            8192
##UNITS=     SECONDS,       ARBITRARY UNITS, ARBITRARY UNITS
##FACTOR=    0.0002004,     1,               1
##FIRST=     0,             0,               0
##LAST=      1.6414764,     0,               0
##MIN=       0,             -89659,          0
##MAX=       1.6414764,     148475,          0
$$ Real data points
##PAGE= N=1
##DATA TABLE= (X++(R..R)), XYDATA
0@%%%%%%%%%%qJ6j6J6j7K5l2L5m3N1n9P2q3R3j07J24j45J65j86K10k37K68l01
$$ 0 0 0 0 0 0 0 0 0 0 0 -8 8 -8 8 -9 16 -16 19 -24 27 -32 40 -43 50 -57 67 -78 87 -99 111 -126 142 -159
33a59L37l78M23m73N25n82O46p15P93q78R71j075J192j324J470j637J833k059
$$ -159 178 -200 223 -250 275 -307 339 -376 417 -461 510 -565 627 -697 773 -864 969 -1090
51a090K324k645L041l541M202n117O479q755J3490m2622R1083N7417j30697o5055
$$ -1090 1234 -1411 1630 -1911 2291 -2826 3653 -5102 8388 -34234 56849 114266 -16431 -81486
65h1486L5381P1090J2350m4662m7817L6255N0634j6915l5341J8906K893k5392
$$ -81486 -46105 24985 37335 -7327 -55144 -18889 31745 14830 -20511 -1605 1288 -24104
77b4104J2261L8019j1506l9140k4697J1695O1346N1124o0617r4542K3006R1766
$$ -24104 -11843 26176 14670 -24470 -49167 -37472 23874 74998 14381 -80161 -57155 34611
89C4611J1317n3348k6259J6038L6673J8612m4779m9767K9915N3905o106k4584
$$ 34611 45928 -7420 -33679 -17641 19032 37644 -7135 -56902 -26987 26918 20812 -3772
101c772o504j3269J913L7371J1352l0741j2965M689m475J6014K6884j6583k8573
$$ -3772 -10276 -23545 -21632 15739 27091 -3650 -16615 -11926 -16401 -387 26497 9914 -18659
114a8659R431P023j2494P938P323j8204J2483M2165j1426n4321j4351K8146L0126
$$ -18659 -9228 -2205 -14699 -6761 562 -17642 -5159 37006 25580 -28741 -43092 -14946 15180
127A5180J6808k4679m5829J2845N2148o500m3724M298K3348p352q650M324L640
$$ 15180 31988 7309 -38520 -25675 26473 19973 -23751 -19453 3895 -3457 -12107 -7783 -4143
140d143J5138R205k8242j4303L1792R6m7139L644N7600J7296l6256l5488n499
$$ -4143 10995 20200 -8042 -22345 9447 9543 -37596 -33952 23648 40944 4688 -30800 -36299
153c6299L3354L5425k7406n0343K2531N5947j0940m0197L339K0226K424p639j9725
$$ -36299 -2945 32480 5074 -45269 -22738 33209 22269 -17928 -14589 5637 8061 422 -19303
166a9303j1344K7301K2574j9271n966K4626j2249m1061M561L3778J1214m393j0816
$$ -19303 -30647 -3346 19228 -43 -6009 18617 6368 -34693 -30132 3646 14860 10467 -349
179c49j3446J4256K3748k4275l6032K1620L3510j2782k1259J376Q883J8346J4021
$$ -349 -13795 461 24209 -66 -36098 -14478 19032 6250 -15009 -13633 -4750 13596 27617
192B7617k7009l3102J4984K3540o229J563J3260p333q526P838j1342j8976J5337
$$ 27617 608 -32494 -17510 6030 -199 1364 14624 7291 -1235 6603 -4739 -23715 -8378
205h378J9223q716k349J0634j0150q081J5238J519j3838K430o00j4252J5311L0108
$$ -8378 10845 2129 -220 10414 264 -7817 7421 8940 -4898 -2468 -3068 -17320 -2009 28099
219B8099j1085k5853M192O294q713p56P68r4K5193J8462l4237l2634K2428K4702
$$ 28099 17014 -8839 -4647 1647 -7066 -7822 -7054 -7148 18045 36507 2270 -30364 -7936 16766
233A6766j0398j0254L67j75J0645P073j9923o082K5770J977k9603k227J8442J058
$$ 16766 6368 -3886 -3519 -3694 6951 14024 -5899 -11981 13789 15766 -13837 -16064 2378 3436
247C436L52J0484m468r067L74j4428j1578K8584K4389k2332k0397J3369Q450q250
$$ 3436 3788 14272 9804 737 1111 -13317 -24895 3689 28078 5746 -14651 -1282 7168 -1082
261a082j478l218k56J8264K574k8197l848K8858M948j7855l206j401o680R901
$$ -1082 -2560 -5778 -6034 12230 14804 -13393 -17241 11617 16565 -1290 -4496 -5897 -12577 -2676
275b676J0286q838K498J3823j4750k1309J1614J5048m160K911M835j1563l598
$$ -2676 7610 -1228 1270 15093 343 -20966 -9352 5696 1536 4447 9282 -2281 -5879
288e879Q235r831p573K1872R989k0513p814R061L1M113J0023j1415j2943J3406
$$ -5879 2356 -7475 -15048 6824 16813 -3700 -11514 -2453 -2422 1691 11714 299 -12644 762
302G62N114j5333M541J8652m779j2021p48o589k182J7995M832j3942O787J2366
$$ 762 5876 -9457 -4916 13736 8957 -3064 -3812 -10401 -12583 5412 10244 -3698 3089 15455
316A5455j9015j6825J5150J3415j890l07p715r579J4383J3299j9091j1208J8264
$$ 15455 -3560 -20385 -5235 8180 6290 5983 -1732 -11311 3072 16371 -2720 -13928 4336
329D336M080j6660nJ1047L046P605m70k0889o994J6908n62j0648J4286J4505j3441
$$ 4336 8416 -8244 -8249 2798 5844 13449 12979 -7910 -14904 2004 1442 -9206 5080 19585 6144
344F144j1638J853k370L645J1076q224j0659J5950R601j8220m645J6731O76j1598
$$ 6144 -5494 -3641 -6011 -2366 8710 486 -10173 5777 15378 -2842 -7487 9244 9920 -1678
358a678l013m968R37J9807P695j7852l817J0763r903j2232J0587R183j360O177
$$ -1678 -4691 -9659 -8722 11085 18780 928 -2889 7874 -2029 -14261 -3674 5509 4149 10326
372A0326q25j5218J232J3352q375r471J1176L335j0628M048Q483l859K852M579
$$ 10326 9501 -5717 -4485 8867 492 -8979 2197 5532 -5096 -1048 7435 3576 6428 11007
386A1007j6483j0830J5280P965p607O937Q887j1137p196J803p125m3J8212J310
$$ 11007 -5476 -16306 -1026 6939 -668 6269 15156 4019 -3177 -1374 -8499 -8542 9670 10980
400A0980j5692L062J0639o955l655P425m504n525O859k580r430J4646J4336j3077
$$ 10980 -4712 -1650 8989 2034 -1621 5804 1300 -4225 2634 54 -9376 5270 19606 6529
414F529j1920N344l235m850R824M681k918P261Q28j8021l703J6792L48r547N117
$$ 6529 -5391 -47 -3282 -8132 1692 6373 3455 10716 11544 -6477 -10180 6612 6960 -2587 2530
429B530K950p562L075N420o187K144R351j1317j4207J1427J1381m146K053M194
$$ 2530 5480 -2082 993 6413 226 2370 11721 404 -13803 -2376 9005 4859 6912 11106
443A1106j0629n315N759m528k103J6417M825j6298l793P742m077r23R269k845
$$ 11106 477 -4838 921 -3607 -5710 10707 15532 -766 -4559 3183 -894 -1817 7452 4607
457D607o558O606r63j1299P225J4174p466r426L304k868m292J1407N955q778R04
$$ 4607 -1951 4655 3692 -7607 -382 13792 6326 -3100 204 -2664 -6956 4451 10406 1628 2532
472B532L627j2464n474J4791N201n437L619j009j2000J895P774n301M67J2868
$$ 2532 6159 -6305 -11779 3012 8213 2776 6395 5386 -6614 -4719 3055 -2246 -1779 11089
486A1089m525j5137L499Q921l001K241L308j0403m572J1379j80p158R201O327
$$ 11089 6564 -8573 -5074 3847 846 3087 6395 -4008 -8580 2799 2619 -4539 4662 10989
500A0989j1399o254K920l957L187J4859r7j1674J702J50j0523L261J3407k153
$$ 10989 -410 -6664 -3744 -7701 -4514 10345 10248 -1426 276 426 -10097 -6836 6571 4418
514D418o858M239j488n575P654L184j0535O69Q695p270p249J0858P423l635J799
$$ 4418 -2440 1799 311 -5264 2390 5574 -4961 -4292 4403 -2867 -10116 742 8165 4530 6329
529F329m312j4710R50J3345J77k008Q586j760j2119J495L860o285K732R899m982
$$ 6329 2017 -12693 -11743 1602 1779 -229 8357 6597 -5522 -4027 -167 -6452 -3720 6179 1197
544A197o114P972O74p847N682O453j0182o614M279m28L895J3579k391j5038j24
$$ 1197 -4917 3055 3729 -4118 1564 8017 -2165 -8779 -4500 -4928 -1033 12546 10155 -4883 -5007
559e007M569o444P3R972k06k331P156l947j2720L911R142n003k199N289m974m536
$$ -5007 -438 -6882 -6809 3163 2957 626 7782 3835 -8885 -4974 4168 -835 -3034 2255 -2719 -7255
575g255J0192N046o955l99r14j1093J507J4391L18p155O201K189q979j757J174
$$ -7255 2937 7983 1028 629 -285 -11378 -9871 4520 4838 -2317 3884 6073 -2906 -4663 -3489
590c489n100N108J3262n159j2771M112N588l171K654J874r750k334R177l86l485
$$ -3489 -8589 -3481 9781 4622 -8149 -4037 1551 -1620 1034 2908 -6842 -9176 1 -385 -3870
605c870Q746J510j1498j133M876n714r57J0309K471m174J770n323j0538P106J3272
$$ -3870 4876 6386 -5112 -6245 -1369 -7083 -8040 2269 4740 566 2336 -2987 -13525 -6419 6853
620F853n113q308L612k65k214P350J614q877J354O788p594m950Q869K581k407
$$ 6853 1740 -6568 -2956 -3221 -5435 1915 3529 -5348 -3994 2794 -4800 -9750 -881 1700 -707
635g07M929j538j1800l02Q496p35J186P732o063j2188N457P953m005M32L949n328
$$ -707 4222 2684 -9116 -9418 -922 -1657 -471 7261 1198 -10990 -5533 2420 -1585 -1153 2796 -2532
651b532j601O805l583p321Q662Q011q192n328J756k402L379J1337k496j1478J742
$$ -2532 -4133 2672 -911 -8232 430 8441 249 -5079 -3323 -5725 -2346 8991 6495 -4983 -3241
666c241L301n735K818R697k073m823K874l108o787N699N378l993K445N445r053
$$ -3241 60 -5675 -2857 6840 4767 -56 2818 -290 -7077 -1378 4000 7 2452 7897 -1156
681a156p684R075O046m509r7p38p178M117Q826k862m782O770l27j0458m49M326
$$ -1156 -8840 235 6281 1772 1675 937 -6241 -2124 6702 3840 -942 5828 5501 -4957 -5406 -1080
697a080k33N585P566p727q748M026l89n054P126P377o771l978N271k036k169N829
$$ -1080 -1313 4272 11838 4111 -4637 -611 -1000 -6054 1072 8449 1678 -2300 2971 935 -1234 4595
713D595j605p590K788M440n914N88J0286k75n933m97m528o648P257Q552l747l5
$$ 4595 2990 -4600 -1812 2628 -3286 -2698 7588 7313 1380 883 -3645 -10293 -3036 5516 1769 1734
729A734O414o418r464M613L755l054K873L012o386r3P988k532n459M147mr084
$$ 1734 8148 1730 -7734 -3121 634 -2420 453 3465 -2921 -3014 4974 2442 -3017 1130 1126 -7958
745g958Q95O695n2L285N879p475r065L733J746n464M733Q844k793m096K466l687
$$ -7958 -7063 -368 -420 2865 8744 1269 -7796 -4063 -2317 -7781 -3048 5796 3003 -1093 1373 -2314
761b314m269O662J622p510J582N969l923j319P986p06o489j27j274n165O239R156
$$ -2314 -6583 79 1701 -5809 -4227 1742 -2181 -3500 4486 3780 -2709 -2836 -4110 -9275 -3036 6120
777F120m398k753N208l436q780K673M569j665L178L569o419k445P688j226o279
$$ 6120 1722 -1031 4177 741 -8039 -5366 -797 -2462 716 4285 -2134 -4579 3109 1883 -4396
792d396L537K920o534L95O176j387O40N433m560q909K934L591l461L778P834m442
$$ -4396 -859 2061 -4473 -4078 2098 711 1351 6784 2224 -6685 -3751 -160 -3621 157 7991 3549
808C549o166L020j139l360N968L305p067Q5O370l662l199N544N33m618K122Ro827
$$ 3549 -2617 403 -736 -4096 1872 5177 -1890 -1805 4565 903 -2296 3248 3781 -837 1285 1294 -5533
825e533L370R731k183n727K369k212n056N343N226m547L96M726m936n000N275
$$ -5533 -2163 7568 5385 -342 2027 -185 -5241 102 5328 781 1177 5903 967 -4033 1242
840A242J539l829M484K703p511j600M972j256k61N670k603r571L173P174k791
$$ 1242 2781 -1048 3436 6139 -1372 -2972 2000 744 483 6153 3550 -6021 -2848 4326 1535
855A535p77L891l403l981L605r58m328O473P003n663m493J123l445q58Q327J967
$$ 1535 758 4649 1246 -2735 870 -88 -4416 2057 9060 3397 -1096 27 -3418 -4276 4051 6018
871F018o557P35K276n074Q69O175k943m781M551R24n591K316N320j899R9K208
$$ 6018 -539 196 2472 -2602 -1733 4442 1499 -3282 1269 2193 -3398 -1082 4238 2339 2438 4646
887D646p626o253P416N462j965K526J528q111k385N242r60l197N932K150n414
$$ 4646 -2980 -9233 -1817 3645 1680 4206 5734 -2377 -4762 480 -480 -3677 2255 4405 -1009
902a009P03L274m797o3O572l022p070K645K727j772N363N240o967n580J800k159
$$ -1009 -306 2968 -1829 -1892 4680 1658 -5412 -2767 -40 -1812 3551 8791 1824 -3756 -1956 -4115
918d115j688P799M495m718M36J767o023l261N486O11k499M550k0o259K287O873
$$ -4115 -5803 1996 6491 1773 2209 3976 -2047 -5308 178 789 -1710 2840 2820 -3439 -1152 5721
934E721k772m190K264l542m745O051N927k305J656J969p289m490M043l53j718
$$ 5721 2949 -1241 1023 -2519 -7264 -1213 4714 2409 4065 6034 -1255 -5745 -1702 -2055 -3773
949c773P138M521o150k710J849l645Q6N765j666o003L404M333k484J721L657n799
$$ -3773 3365 7886 1736 -974 875 -2770 -2684 3081 1415 -4588 -1184 3149 665 2386 6043 244
965B44m776L522o43l071N750N804l732j226P53o761k949P396L017l611K215J293
$$ 244 -4532 -1010 -1653 -4724 1026 6830 3098 1872 2625 -4136 -7085 311 3328 -283 1932 3225
981C225n041O00M964l122l302L527p24m495M531L972l318N94L797n964o223M205
$$ 3225 -1816 -1216 3748 626 -2676 851 127 -4368 163 4135 817 1411 5208 -756 -6979 -2774
997b774L225m73M494J282p308j515L733j704j867N151O73m828J680K555l897N83
$$ -2774 451 -22 4472 5754 -1554 -3069 664 -1040 -2907 2244 2917 -1911 -231 2324 -1573 -990
1013i90N123l520m436L962k08l457M985N258n112l577J864k499j562O760J315
$$ -990 4133 613 -3823 139 -69 -3526 1459 6717 1605 -1972 -108 -2607 -4169 2591 3906
1028C906m280J368J806n939r51N922J4k617K970p30n675K289N464l149p34L175
$$ 3906 -374 994 2800 -3139 -4090 1832 1846 -771 2199 1469 -4206 -1917 3547 398 -336 2839
1044B839l707m192M576L411l026J670J828n640k580M190J06j192N655M34o970
$$ 2839 -868 -5060 -484 2927 -99 1571 3399 -2241 -4821 -631 -525 -1717 3938 4372 -2598
1059b598l86L021l119N46O543j769n072K615R41m262K784M412m186l249L758j732
$$ -2598 -2984 37 -3082 -2536 4007 2238 -2834 -219 722 -3540 -756 3656 -530 -3779 -21 -1753
1075a753j971O029K790n525j426J464m244n01O356J809k772K332r16p012Q09N439
$$ -1753 -3724 2305 5095 -430 -1856 -392 -4636 -5137 1219 3028 256 2588 1672 -5340 -4531 908
1091I08j520j228L805j494m224L026L053l731Q84K581n329k960N212K214j522
$$ 908 -612 -1840 1965 471 -3753 -727 2326 -1405 -521 2060 -3269 -6229 -1017 1197 -325
1106c25M090P35p652k187K868j279J501O441k96n369J182J380n334J171M754j698
$$ -325 3765 4500 -3152 -5339 -2471 -3750 -2249 4192 3896 -1473 -291 1089 -4245 -3074 1680 -18
1122a8k165L219r10k682M687L050n833k147J688k704m40O537K330k925R53o90
$$ -18 -2183 1036 126 -2556 2131 5181 -652 -2799 -1111 -3815 -4255 2282 4612 1687 2640 1950
1138A950o442p28N606M1p78N166j415n859J773K425l150J012K956l530k911N269
$$ 1950 -4492 -5220 386 427 -351 4815 3400 -2459 -686 1739 -1411 -399 2557 -973 -3884 1385
1154A385K513l416K579J004o513j909L825o24k9O672K92n853o74J314l818Q62
$$ 1385 3898 482 3061 4065 -2448 -4357 -532 -1156 -1185 5487 5779 -74 -748 566 -3252 -2390
1170b390N571j153k521K852p74l842K668L187m292j821L555k204j655N548J992
$$ -2390 3181 2028 -493 2359 1585 -2257 411 3598 -694 -2515 1040 -1164 -2819 2729 4721
1185D721m276O26P40n481j043O015O80j361K641q86n879J647L198l047N23M087
$$ 4721 445 1071 1811 -3670 -4713 1302 1982 621 3262 2376 -3503 -1856 1342 -1705 -1182 2905
1201B905j958m124L512J419k772J190K422m631j753M204o40k035M932R29o015
$$ 2905 947 -3177 335 1754 -1018 172 2594 -2037 -3790 414 -226 -2261 2671 3600 -2415
1216b415m95K094k280J182N191j367m011K266J75m322J956M887k653k525L050
$$ -2415 -2910 -816 -3096 -1914 3277 1910 -2101 165 340 -3982 -2026 2861 208 -2317 733
1231G33j945k375M302J646m893J393K596m036j362N422O46k829J502q14m886K093
$$ 733 -1212 -3587 715 2361 -2532 -1139 1457 -2579 -3941 1481 2127 -702 800 -14 -4900 -2807
1247b807M787j544p72L896k403n188K050K275k036J847L012l724j742M039p16
$$ -2807 1980 436 -336 3560 1157 -4031 -1981 294 -1742 105 3117 -607 -2349 1690 974
1262I74l641L588J849m611r41L146q72P65M456j829n372J446J288l407K075N206
$$ 974 -2667 921 2770 -1841 -2782 364 -508 257 4713 2884 -2488 -1042 246 -3161 -1086 4120
1278D120j354k898J986k219l226L640K647l605Q69L072l297j740M508Q38l279
$$ 4120 2766 -132 1854 -365 -3591 49 2696 -909 -40 3032 -265 -2005 2503 3341 62
1293F2N09m15m101K166N666j013j922K190j443n275J101K649j521K467M214l476
$$ 62 571 156 -3945 -1779 3887 2874 952 3142 1699 -3576 -2475 174 -1347 1120 5334 1858
1309A858l861K726j10l027L152K110l420j288K974p01j19L567j344n906Q77K794
$$ 1858 -2003 723 613 -2414 738 2848 -572 -1860 1114 413 294 3861 2517 -3389 -2512 282
1325B82k659J069N163q27k277J164l305m315L909N013k506j310K832j722k645
$$ 282 -2377 -1308 3855 3028 751 1915 -1390 -5705 -1796 3217 711 -599 2233 511 -2134
1340b134L346k44l103J659J320l985P13N471o64k991K234p90m527p7K874m86K414
$$ -2134 1212 968 -2135 -476 844 -3141 -2428 3043 2379 -612 1622 832 -3695 -3772 -898 -1384 1030
1357A030M101m411m869K479K063k633J235K732k433j77K461k460j708M222P64
$$ 1030 5131 720 -4149 -1670 393 -2240 -1005 1727 -706 -883 1578 -882 -2590 1632 2396
1372B396m963N6L062k334l7M916j71l356K46j270l294L611M904l092j939K932
$$ 2396 -2567 -2511 551 -1783 -1820 3096 2925 -431 -185 -1455 -4749 -1138 3766 674 -1265 1667
1388A667j294k713K357M49k123K396K610m167k262M046M66j947J980k33m302J497
$$ 1667 373 -2340 17 466 -1657 739 3349 -818 -3080 966 1432 -515 1465 1232 -3070 -1573
1404a573L551j543j53K899k272m168K539K368k871J674K990k455k488K513j486
$$ -1573 1978 435 282 3181 909 -3259 -720 1648 -1223 451 3441 986 -1502 1011 -475
1419d75k393M389K914m233j501J968j694L61L409j172l722K827J672l994P50M070
$$ -475 -2868 1521 4435 202 -1299 669 -1025 -664 2745 1573 -2149 678 2350 -1644 -894 3176
1435C176j615k228J694j490k807L490K738k164L65J937m252l018M268J977k445
$$ 3176 1561 -667 1027 -463 -3270 220 2958 794 1159 3096 -1156 -4174 94 2071 -374
1450c74J550P07l489J107K937k926j637L475J28l975J563K386j157Q24K115l856
$$ -374 1176 1883 -1606 -499 2438 -488 -2125 1350 1478 -2497 -934 1452 295 1119 3234 -622
1466f22l183K760L54j445M067K363m552j789K436j604j468L409K93k509K132J288
$$ -622 -3805 -1045 -691 -2136 1931 4294 -258 -2047 389 -1215 -2683 726 1019 -1490 642 1930
1482A930l840O95L630j254k949J325r65j964L826K960k456j076J367l057k572
$$ 1930 -1910 -1215 2415 1161 -1788 -463 -1428 -3392 434 3394 938 -138 1229 -1828 -4400
1497d400L521J913j943K112K021m410j542L186j182j113L226l80m044J752L147
$$ -4400 -879 1034 -909 1203 3224 -1186 -2728 458 -724 -1837 1389 1009 -3035 -1283 1864
1512A864j810N6K685l512l822K870J887j278K348K653l437k126J459k147j296
$$ 1864 54 110 2795 -717 -4539 -1669 218 -1060 1288 3941 504 -1622 -163 -2310 -3606
1527c606M630J808l330K97J340k448m71L355q07k665J906j58k397K392L850k845
$$ -3606 1024 2832 -498 -201 1139 -1309 -1780 1575 768 -1897 9 -149 -2546 -154 3696 851
1543H51j635J531j822k775K402K811r19J791J044m613j998L770j77j770K860N73
$$ 851 -784 747 -1075 -3850 -1448 1363 444 2235 3279 -1334 -3332 438 261 -1509 1351 1924
1559A924l576L44K802j565m32K661j720l005K058J297k165J988L437l533k712
$$ 1924 -1652 -1308 1494 -71 -503 2158 438 -2567 -509 788 -1377 611 4048 515 -2197
1574b197J808q18r67L597J597l302l81J677k176j330L840K73k565J528K48l080
$$ -2197 -389 -1207 -2174 1423 3020 -282 -663 1014 -1162 -2492 1348 1621 -944 584 832 -2248
1590b248J336L472j954j188K054j924k947L388K815k502o3J356k733j743L247
$$ -2248 -912 2560 606 -582 1472 -452 -3399 -11 2804 302 239 1595 -1138 -2881 366
1605C66P36j622K425L72l913p73L281j418k63L151m63l265P50J454k185J369K537
$$ 366 1102 -520 1905 2277 -1636 -2409 872 -546 -809 2342 1879 -1386 -636 818 -1367 2 2539
1622B539k498k346K721L92k181K255J843l166q94J778j760k83M146J57l043P33
$$ 2539 41 -2305 416 808 -1373 882 2725 -441 -1335 443 -1317 -1600 2546 2703 -340 393
1638C93K89l299P85L449o43j544K327j000k669J537J760k247k49K227k009j486
$$ 393 682 -2617 -1832 1617 974 -570 1757 757 -1912 -375 1385 -862 -1111 1116 -893 -2379
1654b379L472J051j805Q07K40l956n95L477L18q57L038m46l932N24J341k239N96
$$ -2379 1093 2144 339 1146 1386 -2570 -3165 312 630 -227 2811 2365 -1567 -1043 298 -1941 -1345
1671a345L624j266k580K051Q44k344J658J465l644r44K360l44k39K967Q40l662
$$ -1345 2279 1013 -1567 484 1328 -1016 642 2107 -1537 -2481 -121 -465 -704 2263 3103 -559
1687e59m51R60k341J39L718k77j186J880q10l259Q62K831j576j214K040j295j002
$$ -559 -1010 -50 -2391 -2252 1466 1189 3 1883 1073 -2186 -1324 1507 -69 -1283 757 -538 -1540
1704a540L079N44k344M22Q15l031j367M183N48q22K207p89l368K8J594j653J52
$$ -1540 1539 2083 -261 161 976 -2055 -3422 761 1309 487 2694 1905 -1463 -1435 159 -1494 -1342
1721a342M268r28l021J071J064j848J064J760k441j375K337o21j139L342J111
$$ -1342 2926 1998 -1023 48 1112 -736 328 2088 -353 -1728 609 -12 -1151 2191 3302
1736C302l629n47J024j991L35L529K92j565J057o77l376Q36L323j160j169J711
$$ 3302 -327 -874 150 -1841 -1506 2023 2315 750 1807 1130 -2246 -1410 1913 753 -416 1295
1752A295m50k048J686J359j952L41J602k592j682L376N99j324J839L2l528k61
$$ 1295 845 -1203 483 1842 -110 231 1833 -759 -2441 935 1534 210 2049 2081 -1447 -1708
1768a708K411j100j40K970m37l334J124O08j619J099K250j655j588K067m17k222
$$ -1708 703 -397 -537 2433 1996 -1338 -214 394 -1225 -126 2124 469 -1119 948 531 -1691
1784a691K028J870k380o73J336j676k82L015n6k341Q46P03k815K1L653m50j320
$$ -1691 337 2207 -173 -846 490 -1186 -1468 1547 1491 -850 -4 699 -2116 -2095 1558 1108 -212
1801b12R54j118k262J680J671j500M70K750k360k719J946R57j207P33R16k305
$$ -212 742 -376 -2638 -958 713 -787 -317 2433 73 -2646 -700 257 -950 -217 699 -1606
1817a606J29K275q05j463K701j22l416L36J459q05R12K653j557k222J614o31k657
$$ -1606 -1477 798 -7 -1470 1231 1109 -2307 -1971 -512 -1317 -405 2248 691 -1531 83 -548 -3205
1834c205K092K495j032j088J366j179p84J517M5k173J169J819k416n0L010J34
$$ -3205 -1113 1382 350 -738 628 -551 -1335 182 227 -1946 -777 1042 -1374 -1424 1586 1720
1850A720k116P31j234k115J510K837j247J65K204j422l093Q96J031j231J721J368
$$ 1720 -396 335 -899 -3014 -1504 1333 86 251 2455 1033 -2060 -1164 -133 -1364 357 1725
1866A725k344m11K513l69k110J436L00k633L02K284p83O52K276j708l045J252
$$ 1725 -619 -1030 1483 1114 -996 440 740 -1893 -1591 693 -90 562 2838 1130 -1915 -663
1882f63P91j983J089K843m57j263R00j591j371K332R57k772N29J957j339k50K030
$$ -663 128 -1855 -766 2077 1620 357 1257 -334 -1705 627 1584 -1188 -659 1298 -41 -291 1739
1899A739l32j729M78l14k396J463L789j154j559J554q23k363N28J105o35J530
$$ 1739 1407 -322 156 -158 -2554 -1091 2698 1544 -15 1539 716 -1647 -1119 -14 -649 881
1915H81J735k785j509K123P07k058Q36P47j874L44J547j075p1K598o19l685M07
$$ 881 2616 -169 -1678 445 1152 -906 -70 677 -1197 -853 694 -381 -452 2146 1527 -2158 -1751
1932a751J662j362J289J900q83j143P25j051j696J933K331k413o35J617q08m94
$$ -1751 -89 -1451 -162 1738 855 -288 437 -614 -2310 -377 1954 -459 -1094 523 -285 -779
1948g79J214j04j323J515Rk684L44L295J65j877M89m82k064J302J482j547J170
$$ -779 435 331 -992 523 532 -2152 -1808 1487 1652 -225 264 -218 -2282 -980 502 -1045 125
1965A25K382k629k589J979J197r78P17Q70j782K29J255j463j311L165Q80l391
$$ 125 2507 -122 -2711 -732 465 -513 204 1074 -708 -479 776 -687 -1998 1167 2047 -1344
1981a344m51J726j87N79R96j529j011J693p66k282J961L052j266j591L57j073
$$ -1344 -1795 -69 -256 323 1319 -210 -1221 472 -294 -2576 -615 2437 1171 -420 -63 -1136
1997a136l84K242k01j338J249J554k863j514K619N63q16L59r81j026K031J332
$$ -1136 -1520 722 521 -817 432 1986 -877 -2391 228 791 -25 334 -647 -1673 358 1690
2013A690k137l04K680j096k963N13J833k47J565L25k504o89K182j096j964J944
$$ 1690 -447 -751 1929 833 -2130 -1617 216 -31 1534 1859 -645 -1334 848 -248 -2212 -268
2029b68K007j612o70M42m97R24J169k074j529K194Q65j853K84K617o31j481o28
$$ -268 1739 127 -543 -101 -598 326 1495 -579 -2108 86 951 -902 -618 1999 1368 -113 -741
2046g41j249q9K946Q62k355R25J812j973k191Q80R21K40R37p11j991J528K508
$$ -741 -1990 -2079 867 1729 -626 299 2111 138 -2053 -1173 -252 -12 925 214 -1777 -249 2259
2063B259k166j879J683K50j799L42J237O93J126L08l304j010K436M38k151J138
$$ 2259 93 -1786 -103 147 -1652 -1310 -73 620 1746 2054 -1250 -2260 176 614 -1537 -399
2079c99K038p50o70j87j435O99K402j399k275J364K138j068o63J121n90q50J03
$$ -399 1639 889 219 32 -1403 -704 1698 299 -1976 -612 1526 458 -205 916 326 -524 -421
2096d21j086m64K999J901k844q43J485p79j427J081K92J67J438m64l050Q97K898
$$ -421 -1507 -1971 1028 2929 85 -758 727 -52 -1479 -398 -106 61 1499 1035 -2015 -1118 1780
2113A780n96k080K12Q58q77O75P46r30J252J768l096k642K121J962o91J24M92
$$ 1780 1184 -896 -684 174 -703 -28 718 -212 1040 2808 -288 -2930 -809 1153 462 586 1078
2130A078q39O5j13j225j46L211M6l359L64J649k14m45P04o90n51J688j152k019
$$ 1078 239 304 191 -1034 -1180 2031 2077 -1282 -918 731 517 72 776 86 -465 1223 71 -1948
2148a948K002K759j748k013M97K23l06J358k10j149J947O43l306r49L182Q48j514
$$ -1948 54 2813 1065 -948 -451 -228 -534 824 614 -535 1412 2055 -1251 -2200 982 1830 316
2165C16m6L4j176J465J90j589N40K691j758k483J068J585K43j98l32j465O74J235
$$ 316 270 304 -872 593 783 -806 -266 2425 667 -1816 -748 837 1080 882 550 -915 -241 994
2183I94j561q44K889R71k173j231M25P2Q20J060j286p96J932k27k021K23J919
$$ 994 -567 -1411 1478 2449 276 -955 -530 -458 362 1422 136 -660 1272 1045 -976 -753 1166
2200A166o3j097p06pJ68K276Mk730R85J521j815j742J893J497J80k35j153j376
$$ 1166 1103 6 -700 -707 -539 1737 1741 -989 -4 1517 -298 -2040 -147 1350 1530 1295 142 -1234
2218a234J199J286j812o96K517L21j646m55J118m15N75K24k313l22K660J41j695
$$ -1234 -35 1251 -561 -1257 1260 1581 -65 -520 598 183 758 982 -1331 -1653 1007 1148 -547
2235e47J193J184j380r90j73o71Q87K590j111j862J423J133k309j079J545P54
$$ -547 646 1830 450 -540 -713 -1384 -497 2093 982 -880 543 1676 -633 -1712 -167 587
2251E87j68M1r42n51K384P28k861n17J583j09j060P76O99J17N61n24k688M78K766
$$ 587 419 460 -482 -1033 1351 2079 -782 -1299 284 175 -885 -109 590 707 1268 744 -1944 -1466 1300
2270A300q24j494J397Q10p40p07j86n09J211J046k262j104K445J385j381m36N11
$$ 1300 476 -1018 379 1189 449 -258 -444 -953 258 1304 -958 -2062 383 1768 387 -49 462
2287D62o23k1k34j120M15K963J37k715k01J176m67m24M98K41j85J135p96k027
$$ 462 -161 -182 -416 -1536 -1121 1842 1979 -736 -937 239 -228 -652 -154 87 -98 1037 241 -1786
2305a786J502K294j656j712R58J53K51K74j51m32J206L10k942l24K343R91j334
$$ -1786 -284 2010 354 -1358 -400 -247 4 278 127 -305 901 1211 -1731 -2055 288 1279 -55
2322e5R6K24o87N11j22j273O52K259j033k749J408J647l29j66j98r42P88M29j323
$$ -55 41 265 -422 89 -33 -1306 -654 1605 572 -2177 -769 878 549 383 185 -757 31 460 -863
2341h63q22K598J242k463j391J425J44P3Q14j109k32J768l20k691P10K388j67
$$ -863 -1685 913 2155 -308 -1699 -274 -130 -57 757 -352 -584 1184 864 -1827 -1117 1271 1104
2358A104j675L22m16O2J285n1j718J213J492j855j404J281J627r39O0q83q67J309
$$ 1104 -571 -249 -665 -603 682 631 -1087 126 1618 -237 -1641 -360 1267 328 388 -495 -1362 -53
2376e3Q14j498p9K533m14k160o29J288M39O09R6j461L0J525j046j757J252J889
$$ -53 761 -737 -816 1717 1303 -857 -1486 -198 241 850 946 -515 -485 1040 -6 -1763 -511 1378
2394A378j334p65O9k49J102J084r93j503J052P84j648m23K093N48l94m67j190
$$ 1378 44 -721 -652 -901 201 1285 292 -1211 -159 625 -1023 -1446 647 1195 801 334 -856
2411h56m76J530O14j654K51J862q05j493O21N34k15P64r40j562J156K294j448
$$ -856 -1332 198 812 -842 -591 1271 466 -1027 -406 128 -87 677 -263 -1825 -669 1625 177
2428A77p82J370L06j688o99N98l51J636J067j604j235J594L16j876L50J654m95
$$ 177 -605 765 1071 -617 -1316 -718 -1069 567 1634 30 -1205 389 705 -1171 -821 833 338
2445C38k12P6r54J50K388q32k568N11J463n92l38J013L90l53K47r04j822J385
$$ 338 126 202 -752 -602 1786 954 -1614 -1103 360 -232 -570 443 833 480 727 -177 -1999 -614
2463f14J660q69q08J357P7p23k59m04K00R31J2j448l27K413J0j292N8M02j108
$$ -614 1046 177 -631 726 803 80 -179 -583 -383 548 560 -888 -1215 1198 1208 -84 -26 376 -732
2482g32q5M27n93R66K081j205k260J052O80o35l00R92k83J37O66j657m53J924
$$ -732 -817 -390 -983 -17 2064 859 -1401 -349 331 -304 -604 388 105 242 908 -749 -1202 722
2500G22K57j715o60J314k05L77N02n61m82J037n82j764N82K461o34j242O74j90
$$ 722 979 -736 -1396 -82 -287 90 592 31 -451 586 4 -1760 -1178 1283 649 -593 81 -109
2518a09p79P79M9q25J085P49j751r43J979M28r41J51l3n75L90N96j220L77J839
$$ -109 -888 -109 -60 -885 200 949 -802 -1745 234 662 -279 -128 -161 -736 -346 250 -970 -593 1246
2537A246p16k057O45M74K10K84M4l71m47J142n11j385J276J343q76p52J01l41
$$ 1246 530 -1527 -882 -408 -198 86 130 -241 -688 454 -57 -1442 -166 1177 301 -451 -350 -691
2555f91L52J115q40q82J304L96j737l88K045M74j291n3k63p37J319Q27j364J90
$$ -691 -339 776 -64 -946 358 754 -983 -1371 674 1148 -143 -196 -459 -1196 123 950 -414 -224
2573b24J295j118j641J026J262k58L08q5j096K32J367j316o37J614K72j435o0
$$ -224 1071 -47 -1688 -662 600 342 650 565 -531 -299 1068 -248 -885 729 1001 -434 -494
2590d94P22l08Q84M51j573m40P96L02r02M39J353j45r17k04n99q1J739l2j507
$$ -494 228 -80 804 1255 -318 -758 38 340 -562 -123 1230 1085 168 -36 -635 -716 1023 991 -516
2609e16Q19Q87r11q76R06L16n74L87m14j009J400J111j223o01J300p78j032L45
$$ -516 303 1190 279 -597 309 625 51 438 24 -985 415 1526 303 -298 1002 224 -808 -463
2627d63Q15J33O88j9j536j46J253l16j053J008M11p63K5K72j97j5J169j173j582
$$ -463 352 485 1173 1154 -382 -528 725 409 -644 364 775 12 37 309 112 97 1266 93 -1489
2646a489J335M99m35M37R97o31n29L29j298m92J830N83r88l42O85l65n85J49K06
$$ -1489 -154 345 -90 347 1344 713 184 513 -785 -1277 553 1136 148 -194 491 126 -459 -310 -104
2665a04o05J191l46j138J067J289p66j213J170o68n95O77j1L54M31O25j623j123
$$ -104 -709 482 136 -1002 65 1354 588 -625 545 -123 -718 -41 -52 302 733 1358 -265 -1388
2683a388J509L27r79O01M28o78P5J89p59J91J203j83j792Q65J004n50k52Q02n38
$$ -1388 121 448 -531 70 498 -180 -105 84 -675 -484 719 536 -1256 -391 613 63 -189 613 75
2702G5l27P34r01r10J741R43j370o51R33m90m59R86l14l23J047j71j231K11J214
$$ 75 -252 482 -419 -1329 412 1355 -15 -666 267 -223 -682 304 -10 -333 714 543 -688 -477 737
2721G37l28p54N79l92l85O00O64q56K1Q52q04p99J002K47l16O4K73o99l3O86p49
$$ 737 409 -345 234 -158 -543 57 721 -135 -114 738 -66 -865 137 384 68 132 405 -294 -327 359 -390
2742c90N6J136o2j337N02N55o53J71R44j049l29J191o56n60M59J080j001p05M55
$$ -390 -334 802 740 -597 -95 460 -193 -22 922 -127 -456 735 79 -481 -22 1058 57 -648 -193
2761a93j24j8J088j16r50K96Q86j624q8J199J92k34J10Lj169Q34N26j098j13J469
$$ -193 -317 -335 753 637 -313 -17 869 -755 -843 356 548 314 424 427 -742 92 618 -480 -593 876
2781H76q22r51J002N01m60k2M09j177j56J097o0m63R77N33j259l18L15n39j93
$$ 876 54 -897 105 606 146 124 533 -644 -800 297 237 -226 751 1284 25 -293 22 -517 -710
2800g10J334m61q58R57K48j034M67Q12j150P1M28m44j22J257J24j003q9M97j100
$$ -710 624 163 -695 262 510 -524 -57 755 -395 -324 104 -340 -462 795 919 -84 -173 324 -776
2819g76k27J197J20l01O20k67q81K06Q31p12m96J140k96o27O22L54o28L07L33
$$ -776 -1003 194 314 13 633 366 -515 -309 522 -190 -686 454 158 -469 153 507 -121 186 519
2838E19j167o93J336K69o07O48M05r58k92O43o82m3J470k72q52N45j7n65J37M32
$$ 519 -648 -1341 -5 264 -343 305 710 -248 -540 103 -579 -622 848 576 -276 269 252 -313 -176 256
2858B56k06l63M60k31o33Q83P32j154O7O46j009n6R77R9o46P55J27j379r4J182
$$ 256 50 -313 147 -84 -717 166 898 -256 -189 457 -552 -608 369 468 -178 577 704 -675 -769 413
2878D13n12l39Q56j67j068R74J3m99QJ287j059j041J107O72r50P94J55q21j24
$$ 413 -99 -438 418 251 -817 157 170 -329 -321 966 -93 -1134 -27 645 -305 489 644 -177 -301
2897c01L71l12j21J104J84j515N28J38n03J61R65o06m92N31q8p75O91N95p25N6
$$ -301 70 -242 -363 741 925 -590 -62 76 -427 -266 699 93 -399 132 44 -731 -40 555 -170 -114
2917a14K86j29o48J231m04o63N08L42j165K07J159k84m22M78j18j190L94N10r9
$$ -114 172 43 -605 626 222 -441 67 409 -756 -549 610 326 -96 382 264 -926 -532 -22 -121
2936a21o2J101o51j187Q52J75k61L43K66m87l55O96l55k58Q75j23j161K38N15
$$ -121 -183 918 267 -920 -68 107 -154 189 455 -32 -387 309 -46 -304 571 448 -713 -475 40
2955D0k74K05O24j30o29J97j66r27N74J157m33m43P83o40m86M99O72r57j07N26
$$ 40 -234 -29 595 465 -164 33 -133 -1060 -486 671 238 -205 578 -62 -548 -49 623 -334 -441 85
2975H5n91Q9Q12K51j030J96J50j050K50Q68J33m36Q65n61r46Q01M2m45K09P82
$$ 85 -506 -417 395 646 -384 -188 -38 -1088 -838 30 163 -273 592 31 -915 -114 -72 -517 -308 474
2995D74n99n45Q18k93o16P28N6r90Q0R52p11L08J096l89j123oM29q31M14J384
$$ 474 -125 -670 148 -145 -761 -33 23 -967 -887 65 -646 -338 758 369 -754 -760 -331 -1162 -748 636
3015F36n60k57P70p23q76J010K32p50J62Q72m79n09P57K22j015L86l4m74o3J120
$$ 636 76 -181 589 -134 -1010 0 232 -518 -356 516 37 -472 285 507 -508 -122 -156 -630 -693 427
3035D27m06j54M83j36j040M22J33k32K74Q62n76j77J78j55l04M15O71j095j35
$$ 427 21 -133 350 214 -826 -404 -271 -503 -229 633 57 -120 58 -97 -401 14 685 -410 -545
3054e45R85n41j79O87Q6r36J72K32n89N25Q05J3q80P01m02q09P94O97j063L40
$$ -545 440 -101 -280 407 493 -443 -271 -39 -628 -103 702 715 -165 536 134 -675 119 816 -247 93
3074I3L95q17r0M76M55q47N72L14p31k11N61q2J35L91l34p37J95R21p74R5R73
$$ 93 488 -329 -419 57 512 -335 237 551 -180 -391 170 88 223 614 280 -457 -262 659 -115 -20 953
3095I53n07r98N53K07m74J86R41q90j60P36m01n07O63K06q64K55M50n80M1Q30
$$ 953 446 -552 1 208 -266 -80 861 -29 -189 547 146 -361 302 508 -356 -101 349 -231 -190 640
3115F40k48j043R01l7q49N88Q04m88j05K05n78l32L66N19m40K46N59r45l22R67
$$ 640 392 -651 250 213 -636 -48 756 268 163 368 -210 -542 -176 343 -97 149 708 -237 -559 408
3135D08m51m53P13M3r13O06O01m35l91O16n05o58Q15J09l47L45P41r15n04N15
$$ 408 -43 -496 217 260 -653 -47 554 119 -272 344 -161 -819 -4 105 -242 103 844 -71 -575 -60
3155f0r6p43J252j11n36M4P89o77l13Q56k4r12O29J3l56M37N23m10m81M32p00
$$ -60 -156 -899 353 242 -294 -250 539 -138 -451 405 381 -531 98 111 -245 192 715 305 -176 256 -444
3176d44n05R34O44l95p6L70m89n29P44J3o36O67L8p96K78Q77p90j00O52p39n19
$$ -444 -949 -15 629 234 158 528 39 -490 254 267 -369 298 336 -460 -182 695 -95 -195 457 -282 -801
3197h01P10N28l47p2R21r19n04M74J09l43O11L05o37j68M98q49P6R22r5q12L49
$$ -801 -91 437 90 18 939 20 -484 -10 99 -244 367 672 35 -133 365 -484 -408 514 419 -393 -44
3218d4M30n30K58Q18p00n96M82l90m98N82Q59l75l19N75q22m61Q54K40q12Q45
$$ -44 386 -144 114 932 232 -364 118 -272 -770 -188 671 296 -23 552 -270 -731 123 363 -449 396
3238C96k1q82M09O34k63n41N36m22n63O42O16q24K75O96n34r35Q29Q6m07K96R03
$$ 396 375 -507 -98 536 273 -268 268 -154 -717 -75 541 -283 -8 688 154 -781 48 134 -273 23 926
3259I26j112J50L03n73j42Q38j0o54K54J88l06JN50k12o42M88L9o64M59R50n34
$$ 926 -186 -36 267 -306 -448 390 380 -274 -20 168 -138 -137 413 201 -441 47 86 -578 -119 831 297
3280B97n55N69p05n4O23L13n12M9M94o03n32R00l40m09J066k69q33L42O02o71
$$ 297 -258 311 -394 -448 175 488 -24 25 519 -84 -616 284 -56 -465 601 332 -501 -159 443 -228
3300b28%Q52n47l72K25M69p13M14M93n82j79L12k73j47M72O70j186q1N91m92J68
$$ -228 -228 624 77 -295 -70 399 -314 100 593 11 -168 144 -129 -276 196 866 -320 -401 190 -302 -134
3321a34N55j76m67J97K21n16K68O87m76k22K91p3o49Q26L43r45L27M54o86n51
$$ -134 421 245 -222 -25 196 -320 -52 635 159 -63 228 155 -494 332 675 -270 57 511 -175 -726
3341g26Q68R4m39O13J36r52J55L49j16k06O23m13k93M53O6n99K19N58n69j96M33
$$ -726 142 236 -203 410 546 -406 -251 98 -18 -224 399 -14 -307 146 212 -387 -168 390 -179 -375 58
3362E8l8k32M91K64p73l34P72k21m18Q83M8j74k32l7n93J98P82m15k84L41r1m69
$$ 58 20 -212 279 543 -230 -564 208 -13 -431 452 500 326 94 57 -536 -338 444 29 -255 86 -5 -474
3384d74P77M7n85k83Q25n61n14J024L46o01K90q0p00k62O16j78L17K04L16q30
$$ -474 303 350 -235 -518 307 -254 -768 256 602 1 291 211 -489 -751 -135 -313 4 208 524 -306
3404c06L28J90m67J6R6K48m48P51j93n22N06L09n23k66L81j34k71M25L56q74M64
$$ -306 22 212 -255 -239 -143 105 -343 408 215 -307 199 508 -15 -281 100 -34 -305 120 476 -398 66
3425F6K88o61J17M44k65m01Q48l53o74N98L42m10O3K98m03l82P47j07l22M97j5
$$ 66 354 -307 -190 254 -11 -412 436 83 -591 7 349 -61 2 300 -103 -485 262 155 -167 330 315
3446C15l98m78N07J50o39J032j83o12L78m4m53O6J136m56p09L78j25j26J85M02
$$ 315 -83 -561 -54 96 -543 489 306 -306 72 28 -425 -359 777 321 -388 -10 -135 -261 -76 326
3466C26l42m42N85k36m04O35K72m93J79M7k44k65P78m52M8J81j5n08j32P60n45
$$ 326 -16 -458 127 -109 -513 122 394 -99 80 127 -117 -382 396 -56 -8 173 158 -350 -482 278 -267
3487b67K54L59n07n49P70L33p08R2Q49q84k69P59k77n9K6J31n78O01Ol15J23N08
$$ -267 -13 346 -161 -710 60 393 -315 -223 626 -258 -527 232 -45 -104 -78 53 -525 76 82 -233 -110 398
3509C98p9r00N59j69J78k0M30l44l73M17k26p5Q7O83p85q4L90j13J99M71k77q34
$$ 398 319 -581 -22 -191 -13 -33 397 53 -320 97 -129 -204 -117 566 -219 -303 87 -26 173 644 367 -467
3531d67L22M13p11L80N02l38l94N28m35n88P36J97k81N3N58n13l35N42Q0o83N54
$$ -467 -145 268 -443 -63 439 101 -293 235 -200 -788 -52 145 -136 -83 475 -38 -373 169 249 -434 120
3552A20L7n23J79P36l12m20M23J03p60M87K31m23J90N45l56n79N78j87o71O91
$$ 120 157 -366 -187 549 237 -183 240 343 -417 70 301 -122 68 613 257 -322 256 69 -602 89
3572H9O2k81l9L54l48l42O80K40o12P1K81o79L09P31p1m55L02m70j40K3N43j84
$$ 89 151 -130 -169 185 -163 -505 175 415 -197 -126 155 -524 -215 516 445 -10 292 -178 -318 -295 248 64
3594F4r3L74l20m44N00J85n67K71L29p10K02M82L6k26L60l4p77J5O54n57K27L11
$$ 64 -29 345 25 -419 81 266 -301 -30 299 -411 -209 273 309 83 443 409 -368 -353 301 -256 -29 282
3616B82k97m01M03j65n1L55L04l93m26P52m82N8L67O8m25l27P97n14k22O74k70
$$ 282 -15 -416 -13 -178 -229 126 430 37 -389 363 -119 -61 306 374 -51 -378 419 -95 -317 357 87
3637H7k62M13j06q03M64M68m07j74K11K97n01K94N3K3J03M55o41m28P97m48k65
$$ 87 -175 238 132 -671 -207 261 -146 -320 -109 188 -313 -19 34 57 160 615 -26 -454 343 -105 -370
3658c70M95J7p5k42K65j19J99J79j50l25J8J31l62L02N27J2m84L8q2k88N50L41
$$ -370 125 142 67 -175 90 -29 170 349 199 -126 -108 23 -339 -37 490 502 18 56 -26 -314 236 577
3680E77q60L77L77q97J9N73J19n60K54k4k94K52M67l67r0L04k34k41M01J80k50
$$ 577 -283 94 471 -426 -407 166 285 -275 -21 -45 -339 -87 380 13 -77 227 -7 -248 153 333 83
3701H3j96K88j58m84O13k13K4L81rn18J7K36j1m58N55k27j43Q1M18m43J66M13
$$ 83 -113 175 17 -467 146 -67 -43 338 329 -189 -172 64 53 -405 150 -77 -220 -139 279 -164 2 415
3723D15k60n15N28q6l54O50l42q4J19J50l07l35M87K11n50L61Q3m83J28N26n14
$$ 415 155 -360 168 82 -272 378 36 -48 71 221 -86 -421 66 277 -273 88 171 -312 -184 342 -172
3744a72k45L48r3k96O07K40n26J32K9j29m09L23K00n04Q20o6n41j78Q28n95j99
$$ -172 -417 -69 -162 -458 149 389 -137 -5 24 -105 -514 -191 9 -495 325 259 -282 -460 368 -227 -426
3765d26O80k58l51N45M65q76J7M32k25k32R2K40j30J37M07m38m59Q60p44k11N50
$$ -426 254 -4 -355 190 655 -221 -204 228 3 -229 -137 103 -27 110 517 79 -380 480 -264 -475 75
3786G5J15k77K95L10o76M1N13o39L79L75l00n50M62K41m05r4M97l14m68O47P9
$$ 75 190 -87 208 518 -158 -117 396 -243 136 511 211 -339 123 364 -41 -135 362 48 -420 227 306
3807C06m26L98R2n17J86N1l53K3J71J13j90m5M21q4j65L55k87o62Q21l00k39K81
$$ 306 -120 278 370 -147 39 90 -263 -240 -69 44 -146 -191 230 146 -19 336 49 -613 208 -92 -331 -50
3829e0N65p07K24k1L90p97J78N42o05J98O26p46R4L14j77j05J46n1m10K99L9P4
$$ -50 515 -192 32 11 401 -396 -218 324 -281 -83 543 -203 -109 205 28 -77 69 18 -392 -93 -54 20
3851B0j39M04k35k88K96K51p26N78Qj47j32J93j18P0N9p1j48j88L52l85l5P25
$$ 20 -119 285 50 -238 58 309 -417 161 169 22 -110 83 -35 35 94 23 -125 -313 39 -346 -381 344
3873C44M1m78lJ34m55R3P55n79k61M67M5m81L22L27j74j85N9N7m75P58Q9m30L9
$$ 344 385 -93 -96 38 -417 -324 431 -148 -409 58 103 -378 -56 271 97 -88 -29 28 -447 311 400 -30 9
3896IL6m87J32O61m44j27M77l53j86N3L65k72j19N85m41P7L53k73r5O7R3m31k98
$$ 9 45 -442 -310 351 -93 -220 257 -96 -282 -229 136 -136 -255 330 -111 -34 319 46 -49 18 111 -320 -618
3919f18O66O6j47L98j86m20J89O4k86J92M22j16k15M53m90j78m4M69n32L02J61
$$ -618 48 114 -33 365 179 -241 -52 12 -274 -82 340 224 9 462 -28 -206 -250 219 -313 -11 150
3940A50l02o2M37P2o45M19M7o01J51N07j07j85M41j66n64K82J75j11J07J78l76
$$ 150 -152 -214 223 295 -350 69 116 -485 -334 173 66 -119 322 156 -408 -126 49 -62 45 223 -153
3961a53O8K01lm70K52O1j77NP4K85l55M40J7n22L29m7j68J2K88Mj57qRk38K84
$$ -153 -85 116 113 -357 -105 -44 -221 -216 -142 143 -212 228 245 -277 52 5 -163 -151 137 141 -16 -24 -15 -253 31
3986C1K31m32M1M58j33k99L96J71o44L6J13j44k9O04k92k89K37K74q75K66N99
$$ 31 262 -170 -129 329 196 -103 293 464 -180 -144 -31 -175 -204 400 108 -181 56 330 -545 -279 320
4007C20k80M4K3o2k72N87k47m29K21J65L6l31P24n68p2M19Nl13p3K06l25m26R03
$$ 320 40 84 107 45 -227 360 113 -316 -95 70 106 -225 499 -69 -141 278 283 -30 -103 103 -222 -648 255
4030B55k44k41K84Q2k43j54N91l17K0J38k31k87J30O42m66l38L84j86K72n8l0
$$ 255 11 -230 54 136 -107 -261 330 13 33 171 -60 -347 -217 425 -41 -379 5 -181 91 33 3
4051Cp8k0K86l38R5L05k25kP8n9m46M47J31l07M88K1m61k67M78l11R2K4M42m34
$$ 3 -75 -95 191 -147 -52 253 28 26 104 45 -401 46 177 -130 358 379 -82 -349 129 -182 -90 -66 376 -58
4075e8Q7L87m32k61N24O9m19l39L65p1L52J18O2l32r1L33p68J74L57r9l01M53
$$ -58 29 416 -16 -277 247 316 -103 -442 -77 -148 204 322 384 52 -39 294 -474 -300 57 -42 -343 110
4097A10n0m92N68L73o54K25K87m52j18M96k80jK11k33k33J08M69k81j60L83j42
$$ 110 60 -432 136 509 -145 80 367 -85 -203 293 13 12 223 -10 -243 -135 334 53 -107 276 134
4118A34m75K12R5k16K83L13n52k2O87k61n87P05m35k76P23k69j77K88J30l60k66
$$ 134 -341 -129 -34 -250 33 346 -206 -228 459 198 -389 316 -119 -395 328 59 -118 170 300 -60 -326
4139c26K38L56o27K36J29%R4J55L32j146M97K81m21l1Q17q02o7L90n38L97J38
$$ -326 -88 268 -359 -123 6 6 100 255 587 -559 -62 219 -202 -233 584 -218 -285 105 -433 -36 102
4160A02m8n28K1P89m5o13M25N6j04k55QJ10K11L18o29k0N50j64m74m2N74n00J20
$$ 102 54 -474 -453 336 291 -322 103 159 55 -200 -192 -82 129 447 -182 -202 348 184 -290 -332 242 -258 -138
4183a38K43k84L14M53n48l36n4J72J22K16J59j82l15N38m06m50P51qk54l59M30
$$ -138 105 -179 135 588 40 -296 -350 -178 -56 160 319 137 -178 360 -46 -496 255 247 -7 -366 64
4204F4O2m55N72k31l39K80J99p16R8O67m4k53L19l68j11K22J22m05J93M16o0o50
$$ 64 126 -329 243 12 -327 -47 152 -564 -466 201 157 -96 223 -145 -256 -34 88 -317 -124 292 232 -418
4226d18O62k02l84O89m48q6m7M88l15m11O44J28n50J16M57m52J86k0J60l37p5
$$ -418 244 42 -342 347 -101 -187 -234 254 -61 -472 172 300 -250 -134 323 -129 57 37 197 -140 -215
4247b15N4R8R1K50Kl88J99j66r5J66L23l57r9M67m49l05M86q1k6K64j94j03K53
$$ -215 -161 -63 28 278 280 -108 91 -75 -170 -4 319 -38 -137 330 -119 -424 62 -19 -45 219 25 -78 175
4270A75L72o44J23K87l34k96k3L33j73J30L83m71P7J37jn66J94P19m70l08M12
$$ 175 547 -97 26 313 -21 -317 -340 -7 -180 -50 333 -138 -61 76 75 -491 -297 422 -48 -356 56
4291E6J8k14K35O5p68O92p0l75K35J65q7o7m0r2j20P02l14N0j71O87j46m43k46
$$ 56 74 -140 95 160 -608 84 14 -361 -126 39 -48 -115 -155 -247 -367 335 21 71 -100 587 441 -2 -248
4314b48M71o10P90K5p28L72K46l87l84M91P2k12L24k52k41L29J74m50k76Q63m19
$$ -248 223 -387 403 428 -300 72 318 -69 -453 38 110 -102 222 -30 -271 58 232 -218 -494 369 -50
4335e0j94J63K77k46K22l0l70K44J1R2l04J92K63m54NM36l39k28N26n11KN37o2
$$ -50 -244 -81 196 -50 172 142 -228 16 27 119 -185 7 270 -184 -179 257 -82 -310 216 -295 -293 244 182
4358A82j15j38K27r8k79J86j40kN07j96m98P0L49j83K21j2j63j83L41j12l9M71
$$ 182 67 -71 156 58 -221 -35 -175 -177 330 134 -364 -294 55 -128 93 81 -82 -265 76 -36 -75 396
4380C96M94r46k03M03j93k4m9M6k24L25K00n05J50M40q1j59p0L14l35qJ39L9m89
$$ 396 890 -56 -259 144 -49 -73 -122 -76 -300 25 225 -280 -130 310 229 70 0 314 -21 -29 110 149 -340
4403c40O01j56j89k81N49j07m10L96n8o3L37j98o8M38j9k93m91K72J18j24M0M3
$$ -340 261 105 -84 -365 184 77 -333 63 5 -58 279 81 13 451 432 139 -352 -80 38 -86 -46 -3
4425cj33oK24l89M9M27Ok61J18Kj46m4K11k65j8L38m17j29O25J67k81j35J7M7
$$ -3 -136 -142 82 -307 -258 169 175 -86 32 34 -112 -156 55 -210 -228 110 -307 -436 189 356 75 -60 -43 4
4449Dj37J12K09l03K96M7o42J13L13j58J32k1l18K75J92J9k78P8N83p53Q8MK03
$$ 4 -133 -21 188 -115 181 228 -414 -301 12 -146 -14 -35 -353 -78 114 133 -145 -67 516 -237 -149 -145 58
4472E8K85j34M0p73M20K08m60M6N45J31m26O6r2J8L67j88m75L89J10N8n43M60
$$ 58 343 209 249 -524 -104 104 -356 -310 235 366 -60 6 -86 -68 299 111 -364 25 135 193 -350 110
4494A10J94j49Qm6k69J61L51n37M43n05P08o81M1K80m03N22n5k42o1N15k29m82
$$ 110 304 155 163 117 -152 9 360 -177 266 -239 469 -212 -171 109 -294 228 173 -69 -130 385 156 -326
4516c26L09K29j62L0l7K03l54L92j63m51Q0M91k16k29K77J16m31L35j03j23K69
$$ -326 -17 212 50 80 43 246 -108 284 121 -330 -250 241 25 -204 73 189 -242 93 -10 -133 136
4537A36L88p78nL87L2m99L84K1k0j21N0k41J39K74J09m15K67R4m87M11j8j91J33
$$ 136 524 -254 -259 128 160 -339 45 66 46 -75 -25 -266 -127 147 256 -159 108 202 -285 126 108 -83 50
4560E0O0j01k48N32j27o2l3oj2j98J46Q5l01K14J58l36o7N25k1k46j34P2rM99
$$ 50 110 9 -239 293 166 104 71 65 53 -145 1 86 -215 -1 157 -179 -246 279 258 12 -122 -50 -59 440
4584D40j74m99J25N51l73l40K52P7j45K12L6m70M41L9k08l11O63K5n71k24L17
$$ 440 266 -233 -108 443 70 -270 -18 59 -86 126 162 -308 133 172 -36 -347 316 341 -230 -454 -137
4605a37k8K32l4l1L5L96J1q23J10M16o0J39m8l39k4L17J36m02j7N56r3n75J62
$$ -137 -165 67 33 2 37 433 444 -379 -269 147 87 226 178 -161 -185 132 268 -134 -151 405 312 -263 -101
4628a01L7l64O60l57k84M94j8m07R3M84r6l38K37L7J04m32J2N7JN64l52m53K31
$$ -101 -64 -428 232 -125 -409 85 67 -340 -247 237 141 -197 40 77 181 -251 -239 -182 -181 383 31 -422 -191
4651a91M49k26Mr4M2k5L14k05n28L39M22n63L92m33J34P5J70l18k03N22K5l31
$$ -191 258 32 36 -58 -16 -41 273 68 -460 -121 301 -262 130 -303 -169 -94 76 -242 -445 77 102 -229
4673b29J27M60k24k15k36L55j88M22k11o61Q92O6j07l99K7R1Q3j27K57k46Q6J37
$$ -229 -102 358 134 -81 -317 38 -150 272 61 -600 292 358 251 -148 -121 -30 53 -74 183 -63 23 160
4695A60k04R7J05j77k56K12K10k57L28j82l0P7K8J17o32K05L82j90k05J77J18
$$ 160 -44 53 158 -19 -275 -63 147 -110 218 36 6 83 111 228 -404 -199 183 -7 -212 -35 83
4716H3K04j38k0k99J5K86k98J34K91qm80R0O7N7K39j69j38j05P24n82J03Q6m04
$$ 83 287 149 129 -170 -155 131 -167 -33 258 250 -230 -140 -73 -16 223 54 -84 -189 535 -47 56 142 -262
4739b62K88J44l27N6N7J87l1k38R0R3j38J56l2j82nL06k62l56O89k15l90M81j61
$$ -262 26 170 -157 -101 -44 143 112 -126 -36 57 -81 75 43 -139 -144 162 -100 -456 233 18 -372 109 -52
4762e2L67k63k48M26k99L77k89l99K16L27N8m04O4K9l34K48j83K61J67M8j76j46
$$ -52 315 52 -196 230 -69 308 19 -380 -164 163 221 -183 -119 -90 -424 -176 -359 -98 69 117 -59 -205
4784b05K98o8k25L42k43j80L98j8k89K05K73n7n08J79K84j84L5p1l61M40J72l58
$$ -205 93 25 -200 142 -101 -281 117 99 -190 15 288 231 -277 -98 186 2 37 -34 -395 45 217 -141
4806a41j76M98J16O5l71J50m19K26o9n1J17p9L79r8j94L34j36j9m10J50j6M70
$$ -141 -317 181 297 362 -9 141 -278 -52 -121 -172 -55 -134 245 147 -47 287 151 132 -278 -128 -144 326
4828C26j65j93O8M9J45n21J56J26L6J38P9k67M4J06j78r7M75j86j34J04M7n24
$$ 326 161 -32 36 85 230 -291 -135 -9 27 165 244 -23 21 127 -51 -148 327 141 7 111 158 -366
4850c66L29L91m13j89K94K11j62m63N42O9j96N5k20k27L58K72k73R2J96j92j36
$$ -366 -37 354 -59 -248 46 257 95 -368 174 243 47 102 -118 -345 13 285 12 104 300 108 -28
4871b8M5J15n1Q2k93k35L29K53l76N8Q6K09o64M64o4p1J51n9j3N6l5J11k03j03
$$ -28 17 132 81 163 -130 -365 -36 217 -159 -101 -15 194 -470 -6 -70 -141 10 -49 -62 -6 -41 70 -133 -236
4895b36K37p8j58K94k47L29J55l91N0j03K37R8j94p0J51o1M7n66K24N76j45j71
$$ -236 1 -77 -235 59 -188 141 296 -95 -45 -148 89 187 -7 -77 74 13 60 -506 -282 294 149 -22
4917b2j3J57j81K29n6j52R9j73J75l82K73L0N3J37n11K30p3L53k83n7J19L15m78
$$ -22 -35 122 -59 170 114 -38 61 -112 63 -319 -46 -16 37 174 -337 -107 -180 173 -110 -167 -48 267 -211
4940b11R0J79J71k84k7J45k71N98j61k03l48L00J20j30L8r0J59Lk5k81J2N64o10
$$ -211 -121 58 229 -55 -82 63 -208 390 229 26 -322 -22 98 -32 6 -84 75 78 53 -228 -216 348 -262
4963b62P9K09r0k7K10P3j85j11M4K25l85J40K84j56k16J31J26Q7L5q8j80j2j35
$$ -262 -183 26 -64 -91 119 192 7 -104 -60 165 -220 -80 204 48 -168 -37 89 176 211 123 -57 -69 -204
4986b04K23k01M59k20j14J88lk09J67j32K10k31L9k4J8L63j36m98M23l51K79j04
$$ -204 19 -182 277 57 -57 131 128 -81 86 -46 164 -67 -28 -52 -34 329 193 -305 118 -233 46 -58
5008e8j78M14l67K86q1p2MJ20J76k71j7m3l52N43k34J27r4k5L67o77N22J66j88
$$ -58 -236 178 -189 97 16 -56 -52 68 244 -27 -44 -87 -439 104 -130 -3 -97 -122 245 -432 90 256 68
5031F8k57L28l60J12J97k36M6r8J69j87K02j56p0M58K2m25o4L77K26l51j5N6r9
$$ 68 -189 139 -221 -109 88 -148 -102 -200 -31 -218 -16 -172 -242 216 238 -187 -251 126 352 1 -14 42 -57
5054e7r9LJ8M64k38ll9q3J43l93L4L69l40J57J51P7k84J86P8k01j5J54k5l5J82
$$ -57 -156 -153 -135 329 91 88 49 -34 109 -284 -250 119 -221 -64 87 164 -120 66 144 -57 -72 82 57 22 204
5079B04j04l9L4j34j98K86nk98J20J74j04l0K20O8j81k96M50m16L52ml81L30O
$$ 204 100 61 95 -39 -237 49 44 -254 -134 40 -64 -94 126 194 13 -283 167 -249 103 99 -282 48 54
5102E4k39J21J07l0k08P7M2K04j78J81j65oJ21j16j19l2O2K37k65J34P9k75L1
$$ 54 -185 -64 43 13 -195 -118 -76 128 -50 131 -34 -40 81 -35 -154 -186 -124 113 -152 -18 61 -214 -183
5125a83pJ57K07m18L53j17j22J51o2K50k37o4J44o4L27j08l43K09k95J80J85p8
$$ -183 -190 -33 174 -244 109 -8 -130 21 -41 209 -28 -92 52 -12 315 207 -136 73 -222 -42 143 65
5147F5m7j77J96l36K33J91l43K93k62J00J2j32J31j96N3K46k37J77Q8j62n6K12
$$ 65 18 -159 37 -299 -66 125 -218 75 -187 -87 -75 -207 -76 -272 -219 27 -210 -33 55 -107 -163 49
5169D9J75l18J46o9J45j7j98J04k50K04J93m70L55q0K6k45L09m1J91q6j39l83
$$ 49 224 -94 52 -17 128 111 -87 17 -233 -29 164 -306 49 -31 -5 -250 59 18 209 123 -16 -399
5191c99L55K69l25J34K38l88K81k01J46l43K0L30o4P1k41j09M43O2j18J13k56
$$ -399 -44 225 -100 34 272 -116 165 -36 110 -233 -213 117 53 124 -117 -226 217 279 161 274 18
5212A8J66j63J14J81l49L9k70L58q4q2K21j23l48Q56l76l12J53L7j47N1j21M33
$$ 18 184 21 135 316 -33 6 -264 94 10 -72 149 26 -322 534 158 -154 -1 36 -111 -60 -181 252
5234B52j90j86K11j72O1p5j74P2K61K88m41J29J59M4j13j35J17k29J28J09L9k46
$$ 252 62 -124 87 -85 -24 -99 -273 -201 60 348 -93 36 195 239 126 -9 108 -121 7 116 155 -91
5256i1J86k00J21L77k48j63J64j58qK94k57O8k12R9K4Q1J08m61P2K49J1l23J61
$$ -91 95 -105 16 393 145 -18 146 -12 -20 274 17 85 -127 -28 -4 77 185 -276 -204 45 56 -267 -106
5279a06M89m94L38j56k7j81L90k57j43J21J06k82J18N2J05L2k31n5p1M58l68O6
$$ -106 383 -111 227 71 44 -137 253 -4 -147 -26 80 -202 -84 -32 73 105 -126 -181 -252 206 -162 -96
5301i6nK27k71J85J82m15J47O5L2j51R4q8J16J1J46q0l4R6k86Q2J25j71L12k75
$$ -96 -101 126 -145 40 222 -193 -46 19 51 -100 -6 -94 22 33 179 99 65 161 -125 -43 82 -89 223 -52
5325e2O0j66LK53j51KJ90m6j31P7j03oQ8K58k71n72N40k8Q2L9j87J86L7kL81l94
$$ -52 8 -158 -155 98 -53 -51 139 93 -38 39 -64 -70 18 276 5 -567 -27 -55 27 66 -121 65 102 100 481 87
5351H7q9J16k89k54N33J47j83j76R0Q2j00j7l1k1O4K44n54M19j60O4l01L44J6
$$ 87 -2 114 -175 -429 104 251 68 -108 -18 64 -36 -53 -84 -105 -41 203 -351 68 -92 -28 -329 15 31
5374C1k6J27r7j86J57J19m02J84K94j21l21L47m8Q8j35K12J7l59J99j66r6n7J91
$$ 31 5 132 35 -151 6 125 -277 -93 201 80 -241 106 58 146 11 223 240 -119 80 -86 -182 -239 -48
5397d8p4o8K94p3k71P8L17m09K28J04j05J89j50j1O9K48k40N7r3J54n2j20J31
$$ -48 -122 -190 104 31 -240 -162 155 -254 -26 78 -27 162 12 1 70 318 78 135 42 196 144 24 155
5420A55k49Q6L1n6j85M50j61o17K84J49kL2K36k2N4K9k99L14n21L43j08J33J1
$$ 155 -94 -8 23 -33 -218 232 71 -546 -262 -113 -115 -83 153 131 185 214 -85 229 -292 51 -57 76 87
5443H7k5j0r9J23q2L42j59k04P4K13k37K39m40J95p9n7L27l7j80J34Nj47J66J89
$$ 87 62 52 -47 76 -6 336 177 -27 47 260 23 262 -178 17 -62 -119 208 171 -9 125 130 -17 149 338
5467C38m80J76j28J48q4J87j07j7j2j28K40M8M8Nn38K29o9J29j29L98k62j3l1
$$ 338 -142 34 -94 54 -30 157 50 33 21 -107 133 181 229 234 -304 -75 -144 -15 -144 254 -8 -21 -52
5490e2J62r6q4J04k5K8L31n66J36K00k5J01l53J14P3P3J3l29J40K22l35L16j32
$$ -52 110 14 -70 34 9 37 368 -198 -62 138 113 214 -139 -25 48 121 134 -195 -55 167 -168 148 16
5513A6p1l3P4K51L5l04J20k34j81O73l82j57P3P3Q0OM59m49j83M7L97k92L19k11
$$ 16 -55 -88 -14 237 272 -32 88 -146 -327 346 -36 -193 -120 -47 33 39 498 49 -134 -87 310 18 337 126
5537A26k6k53J03k1j0L05k51M4j58J00r3J59n5J04k80M7K12l83L30K10m50J95
$$ 126 100 -153 -50 -71 -81 224 -27 17 -141 -41 -134 25 -30 74 -206 -159 53 -330 0 210 -240 -45
5559d5J39o5J06Q3j80j49N3K00p0n50M97q0R9J8P6q8n7J11q0r3J06Q3k04J26K47
$$ -45 94 29 135 218 38 -111 -58 142 72 -478 19 -61 38 56 132 44 -13 98 18 -75 31 114 -90 36 283
5584B83l41J62j98J17p4J65J38o55J62K54M5P0j72R6J21k1j93K40m48N75j31n26
$$ 283 -58 104 -94 23 -51 114 252 -403 -241 13 58 128 -44 52 173 152 -41 199 -249 326 195 -331
5606c31M44l25K67O9k03j35K92l94L14j00M30l60q3J62K9j03J38K09l87K42k14
$$ -331 113 -212 55 124 -79 -214 78 -316 -2 -102 328 -32 -115 47 76 -27 111 320 -67 175 -39
5627c9nN1Mj28P6k08K47q9L51k02q9L7O6k78L2R3J36P4k94J15R5K27k70j21JQ9
$$ -39 -44 7 11 -117 -41 -249 -2 -91 260 58 -31 6 72 -206 -174 -81 55 129 -165 -50 45 272 2 -119 -118 -29
5653b9J09o2l51M74k31k23K52l0L0P6K1k29R4K82K9k67R7j46K4n8L33j79q8J0
$$ -29 80 18 -333 141 -90 -313 -61 -91 -61 15 36 -193 -99 183 212 -55 42 -104 -80 -138 195 16 -72 -62
5677f2J62l83K74K56m41J23l9k68J96L33l30M27k96K36l74M19j54L1k9j85J45
$$ -62 100 -283 -9 247 -194 -71 -110 -378 -182 151 -179 248 -48 188 -186 233 79 110 81 -104 41
5698D1k99M0J68k44J18J76J33m85K10J80j30K63l24J83J65n4j37k48L41k06K01
$$ 41 -258 -218 -50 -294 -176 0 133 -352 -142 38 -92 171 -153 30 195 141 4 -244 97 -109 92
5719I2M2l1j98J89J69k17m2l5kj19K25J13j17q1P3j80J60O7K21o91L83N1k47K85
$$ 92 134 103 -95 94 263 46 4 -31 -33 -152 73 186 69 -12 61 -119 41 108 329 -362 21 72 -175 110
5743A10K21k28k19L17j50k11n8M38k59n4L03k38K88r9k38p1K87J06k21k9k01L39
$$ 110 331 103 -116 201 51 -160 -218 220 -39 -93 210 -28 260 161 -77 -148 139 245 24 -5 -206 133
5765A33k30o8L04Q0l46K50k56K46Nl52L0J95M47m70n4M25j60k24m3j88M54j12
$$ 133 -97 -165 139 219 -127 123 -133 113 118 -234 -204 -9 438 -32 -86 339 179 -45 -88 -276 178 66
5787F6O1M9j73r9P5j58M01l26R6j68L99k65k72L89m8j44K45o2j87L92k78l03M31
$$ 66 127 176 3 -96 -21 -179 222 -104 -8 -176 223 -42 -314 75 27 -117 128 66 -121 271 -7 -310 121
5810A21k01k14K16j19J02L9K19k34N8N0J16k93l08O40n42L39j80L85l18J36M2
$$ 121 -80 -294 -78 -197 -95 -56 163 -71 -13 37 153 -140 -448 192 -350 -11 -191 194 -124 12 54
5831E4p4j6K64k10L5rn9j5j57J38qk61K73j7k7M47l35j31K36J17r1j43NJ92k91
$$ 54 -20 -36 228 18 53 44 -15 -30 -187 -49 -57 -318 -45 -62 -89 358 23 -108 128 245 154 11 16 208 -83
5856h3K70j1l04n3J94K6M6j05K10k03N3J66j25q5j64n0L30j9o6J3k06L36k57J74
$$ -83 187 176 -128 -181 13 39 85 -20 190 -13 40 206 81 -4 -168 -218 112 93 27 40 -166 170 -87 87
5880H7o6J22j74K41k73j5M2J65l33q5Q5K9j04K10L51m77P2k2K46q1l8K78j70Q8
$$ 87 21 143 -31 210 -63 -78 -36 129 -204 -289 -204 -175 -279 -69 282 -195 -123 -145 101 20 -18 260 90 178
5904A78k63J57l33J99J87J2M4k51J06j03l9K17j42N7j79L57J20j34k17J54J5m88
$$ 178 -85 72 -261 -62 125 137 181 -70 36 -67 -106 111 -31 26 -153 204 324 190 -27 127 142 -346
5926c46L84j99P0J95j45l3k25L32Rj8n9Rk50M1O5J4N29k46k26K5O4J96l08O4K14
$$ -346 38 -161 -91 104 -41 -74 -299 33 42 24 -35 -26 -276 -235 -170 -156 373 127 -99 -74 -10 186 -122 -58 156
5951A56k57O3J03j64M8rm2J58l38M03j45Q6J66l75m6L10k74L12j04%n9J62Jo1
$$ 156 -101 -38 65 -99 -51 -60 -102 56 -282 121 -24 62 228 -147 -193 117 -157 155 51 51 -8 154 155 94
5975I4l04L57m3o9n3pL92j41j74J84l25J59k33k21M45K22m17L8L7K47l06K63r6
$$ 94 -210 147 104 35 -18 -25 367 226 52 236 -89 70 -163 -384 61 283 -134 -96 -59 188 -118 145 49
5998D9J41N9n89K97j47J35j01K14l01K39J11J86j50j12m0J16k84Q4j55J53j0J58
$$ 49 190 249 -340 -43 -190 -55 -156 58 -243 -4 107 293 143 31 -9 107 -177 -93 -248 -95 -105 53
6020E3k00J93r7k9K10k40L8k07L86M6l17K18j10K44L2k54J04J7M8j95L67r6m08
$$ 53 -147 46 -51 -80 130 -110 -72 -279 107 153 -164 54 -56 188 220 -34 70 87 135 -60 307 211 -197
6043a97N13l26J36o4o3K3R1m12J12K32j9R6j17K70r5m26K39K66m17M1k63J65K14
$$ -197 316 -10 126 62 -1 22 113 -299 -187 45 26 122 5 275 180 -246 -7 259 -158 -117 -380 -215 -1
6066aj19J17Oq0jJ02L07k09j82Q8J36l5j67j24L21j20nj3l5p5N4J37k60J87J29
$$ -1 -120 -3 3 -77 -78 24 331 122 -60 28 164 129 -38 -162 159 39 34 21 -14 -89 -35 102 -158 29 158
6091A58L5p9k17J09M4K72o33L71k9K4k21j15M55r6n04R6M31P2k96N3J29j67J68
$$ 158 193 114 -103 6 50 322 -311 60 31 55 -166 -281 174 78 -426 -330 101 173 -123 -70 59 -108 60
6114F0L5j88K97n4j93N1k63L01j46k71M31r4J24P1j10j21J85j6m67K51j50K13
$$ 60 95 -93 204 150 -43 8 -255 46 -100 -371 60 -34 90 161 51 -70 115 99 -368 -117 -267 -54
6136e4K13J25k61k20J84j82L91j46N6j29P1J67j96J08R8k98L8o6o8K47l11J92
$$ -54 159 284 23 -197 -13 -195 196 50 106 -23 48 215 19 127 225 -73 -35 -101 -169 78 -233 -41
6158d1K84l23%K36j23j20K00L8p7J00q0j47O9p6K02O5r1l43L27k45M3J69P7Q3
$$ -41 243 -80 -80 156 33 -87 113 151 74 174 94 -53 16 -60 142 207 116 -227 100 -145 -102 67 144 227
6182B27k25J77l05K17j12K14j10k30q3M23l89M04k85K07l33L30J12l13k9J77j33
$$ 227 2 179 -126 91 -21 193 83 -147 -230 193 -196 208 -77 130 -203 127 239 -74 -103 74 -59
6203e9j04K88l3M9l87J79R3N0j12k72R4K89p8j42K38N0k23J21J10k43j50J95j09
$$ -59 -163 125 92 141 -246 -67 26 76 -36 -308 -214 75 -3 -145 93 143 -80 41 151 -92 -242 -47 -156
6226a56O8K71l67J14M29k20k82O4q6P0p9M4qPj1M26q4k31K4K2K04j22J16k19k61
$$ -156 -88 183 -184 -70 359 139 -143 -79 -165 -95 -174 -130 -138 -131 -142 284 200 -31 -7 15 219 97 213 -6 -267
6251b67L82j09j35K11k14K80l23K0R9P0K51l28L71l28P4PJ60l53k8J96J62l58
$$ -267 115 6 -129 82 -132 148 -175 -155 -56 14 265 -63 308 -20 54 61 221 -132 -160 36 198 -160
6273a60j9N4N0p2P1o6J59j2j61J09p3J99p9J86k46J46k77L78k9m90M91j10j98
$$ -160 -179 -125 -75 -147 -76 -142 17 5 -156 -47 -120 79 0 186 -60 86 -191 187 158 -332 159 49 -149
6296a49k97M25K9l5J65l4m53L51O4j86L42o9j61l6l0j11K15j48J58j8p8m3L28
$$ -149 -446 -21 8 -27 138 104 -349 2 66 -120 222 153 -8 -44 -74 -185 30 -118 40 22 -56 -99 229
6319B29l40k24K60r3J33J20j14K88j76j27M0j09l4J84K00j27j6K0L62m38j97j1
$$ 229 -111 -335 -75 -168 -35 85 -29 259 83 -44 -4 -113 -147 37 237 110 94 114 476 38 -159 -170
6341a70P3J01j47L04j97j40L91Qm55L95Jk02l1J6K51j76j57Q3J61pk09J23K75
$$ -170 -97 4 -143 161 -36 -176 215 223 -232 163 164 -38 -69 -53 198 22 -135 -52 109 102 -107 16 291
6364B91j61j06Q1p3R8j57n0rJ37j45K47k37k89L29m6k3j85M56k17J07m2q8k92
$$ 291 130 24 105 32 130 -27 -77 -86 51 -94 153 -84 -373 -44 -90 -113 -298 158 -59 48 6 -82 -374
6387c74L89J76m00N56k49k36J8K02m9j93J91j07K07p9m6J00q0k13J51J09l2K25
$$ -374 15 191 -209 347 98 -138 -120 82 33 -160 31 -76 131 52 6 106 26 -187 -36 73 41 266
6409B66l80J93r1k73J54Rr2K80j24M2k66J41K11j09R1O3k24n5nk3j55J15L60k31
$$ 266 -114 79 -12 -285 -131 -122 -214 66 -58 -16 -282 -141 70 -39 52 115 -109 -164 -169 -192 -347 -232 128 -103
6433a03Q8j24K54Q2j42J1l14P3O0R7j99K14j94L9K23p2qK7N1Q7q0m1j22N6n0J2
$$ -103 -15 -139 115 197 55 66 -248 -175 -115 -18 -217 -3 -197 -158 65 -7 -15 12 63 150 70 29 -93 -37 -87 -75
6459g5J05k12K70Kr3n7K02o83M82j22K11L6L4j31l07K95J90l75P0J82j25L6J97
$$ -75 30 -182 88 90 -3 -60 142 -541 -59 -181 30 66 100 -31 -338 -43 147 -228 -158 24 -101 -65 132
6482A32l25L12k84L8K1J18N2j23M8kj44Q3LK09j79p5J5K04n7j61K28J66k3l75
$$ 132 -193 119 -165 -127 -106 12 64 -59 -11 -13 -157 -74 -71 138 -41 -116 -101 103 46 -115 113 279 256 -119
6506a19o6K40J28N1m63Q7K00R2l42L62n02K64RJ54n6P8L1k53q1M37l89K89J25
$$ -119 -185 55 183 234 -229 -142 58 150 -192 170 -332 -68 -59 95 39 117 148 -105 -186 251 -138 151 276
6529B76l93J92k33J88p3O9r4mJ0J01j30J00j07J34Lk69K19L6k62L40j5l4LJ16
$$ 276 -117 75 -158 30 -43 26 -68 -72 -62 39 -91 9 -98 36 39 -230 -11 25 -237 103 88 54 57 173
6553A73j56k01M1L94j20k57K64j44J20m59M9O10l23J20l9J32j94P6k16K90k10
$$ 173 17 -184 -143 251 131 -126 138 -6 114 -345 -296 314 -9 111 72 204 10 86 -130 160 -50
6574e0K09k48j77m9K09K79j69K5r5K00r8P3RK33l05K4k31L8o0K77M1k80K31l42
$$ -50 159 -89 -266 -315 -106 173 4 29 -66 134 36 109 118 351 46 70 -161 -123 -183 94 135 -145 86 -256
6598b56L00j33k3J36j34J45j2O4n3J0J33j05N1K92l16k16R3m23Q52k75k3r1M8
$$ -256 44 -89 -112 24 -110 35 23 87 34 44 177 72 123 415 99 -117 -24 -447 405 130 107 16 64
6621F4r8K75l75M23m77J91Q2k61M39n22L41k10J7j09M66j42o0q1N2J25k86L27
$$ 64 -34 241 -134 289 -188 3 85 -176 263 -259 82 -128 -111 -220 246 104 44 -37 15 140 -146 181
6643A81j36K44m57K62J34n9m5k7j17J08k1j04k24M08j41M3J05m07M51k88K25k33
$$ 181 45 289 -168 94 228 169 124 97 -20 88 67 -37 -261 147 6 49 154 -253 198 -90 135 -98
6665i8j22k3J09K18j41q0J58O8O8K4j22j71J13j33k11L46k80L72k67L67r6l40
$$ -98 -220 -243 -134 84 -57 -137 21 89 157 181 59 -112 1 -132 -343 3 -277 95 -172 195 99 -241
6687b41nJ75K61k52Ok5j19j74L44j9j98K56K70n09QM8j07J67m7L08l37j9L94k06
$$ -241 -246 -71 190 -62 -56 -81 -200 -374 -30 -49 -247 9 279 -230 -222 -174 -281 -114 -161 147 -190 -209 185 -21
6711b1R9j82J24j25j08K42K33j97L4j36K70n1n7j66J59o6q7J09l52J86K79M4m34
$$ -21 78 -104 20 -105 -213 29 262 65 99 -37 233 182 125 -41 118 52 -35 74 -278 -92 187 231 -203
6734b03K43K85l95n9J70L6o4K3j97l6rL67j09J5j36j9K4o2K80j36k48J30O2K54
$$ -203 40 325 -70 -129 41 77 13 36 -161 -197 -206 161 52 67 -69 -88 -64 -126 154 18 -230 -100 -38 216
6758B16l07N2LpqJ75k92Mj97K60M3j73L51q6L25k80n6O3j7k55K72J28k7l0J1l39
$$ 216 -91 -39 -36 -43 -51 124 -168 -164 -361 -101 -58 -231 120 34 359 79 23 86 69 -186 86 214 187 157 168 -171
6784a71J34j12R6K24J7j57j06J10Pk09L89l15j62K50k18O0r9K62j21J79r0M2k02
$$ -171 -37 -149 -53 171 188 31 -75 35 42 -167 222 -93 -255 -5 -223 -163 -262 0 -121 58 -32 10 -192
6807a92R2K36j88O4j48M4J30j38P8P0l64J02J02n6K37l40L15j49M41k09j3pl42
$$ -192 -100 136 -52 12 -136 -92 38 -100 -22 48 -316 -214 -112 -168 69 -271 44 -105 336 127 114 107 -235
6830b35p6O0L66k04k6J16j04n5J87k18K22k76K40J62l84Q0K14p0m4L76k74J50
$$ -235 -311 -251 115 -89 -115 1 -103 -158 29 -189 33 -243 -3 159 -225 -145 69 -1 -45 331 57 207
6852B07k5k98K34j20K60j39l2l44L64Rk04J16j11k16L28k02J55P9P8J8n4j7l12
$$ 207 182 -116 118 -2 258 119 87 -257 107 116 -88 28 -83 -299 29 -173 -18 61 139 157 103 86 -226
6875b26J81k01P7J84k8K9J20k95K58J17Lp4L3K6k41J34J5j63K62k49j49M55k5
$$ -226 -45 -246 -169 15 -13 16 136 -159 99 216 219 145 178 204 -37 97 112 -51 211 -38 -187 268 243
6898B43k49J31K17j50l30O47m64j79M10j33k29N4J66j56Nk08n8K90P7l81M33j16
$$ 243 -6 125 342 192 -138 509 45 -134 276 143 -86 -32 134 -22 -17 -225 -283 7 84 -297 136 20
6920B0j80P4K68j29l2k33J89m9Q2J61j35k31K58k97J15K26k20K37P9Mk05J15m2
$$ 20 -160 -86 182 53 21 -212 -23 -72 10 171 36 -195 63 -234 -119 107 -113 124 203 207 2 117 75
6943G5J11j67j87L04J73k50K41j42m06L83Q6n3l03J56j25K24N8k30K91j4j89M6
$$ 75 186 19 -168 136 309 59 300 158 -248 135 221 168 -135 21 -104 120 178 -52 239 225 36 82
6965H2J27m3K3l20J29K69j23J7k42O0K0j82j0k9K61k36K15J48r9J4j87L45k3M8
$$ 82 209 166 189 -131 -2 267 144 161 -81 -21 -1 -183 -193 -222 39 -197 18 166 67 81 -106 239 216 264
6989B64k85j87L7L62N8j32j47N9mk46L21j68L8P4j27J12P9O4k13r4J03N5nP9k1
$$ 264 -21 -208 -171 191 249 117 -30 29 25 -221 100 -68 -30 44 -83 29 108 172 -41 -135 -32 23 18 97 76
7014G6L3j82K65k46K87l01o4K19k05N1j02K06r9j20J98j16r7J84m9j1l5J29l6
$$ 76 109 -73 192 -54 233 -68 -132 87 -118 -67 -169 37 -62 -182 16 -100 -197 -13 -62 -73 -108 21 -15
7037a5L03j83k3j14k74N68k55j6J9k01J95P9j53J9K1J09q2q7K14R5k35j62J8q3
$$ -15 288 105 82 -32 -306 262 7 -9 10 -191 4 83 -70 -51 -30 79 -3 -90 124 219 -16 -178 -160 -243
7061b43J78R3P0j52n6j8L35j18O5N5l32k7J11R0jk3K3j34M90m24j62J6J14j16
$$ -243 -65 28 98 -54 -110 -128 207 89 154 209 -123 -150 -39 51 50 27 50 -84 406 -18 -180 -164 -50 -166
7085a66J37J97j73l4k68N0K05J00l8o8J63P8n42L63N9k8N2J62m51N63k41j19l89
$$ -166 -29 168 -5 -39 -307 -257 -52 48 10 -58 105 183 -359 4 63 35 87 249 -202 361 120 1 -388
7108c88J77N5N6K00r1k4J1N2l8r2l95M18j40m2L43l79K65Q8l32K42j7J27j43J61
$$ -388 -211 -156 -100 100 9 -15 -4 48 10 -82 -477 -59 -199 -241 102 -277 -12 76 -256 -14 -31 96 -47 114
7132A14r7K18k58n4J70j56K39P6n11K53P4J17k23J42N3ql12k3k27K77J78l5O1
$$ 114 17 235 -23 -77 93 -63 176 252 -259 -6 68 185 -38 104 157 149 -163 -186 -413 -136 42 7 68
7155F8jJ42j00j45R8n8O5l40M47J26o14L48m07P16k20l34JL18l46K18p4m2L00
$$ 68 67 209 109 -36 62 4 69 -271 176 302 -312 36 -371 345 125 -209 -208 110 -236 -18 -92 -134 166
7178A66j01Q0m1m75L89J27k20j22JM3K00N14l76j23l7K47l19n1J67k80K3N30j13
$$ 166 65 145 104 -371 18 145 -75 -197 -196 -153 47 561 185 62 25 272 -47 -98 69 -211 -188 342 229
7201B29k32j4L4j64L49j82K88l86J12o1m6K80l7k1k46p8o3O5J84j39M6J41J23
$$ 229 -3 -17 17 -147 202 20 308 -78 34 -27 -73 207 170 149 -97 -175 -238 -173 11 -128 -82 59 182
7224A82n13L80rr9J51k13K95k95L96k75j73P6KM3L9N2l5R9k33l7Q4J42q8J95l14
$$ 182 -331 49 40 -59 92 -121 174 -121 275 0 -173 -97 -95 -52 -13 39 4 103 -130 -167 -83 59 -29 166 -148
7249a48o3P0K46L47j11l06L15p5l55O5K3M2M8K1j27K93j88j45k0R2j32L09k87
$$ -148 -211 -141 105 452 341 35 350 275 -80 -15 8 50 98 119 -8 285 97 -48 -68 24 -108 201 -86
7272h6J80o5k24K33m1Q5l29K42l6k4l9L01j28k24J5j5J29k45K87K19j50r9J71
$$ -86 94 29 -195 38 -3 82 -247 -5 -41 -65 -104 197 69 -155 -140 -155 -26 -271 16 235 85 -14 157
7295A57j17J36j01k29K23p9j76L55j57k56K97J22J7k26P3O0l11K74J13j43P3L2
$$ 157 40 176 75 -154 69 -10 -186 169 12 -244 53 175 192 -34 39 99 -212 62 175 32 105 137
7317A37k05j66L73L4l42M07r1J8k11j13L08l62J00J87M2j94l02N6M05L3L28p15
$$ 137 -68 -234 139 173 -169 238 147 165 -46 -159 149 -213 -113 74 116 -78 -380 -324 81 114 442 -273
7339b73L63l4k70o1K33O5n29O05l86L56o0q2L18j63j00j28K23k54N9j51M57n27
$$ -273 90 56 -214 -275 -42 23 -506 99 -287 69 9 -73 245 82 -18 -146 77 -177 -118 -269 188 -339
7361c39M17j40J04n3J44P8l50M11o1j00l63J73K25m10M09m7J41l05j18K04l4o3
$$ -339 78 -62 42 -11 133 211 -139 272 211 111 -252 -79 146 -264 145 98 239 -66 -184 20 -14 -77
7383g7L2k13K25K63j39j44j5k67M34J53n19M18l54J11o8L92l31J37j44p9M09k30
$$ -77 -45 -258 -33 230 91 -53 -68 -335 99 252 -267 151 -203 -92 -160 232 -99 38 -106 -185 224 -6
7405fk88L56k12P7J69Q8j7k74P6j08K00M6k02l1J81j48m1q1J57L05m13M78l32
$$ -6 -294 62 -150 -73 96 184 167 -107 -31 -139 61 107 -95 -126 55 -93 -134 -215 -58 247 -166 312 -20
7428b0n3M9K37l16J92K58m33k13O32n65M85j27LM1n13K93J78l97J4L22n1K8p0
$$ -20 -73 -24 213 -103 89 347 -86 -299 333 -232 253 126 129 170 -343 -50 128 -269 -255 67 16 44 -26
7451b6K45k24J55m5o7l57L87j05J87J46p0l82J60K39j48O0k64j73k08M42N5O1
$$ -26 219 -5 150 105 38 -319 68 -37 150 296 226 -156 4 243 95 155 -109 -282 -490 -48 7 68
7473F8l8j19K21k32R3Q5Q8NNk0k22J5J32k21J73j5J43j78Q4j68J28L04j60m7l91
$$ 68 30 -89 132 -100 -7 78 166 171 176 156 -66 -51 81 -140 33 18 161 -17 67 -101 27 331 171 124 -267
7498b67O8R0R3m4K73k12k36L15J2j68l0K60M7l84J67p2p1o1N99m45J93j97M9j01
$$ -267 -199 -109 -16 -60 213 1 -235 80 92 -76 -106 154 201 -183 -16 -88 -159 -220 379 -66 127 -70 -21 -122
7522a22k4K07k88L11K88j5n34L80j52J68k48J25k19J52P7J80m4k66K84l72J74
$$ -122 -146 61 -227 84 372 357 -177 203 51 219 -29 96 -123 29 106 286 242 -24 260 -112 62
7543F2M3m43L98L5p5l8K07n5k54j63M21k19j05K66L18m77R0j1k11K67Mr8R6J37
$$ 62 105 -338 60 95 20 -18 189 134 -120 -283 138 -81 -186 80 398 -79 11 0 -211 56 60 -38 58 195
7567A95k04M5k9R7R4J0j0j00k8J1J82k07J45M9j30J9o0J16l37r8L12j16K24k7
$$ 195 -9 36 7 104 198 208 198 98 70 81 263 56 201 250 120 139 79 195 -142 -240 72 -44 180 153
7591A53k95K19J50k21k16K96K06l76kj15q6P08n38L29N0l28j0N4J86k7j27qJ28
$$ 153 -142 77 227 6 -210 86 292 -84 -86 -201 -287 421 -117 212 262 -66 -76 -22 164 137 10 2 130
7614A30r0p0K15k17j87R1L22K9l79J06J89Jj11%J39l41Q8m7O7J11Q2j08k27M16
$$ 130 40 -30 185 -32 -219 -128 194 223 -156 -50 139 140 29 29 168 -173 -85 -132 -65 46 128 20 -207 209
7638B09k85o5R3K88m19M28p8k74K85j59j81L45n1j99R0M2j45q8K03m5l25L56n9
$$ 209 -76 -141 -48 240 -179 249 171 -103 182 23 -158 187 136 -63 27 69 -76 -164 39 -6 -331 25 -34
7661c4J63j00k25L19L7N9m23N49m71K21j20J22Lm39M96k41j65K09o6J1J63j06
$$ -34 129 29 -196 123 160 219 -204 345 -126 95 -25 97 100 -339 157 -84 -249 -40 -106 -95 68 -38
7683c8j89M32N0k42r6l0L14l77J90K4O6k17K85l24L92J43n48L66k74L61l15J64
$$ -38 -227 205 255 13 -83 -113 201 -176 14 38 104 -113 172 -152 240 383 -165 201 -73 288 -27 137
7705A37k42L35k33r6k35L22R5q9J43l58N4L13n2k5j61J5Q5J18j93J03r6L9J70
$$ 137 -105 230 -3 -99 -334 -12 83 -6 137 -221 -167 146 94 69 -92 -77 8 126 -67 36 -60 -21 149
7728A49k25K84l69O2K05k8P4j85J23p9p3m3r0L94J16m22J27k03J84K84m15l28
$$ 149 -76 208 -161 -99 106 78 152 -33 90 11 -62 -105 -195 199 315 -107 20 -183 1 285 -130 -458
7750d58L65q3O5J16j1R6j24j01jo4K60J86j83K0l43K68L37m29K29j12k11K57o3
$$ -458 -93 -176 -111 5 -6 90 -34 -135 -136 -200 60 246 63 83 -260 8 345 -84 145 33 -178 79 16
7773A6J7q7K59j28J16j80k16L25l15r6L24n5k8J95j05j35L52k84M4k09M68k45
$$ 16 33 -54 205 77 193 13 -203 122 -193 -289 35 -20 -48 147 42 -93 259 -25 19 -190 278 33
7795C3j22L54m90R4J55J65j30L3k17K77J36j72J05l36j50N72l49j70J29p2J13
$$ 33 -89 265 -225 -131 24 189 59 92 -125 152 288 116 221 -115 -265 307 -42 -212 -83 -155 -42
7816d2r3J16k07R9j02J83K23j87k1Q3J9j53M87m51j15J57J72J32l65j20K13Nk4
$$ -42 -135 -19 -226 -127 -229 -46 177 -10 -31 52 71 -82 405 -46 -161 -4 168 300 -65 -185 28 33 9
7839IO4l4k43K83j30J65Q8k20j89K80j82K31j68l7M08k14l89L96K58l51k44L11
$$ 9 73 39 -204 79 -51 114 202 -18 -207 73 -109 122 -46 -83 325 111 -278 118 376 25 -219 92
7861I2rl78L69ok93J79o1J87p9J76p6k40j63M6L01J47l26j09Q0R6J54l25N71m99
$$ 92 83 -295 74 68 -225 -46 -107 80 1 177 101 -139 -302 -256 45 192 -134 -243 -163 -67 87 -238 333 -166
7885a66J38l9M9J89j61rP0l0k88L11n3k1j17K08k61M7J81j18K01J28l99P8J16
$$ -166 -28 -67 -18 171 10 1 71 41 -247 64 11 -10 -127 81 -180 -133 48 -70 131 259 -140 -62 54
7908E4j11N8m8J74k64RJ03k76L71j1j76Q4L65l75p7J68q2O0J09k12k23R5K08J74
$$ 54 -57 1 -47 127 -137 -128 -25 -301 70 59 -117 -33 332 -43 -120 48 -34 26 135 -77 -300 -205 3 177
7932A77n44M05j65J62P4j37J61j84K69j73l35J19J97j72L36j22j01j79L34r7k02
$$ 177 -367 38 -127 35 109 -28 133 -51 218 45 -290 -171 26 -146 190 68 -33 -212 122 25 -177
7953a77kK07J33j22J98o8k14J08p9n8j57M41k37J73R9j35l40J25N93o29k33L14
$$ -177 -179 28 161 39 237 169 -45 63 -16 -74 -231 210 -27 146 245 110 -230 -105 488 -141 -374 -60
7975f0J29k78R3K59j52R8J63k23J15j85j14L40k01K7n4K16j60K98l58m2N1q1J44
$$ -60 69 -209 -116 143 -9 89 252 29 144 -41 -155 185 -16 11 -43 173 13 311 -47 -89 -38 -119 25
7998B5l02L97k23q2K38k20M76p5q5j63N7P8j61k9M7J22K26L0o30L98k62o0J36
$$ 25 -277 120 -103 -185 53 -167 309 234 149 -14 43 121 -40 -69 -22 100 326 356 -274 124 -138 -198 -62
8021f2RJ33J50l95J84j67K35j19J19L7q3k30m2j59K83K30K0j63O3O0k6r4J02K19
$$ -62 -53 80 230 -165 19 -148 87 -32 87 124 41 -189 -231 -390 -107 123 143 -20 43 103 77 -17 85 304
8045C04k17k44M8M08m73J2M40m28J32q8L93j91l39P2J96l3n1j01K42j7J12l31
$$ 304 87 -157 -109 299 -174 -162 278 -150 -18 -106 287 96 -243 -171 25 -8 -59 -160 82 65 177 -154
8067a54J79J78m42J50J06l48M61j98J47k0j41Q0k17J57J59j41P3k12K20L5j81
$$ -154 25 203 -239 -89 17 -331 130 -68 79 59 -82 -2 -219 -62 97 -44 29 -183 37 72 -109
8088a09Rl15L56K03p3j84K26q7L7o6J61k42%N09n57J63J54j71j40M0M58k38n36
$$ -109 -100 -415 -59 144 71 -113 113 26 63 -3 158 -84 -84 425 -132 31 185 14 -126 -86 372 134 -402
8111d02M56P2l73L02J55j76K77l44K00O9j5j34K7J08k87J7J70r8oj94K05j49J59
$$ -402 54 126 -247 55 210 34 311 -33 167 236 221 87 114 222 -65 -48 122 24 18 -176 29 -120 39
8134C9k16K6L51l00J09j7Q2r0O4L30m49k8N0nj52K89R6o5k62j10O04k65m82N22
$$ 39 -177 -151 200 -100 9 -8 74 -16 48 378 -71 -99 -49 -54 -206 83 179 114 -148 -258 346 81 -401 121
8158A21J54l31j15J08l79K13L67j83j36M05m63K28k56L67l09L10o3J3J86k61L3
$$ 121 275 -56 -171 -63 -442 -229 138 -45 -181 224 -239 -11 -267 100 -209 101 38 51 237 -24 9
8179Il2J00J66n57r3K41L21j39p5J56m1j60
$$ 9 -23 77 243 -314 -407 -166 155 16 -59 97 56 -104
8191a04
$$ Imaginary data points
##PAGE= N=2
##DATA TABLE= (X++(I..I)), XYDATA
0@%%%%%%%kJ0j6J6j6J7k5L2m0M8n6O9p8R0j06J22j42J66j91K20k50K82l17L56
$$ 0 0 0 0 0 0 0 0 -2 8 -8 8 -8 9 -16 16 -24 24 -32 37 -41 49 -57 65 -77 89 -102 118 -132 150 -167 189
31A89m02M50n04N63o26O98p76Q60r55J059j171J296j433J587j762J956k176K430
$$ 189 -213 237 -267 296 -330 368 -408 452 -503 556 -615 681 -752 835 -927 1029 -1147 1283
49A283k724L068l479L982m611N424o522Q097j0563J5003k5474R5130O9861j83318
$$ 1283 -1441 1627 -1852 2130 -2481 2943 -3579 4518 -6045 8958 -16516 78614 148475 -34843
63c4843n4816O5506P9470j2851m8012l3988M7280N0024k4630n1547J5678J5003
$$ -34843 -89659 -24153 55317 42466 -5546 -39534 7746 57770 33140 -18407 -2729 12274
75A2274j8601P479L7394j3922l8052n597K7441L9203J3458p0672p8058M5035J04617
$$ 12274 -6327 1152 38546 24624 -13428 -19025 8416 47619 61077 -9595 -87653 -42618 61999
88F1999j63p0136j9649L2522K7720k222m6094l6142M1306N9113j5411m0701l413
$$ 61999 61836 -8300 -27949 4573 32293 30071 -16023 -52165 -10859 48254 32843 -7858 -11271
101a1271K516J866K3989J749l8377j2417K2924J1174J2215J8710k0946l4816P746
$$ -11271 -8755 -6889 17100 18849 -19528 -31945 -9021 2153 14368 33078 12132 -22684 -14938
114a4938J4021j2723K786J4383q757N215L0368j6866n4968l323M3070K4396m147
$$ -14938 -917 -13640 -10854 3529 -5228 -13 30355 13489 -41479 -44802 -1732 22664 18517
127A8517k6694l0489K1109N3147j0249n2827p6K9864q023j4628R884R587P984
$$ 18517 -8177 -38666 -17557 35590 25341 -27486 -27562 2302 -5721 -20349 -10465 -878 7106
140G106N017k3257j5417K7210N491l8669N458N6884Q456m9020k8020J5121L3258
$$ 7106 12123 -11134 -26551 659 6150 -32519 -27061 29823 38279 -10741 -38761 -23640 9618
153I618J9179l3312m6843K5691N7719j3387m5848R152L0936k531j6182j3235m329
$$ 9618 28797 -4515 -51358 -25667 32052 18665 -27183 -18031 12905 10374 -5808 -19043 -23372
166b3372K5287K1024k1681j4485K1130n383l4686Q658L8395L265j9809j0686k979
$$ -23372 1915 22939 1258 -13227 7903 2520 -32166 -23508 14887 18152 -1657 -12343 -15322
179a5322J5120K1514j8418l1074K2901L3361k0223k9821Q517J7542R779L909k4406
$$ -15322 -202 21312 2894 -28180 -5279 28082 7859 -21962 -13445 4097 13876 17785 -6621
192f621k5988K1000K9621j0050j0732J0461m863j0651R161o56j2875J3943J8774
$$ -6621 -32609 -11609 18012 7962 -2770 7691 2828 -7823 1338 682 -12193 1750 20524
205B0524j5305j3643R264l624p671J6028O652j4900q17N445q891P842K2969j4082
$$ 20524 5219 -8424 840 -2784 -10455 5573 12225 -2675 -3492 1953 -6938 904 23873 9791
219I791k8825Q344J7499o393k551M825j000J0001O906l2228k4940L2505L3318
$$ 9791 -19034 -10690 6809 416 -2135 2690 1690 11691 18597 -13631 -38571 -6066 27252
232B7252j4794j8092L828J879L128K965j6111o034K5557N206k8038k260K4354
$$ 27252 12458 -5634 -1806 73 3201 6166 -9945 -15979 9578 14784 -13254 -15514 8840
245H840J68j0123M190m223j1014M375R19k715K3649J7303l0342k7480J5763J4002
$$ 8840 9008 -1115 3075 -1148 -12162 -7787 -6868 -9583 14066 31369 1027 -26453 -10690 3312
259C312r741j725N716K046J1314J33k6181n612K8728M903k3571l108J0563O4O764
$$ 3312 -6429 -8154 -2438 -392 10922 11055 -15126 -20738 7990 12893 -10678 -13786 -3223 -3159 3605
274C605R280j2270p840Q380j0780j7366J7420K2683m911n423K908j0744p741Q787
$$ 3605 12885 615 -7225 1155 -9625 -26991 -9571 13112 8201 2778 5686 -5058 -12799 -4012
288d012k793o325J8930J0770k1078r600J4133K881m765L977r738j1407J4859J2840
$$ -4012 -6805 -13130 5800 16570 -4508 -14108 25 2906 -1859 2118 -7620 -19027 -4168 8672
302H672j1529J259J6806p459j9979j26J989L89J6322O737j5437P49J1376j6027
$$ 8672 -2857 -1598 15208 7749 -12230 -12356 -10367 -9978 6344 13081 -2356 -1607 9769 -6258
316f258j6658J7226J6235q298n427j383l403J2906J1812j8821j4957J6481O517
$$ -6258 -22916 -5690 10545 2247 -3180 -4563 -7966 4940 16752 -2069 -17026 -545 5972
329E972j7994Q52J6764L749j139l065j7084n758J8621M179j2488R482J4053j4867
$$ 5972 -12022 -11170 5594 9343 8204 5139 -11945 -17703 918 5097 -7391 2091 16144 1277
343A277j3288P519M166l82O353p277j2102J3034J2418j5878n629J8113J336j6490
$$ 1277 -12011 -4492 -326 -708 5645 -1632 -13734 -700 11718 -4160 -9789 8324 9660 -6830
357f830k959K579K437J4626N243j8937o069J3541m074j2033J0706J0900o790j305
$$ -6830 -9789 -7210 -4773 9853 15096 -3841 -9910 3631 -443 -12476 -1770 9130 2340 1035
371A035N27j0521K326J6186m756j2655Q180N460j1928M11J1074k711k523M877
$$ 1035 1562 -8959 -6633 9553 4797 -7858 322 5782 -6146 -5735 5339 2628 105 4982
385D982j0957r147J6568J0095j1173j411Q085r070p899P935J256o26J2697j080
$$ 4982 -5975 -15122 1446 11541 368 -1043 7042 -2028 -9927 -1992 -736 -1362 11335 10255
399A0255j9377k08J3783m083n247Q705l03p419N154Q20q927Q898J2184j4086j3687
$$ 10255 -9122 -9330 4453 370 -4877 3828 3525 -3894 1260 2080 -6847 2051 14235 149 -13538
414a3538J0222N280m601P211M639q835p47J129j2697m30K0847L684j3154J178
$$ -13538 -3316 1964 -2637 4574 9213 378 -369 760 -11937 -12367 8480 12164 -990 188
428A88M750q872q44P341m117r42R207o542j2186J1826J2822q787o645L263p326
$$ 188 4938 -3934 -4778 2563 -1554 -2496 6711 169 -12017 -191 12631 3844 -2801 462 -6864
443f864l644J0924K965k911J0508J533k0163o338J1845Q29k051R151J84q194L763
$$ -6864 -10508 416 3381 470 10978 12511 -7652 -13990 -2145 -1316 -3367 5784 5968 -2226 1537
458A537J730j0608L460J2982p357j1666P194M898k866Q274M486j3498m984M973
$$ 1537 3267 -7341 -3881 9101 1744 -9922 -2728 2170 -696 7578 12064 -1434 -6418 -1445
472a445o964k677J7149P848r810j506q8j0392L61J0802k497k357J0424j724j4428
$$ -1445 -8409 -11086 6063 13911 4101 2595 2507 -7885 -7524 3278 781 -1576 8848 7124 -7304
487g304M541J2036m970m874J993o662l079J3809L981q303N188N170j3113q895
$$ -7304 -2763 9273 4303 -571 1422 -5240 -8319 5490 9471 1168 6356 11526 -1587 -10482
501a0482P410J951K408J2083p20j3744n99N235p456J304J2704l313r940M376L621
$$ -10482 -3072 -1121 1287 13370 12650 -1094 -1693 3542 -3914 -2610 10094 6781 -3159 1217 4838
516D838l655N051M164j0935l170Q782m277o989J1527R337o887l589j971j0191
$$ 4838 1183 6234 10398 -537 -3707 5075 798 -6191 5336 14673 7786 4197 2226 -7965
530g965K257J5279k8p738N064J77j0649J924Q285m066j484P204n062q200P694
$$ -7965 -5708 9571 9543 1805 6869 7046 -3603 -1679 6606 2540 1056 8260 3198 -5002 2692
545B692M771o677L030O831r592q002P125L505L00P536l145j4621M04J0551l189
$$ 2692 7463 786 3816 10647 1055 -6947 178 3683 3983 11519 8374 -6247 -5843 4708 1519
560A519k777Q093r63o827L010l28r066M851J2650m866p397L927k354n795Q825
$$ 1519 -1258 6835 5872 -955 2055 1727 -7339 -2488 10162 5296 -2101 1826 -528 -6323 2502
575B502O018q781k386K481n699J334J3055j175j1990K506M308p204j123P129j298
$$ 2502 8520 -261 -2647 -166 -5865 -4531 8524 7349 -4641 -2135 2173 -5031 -6154 975 -323
590c23J985P892p183j4748M440J0687k754o19L807o846l223R105L22o764L994
$$ -323 1662 9554 2371 -12377 -7937 2750 -4 -623 3184 -3662 -6885 2220 2542 -4222 -228
605b28K162r568m66R644j379k781P478L21r500j012n95m835Q832J3923o229j1723
$$ -228 1934 -7634 -8100 1544 165 -2616 4862 5183 -4317 -5329 -5924 -10759 -1927 11996 5767 -5956
621e956K964K504m053M023K491p798J254Q810l961n943Q014K991p044J65M0q052
$$ -5956 -2992 -488 -4541 -518 1973 -5825 -4571 4239 278 -5665 2349 5340 -1704 -1539 -1499 -9551
637i551K174J3229J228l841K690o176j2150N399J1298l426j789N010k652k940
$$ -9551 -7377 5852 7080 3239 5929 -247 -12397 -6998 4300 874 -915 4095 1443 -1497
651a497N326k265q167N600Q151q324n956O932K667J329O424m785j4375O25Q191
$$ -1497 3829 1564 -6603 -1003 7148 -1176 -7132 -200 2467 3796 10220 5435 -8940 -8315 -124
666a24k480K361R904k328q211J031p79o329M695O959l580r81O007n541p076R248
$$ -124 -2604 -243 9661 7333 -878 153 -626 -6955 -2260 4699 1119 138 6145 604 -6472 2776
682B776N936q455m426J443k761L683J0253k370p562M308K55j0936o18Q522J556
$$ 2776 8712 257 -4169 -2726 -5487 -1804 8449 6079 -1483 2825 3080 -7856 -8474 48 1604
697A604J898N096o813q842M895L798n483L359O390o992n394P046K163l155L655
$$ 1604 3502 8598 1785 -7057 -2162 1636 -3847 -488 5902 -1090 -6484 562 2725 -430 3225
712C225q48q763Q69O787m179l42R760J50q735j532K16m510N988Q909n849m307
$$ 3225 2377 -6386 -5517 1270 -2909 -3251 6509 6659 -2076 -3608 -3392 -7902 -1914 6995 1146 -3161
728c161N257k651p819N520P109m605j590K464m901j286Q759K70o635L160J647
$$ -3161 2096 -555 -8374 -2854 4255 -350 -1940 524 -4377 -5663 3096 3366 -3269 -109 1538
743A538p788nQ353o8j524L548n815p736O150O182n025J041P152m940o897L177
$$ 1538 -6250 -6255 2098 2030 506 4054 -1761 -9497 -3347 2835 -2190 -1149 6003 1063 -5834 -2657
759b657J300k664O499K791p884j008N740l014l423O751J124p312O14K988k917
$$ -2657 -1357 -4021 2478 5269 -2615 -3623 2117 -897 -4320 2431 3555 -3757 -3143 -155 -3072
774c072L970O755o293o739N012K37o117M011Q234k764j723J483o234l555P409
$$ -3072 898 7653 1360 -5379 -367 -130 -6247 -2236 5998 3234 1511 2994 -3240 -6795 614
789F14K020n735K985N003n816k199N787j086l336L721k361o641N297P422l353
$$ 614 2634 -3101 -116 4887 -929 -3128 2659 1573 -1763 1958 -403 -7044 -1747 5675 2322
804B322q05M599o345q075L956L919j424M931M099p509k940N466k845m994M892
$$ 2322 1517 6116 -229 -8304 -4348 -429 -1853 3078 7177 -332 -3272 2194 -651 -5645 -753
819g53L145m717K190K721m799J551P614m562r443K601K512k361N407O540n464
$$ -753 2392 -2325 -135 2586 -2213 -662 6952 2390 -7053 -4452 -1940 -4301 1106 7646 2182
834B182l511K892m613n559N785M823l267K665L718o479l084N190n94l100L120
$$ 2182 -1329 1563 -3050 -8609 -2824 1999 -1268 1397 5115 -1364 -4448 742 148 -2952 168
849A68o68p061M728R962l316m845J976l313m951L634K581k364N957O771p203p390
$$ 168 -500 -7561 -2833 7129 3813 -1032 944 -2369 -7320 -3686 -1105 -3469 2488 9259 2056 -5334
865e334K274l50j642P103K143p006L14M840k949j006N254l211p090L926L355m215
$$ -5334 -3060 -3410 -5052 2051 4194 -2812 -2498 2342 -607 -1613 3641 430 -6660 -2734 621 -3594
881c594K641O854j788m149O84n133n127Q011P544l653q88K222n698l115O308K63
$$ -3594 -953 5901 4113 -36 648 -4485 -9612 -1601 5943 2290 1402 3624 -2074 -5189 1119 1382
897A382m804L730K895n117K39N214k650j869N223l205p872L263N304j162K380
$$ 1382 -3422 308 3203 -1914 -1675 3539 889 -980 4243 1038 -6834 -3571 1733 571 2951
912B951M321o371o411L505J073k029N749L588o220k321M204k869l091O134J567
$$ 2951 7272 901 -5510 -2005 -932 -2961 2788 6376 156 -2165 2039 -830 -3921 2213 3780
927C780m803J559R95n107K263P377k195n948J563n50l830N397N465l912j552J786
$$ 3780 -1023 536 1531 -3576 -1313 6064 3869 -2079 -516 -1066 -4896 501 5966 2054 502 2288
943B288m207l440O069K098l436L679K427o597l869M900P20r39M959j362p274K248
$$ 2288 -1919 -5359 710 2808 -628 3051 5478 -1119 -4988 -88 632 -307 4652 3290 -3984 -1736
959a736N100l035k37L820m130m296M945J952l729L610L545n408l809K571j938
$$ -1736 3364 329 92 3912 -218 -4514 431 2383 -1346 2264 5809 401 -3408 -837 -2775
974b775j024Q024L231o759j722K066m174n5O380j160m049L965P81m875K550L636
$$ -2775 -3799 4225 7456 697 -1025 1041 -3133 -3188 3192 2032 -2017 1948 2729 -2146 404 4040
990D040l910k154L897k928m316O421M755k856l69q9o892j637O603J365k617M514
$$ 4040 130 -2024 1873 -1055 -5371 1050 5805 2949 2580 2491 -4401 -6038 565 1930 -687 3827
1006C827J352o399q05L296k902j094N671j559m077L925K347l868J831L707o354
$$ 3827 5179 -1220 -2025 1271 -1631 -2725 2946 1387 -2690 1235 3582 -286 1545 5252 -1102
1021a102n029M311J556K3N297J429o376j627K188m528j326P246J898l719J615
$$ -1102 -6131 -1820 -264 -241 5056 6485 109 -1518 670 -3858 -5184 2062 3960 241 1856
1036A856N39m749J081M758l807k763L875r22l428N315M522m596j847J141m942
$$ 1856 2395 -2354 -1273 3485 -322 -3085 790 -132 -3560 1755 6277 1681 -166 975 -3967
1051c967k440O060K880j632L212R37p437j942M192j546m21N104n62n231K245L470
$$ -3967 -6407 -347 2533 901 4113 5050 -2387 -4329 -137 -1683 -2104 3000 2438 -2793 -548 2922
1067B922l581OL501m124m401M407J886j625M736K520o668l388K412k317l34O704
$$ 2922 -659 -653 2848 -1276 -5677 -1270 616 -1009 3727 6247 -421 -3809 -1397 -3714 -4048 2656
1083B656K043m310O93K83n015J47O658k213l214L009J80l867L345L865m052j162
$$ 2656 4699 389 1082 1365 -3650 -3503 3155 942 -2272 737 917 -2950 395 4260 208 -954
1099i54K348m092l255O163L585k677J854M76o580j848M748Q90p56M230n95o387
$$ -954 1394 -2698 -5953 210 3795 1118 2972 3448 -3132 -4980 -232 658 -98 4132 3537 -2850
1115b850J424L507l415j10M899k091m290K872R84k777L990L292n887k949L269
$$ -2850 -1426 2081 -1334 -1444 3455 1364 -2926 -54 930 -1847 2143 5435 -452 -3401 -132
1130a32n62j484N768J493n140o04J185m209K39O638K3l417K189p95n421J891N069
$$ -132 -694 -2178 3590 5083 -57 -661 524 -3685 -3446 3192 3215 -202 1987 1192 -4229 -2338 2731
1147B731j932j207L044k883l449M488K773m448P22K201m854j423N098O73j737
$$ 2731 799 -408 2636 -247 -3696 792 3565 -883 -161 2040 -2814 -4237 861 1534 -203
1162b03L311j11o812r05M678j578Q51N638j925n464J807N16l699K327M566l673
$$ -203 3108 2997 -3815 -4720 -42 -1620 -769 4869 2944 -2520 -713 -197 -3896 -1569 2997 -676
1178f76k081L773k74k973L432J570n596l26K645k242l50O717P76m893J30n14m334
$$ -676 -2757 1016 742 -2231 1201 2771 -2825 -3151 -506 -2748 -3098 3619 4395 -498 -368 -882 -5216
1195e216J663M952p39j190L697j813n416K811K327l860Q45L247k767r48M340L41
$$ -5216 -3553 1399 660 -530 3167 1354 -4062 -1251 1076 -2784 -1939 1308 -1459 -2407 1933 2274
1211B274k944J514R56o278m63N274M0o1M035j468n969J016J689l440J985N708
$$ 2274 -670 844 1800 -4478 -4941 333 373 312 4347 2879 -3090 -2074 -385 -3825 -1840 3868
1227C868k184l113L036l19l297K769J854n049l00M460j536j643N295R54n182m56
$$ 3868 1684 -1429 1607 1288 -2009 760 2614 -2435 -2735 1725 189 -1454 3841 4795 -387 -843
1243h43N7l392J873O186j024k147K782j370n832K222L565k632L51K905k433j890
$$ -843 -786 -4178 -2305 3881 2857 710 3492 2122 -3710 -1488 2077 -555 -204 2701 268 -1622
1259a622M044O47m278J550K245m722j582M845J234j228L510k172n697J095L146
$$ -1622 2422 3069 -1209 341 2586 -2136 -3718 1127 2361 1133 4643 2471 -3226 -2131 1015
1274A015k400O77N021j428m162J766L35l402K851K449l526j267L480j373k291
$$ 1015 -1385 -708 4313 2885 -1277 489 824 -2578 273 2722 -804 -2071 1409 36 -2255
1289b255M595J552m464j132J080k447J495N556j034l992J917k51m131P89M164
$$ -2255 2340 3892 -572 -1704 -624 -3071 -1576 3980 2946 -1046 871 620 -3511 -2722 1442
1304A442j334j42K843k596m870L624K695k544J057K269m286j829L885K21j543
$$ 1442 108 -34 2809 213 -4657 -1033 1662 -882 175 2444 -1842 -3671 214 435 -1108
1319a108L386n60n930J097M102j740j137L749m51l388R19o97k521L991M821l793
$$ -1108 2278 1718 -4212 -3115 987 -753 -1890 1859 1408 -1980 -1061 -1758 -4279 -288 4533 740
1335G40m000K856r2k656L069K077k977j4K306l414o00M964m42m006J379J473l672
$$ 740 -3260 -404 -496 -3152 -83 1994 -983 -997 1309 -2105 -2705 2259 1817 -2189 -810 663 -3009
1352c009P72M101k82o00J864m031m656L850M714k266J85K066k111k514K000j128
$$ -3009 -2237 1864 1582 982 2846 -1185 -5841 -1991 2723 457 642 2708 597 -1917 83 -1045
1368a045j528L868K044m916l66M092j329j642L063m23m214M69J711j104L137L802
$$ -1045 -2573 1295 3339 -1577 -1943 2149 820 -822 2241 1818 -2396 -1927 -216 -1320 1817 5619
1384E619l778m280J974O9k527K610K679j882Q24K566m263k983L874J507l008R43
$$ 5619 1841 -2439 -465 -396 -2923 -313 2366 484 1308 3874 -389 -3372 502 2009 -999 -56
1400e6J597k828P83M376j613l121J883j634l518L289L900k078K16K684l205l548
$$ -56 1541 -1287 -504 3872 2259 -862 1021 -613 -4131 -842 3058 980 1196 3880 675 -2873
1416b873K023M28k247M079K827l813k294L167n53j435K181j192l695K552K738
$$ -2873 -850 -422 -2669 1410 4237 424 -1870 1297 744 -691 1490 298 -3397 -845 1893
1431A893k190N7L808j790m060J319n99j666L336L551k761q76J946l160k893M066
$$ 1893 -297 -240 3568 1778 -2282 -963 -1562 -3228 108 3659 898 22 1968 -1192 -4085 -19
1447a9K132l305M06J650j768K56L353k228l115K671Q35m263J419L855o57p37J946
$$ -19 2113 -1192 -786 864 -904 -648 2705 477 -2638 33 868 -3395 -1976 1879 1222 485 2431
1464B431l381k849K737J574j740K144K472m268k143L685m6k347K646P88l404O71
$$ 2431 -950 -3799 -1062 512 -1228 916 3388 -880 -3023 662 616 -1731 915 1703 -1701 -1030
1480a030K080j870p6L981j533l707R06Q86j626K521L591l652k026J991r63k500
$$ -1030 1050 -820 -896 3085 1552 -2155 -1249 -363 -1989 532 4123 471 -1555 436 -527 -3027
1496c027L411K228l135K56J910k881j691M138M89j790J378l87l447Q81L904j314
$$ -3027 384 2612 -523 -267 1643 -1238 -2929 1209 1698 -92 1286 899 -2548 -1667 2237 923
1512I23j010J815j567l815L158K950k405L39K048l293k091K769K40r34L383J148
$$ 923 -87 1728 161 -3654 -496 2454 49 388 2436 -857 -2948 -179 61 -873 2510 3658
1528C658m733j360K458j038k62L816l90l773J376R73k511J083L736k607k544K319
$$ 3658 -1075 -2435 23 -1015 -1277 2539 2149 -1624 -248 725 -1786 -703 3033 426 -2118 201
1544B01j15k199K369L094k620j033Q31l363j015N409J150k557J224M65l865o23
$$ 201 86 -2113 256 3350 730 -303 528 -2835 -3850 1559 2709 152 1376 1841 -2024 -2647
1560b647L399n15j404K514j58l320K005J992k045o38K421k602k602L070J590j094
$$ -2647 752 237 -1167 1347 1189 -2131 -126 1866 -179 -817 1604 -998 -3600 -530 1060 -34
1576c4K286J082m625j671K491j047n29M341Q50l464K18R98k762N9L304j341j799
$$ -34 2252 3334 -1291 -2962 -471 -1518 -2047 2294 3144 -320 -102 896 -1866 -1807 1497 156 -1643
1593a643J924L51k142K395K624l527j980J691j585j308M154J951k509N70R90m225
$$ -1643 281 632 -1510 885 3509 -18 -1998 -307 -1892 -3200 954 2905 396 966 1956 -2269
1609b269j116L475P9j359K972K83l381O87K087k468k2J996j741k130K958K071
$$ -2269 -3385 90 169 -1190 1782 2065 -1316 -629 1458 -1010 -1032 964 -777 -2907 51 2122
1625B122k295P50K120l606k351K446Q8o68L404P70l380m30J680k514r4L305n00
$$ 2122 -173 577 2697 -909 -3260 -814 -726 -1394 2010 2780 -600 -1030 650 -1864 -1958 1347 847
1642H47k647J818J108k820J822K244k842j846K739j325j889L355K272k652m51
$$ 847 -1800 18 1126 -1694 128 2372 -470 -2316 423 -902 -2791 564 2836 184 -267
1657b67Q82k726r07L910L58k018K209k01l316N48K665j501r07K675j036k946K042
$$ -267 615 -2111 -3018 892 1250 -768 1441 1240 -2076 -1528 1137 -364 -1271 1404 368 -2578 -536
1674e36J805k007R80J831l267j803L150L60j700K552P47l080j106K235r33n9K865
$$ -536 1269 -738 242 2073 -1194 -2997 153 513 -1187 1365 2112 -968 -2074 161 -772 -831 2034
1691B034j40l217J301O85k638R72L695j624j875J484o02k049K347J950k877J67
$$ 2034 1894 -1323 -22 663 -1975 -1003 2692 1068 -807 677 75 -1974 373 2323 -554 -387
1707c87J377k150r94L758P23k329L80K58k601K84L761j382n11K321j239l856J099
$$ -387 990 -1160 -2154 1604 2327 -2 378 636 -1965 -1681 2080 698 187 2508 1269 -2587 -1488
1724a488K533j240M32K220k121j607J907K52j965J668J536l477o12K733k51j105
$$ -1488 1045 -195 237 2457 336 -1271 636 888 -1077 591 2127 -1350 -1962 771 520 -585
1740e85K918k07l285J36R59k065J252L824m47k909Q45o3k232J252J665j492N16
$$ -585 2333 2126 -1159 -1023 -64 -2129 -877 2947 2500 -409 436 373 -1859 -607 1058 -434 82
1757H2J495j624j762L157N71k510J77J046k711L62L310J23j339J863j083l818
$$ 82 1577 -47 -1809 1348 1919 -591 -414 632 -2079 -1717 1593 1716 377 2240 1157 -2661
1773b661P06J818l15N48K578j227k539J318L30k516J410K269k121j046K060J19
$$ -2661 -1955 -137 -452 96 2674 1447 -1092 226 556 -1960 -550 1719 -402 -1448 612 731
1789G31j081J932J23l371q6J735j514M31L670j6k572L87o63k209J294K700j399
$$ 731 -350 1582 1705 -1666 -1752 -17 -1531 -1100 2570 2554 -18 369 -294 -2503 -1209 1491 92
1806I2k87K257j216k640J756J549k189k07J467k017K24L359o14k051J700P8l792
$$ 92 -195 2062 846 -1794 -38 1511 -678 -885 582 -1435 -1211 2148 1534 -517 1183 1261 -2531
1823b531K11K587K59k3K131j421k566J601J76k097J015K881j333j984J844L47
$$ -2531 -2320 267 526 503 2634 1213 -1353 248 424 -1673 -658 2223 890 -1094 750 1097
1839A097j573J443O11k858J66K394j819l45L178J04k788r8J60j374J260K599j315
$$ 1097 -476 967 1578 -1280 -1114 1280 -539 -884 2294 2398 -390 -488 -328 -1702 -442 2157 842
1856H42j138J730n62k677J105J924j310K81R52j596j087K890Q1k126Q84Q10k001
$$ 842 -296 1434 872 -1805 -700 1224 -86 195 1147 -449 -1536 1354 1435 -691 193 1003 -998
1873i98m57K564n33n67J753r57l122J393K128j879J37K387q07k193Q39J15j203
$$ -998 -1455 1109 576 9 1762 805 -2317 -924 1204 -675 -538 1849 1042 -1151 -312 -197 -1400
1890a400K139J236k577p86J961o65j430K121L82j890M11O14j532J049K586j289
$$ -1400 739 1975 -602 -1388 573 -92 -1522 599 981 -909 -498 116 -1416 -367 2219 930
1906I30k777J495J82j954Q85K494p64j45R00k694j259K536J378j642Q9J339j564
$$ 930 -1847 -352 -170 -2124 -1239 1255 491 346 1246 -1448 -2707 -171 1207 -435 -346 993 -571
1923e71l71J663r72j102K332n69k865J030K709p70m42J338j370j777Q73L54j148
$$ -571 -942 721 -251 -1353 979 410 -2455 -1425 1284 514 72 1410 40 -1737 -864 -510 -1658
1940a658K213K794k686k428J845k47j156J351O00j279J123R38k544j2L348o25
$$ -1658 555 3349 663 -1765 80 -167 -1323 28 628 -651 472 1410 -1134 -1146 2202 1577
1956A577k657J8Q89r91J305J975j546J47Q48k041k795K183K645q19J23Q01j818
$$ 1577 -1080 -1062 -173 -1164 141 2116 570 717 1565 -476 -3271 -1088 1557 738 861 1662 -156
1973a56j74J207r45j228K251R38l162k27K923jk44J62j818j167J119P18j602J835
$$ -156 -330 877 -68 -1296 955 1893 -1269 -1496 1427 1426 1182 1344 -474 -1641 -522 196 -1406 429
1991D29K910j575k986P93j20o39J837P76j746M63K030k418j262K653N25k576l4
$$ 429 3339 1764 -1222 -429 -549 -1188 649 1425 -321 142 2172 -246 -1508 1145 1670 -906 -940
2008i40N65j001K020J699j989j330K248j029l077J010K855QRK72k551k58K021
$$ -940 -375 -1376 644 2343 354 -976 1272 243 -2834 -1824 1031 1039 1048 1320 -1231 -1489 532
2025E32n23j787J664J784j863j146J297k3j34J087j125k284J982J922k481M3K922
$$ 532 9 -1778 -114 1670 -193 -1339 -42 -65 -199 888 -237 -2521 -539 1383 -1098 -1055 1867
2042A867p80k364l72J29M87K078K06k687L69K116j340k051J745J384q79J78o27
$$ 1867 1087 -1277 -1649 -1520 -1033 1045 1251 -1436 -1067 1049 -291 -2342 -597 787 -92 86 -541
2059e41j490J746K376j820k172J595J253k132j1J849j73L13m02k154p19K983P52
$$ -541 -2031 -285 2091 271 -1901 -306 947 -1185 -1196 653 480 793 391 -1763 -2482 501 1253
2076A253k352O39J622j143j736O45Q4N76K132j238k840J475K390j103j518J338
$$ 1253 -1099 -460 1162 19 -1717 -1072 -988 -412 1720 482 -2358 -883 1507 404 -1114 224
2092B24j99q96O38l48n29K254J190k879j672J898K98r10N89J406m13k89M6l120
$$ 224 25 -871 -233 -581 -1110 1144 2334 -545 -2217 -319 -21 -931 -342 1064 651 362 408 -2712
2110b712J149L154l20k749R07J497j087J13L09n60J41J376k492j272K472K258
$$ -2712 -1563 1591 1271 -1478 -571 926 -161 -48 261 -299 -158 1218 -1274 -2546 -74 2184
2126B184j379j335Q30j140k63Q74p28K46L077k16l440l07K336l98j253O74o7k15
$$ 2184 805 -530 300 -840 -1103 -229 -957 -711 2366 2150 -1290 -1597 739 341 -912 -238 -305 -520
2144e20J363l02j601J245K217k105k655R67J109N94Q68l22r17O03J35k616q75
$$ -520 843 541 -1060 185 2402 297 -2358 -1391 -282 312 1180 858 -59 544 679 -1937 -2812
2161b812L547J311k172j45M48m38L25O12j687L13J841o12k582J668K152m86p75
$$ -2812 735 2046 -126 -271 177 -261 64 676 -1011 -698 1143 531 -2051 -383 1769 1283 508
2178E08o70j305J46J629n88p27K176J578l136j331R75J042l49R56p61j058J564
$$ 508 -162 -1467 -1321 308 -280 -1007 1169 2747 -389 -1720 -745 297 -52 904 143 -915 649
2195F49O57j991l50K371n80j755K97M06L72J332L01k476P7J687j505j795J771
$$ 649 1306 -685 -1035 1336 756 -999 -702 -296 76 1408 1709 -767 -690 997 -508 -2303 -532
2212e32K323q12l77q42r88J095J501j466j503K178P66j932l07J406M36k44r8j995
$$ -532 1791 979 602 -240 -1228 -133 1368 -98 -1601 577 1343 -589 -896 510 946 702 604 -1391
2230a391j74K535K39j995Q64J632j072j669M24k8R58J468j203k052J358J593j728
$$ -1391 -1565 970 1209 -786 78 1710 638 -1031 -607 -635 323 1791 588 -1464 -106 1487 -241
2247b41j127J878R27j065n54l48m57K165K70k243q25K396k8j497Q33N21j00L85
$$ -241 -1368 510 1437 372 -182 -530 -987 1178 1448 -795 -1620 776 748 -749 84 605 505 890
2265H90o96k000Q29L078q56k219Q09J286j448o66J205l79P89J211j939j486J787
$$ 890 194 -1806 -977 2101 1245 -974 -165 1121 -327 -993 212 -167 622 1833 -106 -1592 195
2282A95J565j913q41J425r0l99P16o98j31K301p64k740k19K155mo53R36j40N6
$$ 195 1760 -153 -994 431 341 -58 658 -40 -171 2130 1366 -1374 -1593 562 558 -95 841 701 757
2301G57n9l96k076J685K325j687j620J068J155r44J86j73p70O69Q98k265j74K945
$$ 757 698 302 -1774 -89 2236 549 -1071 -3 1152 208 394 221 -549 120 1018 -1247 -1421 1524
2319A524Q50k248n14L11n19N67N75r56M54K206j192k957R95K152r28p45K0p2O40
$$ 1524 2374 126 -388 -77 -596 -29 546 -410 44 2250 1058 -1899 -904 1248 320 -425 -405 -477 163
2338A63J069j320j062K129P86k865j136K188O04p8Q73j051j001R58j69j996Q60
$$ 163 1232 -88 -1150 979 1765 -1100 -2236 -48 556 478 1351 300 -701 257 88 -1908 -1048
2355a048K800r1k306J82O26q6K62l77j517J044J778j388j669K098J585j443q96
$$ -1048 1752 1661 -645 -463 163 77 339 -38 -1555 -511 1267 -121 -1790 308 1893 450 -446
2372d46m71l95P78J526j167j60J729o0k844l3J304L78o0j2p77k19K007j94k396
$$ -446 -917 -1312 -534 992 -175 -335 1394 1334 -1510 -1543 -239 139 79 67 -710 -929 1078 884 -1512
2391a512Q69J676j353j131O81P38N48Q97j130j832J163J093k051j25K443K71j314
$$ -1512 -643 1033 -320 -1451 -770 -32 516 1413 283 -1549 -386 707 -1344 -1469 974 1245 -69
2408f9L1m34l31R44Q26j622m28J996r1j856O80J257j98p59j99j272P35K337p57
$$ -69 -38 -472 -803 141 967 -655 -1083 913 822 -1034 -354 903 705 -54 -253 -1525 -790 1547 790
2427G90j642J226R27j543n43O47L43O41M13j297j093J376J155k038J2J879k26
$$ 790 -852 374 1301 -242 -785 -138 205 846 1259 -38 -1131 245 1400 -638 -626 1253 1027
2444A027j097m54K21L55J508n63k035N96J472m17r86R28K43m76k04m53p47J561
$$ 1027 -70 -524 -303 52 1560 997 -1038 -442 1030 613 -373 555 798 322 118 -335 -1082 479
2462D79J573j642j493J502L32j268J65Q15l56O48K89j626o57K573k45j936M09
$$ 479 2052 410 -1083 419 751 -517 -352 463 107 755 1044 -582 -1239 1334 1089 -847 -438
2479d38R11k83m23N61r10P72R73j084j967Q35K321r27n68P88j40n14J58p39n26
$$ -438 473 190 -233 328 -582 190 1163 79 -1888 -1053 1268 341 -227 561 421 -93 65 -674 -1200
2498a200J832P82j990m05J147L64r56N09m44m72J197l23p64O25J851r04k099L14
$$ -1200 632 1414 -576 -981 166 530 -426 83 -361 -833 364 41 -723 -98 1753 849 -1250 -936
$$ [...]
8191f6
##END NTUPLES=NMR FID
##END=
