##TITLE=1H_T-3942
 aceton, 8 sc, 
 19.12.2019
##JCAMPDX= 6.0         $$ Bruker NMR JCAMP-DX V2.0
##DATA TYPE= NMR FID
##DATA CLASS= NTUPLES
##ORIGIN= UXNMR, Bruker Analytische Messtechnik GmbH
##OWNER= root
$$ XWIN-NMR		Version 3.5
$$ Thu Dec 19 15:33:03 2019 Russian Standard Time (UT+4h)  she@DPX200
##.OBSERVE FREQUENCY= 200.1315
##.OBSERVE NUCLEUS= ^1H
##.DELAY= (6, 6)
##.ACQUISITION MODE= SIMULTANEOUS
##.ACQUISITION SCHEME= undefined
##.AVERAGES= 8
##.DIGITISER RES= 18
##SPECTROMETER/DATA SYSTEM= spect
##.PULSE SEQUENCE= zg30
##.SOLVENT NAME= Acetone
##.SHIFT REFERENCE= (INTERNAL, Acetone, 0, 15.7039)
##AUDIT TRAIL= $$ (NUMBER, WHEN, WHO, WHERE, WHAT)
$$ ##TITLE= Audit trail, XWIN-NMR		Version 3.5
$$ ##JCAMPDX= 5.01
$$ ##ORIGIN= Bruker BioSpin GmbH
$$ ##OWNER= she
$$ F:/spectra/data/she/nmr/H-F/1/audita.txt
$$ ##AUDIT TRAIL=  $$ (NUMBER, WHEN, WHO, WHERE, WHAT)
(   1,<2019-12-19 15:32:07.17 +0400>,<she>,<DPX200>,
      <created by zg, POWCHK disabled, PULCHK disabled
       configuration hash MD5:
       00 E9 B6 7A A2 85 ED C7 34 08 36 98 17 FE 4E 26
       data hash MD5: 16K
       31 00 B9 52 16 C6 72 97 A0 E3 06 88 E9 FC 21 08>)
$$ ##END=
$$ 
$$ hash MD5
$$ D3 84 96 C5 1F 04 EC 29 70 1E A5 D7 41 2D 84 1E
##$RELAX= 
##$RELAX= 
##$RELAX= 
##$RELAX= 
##$RELAX= 
##$RELAX= 
$$ Bruker specific parameters
$$ --------------------------
##$DU= <F:/spectra>
##$EXPNO= 1
##$NAME= <H-F>
##$PROCNO= 1
##$TYPE= <nmr>
##$USER= <she>
##$AMP= (0..31)
100 100 100 100 100 100 100 100 100 100 100 100 100 100 100 100 100 100 
100 100 100 100 100 100 100 100 100 100 100 100 100 100 
##$AQSEQ= 0
##$AQ_mod= 1
##$AUNM= <au_zg>
##$AUTOPOS= <>
##$BF1= 200.13
##$BF2= 200.13
##$BF3= 200.13
##$BF4= 200.13
##$BF5= 200.13
##$BF6= 200.13
##$BF7= 200.13
##$BF8= 200.13
##$BYTORDA= 1
##$CFDGTYP= 0
##$CFRGTYP= 5
##$CHEMSTR= <none>
##$CNST= (0..31)
1 1 145 1 1 1 1 1 1 1 1 1 1 1 1 1 1 1 1 1 1 1 1 1 1 1 1 1 1 1 1 1 
##$CPDPRG= <>
##$CPDPRG1= <>
##$CPDPRG2= <>
##$CPDPRG3= <>
##$CPDPRG4= <mlev>
##$CPDPRG5= <mlev>
##$CPDPRG6= <mlev>
##$CPDPRG7= <mlev>
##$CPDPRG8= <mlev>
##$CPDPRGB= <>
##$CPDPRGT= <>
##$D= (0..31)
0 1.2 0 0 0 0 0 0 0 0.06 0 0.03 0 0 0 0 0.0002 0 0 0 0 0 0 0 0 0 0 0 0 
0 0 0 
##$DATE= 1576755126
##$DBL= (0..7)
120 120 120 120 120 120 120 120 
##$DBP= (0..7)
150 150 150 150 150 150 150 150 
##$DBP07= 0
##$DBPNAM0= <>
##$DBPNAM1= <>
##$DBPNAM2= <>
##$DBPNAM3= <>
##$DBPNAM4= <>
##$DBPNAM5= <>
##$DBPNAM6= <>
##$DBPNAM7= <>
##$DBPOAL= (0..7)
0.5 0.5 0.5 0.5 0.5 0.5 0.5 0.5 
##$DBPOFFS= (0..7)
0 0 0 0 0 0 0 0 
##$DE= 6
##$DECBNUC= <off>
##$DECIM= 24
##$DECNUC= <off>
##$DECSTAT= 4
##$DIGMOD= 1
##$DIGTYP= 9
##$DL= (0..7)
0 120 120 120 120 120 120 120 
##$DP= (0..7)
150 150 150 150 150 150 150 150 
##$DP07= 0
##$DPNAME0= <>
##$DPNAME1= <>
##$DPNAME2= <>
##$DPNAME3= <>
##$DPNAME4= <>
##$DPNAME5= <>
##$DPNAME6= <>
##$DPNAME7= <>
##$DPOAL= (0..7)
0.5 0.5 0.5 0.5 0.5 0.5 0.5 0.5 
##$DPOFFS= (0..7)
0 0 0 0 0 0 0 0 
##$DQDMODE= 0
##$DR= 18
##$DS= 0
##$DSLIST= <SSSSSSSSSSSSSSS>
$$ [...]
##$SUBNAM2= <"">
##$SUBNAM3= <"">
##$SUBNAM4= <"">
##$SUBNAM5= <"">
##$SUBNAM6= <"">
##$SUBNAM7= <"">
##$SUBNAM8= <"">
##$SUBNAM9= <"">
##$SW= 24.9337058887773
##$SWIBOX= (0..15)
0 0 2 0 0 0 0 0 0 0 0 0 0 0 0 0 
##$SW_h= 4990.01996007984
##$TD= 16384
##$TD0= 1
##$TE= 0
##$TE2= 300
##$TE3= 300
##$TEG= 300
##$TL= (0..7)
0 120 120 120 120 120 120 120 
##$TP= (0..7)
150 150 150 150 150 150 150 150 
##$TP07= 0
##$TPNAME0= <>
##$TPNAME1= <>
##$TPNAME2= <>
##$TPNAME3= <>
##$TPNAME4= <>
##$TPNAME5= <>
##$TPNAME6= <>
##$TPNAME7= <>
##$TPOAL= (0..7)
0.5 0.5 0.5 0.5 0.5 0.5 0.5 0.5 
##$TPOFFS= (0..7)
0 0 0 0 0 0 0 0 
##$TUNHIN= 0
##$TUNHOUT= 0
##$TUNXOUT= 0
##$USERA1= <user>
##$USERA2= <user>
##$USERA3= <user>
##$USERA4= <user>
##$USERA5= <user>
##$V9= 5
##$VALIST= <valist>
##$VCLIST= <CCCCCCCCCCCCCCC>
##$VD= 0
##$VDLIST= <DDDDDDDDDDDDDDD>
##$VPLIST= <PPPPPPPPPPPPPPP>
##$VTLIST= <TTTTTTTTTTTTTTT>
##$WBST= 1024
##$WBSW= 4
##$XGAIN= (0..3)
0 0 0 0 
##$XL= 0
##$YL= 0
##$YMAX_a= 127181
##$YMIN_a= -80019
##$ZGOPTNS= <>
##$ZL1= 120
##$ZL2= 120
##$ZL3= 120
##$ZL4= 120
##$ABSF1= 10
##$ABSF2= 0
##$ABSG= 5
##$ABSL= 3
##$ALPHA= 0
##$AQORDER= 0
##$ASSFAC= 0
##$ASSFACI= 0
##$ASSFACX= 0
##$ASSWID= 0
##$AUNMP= <proc_1d>
##$AZFE= 0.1
##$AZFW= 0.1
##$BCFW= 1
##$BC_mod= 2
##$BYTORDP= 1
##$COROFFS= 0
##$CY= 11.3945322036743
##$DATMOD= 1
##$DC= 2
##$DFILT= <>
##$DTYPP= 0
##$F1P= 16.9975609425685
##$F2P= -3.02152046262296
##$FCOR= 0.5
##$FTSIZE= 0
##$FT_mod= 4
##$GAMMA= 1
##$GB= 0.15
##$INTBC= 1
##$INTSCL= 1
##$ISEN= 128
##$LB= 0.24
##$LEV0= 0
##$LPBIN= 0
##$MAXI= 10000
##$MC2= 0
##$MEAN= 0
##$ME_mod= 0
##$MI= 1.114404
##$NCOEF= 0
##$NC_proc= 0
##$NLEV= 6
##$NOISF1= 3.799351
##$NOISF2= 2.8
##$NSP= 1
##$NTH_PI= 0
##$NZP= 0
##$OFFSET= 15.70392
##$PC= 1
##$PHC0= -10154.31
##$PHC1= 20.4008
##$PH_mod= 1
##$PKNL= yes
##$PPARMOD= 0
##$PSCAL= 0
##$PSIGN= 0
##$REVERSE= no
##$SF= 200.130013532006
##$SI= 16384
##$SIGF1= 3
##$SIGF2= 2
##$SINO= 400
##$SIOLD= 16384
##$SREGLST= <1H.CDCl3>
##$SSB= 0
##$STSI= 0
##$STSR= 0
##$SW_p= 3612.71676300578
##$SYMM= 0
##$S_DEV= 0
##$TDeff= 0
##$TDoff= 0
##$TI= <>
##$TILT= no
##$TM1= 0
##$TM2= 0
##$TOPLEV= 0
##$USERP1= <user>
##$USERP2= <user>
##$USERP3= <user>
##$USERP4= <user>
##$USERP5= <user>
##$WDW= 1
##$XDIM= 8192
##$YMAX_p= 0
##$YMIN_p= 0
$$ End of Bruker specific parameters
$$ ---------------------------------
##NTUPLES= NMR FID
##VAR_NAME=  TIME,          FID/REAL,        FID/IMAG
##SYMBOL=    X,             R,               I
##VAR_TYPE=  INDEPENDENT,   DEPENDENT,       DEPENDENT
##VAR_FORM=  AFFN,          ASDF,            ASDF
##VAR_DIM=   8192,          8192,            8192
##UNITS=     SECONDS,       ARBITRARY UNITS, ARBITRARY UNITS
##FACTOR=    0.0002004,     1,               1
##FIRST=     0,             0,               0
##LAST=      1.6414764,     0,               0
##MIN=       0,             -80019,          0
##MAX=       1.6414764,     127181,          0
$$ Real data points
##PAGE= N=1
##DATA TABLE= (X++(R..R)), XYDATA
$$ [...]
1992b73J450r28p27O14o61m10J335K14j220R39J072j771r89J054K74J3N18l63
2010A41r29Q08O83j374j19J505n75j221N23P56J80N35j00j455j08P38k81r62J587
2029C32J023r80o91N4l97J53J031o00p79J247O85j483j33J306p8q75J20r66Q8
2048i43J700L69j349k00J312j064j117O73P24K32M42l91j079N32J110j206l92
2065f47R18J54r43J67O30j60M64K18j625k52J581m25r50J055R16p40m73R2r27
2084i47J44J642k19j367N97J012q31n93O72K95n01M31m76r21J556P19j122n26
2102d35Q77k56j108J067kj08R23m23j244j29J623k42j026M80K68l50K42j44p35
2121g22J044Q18j021j179J141M72n24j74M70m28L24L92j280p6J659M35j488m49
$$ plain form
1992 -273 1177 249 -478 136 -525 -935 400 614 -606 333 1405 -366 -1355 -301 -27 -14 504 141
2010 141 -788 20 703 -671 -790 715 140 -1081 -558 198 378 913 813 -642 -750 -12 -293 -1255 332
2029 332 1355 375 -316 -262 -659 -506 525 -75 -854 393 1078 -405 -538 768 690 -185 -65 -1031 -943
2048 -943 757 1126 -223 -423 889 -175 -1292 -619 105 337 779 388 -691 -159 951 -255 -647
2065 -647 271 425 -518 -351 279 119 583 801 -824 -1076 505 80 -870 185 1101 361 -112 -20 -947
2084 -947 -803 839 620 -747 -150 862 31 -562 110 405 -96 335 -141 -1062 494 1213 91 -435
2102 -435 442 186 -922 145 143 35 958 535 -709 -838 785 543 -483 -3 265 -85 157 13 -722
2121 -722 322 1140 119 -1060 81 553 29 -145 325 -103 221 613 -667 -743 916 1351 -137 -586
2139e86J093m50k40M45o6j12M96k90j311O41J656m37j221K50m7K58K63lp29R70
2159E80L29j600k76J281O49p80L39j97q44J007j17j242M63J806o85j500L21Q36
2177C70k24j9P9n69L63O30m66r87J202L97j064n11N22r2L23R68p46n12J040p7
2197F27j677J40J366J16n41J61o0l07Q70j72j427P54Q70p18r10P79Q75l43K38
2216F41n63p50L25P93p11k10J220M03j471l69M22k45M30P11q40l86J525o9j324
2235d68J67Q23k78p67R9j27N72J266m08j443O46M67r97m27Q82L47J99N0p17o11
2255g25J118L65j410k10J252j29n24N7J50K05L65n38j031K57J202j76n59J104
2273G73Mq40l63K73o57Q75R26r05j085J233K77r07J99M70n00j57N20q88K69J368
$$ plain form
2139 -586 507 57 -183 262 196 84 580 290 -1021 -380 1276 839 -382 -132 -179 79 342 339 -390 580
2159 580 909 -691 -967 314 963 183 522 325 -519 488 371 -871 -408 1398 713 -787 -466 370
2177 370 146 127 206 -363 0 630 164 -823 379 776 -288 -799 -277 -369 -46 922 176 -336 704 627
2197 627 -1050 -910 456 572 31 192 132 -175 695 523 -904 -150 720 2 -908 -129 746 403 641
2216 641 78 -672 -347 446 -265 -475 745 1148 -323 -692 -270 -515 -85 626 -214 -600 925 856 -468
2235 -468 -301 522 244 -523 -424 -551 21 1287 879 -564 82 549 -448 -875 7 354 553 603 -114 -725
2255 -725 393 758 -652 -862 390 261 -263 -206 -56 149 514 -24 -1055 -798 404 228 -331 773
2273 773 777 -63 -426 -153 -810 65 991 86 -999 234 511 -396 -197 273 -227 -384 136 -752 -483 885
2293H85k15j101m07J056k72m73P73j02n24R71p73j042Q98R71m91q74O59j26l41
2312e28L64lp2M37L84j092n50J381L68q87NM80o40M03p1p84Q13J186o82j300M68
2333c20P21l74R7K45m21l3Q79j245n38J201N55j119k10L29M33q6K72m68l89J093
2353F22k46j281J84J429p0p15N7k31j99N28m14l78O01J062r58r31J024r0j4k0
2373d0k11k24O22J27l50k94Q93O0j025m26N82M08L29K03j207J67R25n85j140J003
2393a83R00m90k94J32o27O29L01k14p99O49L63q94j73P69O96n86r3l73o62J196
2413B47K43j039J78J074k77j004J78N9J58M26J21j073O32J099q84p43Q08K58r97
2432e36J63K08J81N44L84j196p09J123K32j047J46Q97j33j01J45n58n11J172J24
$$ plain form
2293 885 670 -431 -838 218 -54 -527 246 144 -380 591 -182 -1224 -326 645 154 -720 -61 -187 -528
2312 -528 -164 -167 -239 198 582 -510 -1060 321 689 -198 -193 287 -353 50 -21 -805 8 1194 512 -788 -320
2333 -320 401 27 124 369 -52 -85 794 -451 -989 212 767 -352 -562 -233 200 114 386 -82 -471 622
2353 622 376 -905 -721 708 638 -77 -20 -251 -450 78 -336 -714 -113 949 -9 -940 84 -6 -20 -40
2373 -40 -251 -475 147 274 -76 -370 523 583 -442 -868 -286 122 451 654 -553 -386 539 -46 -1186 -183
2393 -183 717 227 -67 65 -562 67 368 154 -645 4 367 -527 -700 69 765 179 86 -287 -949 247
2413 247 490 -549 -371 703 426 -578 -400 -341 -183 243 364 -709 -77 1022 138 -605 203 461 -536
2432 -536 -373 -165 16 560 944 -252 -961 162 394 -653 -507 390 257 156 301 -257 -768 404 528
2451E28j177J80J016k82n00L82j62K68J11q48m19P24R80j048j55N25J75o05o3
2470c70K53j59O93K32j210L0P75Q1o80J3N79k14j49M76n57M10N50m16r10L84O92
2491E03p70l9M93o2k48K22p09k88J227N17j391M8R60l83m70M18r1l73O31M27j147
2512e25J51Q34k94n82L49J83o25M62J23l43Q5Q88j292r0K78N44l75K20K34n27
2532c02M21K87q55j37R76M9q58L85L65l53N8nk76k32P21l66n57N12P81n29j86
2553a01J43n40R7Q05l03l88P19J37j210N03N27k54j50J47q8l46O12K65n41rN84
2574F09n06j105P98L61m5P01o14k31k54O90o45l31P79O29j040L34Q7k16L93L32
2594G26r10j84Q58l9o50K86Q19n45j21Q7q95K22L92K83l48K09M97o29p76R63k0
$$ plain form
2451 528 -649 -469 547 265 -235 147 -15 253 364 -484 -903 -179 801 -247 -402 123 298 -307 -370
2470 -370 -117 -276 417 649 -561 -531 244 325 -355 -342 237 23 -126 350 -207 203 753 337 -573 -189 503
2491 503 -267 -306 187 125 -123 99 -610 -898 329 846 -545 -497 463 80 -390 28 -63 -436 195 622 -525
2512 -525 -374 460 166 -416 -67 116 -509 -47 76 -267 -182 706 -586 -676 -398 146 -229 -9 225 -302
2532 -302 119 406 -449 -586 390 439 -419 -34 331 -22 36 31 -245 -477 244 -122 -679 -167 614 85 -101
2553 -101 42 -498 -401 404 101 -287 432 569 -641 -138 389 135 -15 132 44 -302 310 575 34 25 609
2574 609 103 -1002 -204 157 112 813 199 -32 -286 404 -241 -572 207 836 -204 130 217 1 394 726
2594 726 -184 -368 490 451 -199 87 906 361 240 327 -568 -346 46 329 -19 190 687 58 -718 245 225
2615B25m06M44o8k65J75N69j002K21N45m60l84M37pR7N90j80j070L8Q13l78m50
2636e16O43N56m82N4k17k00J4P86m61o07K67L38j05m11P19k79k68L05j91m71Q37
2657C11j16n23K74N76o86l99N25J06J9N40l69p81L35M15l97j3M34l22l56K94N8
2678g5k80N82K77p77j20O65qo27N92J58m95l2m9j66K04O91j19q43Q18r6m49K96
2700A47K31m35J94K73n51l68O92L13p66K10J00m39J61K88o3q4M68L8j062J18Q75
2721C40N6p01N70j17p66P79N4n48L87K08o0o23N79qk27K10R5o48L19R6j25J25
2743eN76j4l15l61M3j41K66L92m87K2K47j16m47J82O04l47m79M89o9l9J60K3j55
2766B9lP5m05l1M44K60n18M68k12l62P0M00l86k03R17n31j85n5L64j07l6L79q30
$$ plain form
2615 225 -181 263 195 -70 105 674 -328 -107 438 -22 -406 31 24 121 711 531 -539 -501 312 -66 -516
2636 -516 127 683 201 255 38 -162 -148 638 177 -430 -163 175 70 -341 378 99 -169 136 -55 -526 311
2657 311 195 -328 -54 522 -164 -563 -38 68 87 627 258 -523 -188 227 -170 -183 251 -71 -427 -133 -75
2678 -75 -355 227 504 -273 -393 272 264 -363 229 387 -108 -140 -189 -355 -151 540 421 -422 396 300 -149 147
2700 147 378 -57 137 410 -141 -509 183 496 -270 -60 40 -399 -238 50 -13 -97 371 409 -653 -535 340
2721 340 396 -305 265 148 -618 161 215 -333 54 262 202 -421 158 150 -77 133 228 -420 -101 -5 -130 -5
2743 -5 571 557 242 -119 -76 -217 49 441 -46 -24 223 107 -340 -158 446 99 -380 109 40 1 161 184 29
2766 29 26 101 -304 -335 109 369 -149 319 107 -255 -185 215 -171 -374 543 12 -173 -228 136 29 -7 372 -458
2789d58M1P19j87m78O22K03p33J34J83o20L81J059o21l28Q3K28p28K33M69j34
2809F8q5L18m39j94O84J06p48K84K14m40l09N87M58m38J66p1p57J93P01m93K77
2830H2K88j96l49k2K35N5j0J78m27l29O03k07l05N45K00n55J16K4r9Q3J24Q4n12
2853c94K87K68l82J2M78n50J52L02j25m24M36n4l28L60r5L24p16M52J52k03K23
2874A75l69J31j88O31k24m39N82m44p3J95P7l16K09N63k30o30M81q7l35L81j03
2895a3L39l24P0k16K16L4J10m98L68m3n15L89O42o10m9N21o20m77O35L40j08j69
2917B2J18k17k95L24K45l97K70M33n40k43N65Q6o00M19k64m10L52N09n25L07K65
2938D24l88l96N11k49p9J59M30m57pK45j71k63L65M2m20K4N45o37K17L70j36o27
$$ plain form
2789 -458 -417 302 115 -363 259 462 -271 -137 46 -574 -193 866 245 -83 0 228 -500 -267 202 68
2809 68 -17 301 -138 -332 352 458 -290 -6 208 -232 -541 46 504 66 232 161 -596 -403 298 -195 82
2830 82 370 174 -175 -197 38 93 83 261 -166 -495 108 -99 -404 141 341 -214 -98 -74 -173 -90 34 118 -394
2853 -394 -107 161 -221 -209 269 -281 -129 173 48 -376 60 6 -322 38 -57 267 -449 3 155 -48 175
2874 175 -194 -63 -251 380 156 -283 299 -145 -218 -23 54 -262 -53 510 280 -350 131 44 -291 90 -13
2895 -13 326 2 72 -144 72 106 216 -282 86 43 -472 -83 559 -51 -100 421 -199 -676 -41 299 191 22
2917 22 140 -77 -372 -48 197 -200 70 503 -37 -280 285 371 -229 190 -74 -484 -132 377 -148 159 424
2938 424 36 -360 151 -98 -177 -18 412 -45 -52 193 22 -241 124 166 -254 -230 315 -322 -105 265 129 -498
2960d98K97K22n64L26M29K6k85K80m32l33Q55m82o1K27N83n95l08P67m43k11P6
2981a24M68m11P8K94m14L63j70j81l61M27J40l67K85M73n15k12K75p8o67P86L05
3002C94p35K75J70n37J44J71K44l75k24N61l31m6L86l78L69K26j11o39N50K43
3022C57n59K00M59l97j80K84j38l33M73o6l90K19K73k57j39L42k84n5%L43l77
3043b25J09K49J44p36M06L6L4J8J98j79k65L39l13q5M79l6k27j9K48l69Q9K75
3065A70n2j37K84l8k37k63N66m70M56l01P4n18N77j62l1K39n6j48j84K04lk13
3087b43M26J36n03J53K22k25R7L25o00K30M8K19n44M71N36q38J70l6j3n58P43
3108B16K27n92L02L30l76n7J98j86l23M76K29n54K74J32k04k80N47o00r8N52j15
$$ plain form
2960 -498 -201 21 -543 -217 212 238 -47 233 -199 -532 323 -159 -220 7 590 -5 -313 454 11 -200 -124
2981 -124 344 -67 11 305 -109 254 84 -97 -458 -31 109 -258 27 500 -15 -227 48 -30 -697 89 394
3002 394 -341 -66 104 -433 -289 -118 126 -249 -473 88 -243 -289 97 -281 88 314 203 -436 114 357
3022 357 -202 -2 457 60 -120 164 26 -307 166 100 -290 -71 202 -55 -194 148 -136 -191 -191 152 -225
3043 -225 -116 133 277 -459 -53 -17 17 35 233 54 -211 128 -185 -270 209 173 -54 -73 175 -194 -105 170
3065 170 118 -19 265 227 -10 -273 293 -177 279 -22 52 -466 111 -51 -82 157 101 -47 -231 -27 -30 -243
3087 -243 183 319 -184 -31 191 -34 63 388 -212 18 66 285 -259 212 748 -90 80 44 31 -527 216
3108 216 443 -149 153 483 107 50 248 62 -261 215 444 -110 164 296 92 -188 359 -241 -339 213 98
3129I8j01J93N9l34j94R7K07j02M3J06j90m6J35J06j64J07o2k15K79O7n6R3K5
3152A51k74k07M34k20k57M19K95n44L32Ln71K1N27J44m08PM81m31r8L78l5l62
3174b15K02L7k67M02M3o6j6J88m71q5L44k89J57K80r8p62L74L62l19M9L33k14
3196c1l03N07O5j11j56L82l61j05L42j19k13P1L69k68k79M3J40k17J69K37k73
3217a11J84k6o3k62L78o8j70K36j18j07J19K7j36Q8L96l05j28K65P9m57J52K77
3239B50m53K66k40K54L3J30J0m35J79n3j18R3N90m73j88K90k4l54M28M1k08q0
3261f2R8j77k03M18L6m4k79J41O1p7L36l80j80N84l0m63K39o1J56q1R4M4k16q0
3285a26K27j10j33N64p73N7M53m2j68K3J67n66K56K52m38J60N65k82m33M65j82
$$ plain form
3129 98 -3 190 249 -85 -279 -182 25 -77 -34 72 -118 -164 -29 77 -87 20 -42 -257 22 89 33 126 151
3152 151 -123 -330 104 -116 -373 46 341 -203 129 132 -439 -418 109 253 -155 -148 333 -98 -196 182 147 -215
3174 -215 -13 24 -243 159 202 136 120 308 -163 -248 96 -193 -36 244 146 -616 -242 120 -199 -150 183 -31
3196 -31 -334 173 238 127 -29 353 -8 -113 229 110 -103 -32 337 69 -210 -167 -27 -244 -75 162 -111
3217 -111 73 47 -16 -278 100 32 -138 98 -20 -127 -8 19 -117 -29 367 62 -66 199 278 -179 -27 250
3239 250 -203 63 -177 77 110 240 250 -185 -6 -59 -177 -84 506 33 -155 135 111 -243 185 226 18 -62
3261 -62 36 -141 -344 74 110 66 -213 -72 -11 -88 248 -132 -312 272 242 -221 18 -43 113 32 126 170 -46 -126
3285 -126 101 -9 -142 422 -351 -294 159 117 -51 -28 139 -427 -171 81 -357 -197 368 86 -347 118 -64
3306f4k30O75l65j78K62o2O5j24J60K0n76L39L99m93N2M00j18k08K93J14o64O9
3328b34K60j00n5N92m31n36P52k42m8k22K30N9j29L42j45k77J65K72p55M64J46
3349A08k18J17L12n8l92J49J9k61L16r7K50k81K84j60j77J25P9k01k2qK03k59
3371a72N29k39k16R9L1k62L3K55M8j41N1n2k82N75k18k06J20J98L6n10K69q7r6
3394b37L61O1n55L3K22J1J6P1R3j86K2K27m13J98K73l45J06K31l1n47M62n9j94
3417a80N2J93l87J13M14L1j69k03M21l19j11K05j5j47J31J01l56m0N25k65p1Q8
3439A1M6k47K86j30k06NL82m41r5P21k41m35L21P6m54P00m8k50K6J68K91r07O41
3462B20n87P4J9P05l53j35j02j21J10K80l7j35J85j37j17j95O28j75l31O7J95
$$ plain form
3306 -64 -294 381 16 -162 100 38 103 -21 139 159 -417 -78 321 -172 -120 280 162 -46 247 361 -303 -234
3328 -234 26 -74 -129 463 32 -504 248 6 -42 -264 -34 25 -104 238 93 -184 -19 253 -502 -38 108
3349 108 -110 7 319 261 -131 18 37 -224 92 -5 245 -36 248 88 -89 36 115 -86 -108 -116 87 -172
3371 -172 357 118 -98 1 32 -230 -197 58 106 -35 16 -36 -318 257 39 -167 -47 151 187 -323 -54 -141 -237
3394 -237 124 185 -370 -337 -115 -104 -88 -17 76 -110 -88 139 -274 -76 197 -148 -42 189 158 -389 73 14 -180
3417 -180 -128 65 -322 -209 205 236 67 -136 285 -34 -145 60 45 -102 29 130 -226 -266 259 -6 -77 11
3439 11 57 -190 96 -34 -240 -235 147 -294 -389 332 91 -344 -23 53 -401 299 251 1 27 195 486 -421 220
3462 220 -367 -293 -274 431 78 -57 -159 -280 -170 110 73 -62 123 -14 -131 -326 302 127 -204 -137 58
3483E8j47k9M05l44J38mm0m11K93J19k38J76L58m43K51j98n1k67M96k55N3n7K25
3506H8j52j08L2J04j59K03K63n10M54L4l4m76J24K17l86L35J59p4m7J59j37m49
3528c60O19j74j6j28J38q3N5L32l57j87L83Mm79J01K15k33J02L74j31l65J60j84
3550b14J77j15N16l37p1J54j02j3J69l03l2L51r5l96M23Jj29O4K19k90j01J59
3572C5O7J09k22r2j59m5L42K41k58PK54n10L26J92k96j10L12j09m09M21j6nO0
3595A35J01k33j07R2j58J99p7M64m28l6oJ34m56L30L60n98jK37k39M1N64j99l77
3618b58J73j6O3K47k51l19M53K45k02k35R6J19o09K55L47k05k71N07Nj71J03k5
3640E1n5k08L83k08o6K38M43m85q9j14r7J45O4k99j8L44O7j76L52j49m1r2K01
$$ plain form
3483 58 -89 -118 287 -57 81 77 37 -374 -81 38 -200 -24 334 -109 142 -56 -107 -374 122 -133 -80 -137 88
3506 88 -64 -172 -140 -36 -195 8 271 -239 215 249 215 -261 -137 80 -306 29 188 114 67 226 89 -360
3528 -360 259 85 69 -59 79 -4 51 383 26 -161 222 226 -253 -152 63 -170 -68 306 175 -190 -30 -214
3550 -214 -37 -152 364 27 -44 110 8 -5 164 -139 -171 180 85 -311 112 113 -16 48 267 -23 -124 35
3572 35 102 211 -11 -103 -262 -307 35 276 18 25 279 -231 95 287 -9 -119 193 84 -325 96 80 75 135
3595 135 236 3 -104 -12 -170 29 -48 416 -12 -48 -54 80 -376 -46 314 -284 -285 -48 -287 -246 318 119 -258
3618 -258 -85 -101 -38 209 -42 -361 92 337 135 -100 -4 115 -494 -239 108 -97 -368 139 144 -27 76 51
3640 51 -4 -212 171 -37 -103 135 578 93 4 -110 -207 -62 2 -297 -315 29 96 -80 272 123 82 -10 191
3663A91l40M8K70j04L2o2l7J0O4j64o4QM55k63l99M13J82n47K85J50l26j01K93
3686fJ47l0p9K76n16l9K17j19j62M02o6N7j7j10O7k51K03M2n48O01J9m65K97K70
3710A90k40K57k08R9k33K22L48o67n8N37l31J03L29o93Q8M10k03K0m9K4n3j25
3732b33R0ko7J96N1j70Q8o3l6p9R6L07l72K31K49n09K96O1k46K23J94k60n82M30
3756a07J99Kn13M80l05J09L79m27n0K91K67m84K66J25j33k60L63m73J08K74j73
3777f2OpK75p7k58L88m19L23K86j66k32K3J28m21J36l7N9J7O1K80o89N76k7n3
3801A10rJ83o4l49J90k0o9j86M49m60K07O0l07J93P3K54j64k64J26J31k1j47J33
3824D9J42o5k21j43j02N88p8k22K02k12j63M53k57j83K29L5q0k86M61J72k48K39
$$ plain form
3663 191 -149 -101 169 65 97 35 -2 8 72 -92 -156 -148 307 44 -355 58 240 -307 -22 128 -198 -299 -6
3686 -6 141 111 32 308 -208 -247 -30 -149 -311 91 25 82 65 -45 22 -229 -26 16 -532 69 88 -377 -80 190
3710 190 -50 207 -1 98 -135 87 435 -232 -290 247 -84 19 348 -345 -257 153 -50 -30 -79 -55 -108 -233
3732 -233 -143 -145 -212 -16 35 -135 -47 -110 -146 -225 -129 178 -194 37 286 -223 73 134 -112 111 305 45 -537 -107
3756 -107 92 94 -419 61 -244 -135 244 -183 -233 58 325 -159 107 232 99 -161 202 -271 -163 111 -62
3777 -62 -56 -63 212 135 -123 265 -154 169 455 289 57 80 208 -213 -77 -114 -55 -38 23 303 -386 190 163 110
3801 110 101 284 220 -129 61 41 -28 -214 235 -225 -18 42 -265 -72 1 255 91 -173 -47 84 63 -84 49
3824 49 191 126 -95 -238 -340 248 170 -52 150 -62 -225 228 -29 -212 17 52 -28 -314 147 319 71 310
3846C10l23P1k75L03j12K00o2M6k38j12M16k34p9K90j93m44N59k41m1M8L51n39
3868b99N59k37J8O1L4J41m10K3K44m01J04M68m47J51J76m30K36q9K4R6q4K67k10
3891eM1P7J03kPm87K72j06J45k3K8Q3J39l03j62K77l34L44Q0L8k24K50m39J98
3915cK4K73p7m26J19n8K7K37r4l68N74J52n07j75J50K92k26q1K64k38M1J39j4
3938B5j30K06R6j99lr9j18K49l7N6l6K52j80p4K33j71M5m13L20Q4j28L2K90m48
3962a48L86J9k28j34j75L47M8j18L14j75K5J8p7k16J62j32k03L94K62p12M00q5
3984b8k84K29M76k85l97J36J13k56M47k12m5K7K19k00j15n6J68J07L06pn06N4
4006a09R6K06k80l9Mo3j08O26l54j92L96r6k00N34m23k49J9M42l68J0M71k68l1
$$ plain form
3846 310 -13 58 -217 86 -26 174 112 158 -80 -192 224 -10 -89 201 8 -436 123 -118 -159 -111 240 -299
3868 -299 260 23 41 102 136 277 -133 -110 134 -267 -163 305 -142 9 185 -245 -9 -98 -74 22 -62 205 -5
3891 -5 36 113 216 214 221 -266 6 -100 45 22 50 133 272 -31 -193 84 -250 94 174 212 -12 238 -201 -3
3915 -3 21 294 217 -209 -90 -148 -121 116 22 -346 228 380 -127 -302 -152 140 -86 -167 97 -141 -100 39 25
3938 25 -105 101 197 -2 -5 -104 -222 27 -10 46 10 262 82 8 241 70 115 -298 22 106 -22 10 300 -148
3962 -148 238 257 29 -105 -280 67 115 -3 311 136 161 179 102 -114 48 -84 -287 107 369 -343 57 -28
3984 -28 -312 -83 393 108 -289 -153 -40 -296 151 -61 -106 -79 140 -60 -175 -231 -63 44 350 343 -163 -109
4006 -109 -13 193 -87 -126 -122 -185 -293 333 -21 -213 183 87 -113 421 -2 -251 -232 210 -158 -148 323 55 24
4029B4m08M76r6L01j71k26L83j49k01N1K80l04m5j91K64O7j97K49j47O0J1K5k55
4052a99J01L53k66j64P8lJ06k1k21P7J09M98n05K74k88J28k02L39k24J55l3K3
4074A15Q8l06R1k65K04K29n0m12K93K83l37j26L86k01J01K63k69m00J70N44k75
4095A26k90K13J22k97LoK17j36k1L49l13J0j71K93Q7l52L03k69N08m15J22j04
4117b1J58l44M8L12j05n3J88l45kL97k03m7q6Q6j3k4K87n82N92l72L78m44K89
4140I4K03m27K41r2R4J9Q5k90j06K81l78M45m32L59j86J57qj4k12O1K41n24L30
4163e9J31j13J87k21K89l06j22O44o46j54K28K82p0p8P1l69L23R8m1m1J7j17Q8
4186B1j22p2J09q4L23n7L9N0k37j63J34J43j31K87l05J5j01L12o4k00L10L3n02
$$ plain form
4029 24 -384 92 -4 297 126 -100 283 134 -67 -16 264 -40 -85 -276 -12 55 -142 107 -40 20 31 56 -199
4052 -199 -98 255 -11 -175 -97 -100 6 -15 -236 -159 -50 448 -57 217 -71 57 -145 194 -30 125 92 115
4074 115 203 -103 -12 -277 -73 156 106 -306 -13 270 -67 -193 193 -8 93 356 87 -313 -143 401 126
4095 126 -164 49 171 -126 -123 -129 88 -48 -69 280 -33 -23 -194 99 186 -166 137 -132 376 -39 83 -21
4117 -21 137 -207 -159 153 48 -5 183 -162 -164 233 30 -17 -103 -17 -30 -54 233 -349 243 -129 249 -195 94
4140 94 297 -130 111 19 113 132 217 -73 -179 102 -276 169 -263 96 -90 67 59 45 -167 -106 135 -389 -59
4163 -59 72 -41 146 -75 214 -92 -214 430 -216 -370 -142 140 70 -8 63 -306 17 115 74 33 50 -67 21
4186 21 -101 -173 -64 -148 175 118 157 207 -30 -193 -59 84 -47 240 -65 -50 -151 161 97 -103 207 240 -262
4209b62K90O6l42L40n3k12K6J66n2J96Q6l40k14K47k5K94l66M95l80J27p6J08
4231A19k01J8K25J91m45O2k7K30j00J26k20J79j99J48j70k46N53o11L59R2m04
4252c21M74j30j87R4L17o3l1R5M5k40l87K39J18n4L12m11L08l04K15p4j37K57
4274A35j59o8O6L6O1j02J09j34J35J85l61Q8P5qJ9J27k06K78p91M40K36m21L38
4297G8Q6m04K51P8J79R9l40Q5k38J05j12l4j41M86j78k85K71J24l45M71k69Q9
4319E6kJ38j36j42j9P7j23J14N8j77N1K75j78r7K32k47J79J34m18J91j5J90r0
4342E1J19n8J03o4k62J63k3L1j18J19q4J76m2k65L14j10j41L41j49m1r1j82J24
4365h9M4j52O8L25k27r6K14p6M49k59l31n7R6J89k70L83n2j52p5L10k18L8j33
$$ plain form
4209 -262 28 94 -248 92 39 -173 -147 19 -33 163 249 -91 -305 -58 -83 211 -155 340 -40 87 11 119
4231 119 -82 -64 161 352 -93 -31 -58 172 72 198 -22 157 -42 106 -64 -310 243 -368 -9 83 -321
4252 -321 153 23 -164 -70 247 184 153 248 293 53 -334 -95 23 -31 281 -130 178 -126 89 15 -122 135
4274 135 -24 -92 -26 10 71 -31 78 -56 79 264 -97 -9 66 58 77 204 -2 276 -515 -75 161 -260 78
4297 78 164 -240 11 89 268 367 27 112 -126 -21 -133 -167 -308 178 0 -285 -14 110 -235 236 -33 56
4319 56 54 192 56 -86 -105 -28 -151 -37 21 -156 -105 170 -8 -105 127 -120 59 193 -225 -34 -49 141 51
4342 51 170 112 215 151 -111 52 29 60 -58 61 -23 153 111 -154 160 50 -91 250 101 60 -31 -213 -89
4365 -89 -45 -197 -129 196 -31 -127 87 11 460 201 -130 -187 -91 98 -172 211 159 7 -68 242 24 62 -71
4388g1K95j91J28k22m07L76r5P4Q8K09M2m92M26k89P2J59Jk85J77J60j31k27M47
4411B44j8l47K91k47j06r4M77m69j6K01K49j55K90k63l07J49J08J5r3J84o7k40
4433b14J35K92j14j8n5J43l1K56l11j56K34l47M6K38K42l00p3q5J91j95j62K40
4455d4J36O7j6o8l02QL88k40J96j73q5L4Q3Q4k5J41j76N5j02j99Q4K93Q3l35l15
4480d28P52j48n10K62J01j97L0J6mk2M02k7l42J98r2n4j55M37k50p0J81k5j18
4503f3n0M25o95L74j29J38M7j4J87l3m25O71o04q9J18L12k43L10l9j96L27k13
4525A16k21k1K15on5L6J20j32K43k10k63p1M00j1k94L93J09m71J29J98l9k30K
4548f3L30j07l9l17R2K1k7K31m74K60m1J54K32k69r3N4K33O5m45K10j46R1L3k59
$$ plain form
4388 -71 224 33 161 -61 -468 -92 -187 -113 -25 184 226 -266 160 -129 -57 102 103 -182 -5 155 24 -203 244
4411 244 226 -121 170 -77 -183 -277 200 -269 -285 -84 165 10 300 37 -270 -121 -13 2 -91 93 26 -214
4433 -214 -79 213 99 81 26 169 138 394 83 -73 161 -186 -140 98 340 40 -33 -118 73 -122 -284 -44
4455 -44 92 159 143 75 -227 -219 169 -71 125 -48 -133 -99 -16 68 43 184 8 63 -39 -238 -154 139 222 -113 -428
4480 -428 324 176 -334 -72 29 -168 -138 -122 -126 -148 254 227 -115 83 -9 -63 -218 219 -31 -101 80 55 -63
4503 -63 -113 312 -383 -9 -138 0 47 33 220 187 -238 433 -171 -260 -142 170 -73 237 198 2 329 116
4525 116 -105 -126 89 83 28 64 184 52 295 85 -178 -249 151 140 -154 239 348 -123 6 204 165 -65 -63
4548 -63 267 160 121 -196 -104 -83 -110 121 -353 -93 -134 20 252 -17 -110 -56 177 242 -203 7 -139 -48 -15 -274
4572b74J39o5K80k33k2K61k77J63p9L1R2J11k56K12K4J64k88j24k9M50k83K31
4594B28p5q5n22P44k50K3l91K85k16K83k12M2O3K15k65Kk19M43pl57K76J0j69
4617a54J94j32k03L82J20j26j32K08l1j16r2o5Q6K29j61j21K22oj11L4J13J48
4639B86k13RN5l7k5R3m42J24J11J13l9l7k1j15Q1j97M43k14L4J17l86K99K15j40
4663A14k90L52J13l84j57N1j8L12J73l57J93j65K35l63n1M21l01kM3L76l75J20
4685D0j82J29j94j50K31K18J96l08R4J37k99l0K02j10j38K7KN12n88K27j18J18
4707A6l16N32l86j57N55K1j65k10K59k88M63nk39l4P0j43L44l44n7L4O7j05j25
4730b13P5p3J51j60M99k24J6j68J41k1K03O2k65k18L71j41k44K55J84k66K31q0
$$ plain form
4572 -274 -135 -200 80 -153 -175 86 -191 -28 -107 -76 16 127 -129 83 107 271 -17 -141 -170 280 -3 228
4594 228 153 68 -454 290 40 63 -328 -43 -259 24 -188 -146 -83 132 -133 -131 -350 93 86 -271 5 15 -154
4617 -154 40 -92 -295 87 207 81 -51 157 126 10 -82 -147 -61 168 7 -114 108 102 -9 25 138 286
4639 286 73 82 137 100 75 168 -274 -150 -39 74 35 -2 -23 -138 -57 -254 189 -25 9 126 -260 39 254 114
4663 114 -176 176 289 -95 -252 -201 -219 93 266 -91 102 -63 172 -191 -242 179 -122 -124 -81 295 -80 40
4685 40 -142 -13 -207 -357 -126 92 288 -20 74 211 -88 -118 84 -26 -164 -137 -135 377 -211 16 -102 16
4707 16 -300 232 -154 -311 244 265 100 -110 149 -139 324 319 80 46 116 -27 317 -27 -84 -50 17 -88 -213
4730 -213 -138 -211 -60 -220 279 55 71 -97 44 23 226 288 23 -195 176 35 -209 46 230 -36 195 115
4752A15j65o0j09J99J4o7Q6o6P3L15n21J64J12M7l31l3M90k79j83L02L2k1J03
4775B17j04K17l85n5K2R8j6Q8N6j88K61l96M5K2L6L13k10ol1q0M05k75j05J86
4799A15O5l08j10K68J16L4j94o3qK72j63QJ11k47PK70J12k74N3K25l32j06P6K06
4823A33j26K14j44l5K25j96r8k4l7Q0j7Q3K9j40J76l21K41J02L1j33M9J28k43
4846b3K3j97L11k70L11q2j17L0o9K84j86j72J50K77j77j08j22K13k9k28J47N0
4868A6k8j10K8p7j64Q9J78L42k87K59m60O7n4K54K72m37r7K85j81Nj8k3j7L0P2
4893e6j17J85J44l0j80k45L34m4j87L38k95K66j85p0K61J00k80J30j71J38rl09
4915b82K91j16n6P1K57j55J16j14%R4k10j8j5j0K42nj6P7k21L74j90l50K30q5
$$ plain form
4752 115 -50 -110 -219 -20 -6 -73 13 -53 20 335 -186 -22 90 137 -194 -227 263 -16 -199 103 135 114 217
4775 217 113 330 -55 -110 -88 10 -6 82 138 -50 211 -185 -140 -118 -82 231 21 15 -16 -96 309 34 -71 115
4799 115 180 -128 -238 30 146 180 -14 -77 -85 187 24 32 143 -104 -97 173 285 11 64 289 -43 -149 -73 133
4823 133 7 221 77 42 267 71 -27 -51 -88 -8 -25 58 87 -53 123 -198 43 145 176 43 92 220 -23
4846 -23 0 -197 114 -156 155 73 -44 -14 -83 201 15 -157 -7 270 93 -15 -137 76 47 -181 -34 16
4868 16 -12 -122 -94 -171 -335 -246 -68 274 -13 246 -214 -147 -201 53 325 -112 -209 76 -105 -100 -118 -141 -158 -128 -56
4893 -56 -173 12 156 126 -54 -299 35 -9 -196 142 -153 113 -72 -142 119 219 -61 69 -102 36 27 -282
4915 -282 9 -107 -163 -92 165 10 126 12 12 106 -104 -122 -137 -147 95 90 74 151 -70 304 114 -236 -6 -91
4939i1M29o11L85Ok66L12O8l07l00M51j61j22L98l23P6R1J16j26o1K11l09L42
4961B08k5j27l48M31j8j39nM1K44k52oK44k29k0k1J44k45P4OO6L57n57J08M3J60
4986A34j11j74J63J88l67K0J29k4j06L65k78L5J33M30p86K04L1j64M9K45l95M15
5008A36l12K47j2MK82m92K46J15j01j3k82O6J48K3j82L43m09K33J00m10M33R1
5030B54l27L87n95J79J48o1M1n8J0P6L63p95K61j63K48K08m7j36k10J33r0M25
5052B51j18k61P9K12N2k32L9O6j30r9J19q7J44K16l77J14J51l14J85o4L80o07
5074b81L59k20K98k77o9J99k03K30n8J47m93N45l28J91o0J3J00k40J07J11j12
5095d1L3J53k44J3m5Q6N6j8L04m54L14j01j49J85j00J47m44M14R4l86N85m95l04
$$ plain form
4939 -91 338 -273 112 118 -148 164 232 -75 -375 76 -85 -207 191 -132 -56 35 151 25 -36 175 -134 208
4961 208 183 56 -292 139 121 -18 -23 18 262 10 4 248 19 -1 -22 122 -123 -49 -43 23 380 -177 -69 -26 134
4986 134 23 -151 12 200 -167 -147 -18 -42 -148 217 -61 -26 107 537 -249 -45 -14 -178 -129 116 -279 136
5008 136 -176 71 59 63 345 -147 99 214 113 100 -182 -116 32 55 -127 216 -193 40 140 -270 163 254
5030 254 -73 314 -281 -102 46 -15 26 -32 -22 54 417 -378 -117 -280 -32 176 129 -7 -217 -84 -174 251
5052 251 133 -128 -49 163 215 -17 22 88 -42 -141 -22 -109 35 251 -126 -12 139 -175 10 -54 326 -281
5074 -281 78 -142 156 -121 -190 9 -194 36 -22 125 -368 177 -151 40 -20 -7 93 -147 -40 71 -41
5095 -41 -8 145 -99 -86 -131 -45 11 -7 297 -157 157 56 -93 92 -8 139 -305 109 203 -183 402 -93 -397
5118c97J96K15m2p3K11q1l5R9j80k27P4M3L26Q8j21N5k15R0j95N3N72m68j30K0
5142a22K65r5Pj23L91m10k28K54K2LJ45k33K20Q6m69K51J54L7k35n3K30l7k0j35
5166i5O5J23Q3l14K41l52L96J3n15K54j31K73k8m0J74j93k19L72n2j38J34k36
5188a85L54k23L10l73K61j41j9K80l86J55q0K21k60j6J99l27l7L30L81o98J62
5209i2J04l75L25R4l7p6q7R4J55N3j27j84K34m68M19J85k60k42K03P4j25L52l17
5232i8o1K29P4k75M7K2J19j86p4P77n23j88J5J16J73k33rRj98J67j31M06l82K94
5256I0j90R2k6j11K92m2l75K08k9K38q5k48K74k09L32j09k78L83M41n75o2K4J97
5279B32J31l94l91J61K42k11R4J43j09J46N1pk1O5M8l24L26k05J3N0J69m30O2
$$ plain form
5118 -397 -201 14 -28 -101 110 29 -6 93 -87 -314 -240 -197 129 217 96 151 -64 26 -169 -116 456 -12 -142 -122
5142 -122 143 48 55 -68 323 -87 -315 -61 -39 -36 109 -124 96 182 -287 -36 118 155 -80 -133 97 60 40 -95
5166 -95 -30 93 176 -138 103 -249 147 160 -355 -101 -232 41 13 -27 147 -46 -265 107 55 -83 51 -185
5188 -185 169 -54 256 -117 144 3 -16 264 -122 33 -47 174 -86 -102 97 -230 -267 63 444 -254 -92
5209 -92 12 -363 -38 56 19 -57 -144 -50 105 158 31 -153 81 -387 32 217 -43 -285 -82 -8 -133 219 -98
5232 -98 -159 70 144 -131 -84 -62 57 -129 -203 574 51 -137 -122 -6 167 -66 -75 -66 -264 -97 -228 178 -204 90
5256 90 -100 -8 -34 -145 147 105 -270 -62 -91 147 62 -186 88 -121 211 102 -176 207 648 73 11 35 232
5279 232 363 -31 -422 -261 -19 -230 -136 7 -102 44 95 88 67 132 180 -144 182 -23 -10 40 209 -221 -159
5302a59rKK43Po7r4j02M11q8l73P2L1J99n7J67j94NJ52j14n0j32J63p1P2J99m81
5328b68K60j3lO4k1J36k08J90k3k5Qr9Oj67P7J14q5K19k04j87J37M86m62k44M49
5353A37l16j65N47k42l4q6l4K42L2o6J92m54L62k86PK24m3J30m90N09k3j05J25
5376A63k54R2k99K90K23m13L84o3n54K08J23j22O2K71j02r8M42n07K04q7l2L06
5398B37l02O6j63N02m32p9L4J12J4j94K29Jq5P5l3P8J49j0k58l9q8O1o9K55k16
5423a55J60J16M4m27K22lL9p4K82j18j27K63j45Ql9L3k9j42%N6k01K93p4J67n1
5448I8l50K46J91l70L05j7k16J09L3o3o8N0k36K87p2p9J12M1j70J98k59L43l25
5471b12L01k82J21J3J62L5n0o2J73k94K04j85J13p4k23J45l15N01J12M1m82K92
$$ plain form
5302 -159 -168 -166 77 84 17 -77 -179 232 144 -229 -157 -126 73 16 183 -11 -6 146 32 -18 -150 13 -58 14 213 -268
5328 -268 -8 -21 -24 40 19 155 -53 137 114 89 97 -2 4 -163 -86 28 -57 162 -42 -229 -92 394 -68 -312 137
5353 137 -179 -344 203 -39 -73 -159 -193 49 81 15 207 -247 115 -171 -164 60 17 147 -343 166 143 38 163
5376 163 -91 1 -298 -8 215 -198 186 123 -431 -223 -100 -222 -160 111 9 -89 353 -154 50 -37 -69 237
5398 237 -65 1 -162 340 -92 -171 -137 -25 -11 -205 24 25 -60 15 -18 60 209 199 -59 -98 -186 -125 -194 61 -155
5423 -155 5 121 165 -262 -40 -43 -4 -78 204 86 -41 222 77 85 46 79 50 -92 -92 -36 -237 56 -18 149 98
5448 98 -252 -6 185 -185 120 103 -113 -4 29 -34 -102 -52 -288 -1 -73 -152 -40 1 -169 29 -230 113 -212
5471 -212 89 -193 -72 -59 103 138 88 26 199 -95 109 -76 37 -37 -260 -115 -430 71 183 224 -258 34
5493C4k86J39PN3J73P9j69Pn2jk55M48j31j23q7K86j0Q7m1m4O8k52KM52k69k80
5519a65K62n9r2r7K35o0j09P8n0rK58L2l24O6L5J39l45J0J36j50L05p9Kk10L75
5544A84k60p9L27K8K8n1m90M21k06J08Q8k96K55M1k63J85n1L39m10J99m6j88P7
5567f0K84k52K15j04l12K89J24l62M5J92j2l30J91J36j40J11J69k63J54p0J83
5588A88k52j82K66j1J11j78j59J48K65l18Q8J13K30k65q4K03n05K79j86L66j79
5609f2K50k94J84J6j86m0R4L41k48N0J01o8j66J29k1j07J8j10J5K09j82K23k29
5632h3J46K7Pj11Q8k03k2M57k48k33K38k14K93k31j07J26k88L27K44k97K81j68
5654B9l56L03k5k8j67L84l76J37K36J75k82o4k76M97r2k29K94j14j67Q3L28m07
$$ plain form
5493 34 -252 -113 -106 -53 120 199 30 37 -15 -16 -271 177 46 -77 -164 122 112 199 158 114 182 -70 -68 384 115 -165
5519 -165 97 38 -54 -151 84 24 -85 -7 -57 -66 192 224 -100 -34 1 140 -205 -195 -59 -209 96 17 19 -191 184
5544 184 -76 -155 172 200 228 177 -313 108 -98 10 98 -198 57 98 -165 20 -31 308 -102 97 51 -137 -60
5567 -60 224 -28 187 83 -229 60 184 -178 -133 59 47 -283 -92 44 -96 15 184 -79 75 5 188
5588 188 -64 -246 20 9 120 -58 -217 -69 196 -122 -34 79 309 44 -40 163 -342 -63 -249 117 -62
5609 -62 188 -106 78 94 -92 -132 -38 303 55 105 206 138 -28 101 80 -27 -9 -119 -104 105 -77 146 -83
5632 -83 63 90 97 -14 74 -129 -151 306 58 -175 63 -151 142 -89 -196 -70 -358 -31 213 -84 197 29
5654 29 -327 -24 -49 -77 -244 140 -236 -99 137 312 30 -34 -310 187 95 -134 160 46 -121 -38 290 -117
5676a17L5N2L5L2k9n06L52L10j93r3q3N70n37L01K03j69l6j82O3j3N4K17l94m7
5700a75K51J87j61p0R7J21j67P2n37M16o0j39K54r2o2q9J31O4n9K09j13j94K77
5723A61n13N35l31L9q7j47N43m2j75J03j16n4j5q7K15q4R8K66m09K46k41M4J61
5746A10o6J6k32rL39j97L22j54J2k1j14j74j53L0L53r0K71R4p66K55j38J88P0
5769e4J42J7j63o8L37j52n3k00p0j9J40L41l17J66j73P6k6k04J79K25k93K32k19
5792a56J35L23n7k58r1L3J42k4k3L7N1q1J48m53O31m71J13p6J96q6oL0K75m99
5816a67K48j29P0q6J12k04RP2N8j33K27j53k20J42K33K8k0k2j95N1L21j84j56
5839i8J14k16K64O8j99J96j2L1M9j43J31j37j65j39M33l52K7L36q1K35n4k68J76
$$ plain form
5676 -117 -82 -30 5 37 8 -498 -146 164 -29 -122 -205 365 -172 129 332 163 127 -55 8 -5 49 266 -128 -175
5700 -175 76 263 102 32 129 250 83 155 -382 34 -26 -165 89 -3 -65 -154 -23 41 -18 191 78 -116 161
5723 161 -352 183 -148 -109 -196 -343 200 158 -17 86 -30 -84 -99 -186 29 -55 43 309 -100 146 -95 -51 110
5746 110 44 60 -172 -181 158 -39 283 129 141 120 6 -168 -321 -291 62 -28 243 337 -429 -174 -312 -124 -54
5769 -54 88 105 -58 -126 211 59 6 -194 -264 -283 -143 198 -119 47 -126 -50 -76 -280 -101 124 -169 63 -156
5792 -156 -21 302 245 -13 -104 -71 71 47 24 61 112 31 179 -274 357 -114 -1 -77 119 33 27 57 332 -167
5816 -167 81 -48 22 -64 48 -156 -147 -75 -17 -150 77 -76 -296 -154 79 107 87 65 -130 -79 242 58 -98
5839 -98 16 -200 64 132 -67 129 117 148 197 54 185 48 -117 -256 177 -175 -148 188 107 342 288 20 196
5862A96k32J59l01O6j3L57q6Q2Qk35L2r9L17l13O6J72l61j9L28Q0r3p4k36K22
5886B3R0j02j80o2M85j40m46M34J48j85l40L2K69j46L74j57M5K10l02j49K97l37
5908a39j5K82j42J78k55L83l32J55j42L09l36j09N7J94L5J50k06oJ60M3n20R4
5930a62J22r7P04n59N6k18K2R7Rl64L00j3j60J98Q5j33K40r3kN4J01k43q9J33
5954a2K01k27k97K33k19K62N8J2k62J63J96k20k17L00L04j23R1l16N1J72l9q5
5976B6o5K75k82r4N8J6q6K72j42J34r5K49l61%L23N5j97j02k15K83j35O0r4J72
6000E5j66K17j12K00l62K03p4J1j21O4%j11LK14K73m30J38J48j81n6J76J25o6
6023A48k49O5J1Q9J18p8P5j38J93k10l05P8K22l51J84R9J94k37N2Q7J77j31l05
$$ plain form
5862 196 -36 123 -178 -112 -125 232 146 228 236 1 33 -66 251 -62 4 176 -185 -204 124 204 111 37 -199 23
5886 23 113 11 -169 -231 254 114 -332 102 250 65 -275 -243 26 -120 254 97 142 352 50 -99 198 -139
5908 -139 -154 128 -14 164 -91 292 -40 115 -27 282 -54 -163 -106 88 123 273 67 61 221 264 -256 -162
5930 -162 -40 -137 567 8 64 -154 -132 -35 -26 -390 -90 -103 -263 -65 20 -113 127 34 32 86 187 -56 -145 -12
5954 -12 189 -38 -335 -102 -321 -59 -1 11 -251 -88 108 -112 -329 -29 275 152 243 -73 -22 150 111 26
5976 26 -39 236 -46 -140 -82 -66 -152 120 -22 112 17 266 -95 -95 228 283 86 -16 -231 52 -83 -23 -117 55
6000 55 -111 106 -6 194 -168 35 -39 -28 -149 -85 -85 -196 -193 21 294 -136 2 150 -31 -87 89 214 148
6023 148 -101 -36 -25 64 182 104 179 41 234 24 -281 -203 19 -332 -148 -49 145 -92 -40 47 224 93 -212
6046b12J42J67k56K16M3k74O9j59M17%l1m28J99K7J21k77j03L76j00M9j51M1Q
6069a16L59n7Rj48j2K2J13K2l39nJ58O3j46k68J54J42L24m37N5J96k48L72j4j89
6093A0L6L22l94pJ50k74J97J12l0j09P4l7k3j10K4J6J08n4M7m25N01OJ10n01J58
6118i3K65m13K23l3P0j14J56j74J69o5J74k47K58k13J79k83K99k42J3M9M9k31
6140b04J58K00p0k73J28J53rk28k07J93K21m0k18J07L3J07j12K57j93m4j02J35
6162hPl7m6L77n88N21L8k34j46qj04L52k10j52K57m3j53N5P3p4qJ50M10m50k85
6187c06K48M6J35j86K65m26J63j92K23J5K02m13K6M80m52J51m8N50l78k8O9k08
6209f4R1J24m5l71J84j8K32l22K16J64k68J44j17j85L00J14O6k82j30J48j0M1
$$ plain form
6046 -212 -70 97 -159 57 100 -174 -105 -264 153 153 122 -306 -107 -80 41 -236 -339 37 -63 -14 -165 -124 -116
6069 -116 243 186 195 47 35 57 170 192 -147 -152 6 69 -77 -345 -191 -49 275 -162 -107 89 -159 213 199 10
6093 10 46 368 -26 -33 117 -157 40 152 122 13 87 50 27 -83 -59 -43 65 11 58 -367 134 140 250 -251 -93
6118 -93 172 -241 -18 -51 19 -95 61 -113 56 -9 165 -82 176 -37 142 -141 158 -84 -71 -22 27 -204
6140 -204 -46 154 84 -189 -61 92 83 -145 -352 -159 62 22 -196 -89 -56 51 -61 196 3 -41 -143 -8
6162 -8 -1 -38 -84 293 -295 226 264 30 -116 -124 -228 124 -86 -238 19 -24 -177 -122 -49 -123 -131 19 429 -21 -306
6187 -306 -58 -12 123 -63 202 -224 -61 -253 -30 -15 187 -226 -200 280 -172 -21 -69 481 103 75 144 -64
6209 -64 27 151 106 -265 -81 -99 133 -189 27 191 -77 67 -50 -235 65 179 245 -37 -167 -19 -29 12
6231A2J49k42M4O7j4j13L0M02m07q9N25l81L7k7P9k57M45l14k44L56j15j52M58
6254B49l07K46r4l43q6L17R7k98J54R0K25N7m20M56j85j60K11K8R4m07p9L1o0
6277a84K38m0K8k11R4j25J21J13K25m71P4J72J45k97J74J51j48l8J51k09J60Q9
6299B12k73J04J5j43J63j32J31J91m43n7K12K08k62L3Q2J7j72Q9j11n5K38J37
6321A84n29K89k13K57J80l06k3J11O1k3k28J17K29J27m12N1J49j66K17l3M7jp5
6344A0K27k74k64L95j95M3J06l9l0r3J31m4R8p6L01l63j71K18O7J51k77N8k04
6367b25j09L59j24P6Mj15M9J13j46N7M81m16k5J43j41R3k7k58J40J36j54Oj58
6390b41m9L35J57k81K27j50J36j31L17k41k43m4J61m0M27k94j63K47k71J14k7
$$ plain form
6231 12 161 -81 -37 30 16 -97 -67 335 -72 -161 364 -17 20 -7 72 -185 260 -54 -298 58 -57 -209 249
6254 249 -58 188 94 -249 -335 -18 79 -219 -65 25 250 307 -113 343 158 -2 209 237 331 -76 -155 -124 -184
6277 -184 54 14 42 -169 -75 -200 -79 34 259 -212 -138 34 179 -118 56 207 59 21 172 -37 123 212
6299 212 -61 43 58 -85 78 -54 77 268 -175 -232 -20 188 -74 -41 41 58 -114 -25 -136 -191 47 184
6321 184 -345 -56 -269 -12 168 -138 -161 -50 11 -12 -240 -123 106 233 -179 -128 21 -145 72 39 86 85 10
6344 10 237 -37 -301 94 -101 -58 48 9 -21 -114 17 -27 71 -5 296 -67 -238 -20 47 198 -79 -21 -225
6367 -225 -334 25 -99 -23 -19 -134 -85 28 -118 -61 420 4 -21 122 -19 74 47 -211 -71 65 -89 -83 -241
6390 -241 -290 45 202 -79 148 -2 134 3 320 79 -164 -208 -47 -87 340 46 -117 130 -141 -27 -54
6411e4M5l71N28J40l48J71l80K13L4k56K35L6J17o5N0j63o2qn8M00l30K38K17
6434C29j47k53k77K97K86j16n3n6L7l82N05l54J72J55j98N9J04j80R6Jj62J08
6456b9j8J24l9j04J73R0j88L7j09p8J08r6M77l08M3M7k13L81l1m33M05l41R4K49
6480B41l14K12P1k21o3J50j26R1m6Qkj34L25k16J00p4j14J36J93m43l2J36Q9J79
6504A46l16J72J83j87K56l19l7K76j44J10k05j22K38O9l28N5P6r9J70J84n4j8
6526A06m02M56l2K05m59J03R5qk12P5J05n0K04j86j01J51k09j09O09j93k72J3
6548a11j18L18j70J33j23Q9K55k34J99k09o7J2J07L0l19K52N1Jk28K48J07l51
6570a28J46k92O76k47k97J83o4N9l09J64N5k39K52j63J81O6L9l13K28j00k31J32
$$ plain form
6411 -54 -9 -380 148 288 -60 111 -269 -56 -22 -278 -43 -7 110 45 95 -68 -130 -138 -196 204 -126 112 329
6434 329 182 -71 -348 -51 235 119 66 10 47 -335 170 -184 -12 143 -55 4 108 -72 24 25 -137 -29
6456 -29 -47 77 38 -66 107 197 9 46 -63 -141 -33 -129 348 40 83 130 -83 298 267 -166 239 -102 -8 241
6480 241 -73 139 210 -11 -74 76 -50 41 -5 3 1 -133 192 -24 76 2 -112 24 217 -226 -258 -122 -33 146
6504 146 -170 2 185 -2 254 -65 -102 174 30 140 -65 -187 51 120 -208 -153 -77 -176 -6 178 124 106
6526 106 -296 160 128 333 -126 -23 72 64 -148 -73 32 -18 186 0 -101 50 -159 -268 341 148 -124 -111
6548 -111 -229 89 -81 52 -71 18 273 39 238 29 -38 -26 81 111 -208 44 95 96 -132 116 223 -128
6570 -128 18 -274 402 155 -142 41 -23 36 -273 -109 -54 -293 -41 -204 -23 43 82 -231 -3 -103 -334 -202
6592b02O05m32l2J89j58j5K70j70l2J48k96Q8%K51j64P1l6J81k14j84K76l34K53
6615F3p3j03K99k23r5J74j55O2q4J73q1p4L9K92J97k22J7j72k41K73j49k21J17
6638a87P9p1K31J01k64K70k49L3j6j88L84O8j93N1N6r6Q0j43J25R9nJ05l71Q1
6662b0MK29l15O9K58m05L27N9r8k58L64Q2l82K20q3l85N33m75L04J0m4l20M80
6685A54l04J21L91j53j19p5n5L94j90k81M9l7p0J62K35n6l32O51m48l36L45k34
6707a88J50j79Q8N1K12O1j83Q5p5j84K05j13j38N8J56J60J3k59L3K70l75m4K78
6730H2j30K79k41p9K53p5j65R0j58K04N5k35o5J86J70k38J67j23n1J76l14N3J86
6753B7q3K7J69r0%J0k4j32L10j79n2pq6O9K54l9O6kk94M1J05MK52l92M8J05n1
$$ plain form
6592 -202 403 -29 -61 128 -30 -45 225 55 23 171 -125 -37 -37 214 50 121 85 266 52 -132 144 -190 63
6615 63 -10 -113 186 -37 -132 42 -113 -51 -135 38 -43 -117 -78 214 411 189 206 34 -207 66 -83 -304 -187
6638 -187 -108 -179 52 153 -111 159 -90 -57 -73 -261 123 191 -2 49 105 9 89 -54 71 170 165 270 -101 -20
6662 -20 -16 213 -102 -33 225 -180 147 206 108 -150 214 296 -86 134 51 -334 199 -276 28 38 -6 -326 154
6685 154 -150 -29 362 209 90 15 -40 354 164 -117 -68 -105 -175 -13 222 166 -166 485 37 -299 46 -188
6707 -188 -38 -217 -129 -78 134 195 12 97 22 -162 43 -70 -208 -150 6 166 179 -80 -47 223 -152 -196 82
6730 82 -48 231 -10 -89 164 89 -76 14 -144 60 115 -120 -185 1 171 -67 100 -23 -74 102 -212 -159 27
6753 27 -56 -29 140 50 50 60 36 -96 214 35 -17 -24 -110 -41 213 174 240 238 -56 -15 90 94 346 -46 2 107 56
6780E6Nk8J64J54n88L32j89j12J90J76n0j89k63K46O1j12m9N08l42J19r9Q5J66
6803B41j18m25M28j56j0N1k29L05n7j47L7j09J90J00k11J74K31l85j71J60j05
6824b06K73p0k78K14l09N09k7o3Q1r7j83J01jJ8q3J02k01J02L01k4k55J37N5R
6848A05k00J56Q6j72o6K18k10o0k2J39J92r1N4l41P3P4K15j46J58j44K9J46l96
6871b03K46M0L11l58p0nN9JK04k80K55l76J34P1j23R9j10oM2J95k55L46l3l39
6895a55J50L38k59o8k4o6j31J93K73k73k46LJ05K07m07J31L79J38l11O1O2n2n26
6918d78L75J47k46K95k61K96k36N57o19qK01O6N2O5J8l21N4M2N9j47j42M24m32
6941b39L73m4m23M43k07J2L00j55Mk5J42k9j44j33J81L2k38M22j32n5j48L12l66
$$ plain form
6780 56 61 33 197 351 -237 95 -94 -206 -16 160 110 -79 -342 -96 -35 -147 -196 312 -30 89 -10 75 241
6803 241 123 -302 126 -30 -40 11 -218 87 30 -117 -80 -189 1 101 -110 64 295 -90 -261 -101 -206
6824 -206 67 -3 -281 -67 -376 133 106 43 124 27 -156 -55 -56 -38 -121 -19 -220 -118 183 159 -96 41 96 105
6848 105 -95 61 147 -25 -91 127 -83 -143 -165 -26 166 75 129 -212 -139 -65 150 4 162 18 47 193 -203
6871 -203 43 83 394 36 -34 -39 20 21 225 -55 200 -176 -42 29 -94 5 -105 -111 -69 126 -129 217 184 -155
6895 -155 -5 333 74 6 -18 -84 -215 -22 251 -22 -268 -265 -160 47 -360 -229 150 288 -23 38 100 48 -478
6918 -478 -103 44 -202 93 -168 128 -108 449 -170 -178 23 89 141 206 224 -97 -43 -1 58 -89 -231 193 -239
6941 -239 134 90 -333 110 -97 -85 215 60 64 39 181 152 8 -125 56 88 -150 272 140 85 -63 249 -117
6964a17K39K04k85kK06l02j00Q3J37R4l08K7Q5J67k97L90m61M68k97K58k88l7
6986a36L54n35K93O6k8M53n40l9J32R9k8jk16J60L14m33L6Q2o4k5K14o9j23L10
7010B76k62j13m4L06j90K40k16J16r4r8M7j0j80K1J72j34L74j43p7K84l73J06
7032Hj88L51j18jj51K06j58J81J8k94L54j36K25j55r8j53L06l62J05r6L0R4J60
7055A28r5L72m49o7Q6J74k34J74l0k93p6M83J43j00k45Q4j66L8K92m34K92N6K9
7078A62P9m21L26l92R9J07j19P0K34k92j48K62J32m6p2j77L34j28N4j50M09m58
7100a35K05Q4j15J66j50P2l77M73k87P4P7j1j94J90j79L01j18k38O9L04m12K97
7122I6l66L86j49k2J88j07MK1K94k3n61L45j30l9lL5Qk00R9N9J64k30J77J51m2
$$ plain form
6964 -117 122 326 41 39 245 -57 -157 -74 63 157 -151 -124 -39 128 -169 221 -240 228 -69 189 -99 -136
6986 -136 218 -317 -24 42 14 467 -73 -112 20 119 91 90 -126 34 348 -85 -49 33 -31 -56 158 89 -34 276
7010 276 14 -99 -143 163 -27 213 -3 113 19 -79 -32 -42 -222 -201 -29 -163 211 68 -9 275 -98 8
7032 8 -180 171 53 52 -99 107 -51 130 148 -146 208 72 297 142 44 -109 197 -165 -60 -156 -126 -32 128
7055 128 33 405 -44 -111 -25 149 -85 89 59 -234 -310 173 316 216 -29 55 -111 -73 219 -215 77 133 162
7078 162 241 -180 146 -246 -147 -40 -159 -89 145 -147 -295 -33 99 53 -19 -196 138 10 64 -86 323 -135
7100 -135 70 154 39 205 55 127 -250 223 -64 10 87 76 -118 72 -107 194 76 -162 -93 211 -201 96
7122 96 -270 116 -33 -55 133 26 30 51 345 322 -239 106 -24 -63 -66 -31 -23 -223 -124 -65 99 -131 46 197 155
7147A55k05j23M55n31J61j12K65mk34MJ09J4O8J3k49M5K07r2J06m9q9J19j86K79
7171A26k83L56l03K03j59M3k50N53j36p2j13J53n6l50L57o5l3j49L86k74j68Q9
7193a45J24L35o22N82M0k48Mj56L05j85j57J64kn9L09l9k52n9R5J26r0o5J40q2
7217F3j45L0L5j20L51j21l95K71K36n21L64l4l1R6k8K1K6j15oJ77P1O8k33j30
7241g0K25j81j8j57K63Q3l32M73m21O6J08k63J05J13qp4J38P0J58j22j63M7J54
7264A94k76O0j5J7J06K02n10J36K02j07K01j28j35J32Kl9r9J86l63J39j37j26
7286c58N82J71l48%j9k84M40k50o4J76r4Q8j44J48q2J87k59j27L03k35K97j50
7308b2K05P5j36p7j30l6M47l19OJ54j60l4K32j96n1K2N2o3Pl36K97J78j20j62
$$ plain form
7147 155 -50 -173 282 -249 -88 -200 65 61 -173 -169 -60 -46 22 35 -214 -169 38 -54 52 3 -86 33 -153 126
7171 126 -157 199 -104 99 -60 -17 -267 286 150 78 -35 118 62 -288 69 4 -29 -178 208 -66 -234 -145
7193 -145 -21 314 -308 274 314 66 70 -86 219 34 -123 41 39 -20 289 250 -2 -61 34 160 70 5 145 63
7217 63 -82 -52 -17 -137 214 93 -302 -31 205 -316 48 14 -17 79 51 72 98 -17 -23 154 225 293 60 -70
7241 -70 155 -26 -44 -201 62 145 -187 286 -135 -69 39 -224 -119 -6 -14 -88 50 120 278 156 -7 40 194
7264 194 -82 -22 -37 -20 86 288 -222 -86 116 9 210 82 -53 79 81 42 -57 129 -234 -95 -232 -358
7286 -358 224 395 47 47 28 -256 184 -66 -130 46 -48 40 -104 44 -38 149 -110 -237 66 -169 128 -22
7308 -22 183 258 122 45 -85 -121 326 7 13 167 7 -27 205 9 -42 -20 32 -31 -24 -360 -63 115 -5 -167
7332a67J64J49M3j92l2k6J62P7j65p4o9L67j40N2qj1m06L27r9Q5M3p2q9j56J75
7357f2Q9R7j78K41j09mLn1o2J10J6j65J04J43o9l52L04k0J22r8k6j39k0L19l11
7382a18J51J03j13j07J31L9M3k17n2j19L18k56J41J16m44O68j91j35q5J64r0J03
7404E0K1N3j03J10k65J54J63O0l29K29J5l38J58J15K0j3l12n9J66J57J31k72K34
7427A45l82K29R8l3N2k14k3J17O6J8k00L29j27K8m69L66J04k41K64k58L36q8q3
7450C4k22O09o32J96K0j83L57j60N8k41K75l7n8l41N07k45J29J21l41n6J30L36
7472B56k47n6K1j35K0N28k06M9j84L56m14P9m0n0L79m36N47o37j08J23K35Q0j68
7495hk37J2K28L8p4j37R7J1J91l16j1kK74k85j24K95oj41K96k56K27p9J85j50
$$ plain form
7332 -167 -3 146 189 -3 -35 -61 101 178 13 -61 -130 237 97 149 141 130 -276 51 -48 37 80 8 -81 -237 -62
7357 -62 27 124 -54 187 78 74 77 26 -36 74 90 -75 29 172 103 -249 55 35 157 59 33 -106 -126 193 -118
7382 -118 33 136 23 -84 47 86 129 -88 -140 -259 59 -197 -56 60 -384 284 93 -42 -127 37 -53 50
7404 50 71 124 21 131 -134 20 183 243 -86 143 158 -180 -22 93 113 100 -212 -271 -105 52 183 -89 145
7427 145 -237 -8 90 57 109 -105 -128 -11 55 73 -127 202 75 103 -366 0 104 -137 127 -131 205 117 34
7450 34 -188 421 -211 -15 5 -178 179 19 77 -164 111 74 16 -325 182 -63 66 187 -154 -210 -80 256
7472 256 9 -47 -26 -161 -141 387 181 230 46 402 -12 67 27 -23 356 -80 467 -170 -278 -155 80 160 -8
7495 -8 -245 -233 -5 33 -41 -178 -81 -70 121 -195 -206 -208 66 -219 -343 -48 -54 -195 101 -155 72 -7 178 28
7519B8N8j79M7J37MJ89j73k58J87r0P2j09J70l00K92J20k43Q9OK3k01J37J40l08
7543a62J39K44k48j28K06j65L17j74k40K12k85J70J33p4L9J71j81k7m3K1j00K31
7565E6o6k10L13o2j8N7j54J84j95n1J98o8k1R2j21M1K17l97K63K92m38Kj86O1
7589b11O4K92m3o1j48L40J20o0l41J33M7K53l92j5M49l92m2P5K5Qr4p2R6k5M54
7614D60n68j59N63j22j19j41J95l2P8j40p8Q6K9J64m10j22J99K61k21M1q1l8L6
7637a19n6J33J14l93N47j49M3J12k56l9R3J2k11J82L15m10p7M0J13j54L74j02
7659A12Mr9L08j55l12J61j05k4q0O1O1l0L7q5J4j49K83K19l28J06M12m91j30M0
7683a70N5K20n1j91O8L94m75J89r3J25j05P9o7J9P4L86k16k07j70J82j9j19K07
$$ plain form
7519 28 86 -93 -46 91 95 284 111 -147 40 -50 22 -87 83 -217 75 195 -48 41 47 70 -131 6 146 -162
7543 -162 -23 221 -27 -155 51 -114 203 29 -211 1 -284 -114 19 -55 -16 155 -26 -53 -96 -75 -175 56
7565 56 -10 -220 93 31 13 70 -84 100 -95 -146 52 -16 -37 55 -66 -25 192 -205 58 350 -88 -86 -272 -211
7589 -211 -147 145 102 41 -107 233 353 293 -48 85 132 385 -7 -22 427 35 -7 68 93 101 7 -65 31 6 460
7614 460 -108 -267 296 174 55 -86 109 77 155 15 -63 23 52 216 -194 -316 -117 144 -77 -36 -117 -155 -119
7637 -119 -175 -42 72 -321 226 77 120 232 -24 -63 30 42 -169 13 328 -82 -159 -119 -6 -160 214 112
7659 112 116 17 325 170 -142 19 -86 -110 -190 -129 -68 -98 -61 -146 -132 -281 2 221 -107 -1 411 -80 -210 -170
7683 -170 -115 105 54 -137 -69 325 -150 39 -54 71 -34 45 -22 -3 71 457 241 34 -136 46 27 -92 115
7706A15k01L42m22M2Q8J87k06J43r5k49N9Q2K78n16L95j29J29R9j81N8m33N80
7728A65p4k13N8j68L86L47m95o1P5J09J07n83L77l6j21L7K1J49J12k29P9q2K35
7751A95k18L5j70J94j58K27k14K45j41Rk4j2k69N9J9j7M84m27N0J21J0kj50R9
7775e5K77j40QJ84l05j96K51J89k18m6J95K5j29k13L41k91%L59j34l76K61k52
7797b65J03K07j6p1j35K12l03M72j76r3k02M46l58J07j98p5M31L0j2o7J26k48
7819h5K51j19r8n2L3N9J70k41J41k04J41j43K58l22J27N89p36L37j48m9J05p7
7841f3J81M9j38m6m6j97N18l50J61K7J7P6k88OJ06j31O7k21P1J33J26k34J58M
7865a4j57J67K8j06J23m6k68n6J90J03M2k44J95l2J18K84l30m0K5p9L6K1J61k86
$$ plain form
7706 115 -86 256 -166 -124 -36 151 -55 88 -7 -256 -197 -115 163 -353 42 -87 42 141 -40 18 -415 165
7728 165 91 -122 -64 -232 154 501 6 -55 20 129 236 -347 30 -6 -127 -90 -69 80 192 -37 42 -40 195
7751 195 -23 12 -158 36 -122 105 -109 136 -5 4 -20 -32 -301 -242 -223 -240 244 -183 -133 -12 -2 -4 -154 -55
7775 -55 222 82 90 274 -31 -227 24 213 -5 -51 144 169 40 -173 168 -123 -123 236 102 -274 -13 -265
7797 -265 -162 45 29 -42 -177 35 -268 204 28 -65 -267 179 -179 -72 -270 -345 86 116 104 37 163 -85
7819 -85 166 47 -51 -103 -70 -11 159 -82 59 -145 -4 -147 111 -211 -84 505 -231 106 -42 -91 14 -63
7841 -63 118 167 29 -17 -63 -260 258 -92 69 96 113 189 -99 -93 13 -118 -51 -272 -201 -68 58 -176 -18 -14
7865 -14 -171 -4 24 -82 41 -5 -273 -329 -139 -36 6 -238 -43 -75 43 327 -3 -43 -18 -97 -61 -40 121 -165
7889a65K41R1j01j27Ll29N87k22J02j42J96K4J00j77J01j0j47j05j32L13j04q5
7911h8K95n32K16J07K25Q4j52k93j79L90P1j44o9L1k4l1K3K70k64M5K38Q5n13
7934b09K48pN7q3J25j50N5k8k39J31l6j6J26J84l61K01o4K94m5j56J51k45K05
7957A38l26N18k11j28o6J18o5o6J46o4J26j37M5k37L08nM4k97p0K37m2K67R3m45
7981a19J69J0M4K76n75M02k14j08j40K78J26l58K55j68R9M6l2J23j23J14Jl1K9
8004A04j49j08L92m41K37l4j76K24N7j18Q4l3k02L24j40ll2J4K41k77P7j30L6
8027e3r1K09p4j32J11j11K27j76O3nj2l47M39o9k31K28m3J26j09K22J25j92j03
8050Bn2j08l1J12Q5K9r3n3k9J00k76P7L55o9l03j05M52O1Q1n09j04N19j79j51
$$ plain form
7889 -165 76 167 66 -61 -58 -387 200 -22 80 -62 134 158 258 81 182 172 25 -80 -212 101 -3 -88
7911 -88 207 -325 -109 -2 223 307 155 -138 -317 73 144 0 -69 -38 -62 -93 -70 200 -64 -19 219 304 -209
7934 -209 39 32 89 6 131 -19 36 8 -231 -100 -136 -152 -26 158 -203 -2 -66 228 183 27 178 -67 138
7957 138 -188 330 119 -9 -75 43 -22 -88 58 -6 120 -17 28 -209 99 94 138 -159 -229 8 -34 233 326 -119
7981 -119 50 60 104 380 -195 207 -7 -115 -255 23 149 -209 46 -122 -23 23 -9 114 -9 105 106 75 104
8004 104 -45 -153 239 -202 35 1 -175 49 106 -12 72 39 -163 161 21 18 -14 0 241 -36 41 -89 -53
8027 -53 -144 65 -9 -141 -30 -141 86 -90 -27 -32 -44 -391 48 -21 -252 -24 -67 59 -50 172 297 105 2
8050 2 -50 -158 -189 -77 8 37 -56 -109 -138 -38 -314 -237 118 49 -254 -359 93 154 235 -274 -378 141 -38 -189
8074a89J5K32j49o3N55n08o2j35K68q3J56k04Q5L61j19j77K13j25Qj74K51l4l88
8097b66N8P9J08jj06J96k48K31m2J09n73M97j25r9K15kJ33k19j58J75r3j91L27
8120Ej39Qq0M88m88J81j69K00L35m78l08O82m37J33J93k20L60j94j79Q3N7N6j48
8143e9K07j02q7M47m03n9R5r0nj3j49J78L11j67k13K75m64M66P4k26j92K64j15
8166b7j09K75K1l08k41O10j73j04N6J09j36l06N40j1k32R6j91J05R4M4m0p5M7
8189D4Kl6
$$ plain form
8074 -189 -174 58 -91 -154 401 -107 -169 -304 -36 -119 37 -167 -82 279 160 -17 196 71 79 -95 156 122 -266
8097 -266 -208 -129 -21 -22 -128 68 -180 51 9 118 -455 42 -83 -182 33 31 164 -55 -213 -38 -131 -322 5
8120 5 -134 -126 -206 282 -206 -25 -194 6 341 -137 -445 237 -200 -67 126 -94 266 72 -107 -24 33 89 -59
8143 -59 148 46 -41 406 3 -56 39 -51 -56 -69 -218 -40 271 104 -109 166 -298 168 242 16 -176 88 -27
8166 -27 -136 139 160 -148 -389 221 48 -56 0 109 -27 -333 207 196 -36 60 -131 -26 68 112 72 -3 44
8189 44 46 10
8191A0
$$ Imaginary data points
##PAGE= N=2
##DATA TABLE= (X++(I..I)), XYDATA
0@%%%%%%%%JrJ6j6J6k4L2l3M1m9N7p1Q0r0J06j22J44j67J90k15K42k74L09l50
32a86L95m41M91n48O10o76P51q34R23j021J130j253J387j536J707j901K122k377
50a257K678l040L480m029M740n701P079r236J3118k2264Q2962N8651j56200m2857
64g1876N1043O3860n740l8343l6137M0147N1034k2145n0575J5838J7121j8704
76d477N503L3637j6420l4768K112K8619L0159N890o5592o4682M6792R0412p627
89D9558o2014r530K9140J9073l696m0315l1109M0812N4592j6453l9107l512J563
102a0998L805K7090n82m1658j1197K8083J1927P051J2638j9203k8463J2061J3972
115D526j5298j880J2923l806R359K4025k5003n0717P805M4655J7083r522k4333
$$ plain form
0 0 0 0 0 0 0 0 0 0 1 -8 8 -8 8 -16 16 -17 24 -25 32 -39 41 -49 57 -65 79 -88 102 -113 129 -145 164 -186
32 -186 209 -232 259 -289 321 -355 396 -438 485 -536 594 -659 728 -808 899 -1002 1120 -1257
50 -1257 1421 -1619 1861 -2168 2572 -3129 3950 -5286 7832 -14432 68530 127181 -29019 -71876
64 -71876 -20833 43027 37287 -1056 -37193 2954 53988 31843 -18732 -2894 14227 -4477
76 -4477 1026 34663 18243 -16525 -14413 14206 44365 50255 -15337 -80019 -33227 57185 49558
89 49558 -12456 -21986 7154 26227 22531 -17784 -48893 -8081 46511 30058 -9049 -12561 -10998
102 -10998 -7193 19897 19315 -22343 -33540 -5457 6470 13521 26159 6956 -21507 -9446 4526
115 4526 -10772 -12652 271 -3535 5824 29849 4846 -45871 -38066 6589 23672 14150 -10183
128a0183k5004K3359M9699j3070n1823J464L0177n037j2234O473L682N533P888
141A0924j6450j5562J7716J853k7248J7036M9732p580n0600j5081K2977K7451
153A5168J0621l1195l6930K7476M8805j8572m3689J0174K9431K7j0872j2623q320
166b0499K0784K1950j5709j3751J3934r572k6162J7235L4610o301k2069n512J135
179i927J1735J4051j8788k3355K5878L0525k0768k7521O228J3380J0192O259k1719
192c830k5436J8810K8143q378j0955O960p289r091J1822L042j1309J0956J3794
205A7239j3316q408Q293r141j0364J6732J0711j0064j063M55j1636Q955K3248
218B1641j3429k7215Q353J7214l601j305L070n414N466P291k2572j7646K5651
$$ plain form
128 -10183 -35187 -11828 37871 24801 -27022 -25558 4619 -418 -12652 -6179 -2497 3036 10924
141 10924 -5526 -21088 -3372 -1519 -28767 -11731 38001 30421 -20179 -35260 -12283 15168
153 15168 25789 -5406 -42336 -14860 33945 15373 -28316 -18142 11289 11316 444 -12179 -20499
166 -20499 285 22235 6526 -7225 6709 -2863 -29025 -11790 22820 16519 -5550 -11062 -9927
179 -9927 1808 15859 -2929 -26284 -406 30119 9351 -18170 -11942 1438 11630 17889 -3830
192 -3830 -29266 -10456 17687 9309 -1646 5314 -1975 -11066 756 3798 -7511 3445 17239
205 17239 3923 -4485 3808 -5333 -15697 1035 11746 1682 619 1074 -10562 -1607 21641
218 21641 8212 -19003 -10650 6564 2963 1658 4728 -686 4780 12071 -10501 -28147 -2496
231b496K1209j4687p341Q271l395m251K342q734r5K0836l4k6129L115K4204k787
246A0028j4641P38k392m282Q817M45o193J6447J3327k3046j8413J4425O659r904
260g985N115Q107k965L828j420j8699K7K3929j337k2183K263J3795L03K749K965
275H492j1997l091J1749q097j6736J3608J7784n475l121J856j2153o024J2504
288g01M85o410J1433N701j6460k270J4084k060q406L320m483n778J3004N766j3925
303f700L366J7286p774j7858O25M001L066J3632J677j7481L03J2724r745j1360
317a4238J3313P840r151j179K570m542P077Q443j3727p879J5248J210j7476L449
331i042J7177N81m438m411j2200m80J7932P87j4302P016J1418j0439p654O987
$$ plain form
231 -2496 18713 4026 -3315 4956 1561 -2690 -348 -9082 -9177 11659 11625 -14504 -11389 12815 10028
246 10028 -4613 -3875 -6267 -10549 -1732 -1287 -7480 8967 22294 -752 -19165 -4740 1919 -7985
260 -7985 -2870 5237 2272 6100 4680 -14019 -13992 9937 8600 -13583 -11320 2475 2778 5527 8492
275 8492 -3505 -6596 5153 -2944 -19680 -6072 11712 6237 3116 4972 -7181 -13205 -701
288 -701 -216 -6626 4807 10508 -5952 -8222 5862 3802 -4604 -1284 -5767 -11545 1459 7225 -6700
303 -6700 -3334 13952 6178 -11680 -11055 -7054 -3988 9644 11321 -6160 -5857 6867 -2878 -14238
317 -14238 -925 6915 -2236 -3415 -845 -5387 1690 10133 -3594 -11473 3775 4985 -12491 -9042
331 -9042 8135 8716 4278 -133 -12333 -12813 5119 5906 -8396 -1380 10038 -401 -8055 -1068
345a068J276j842O659m365r733Q295P218j2142p23J5906l182j5183O00N520K264
360e00R252O51j6451j875J4736l514j0991P787P151n337O38J19j0568J767J5124
375G989k506r688N618J739r681L815R699n041l636M576o152m800J2678M036j1959
390c313J110Q515o735o620N589O6J213J1701k253j7865K23J2408k482m203N935
405C289j834m812O747Kq824N461Q979j0154p710R823K371n962N872L825o264k86
421E23R2j1384J556J7764J484j2669J428M739n957L2M140n294N94R679m129j0269
437g671Q314P669q603l023M925n630l803Q356J864j941Q013m90j6023k125J1421
452A253o06m170N919J170m517M390k22j0998K953J1334n114q257N815K547k714
$$ plain form
345 -1068 208 -1634 5025 660 -9073 -778 6440 -5702 -6425 9481 6299 -8884 -8284 -2764 -500
360 -500 8752 9403 -7048 -8923 5813 2299 -8692 -905 6246 909 1547 1666 -8902 -7135 7989
375 7989 5483 -4205 1413 3152 -6529 -2714 6985 1944 -1692 2884 -3268 -8068 4610 8646 -3313
390 -3313 -2203 6312 -423 -7043 -1454 -1388 -175 11526 9273 -8592 -8369 4039 1557 -2646 3289
405 3289 1455 -3357 3390 3392 -5432 29 9008 -1146 -8856 967 3338 -2624 3248 7073 809 523
421 523 615 -10769 -9213 8551 10035 -2634 -1206 3533 -2424 -2392 1748 -3546 -2952 6727 2598 -7671
437 -7671 643 8312 -291 -3314 1611 -4019 -7822 534 2398 457 8470 7980 -8043 -10168 1253
452 1253 647 -3523 2396 3566 -951 3439 3217 -7781 -4828 6506 1392 -6865 -1050 1497 -1217
467a217O867K774j0950k931N446m684j342J2055K864q871P73K573p914m90O649
482A602k566q01R896k061j1548L866Q452l741l352J705o160j044J1890J722q224
497c64L301M298q929m215O386m81j72R051j69r856Q78L467o391J152J0101l034
513E023q200L833L277k441M036K126r995j379Q913l031o042P893N388n262j033
528C106q82q403J634J1486k85n871L854L86q078K051O935l720j702M925l804m596
544b964O760J673o790K996O148p635n963N726J882J3O546j930j1800L95Q287k596
560G48j664O736j695n420L156o26p027L807R084m817m117M033k387m894O742M777
576F436p091j293K572n067N69J0018q57q317K077K297o591N80N857j200J183O584
$$ plain form
467 -1217 5650 8424 -2526 -5457 -11 -4695 -6037 6018 8882 11 784 3357 -4557 -5047 1602
482 1602 -964 -1765 8131 6070 -5478 -1612 6840 3099 -253 1452 -4708 -5752 6138 7860 -364
497 -364 2937 7235 -1694 -5909 477 -4 -176 8875 8706 -1150 -272 3195 -3196 -2044 8057 5023
513 5023 -3177 656 3933 1492 5528 7654 -2341 -3720 5193 2162 -3880 4013 9401 4139 3106
528 3106 2224 -6179 -4545 6941 6656 785 4639 5025 -3053 -1002 5933 2213 511 5436 1632 -2964
544 -2964 3796 5469 -1321 1675 7823 188 -5775 -49 1833 1846 8392 6462 -5338 -4943 3344 748
560 748 -916 5820 4125 -1295 1861 1235 -5792 -1985 7099 2282 -1835 2198 -189 -5083 1659 6436
576 6436 -655 -1948 624 -4443 -3874 6144 5287 -3030 -953 1344 -5247 -4667 1190 -10 1173 7757
592G757n866j1353M122P526l042O42L706n706k239O248k22n508M195K027p583
607e296k29O923j675j452O520k94p831O0l56m683O199J0995m362q324K570O61
623e74m078L417K410n018K415O158m701m675O817J762n440Q49K17o645K558R090
639D562o2k972L242m484q965L552P580k575M2N189k787l587L101k575m991O032
655C02O006p202l700N651P36j54M819l915q938K340N625l569J049P596j035n966
671c55P88j528n017M135O187l528J73L802m848n156O696L525n842j101K012l094
687c151J944P293k976m751L913M60q254l57N977J030J233L847o049o329M846K275
703I51m214L196N147n386l034M221o07k570M475K48o673J438M388l609j69O773
$$ plain form
592 7757 1891 -9462 -5340 2186 -856 -214 3492 -2214 -4453 1795 1573 -3935 260 2287 -5296
607 -5296 -5525 1398 -277 -1729 4791 4497 -3334 -3274 -3630 -8313 -2114 8881 4519 -3805 -1235 -574
623 -574 -4652 -1235 1175 -3843 -1428 4730 29 -4646 2171 3933 -1507 -658 -441 -7086 -4528 4562
639 4562 4500 1528 4770 286 -8679 -5127 2453 -122 -80 5109 2322 -1265 1836 -739 -5730 302
655 302 6308 -894 -4594 1057 1793 1639 6458 2543 -6395 -4055 1570 -1999 -950 6646 5611 -355
671 -355 433 -1095 -6112 -1977 4210 682 855 4657 -191 -5347 1349 4874 -968 -2069 -57 -3151
687 -3151 -1207 6086 3110 -1641 2272 2732 -5522 -5879 98 1128 2361 6208 159 -6170 -1324 951
703 951 -3263 -67 5080 -306 -3340 881 274 -2296 2179 2427 -4246 -2808 1580 -2029 -2198 4575
719D575o17o673L50R1k577N271N199n372k798M521k157n839L998M893k936N53
735D82J468n457j050O503r5m434L004J343n566M05N700j638n67K810m008n477
751f577M982M027m050J138N675m202n417K327L44q27N528J527o300q64M241k927
767a375j831N189J05n149J479K058k831K774M931m561m532L726j077l914M231
782g77N789k509j241M92m970k292O568J381m376K207L359m328r80L711k406k052
798b424M252j090n097K688M830j899J00L399n492n526L819K229p21L824K159n745
814f94j843M345l111l591M776K680l830J490J405m458J263O181k891o133J711
829b700R54j414M724M071m919k209K485l452l393M769L069k495J865K655n637
$$ plain form
719 4575 3958 -2715 -2365 -2274 -4851 420 5619 247 -2551 1970 -187 -6026 -2028 2865 -71 482
735 482 1950 -3507 -4557 1946 1851 -2583 421 1764 -3802 -3397 2303 665 98 2908 -1100 -6577
751 -6577 -1595 2432 -1618 -480 5195 993 -4424 -2097 -1753 -2580 2948 4475 -1825 -2689 1552 -1375
767 -1375 -3206 1983 2088 -3061 -1582 476 -2355 419 5350 789 -3743 -17 -1094 -5008 -777
782 -777 5012 2503 1262 1754 -3216 -5508 1060 2441 -1935 272 3631 -697 -1677 2034 -372 -2424
798 -2424 1828 738 -4359 -1671 3159 1260 1360 4759 -733 -6259 -2440 -211 -932 2892 5051 -694
814 -694 -2537 1808 -1303 -4894 -118 2562 -1268 222 1627 -2831 -1568 4613 1722 -4411 -2700
829 -2700 -1746 -3160 1564 5635 716 -1493 992 -2460 -5853 -1084 1985 -510 1355 4010 -1627
844a627k741M283L24k005K652q59m563K787N957k760k915K420k322l452L742J735
860F56k718L613L999m945m532K297k5j896M848K834n492k04K615k484j05M227
876B688k100m437K767K286l255J728M211k690k547K450k844l601N084M660l234
891A166n88J400m071j690N225N23l189K434R73m551R60M129k592j438M154j680
907A165m965K391L265k342J801K993m006l716K797Q91j555L840J594n176p41K966
923A202k263j197N066L46m128J728J008m470J167N261j866l344K255m24l195L653
939G99L225l498j148J789l052j060M861J076l595K271J605n624j161M141p5l37
955B17L513j124n318J339L670k647R4L047k817l000L963J380k679J802K096m592
$$ plain form
844 -1627 -4368 -85 239 -1766 886 27 -4536 -1749 4208 1448 -1467 953 -1369 -4821 -1079 656
860 656 -2062 1551 5550 605 -3927 -1630 -1655 -3551 1297 4131 -1361 -1565 1050 -1434 -1539 2688
876 2688 588 -3849 -1082 1204 -2051 -323 3888 1198 -1349 1101 -1743 -5344 -260 4400 1166
891 1166 578 1978 -2093 -3783 1442 1965 -1224 1210 2183 -2368 -1408 2721 129 -1309 2845 1165
907 1165 -3800 -1409 1856 -486 1315 4308 302 -3414 -617 274 -1281 2559 4153 -1023 -1764 1202
923 1202 -1061 -2258 2808 3154 -974 754 1762 -2708 -1541 3720 1854 -1490 765 341 -2854 799
939 799 4024 526 -622 1167 -1885 -2945 1916 2992 -603 1668 3273 -2351 -3512 629 554 217
955 217 3730 2606 -2712 -1373 2297 -350 -256 2791 -26 -3026 937 2317 -362 1440 3536 -1056
971a056j694K975j406o70N110J917n124j078J347l119Q99M491r29k686K659N3
987A689l761J893K778k916r83K915k291k201M444K359l074N9M82m556p87M963
1003A013O26j960L403L42n118k17K527k036L31L918j758k709K613J076l374K018
1019F95K371m254k313L188O16j181L414J395m247m72J407l650k85N564P31l242
1035b63J556J95l727J107L015k004j693L473j314k707L224K695l567l55J415l115
1051b065j477M232J050k088K915K44m998p00L415j542k65L853r25l276J520J493
1067A386k829P28L141k449k505K750N46j891K552J421m065o93K142k118m85M333
1083A964O00l005N25P66l487O83M152j003k833L035l31l400K238J960k709L6K552
$$ plain form
971 -1056 -2750 225 -1181 -1851 3259 5176 52 -1026 321 -2798 -1899 2592 1663 -1023 1636 1689
987 1689 -2072 -179 2599 -317 -1300 1615 -676 -2877 1567 3926 852 911 1393 -3163 -3950 1013
1003 1013 1639 -321 3082 3424 -1694 -1911 616 -1420 -1089 2829 1071 -1638 975 2051 -1323 695
1019 695 3066 -1188 -3501 -313 303 -878 2536 3931 -316 -788 619 -3031 -3316 2248 2979 -263
1035 -263 1293 1488 -2239 -1132 1883 -121 -1814 1659 345 -2362 862 3557 -10 -365 1050 -2065
1051 -2065 -3542 690 1740 -348 2567 2811 -2187 -2887 528 -1014 -1279 2574 1649 -1627 -107 1386
1067 1386 -1443 -715 2426 -23 -2528 222 768 -1123 1429 2850 -1215 -1908 234 -1884 -2369 1964
1083 1964 2564 -441 84 850 -2637 -1954 2198 1195 -1638 1397 1066 -2334 -96 1864 -845 -809 1743
1100A743k657j967M063R13k742J738O96l841k76L384l29j223K979r23l878J219
1116a101K175k082N58L329j768k594J563K91k241K317K547l529j316K889p09j690
1132a361L297L57l352J93J269k302N89M265n96k749J421o03l393J192L510j342
1148C95k98K558k596k777L147J153k722O65J957k347o96L401p29j769K265m56
1164A151m250N07L540j445L45L574j621l990J319L75k484K239L326k333j349J950
1180H54m75k155J945R79l061N35J912k152K20M029k67l635P10m30k594J501L719
1197A635r74o23K359j890l513J643J727j783P79K380j870j422K930m44k280J889
1213E43M53l719Q5L568l96m95K863j608l705J141J122k211J591L845j468k554
$$ plain form
1100 1743 -914 -2881 1182 2095 -647 1091 1787 -2054 -2330 1054 725 -498 2481 1558 -2320 -1101
1116 -1101 1074 -1008 -450 2879 1111 -1483 80 371 -1870 447 2994 -535 -1851 1038 329 -1361
1132 -1361 1936 2293 -1059 -866 403 -1899 -1310 2955 2359 -390 1031 428 -2965 -1773 1737 395
1148 395 97 2655 59 -2718 429 1582 -1140 -475 1482 -865 -1561 1840 1111 -658 1607 1151
1164 1151 -3099 -2592 948 -497 -152 3422 1801 -2189 -870 -495 -2979 -740 2586 253 -1096 854
1180 854 379 -1776 169 1148 -1913 -1378 534 -1618 -1398 2631 2364 -1271 -561 -991 -3585 -2084 1635
1197 1635 661 38 2397 507 -3006 -1363 364 -1419 -640 1740 -130 -1552 1378 934 -1346 543
1213 543 996 -2723 -2638 930 534 39 2902 1294 -2411 -1270 -148 -2359 -768 3077 1609 -945
1229i45J744q97k036J947J969k630O7K368j483j398L301K85k769J52M96k465J174
1246a120L640r85j585K226j292l681J436K780j109J41J950k015k187K711P5k484
1262a499K015J934k894j198K619p4j246K440o57l661P79K260j710L76L265j485
1278A264k187R23j97k280K393K771k749k22J594j884j653K686J094k246L20J151
1294G78k495K82L518j027k767K111q1k717P32K925j154j83J846k163k910K496
1310h09J724j579J056J616k583j176J645l91r36K145M99l051O30K407j793p48
1326a344K285n85k158J296R6j541K293K880k545k559J655j137j091K267J654j806
1342c40Q16O08k469p28K861k38k313J617J264k070J89K369j110o41J426j811l189
$$ plain form
1229 -945 799 -98 -2134 -187 1782 -848 -781 1587 104 -1294 2007 2292 -477 -325 171 -2294 -1120
1246 -1120 2520 1535 -50 2176 884 -2797 -1361 1419 310 451 2401 386 -1801 910 985 -1499
1262 -1499 516 2450 -444 -1642 977 903 -343 2097 1440 -2221 -1442 818 -892 -516 2749 1264
1278 1264 -923 0 -197 -2477 -84 2687 -62 -284 1310 -574 -2227 459 1553 -693 -373 778
1294 778 -1717 -1435 2083 1056 -1711 400 319 -2398 -1666 1259 105 -78 1768 -395 -3305 -809
1310 -809 915 -664 392 2008 -575 -1751 -106 -497 -1433 712 1211 -1840 -1210 1197 -596 -1344
1326 -1344 941 356 -1802 -506 -410 -1951 342 3222 677 -1882 -227 -1364 -2455 -188 1466 -340
1342 -340 476 1084 -1385 -2113 748 510 -1803 -186 1078 -992 -803 1566 456 -185 1241 -570 -3759
1359c759K934K594j432O5J803k114j867J319l22j088L287J113l015l07K242j568
1375a15j222K372m28k098J289R23j572J669K404k660k610J687L49j565K088J675
1391B186j361j41J033k586j493K996O86j887J191R35k286O7K246j033j011R41
1407D83l49j965J713K209j771J42J421k316j945J996M04j016K408J499l169j248
1423a504J790o58p54K054j35k340J265J546j829J81K019j380j847J328P3j478
1439a669K295J808j814j125J259k110j049K615J617j928L58Q81k421k27K455j113
1455a68j277K258L16k854P21K036o58j68J048j919j764K018J017j090J171J062
1471A749k385j707K586q4j231K013K58k073N16R55j910J61K515j47k203N06O98
$$ plain form
1359 -3759 -825 1769 337 402 2205 91 -1776 -457 -779 -1867 1420 2533 -482 -789 1453 -115
1375 -115 -1337 1035 607 -1491 -202 721 -851 818 3222 562 -2048 -361 -12 -1577 511 2186
1391 2186 825 684 1717 -869 -2362 634 1320 -567 624 1559 -727 -660 1586 553 -458 483
1407 483 134 -1831 -118 2091 320 462 1883 -433 -2378 -382 22 -994 1414 2913 -256 -1504
1423 -1504 286 -372 -1126 928 793 -1547 -282 1264 -565 -384 1635 255 -1592 -264 -191 -1669
1439 -1669 626 2434 620 -505 754 -1356 -2405 210 1827 -101 257 1138 -1283 -1510 945 -168
1455 -168 -1445 813 1129 -1725 -1004 1032 374 206 1254 -665 -2429 -411 606 -484 687 1749
1471 1749 -636 -2343 243 159 -1072 941 1199 -874 -358 597 -1313 -1152 1363 1216 -987 -481 217
1488B17j362J155J880j676j499J815p56j419K446J183k017Q5R66k252o98K628
1504F96J81r42J268J96l100M74K343q98q37J889q21j833J353J296j909N07J477
1521A340j956q03J698K11j031K203M84k853p14J386j105P5K556j96j817N79M26
1538D83j576L12K063j104j332J893j39j780J456J377j938n29J484j929r10L229
1554A060O65j678Q48J07k430l13K390o67l05J544K94k356N52R76j603M97J726
1571A307j603j522J825R79j326J462K78k266p98J690l37q95K426N56k265J88R61
1588F60k034j85K603p33j057J593k20j675R36J809k131o22J342r02m18J844P80
1605A590j760K34N83j996n02K150L3m36J110L21k555N80J419j355J97J058p40
$$ plain form
1488 217 -1145 10 1890 214 -1285 530 -226 -1645 801 1984 -33 52 1018 -1234 -1932 696
1504 696 877 -65 1203 1399 -1701 -1227 1116 218 -619 1270 449 -1384 -31 1265 -644 -137 1340
1521 1340 -616 -1419 279 490 -541 1662 2146 -707 -1421 -35 -1140 -1065 1491 1295 -522 57 483
1538 483 -1093 -781 1282 178 -1154 739 600 -1180 276 1653 -285 -814 670 -1259 -2169 1060
1554 1060 1725 47 895 1002 -1428 -1741 649 -18 -323 1221 1515 -841 -289 687 -916 -419 1307
1571 1307 -296 -1818 7 986 -340 1122 1400 -866 -1664 26 -311 -1206 1220 1776 -489 -301 660
1588 660 -1374 -1559 1044 311 -746 847 627 -1048 -112 1697 -434 -1056 286 -616 -1034 810 1590
1605 1590 -170 64 647 -1349 -1851 299 332 -104 1006 1327 -1228 -648 771 -584 -387 671 -69
1622f9j220J552M91j467P86J034j589j002J237J71o12J736J96k039J81P75j265
1639a104j42K488m27j549J095L20j886J018J382j655m95J692j099q24J355Q20
1655I89j448K47Q33j717m44J847K99j009J139Q8k107P5J666p82Q7J525n28j997
1673a237J071P30j514O97J703j555r37J416kq71J112P19j877m44J669j009j20
1690d49J679j32j776M84N17j618O46K229o18r28O15j13j753R77J286j438L65J160
1708A133j610l30J314N47j724P42P05j959K29J344L21m39J253p48k196O80J230
1725D92q24K38J579p82j406Q83J85j484J144J099j410l98J353l62q89J517P5j694
1743f84K85M96j117P36K068n51j296O91m51j533P65J263q68L64J024r56j062J093
$$ plain form
1622 -69 -1289 263 754 -713 73 1107 -482 -1484 -247 -76 -688 1048 1244 -795 -614 161 -1104
1639 -1104 -1246 1242 815 -734 361 681 -1205 -187 1195 -460 -955 737 -362 -1186 169 989
1655 989 -459 -212 621 -1096 -1540 307 606 -403 736 824 -1283 -1208 458 -324 -237 1288 760 -1237
1673 -1237 -166 564 -950 -253 1450 -105 -1042 374 372 -499 613 1332 -545 -989 680 -329 -449
1690 -449 1230 1098 -678 -194 323 -1295 -649 1580 962 34 649 536 -1217 -240 1046 -392 -27 1133
1708 1133 -477 -807 507 1054 -670 72 777 -1182 -953 391 712 273 1526 778 -1418 -738 492
1725 492 -332 -94 1485 703 -703 180 365 -1119 25 1124 -286 -684 669 307 -582 935 1010 -684
1743 -684 -399 97 -1020 -284 1784 1233 -63 628 177 -1356 -591 672 -196 168 1192 236 -826 267
1761B67N41j281M48P30j282o9J683l11p96J080k66k176K85J539m88K42J375p91
1779G30j826R21q0o91M10J627q51j000J319l73q96J338Q1j750N12Q44j101k09
1797i95K231k6j628M84n56r35R84J302o11k22J068j008j210P71Q89r50K29R54
1815G71j454L8J400j07j275Q82M78j680m2J586m03j70J399q42j544Q82N62j144
1833f63L84J570p81j119J036n53o41J308K32j175K18R72r54n19J525J90j305J26
1851a49L47j233Q68J347p55q20J024l55j407Q07J221j093M18Q85j120j324J601
1868B62L94j325J001Q98j599o35J165k47k32J172n99j402P30J105q51O3J307r39
1886B68j066M15k13m67J688O27j373o90J155o09q20J087K60n85M32N25j586M23
$$ plain form
1761 267 808 -473 -25 705 -577 -646 1037 726 -70 1010 744 -1432 -1147 392 -96 146 1521 730
1779 730 -1096 -175 -255 -946 -536 1091 240 -760 559 186 -710 628 709 -1041 -529 315 -786 -995
1797 -995 1236 1210 -418 66 -490 -1425 -441 861 250 28 1096 88 -1122 -351 538 -412 -183 771
1815 771 -683 -645 755 648 -627 255 733 -947 -989 597 194 24 1423 581 -963 -81 481 -663
1833 -663 -279 1291 510 -609 427 -126 -767 541 773 -402 -184 788 -166 -685 840 1030 -275 -149
1851 -149 198 -1035 -167 1180 425 -395 629 274 -1133 -326 895 -198 220 1105 -15 -1339 262
1868 262 656 -669 332 1230 -369 -1004 161 -86 -318 854 255 -1147 -417 688 -163 -100 1207 268
1886 268 -798 -383 -596 -1063 625 1252 -121 -811 344 -265 -1085 2 262 -323 109 634 -952 -529
1904e29J479n95j433Q91M16j063M76J045o12J47M84j456r82J504O74p42M14R26
1922A044j308l15M60n01l72J484M47j850L73J270m76k27L85o43j154J160l0n44
1940g97J154J081j106j150N55k05q08J135O72k64L33J56j525l02J802l90r67M32
1958a94N67p14P80L51n28k83J170j398j556J492J208o08K9N65j064k58O19m19
1976b41n18J563O80j586m06Q73j90q3J66l56o12J077M43j425P80J389j018j230
1994f94M62j95j46J040J96r32N26P86j712o41J470P90r67j51M36o84k9J132p31
2013d4q25J628m65j574O49J270k13l37K35j159k01J385k66j186J614P45j447p29
2031i20Q21J90o16J049k47j601R55J071j474k13J866l70j236L86k66R8J015L85
$$ plain form
1904 -529 950 355 -1078 -187 229 -834 -358 687 75 222 706 -750 -1732 -228 446 -296 118 1044
1922 1044 -264 -579 -119 -620 -992 492 939 -911 -538 732 256 29 414 -229 -1383 -223 -253 -797
1940 -797 357 1438 332 -818 -263 -468 -1276 -141 531 267 600 756 -769 -1071 731 341 -626 -194
1958 -194 373 -341 439 790 262 -21 1149 -249 -1805 -313 895 287 316 881 -183 -441 178 -241
1976 -241 -759 804 1484 -102 -508 365 175 92 258 -98 -710 367 810 -615 165 1554 536 -694
1994 -694 -232 -427 -573 467 663 -269 257 1043 -669 -1310 160 950 -17 -168 268 -416 -445 687 -44
2013 -44 -869 759 294 -1280 -631 639 426 89 324 -835 -1036 349 83 -1103 511 1256 -191 -920
2031 -920 -99 91 -525 524 277 -1324 -369 702 -772 -985 881 511 -725 -339 -605 -507 508 893
2049H93j600j85J397p14j321J219J147n06j39n64o70M53J392p19q67J231J93j295
2067f55j1N98k8RN63r87o29J607M10j341K90J104j089q08P69j90J73J163j29j671
2087h52K14J184r68k65J144n8l51J28L8q85R75J042j923n55J331k6p10Q57N19
2106H39p66L76l01r48m07K239k11j002L85K99q59J12j3k07L34J068j172q36J107
2125C7Q80q51o49N48k95j90Q76n82k9J429J28j863n64J348j41n75P19J01j8P41
2145A050o78j380Q61J376j027j258P56N94J16j54J61p14L44L85j125q04J811Q47
2163A161r56l79K79o41K76N82q68L92J357p00j374M53R50l32m29N89p95N9J072
2182F96m68o18P05R62j177j163P78L40m6J145n38r87O42K10j310K65J183M6p64
$$ plain form
2049 893 -707 -892 505 -209 -1530 -311 836 330 191 -373 -1043 -590 802 83 -784 447 640 -655
2067 -655 -666 -68 -96 -87 476 -511 -1140 467 877 -464 -174 930 -159 -967 -198 -388 -215 948 819 -852
2087 -852 -638 546 -422 -687 457 399 48 176 214 -671 304 1346 -577 -1132 199 173 -537 320 839
2106 839 73 449 148 -800 -1207 1032 821 -181 204 503 -356 -244 -257 -464 -130 938 -234 -1070 37
2125 37 917 66 -583 -35 -330 -520 356 -226 -255 1174 1302 -561 -1125 223 82 -493 226 327 309 1050
2145 1050 372 -1008 -147 1229 202 -1056 -300 294 410 256 417 -297 47 432 -693 -1497 314 1161
2163 1161 205 -174 105 -536 -260 322 -546 -154 1203 503 -871 -418 532 200 -229 360 -435 -376 696
2182 696 228 -390 315 1277 100 -1063 -285 55 9 1154 616 -371 271 481 -829 -564 619 665 -99
2201i9k58L73l02P72J62j117q5J214p51p64Q12Q57l72l31K2q17M87J182p68p92
2221e75O81O20j325l28Q51K37R2M55q58n90J371M9j060J32P48k02p32L59Q1j75
2241a69P03l79j178Q34R18j003k01Q16L80p64n3l35m21J105N99r48l31R02J61
2260F36j120L31O18l32M8N0j090L81J276j49r50M2P85r55j46Q09m5K23P81r31
2280B62r75N79Q93q52n50J346l72l84K28l68n2P69K63j655k6J276L9m59P99j65
2300E96j98l69k69r90J166J068o04p55N71K40p11Q3K17l69O10L67j097J7J347
2319I20J54j150n19L41l9K17O8j54K10J053m12j658K86R29o3j99M43r0n4m1o02
2340c60m88J002N08r00n76Q60K57l86K44k36m30N59L2j016L02J665m43r63K11
$$ plain form
2201 -99 -357 16 -286 486 648 -469 -554 660 -91 -855 -43 814 442 111 133 -684 -197 985 217 -575
2221 -575 106 726 -599 -927 -76 161 253 708 -150 -740 631 680 -380 -248 500 298 -434 -75 6 -169
2241 -169 534 155 -1023 -189 729 -274 -475 341 721 -43 -96 -431 -852 253 852 -96 -427 475 636
2260 636 -484 -153 465 133 181 231 -859 -478 798 649 -301 -259 526 -429 -575 234 189 412 1193 262
2280 262 -713 -134 759 -93 -643 703 331 -53 175 -193 -245 524 787 -868 -894 382 421 -38 761 596
2300 596 398 29 -240 -1230 -64 1004 400 -355 216 456 -255 -172 45 -324 286 653 -444 -427 920
2319 920 1074 -76 -595 -254 -293 -76 -8 -162 48 1101 689 -969 -683 246 183 -16 427 337 283 242 -360
2340 -360 -848 154 662 -238 -814 46 303 -83 161 -75 -505 54 86 -930 -628 1037 594 -369 -158
2359a58l6j29L75j25j80L75P13p40q63Q62O28p77k32q0k15L52P04o84k60P60L95
2380F85j624j28J190j5J53q5k78k62N67R0j457R34J130q05o39K62K72N5K56j76
2400A25p76N44O50p50j76L47P24p97j46J13j00P82Kp42j52J183n30r54R6R42m5
2421C40J10k71o67Q9J140k98j234R81L80n99m09N77j7K03J74p93m28J025J50o21
2441a68K24O14k27n76o2o0J44P08J49j156K59N15m36k99M59O18p98K34J65p58
2461d51M45J217r04p85N64M19q77P8L97lM53R4r50p84J252K50q27K11O20n09l8
2482a28M37o97M89L54m78o65M42P62l01n03N23j95k46J62n88l0Q04M87p79n56
2502g06Q76m85j75M58j8l29M05J18q45L89Q73m94q81M24M41l34o6K74K09J76J5
$$ plain form
2359 -158 -194 -323 52 -73 -253 122 835 95 -768 94 722 -55 -287 -367 -582 -230 474 -210 -470 290 685
2380 685 -939 -1067 123 108 261 176 -102 -364 203 293 -1164 -230 900 95 -544 -282 -10 45 301 125
2400 125 -651 -107 543 -207 -383 -36 688 -109 -255 -142 -242 540 542 -200 -352 831 301 -653 -557 385 340
2421 340 450 179 -488 -399 741 443 -791 190 570 -29 -438 139 122 325 499 -294 -722 303 453 -168
2441 -168 56 670 443 -133 -195 -255 -111 597 746 -410 -151 364 -72 -371 88 706 -92 142 307 -451
2461 -451 -6 1211 307 -478 86 505 -372 -294 103 100 553 647 -303 -1087 165 415 -412 -201 419 -90 -128
2482 -128 309 -388 101 455 -23 -688 -246 516 215 -288 235 40 -206 -44 -632 -662 142 629 -150 -706
2502 -706 170 -315 -490 -32 -50 -379 26 144 -701 -312 561 67 -814 -390 51 -283 -349 -75 134 310 325
2523C25o68p08O20P77o54K75L49n82J21K27n97J90M89L13j168K13Q66k52k19M63
2543C80p93o7K60J57p74J028O52r53m90L40J00j8M68J1p87N05M69q51j99R80j20
2564B98n86L94k89P6j37O97p25L1Q30o03o81N41N01l97j50N31n06j90N73l28m54
2585e74R21K34r29l0N01M0L08Q6q13m60R36K2p18L92Q73n67n15K32k53N3O62l2
2607C69n96K40L97m78n56J026pl07j4j4n19L07O68m79k83J33N60p79o7N19j32
2628a2K08O1n56k37O68L62q34O40Q7l21m78J41p1L67O70o55m82K90O49p14m2O46
2650C87m24j28M04l28O4K41M04j093K88M08L5n37L23K98k02K96j38o63p0Q84k84
2671A65k14K43J62n72J14K65k71j13M76l43r8M54J06k11j44J99j67l62K43j75
$$ plain form
2523 325 -343 -1051 -431 346 -308 -33 316 -266 -145 82 -515 -325 164 477 -691 -478 388 136 -83 380
2543 380 -413 -480 -220 -63 -837 191 843 -110 -600 -260 -160 -178 290 301 -486 19 488 -363 -562 418 298
2564 298 -288 106 -183 -107 -244 453 -272 -241 589 -14 -695 -154 347 -50 -200 331 -175 -365 208 -120 -574
2585 -574 347 581 -348 -378 123 163 471 557 -256 -716 220 242 -476 -84 789 222 -293 -61 -314 -261 401 369
2607 369 -227 13 410 -68 -624 402 395 88 74 60 -459 -152 516 37 -246 -113 447 -332 -399 120 -12
2628 -12 196 257 -299 -536 132 494 -340 300 387 66 -412 -271 -342 25 695 40 -442 -152 497 -217 -259 387
2650 387 -37 -165 239 -89 -25 216 620 -473 -185 223 258 -279 44 342 140 436 298 -365 -435 449 165
2671 165 -49 194 356 -216 -102 163 -108 -221 255 -88 -186 268 374 163 19 218 51 -311 -68 -243
2691b43L7Q12k40m90l96N44l74N7N83k61k01J64J88k23L81m1l62l04M54N4k55
2712a16K76L2l04K89j58m65K4O60j56m08O20K6m83K90P0m88K22M81k38q69O84
2733a1L80o1o1K96p59J1L36k23k58O79Q3p31K1L82j73k81R26m43r1K39l53K9L06
2756B43J73o31k48M01P2k71O16P9n78L87j51j86k65N78lj55o4J17p17K73O93k61
2778A02j68J06j00k53R4P77o90J7M20m21n6J64J88n09J02M89o41j59R12k57j48
2799c1N43j54q83M58N3k65K0N81m8l33M56j67m61O00j72n48R8O82n02j36L56K35
2821C82n50j11O59q19L64M42k58k06M50l80l76J00K63j20L56L69n45l21M48K07
2841C54p08O4K33j7q6P12l00k15L74k32p09L39L22l77M03K18j10l44L52l48m66
$$ plain form
2691 -243 -206 606 366 -124 -520 24 -350 -293 290 29 -172 -8 180 -43 338 297 -65 -369 85 139 -116
2712 -116 160 192 -112 177 19 -446 -422 238 82 -326 294 320 -163 127 197 -291 -69 412 174 -695 -11
2733 -11 369 308 247 543 -216 -205 131 -92 -350 329 412 -319 -298 84 -89 -370 556 113 22 261 -92 -63 243
2756 243 416 -215 -463 -62 10 -261 355 434 -144 243 92 -94 -359 219 216 61 -3 114 -603 -330 363 102
2778 102 -66 40 -60 -313 -219 558 -132 -115 305 -116 -172 -8 180 -329 -227 262 -379 -538 374 117 -31
2799 -31 512 358 -525 -67 -14 -279 -259 322 274 -59 397 230 -231 369 197 -351 -253 429 -73 -209 147 382
2821 382 -168 -279 380 -439 -75 367 109 -97 353 -27 -403 -303 -40 -160 196 565 20 -301 147 354
2841 354 -354 -290 -57 -74 -160 552 252 37 411 179 -530 -191 131 -246 157 375 265 -79 273 -75 -541
2862e41M99M43n89J55J73l13K82p0J56m39L94k53k80Q3P13J4q56M21J5m96K54
2883b35O46l62K37J36j92q13N54J72p15N89N13o26J02N64l53K1k03pl09K54K8
2904AL35j26K94r3q27K6L21k58J86J96Q2j10J93J02o43P61j83k83j06L97n06R9
2926a42M59k03l52N60m59j30K42J53k03L79O6j98o79O56K09k91j05M08o78l76
2946f84J053j76n78P61j48k17l84L10J60J0J10j94k34m4N13n07J98O64n84k45
2966b16N09l96k95L78L66l30l27N54m37n78J046o4k85q8L80k60l62O64j24m30
2986b95K74o9j55J04L46n58P05k55j79m97O38L5m32N45K59m15j23L84j21n17J10
3007b16L28l66O47k86j69j9L95k58k04K19k84mK82M43o26NJ23j62k52K46K93m5
$$ plain form
2862 -541 -42 401 -188 -33 140 -173 109 39 195 -244 150 -103 -383 -300 413 427 -429 -8 7 -489 -235
2883 -235 411 49 286 422 230 -583 -29 143 -572 17 530 -96 6 570 217 238 35 28 -281 -27 1
2904 1 336 210 504 411 -416 -390 -69 -327 -141 55 137 27 220 322 -321 440 257 -26 -132 265 -241 -142
2926 -142 317 114 -238 322 -137 -267 -25 128 -75 304 370 172 -507 149 358 67 -38 370 -308 -684
2946 -684 369 193 -385 376 228 11 -373 -63 97 107 217 23 -211 -255 258 -249 -51 613 29 -216
2966 -216 293 -103 -398 -20 346 16 -311 243 -194 -772 274 210 -75 -163 217 -43 -405 259 135 -295
2986 -295 -21 -90 -245 -141 205 -353 352 97 -82 -579 59 94 -338 207 466 51 -72 312 191 -326 -216
3007 -216 112 -254 393 107 -62 -81 314 56 -148 71 -213 -217 65 508 -118 -113 10 -152 -404 -158 135 90
3029I0J61l96Q8n3J54k51j71M99r9j84j6N51p25l1M53j34n06M38M10o22N87Rn12
3052b60Q9R7m3l82P41J31o57N17K7o7l68O02k91m83n5N38k61j70N81l80k19M98
3074A85k08m87L40O35m88L05k15k99j49L74L6J37K00k19m01M81n2m63M13K62n38
3095a51k05M3L10k18J78M5l03O2J80J08l26M96K7k38k22L12l60J73M48j01m77
3116b19R9K27k92p4P59k01n48K46k7l98N56J96l65L12j42l58o1J70J97k12J06
3137b9L57l91j06J21O5j25N58l30j53k57M12j34pM36j57m01J25L79n44M64J32
3158D15o08L4M70j05n52P35j92m45K87J47m31K76l8L25l61q6L86m59M68r8k30
3179f2j46L70k53l31N46j1k98N01k83n32L18N12q1k58%Qj04k71P52m14j46L13
$$ plain form
3029 90 251 -145 -57 -110 44 -207 -378 121 22 -162 -178 373 -352 -383 70 -64 -570 -132 278 -344 243 252 -260
3052 -260 -171 -74 -117 -499 242 373 -284 233 260 193 -175 427 136 -347 -402 136 -125 -295 286 -94 -313 185
3074 185 -23 -510 -170 465 -23 282 67 -232 -381 -7 29 166 366 147 -254 227 175 -288 125 387 -151
3095 -151 -356 -313 -3 -221 -43 2 -301 -239 -59 49 -277 219 246 8 -214 98 -262 -89 359 258 -219
3116 -219 -120 107 -185 -259 500 299 -249 -3 -30 -428 128 324 -41 271 129 -229 -290 -120 77 -135 -29
3137 -29 328 -63 -169 -48 17 -108 450 120 -33 -290 122 -12 -19 417 260 -141 -16 363 -181 283 415
3158 415 -193 -159 311 206 -346 389 197 -248 39 186 -245 31 -7 318 -43 -129 257 -202 266 168 -62
3179 -62 -208 162 -91 -422 124 113 -185 316 33 -499 -181 331 250 -8 -8 0 -104 -375 377 -37 -183 130
3201A30p2j95P5K61o24M71L73o72J03N5J7j14K32n1j19L34p0k99j20M32o8j53
3223g4J98j66k39K16L4l08K60K89l58P7K19k6o2j94J31J9k36N00K2k04L5M5k83
3246a05m3P3J61l85N89k43j64k27N96p10L48L25m08r6M28k80n1M08J61n51J24
3267e0K21l30J08K35R0j23m0J95m61k52O28k53j99L28M3j84l4J42k65J23J15k75
3289b38L1O56k14m18R0K93m13oL48j68J71j30J36j51Q9J02l74J69K93l82j35K76
3311B5K34n35L95p0l37J97M04m34j45M85k23l84K72O1j85K35K08J0k51K63j59
3332F6m22L47J12k9j26L44j78o4j69K45j50J42R5j92j14K71k60J16L13l76k26
3353b55J38J97k05P1M09k63k90J99J55m00K84K47k67k77N62k74k34L23k60pK59
$$ plain form
3201 130 58 -137 -62 199 -425 46 419 -253 -150 -95 -78 -192 40 -11 -130 204 134 -165 -285 147 79 -74
3223 -74 124 -42 -281 -65 -31 -339 -79 210 -148 -71 148 122 60 -134 -3 16 -220 280 302 98 133 178 -105
3246 -105 -148 -75 86 -299 290 47 -117 -344 252 -458 -110 215 -193 -289 139 -141 -192 216 377 -174 -50
3267 -50 171 -159 -51 184 274 151 111 306 -155 -407 221 -32 -231 97 140 -44 -78 64 -201 -78 37 -238
3289 -238 -207 449 235 -183 -93 200 -213 -219 129 -39 132 2 138 -13 76 178 -196 -27 266 -116 -251 25
3311 25 259 -276 119 49 -288 -91 313 -121 -266 219 -4 -388 -116 -55 -240 -5 203 213 -38 225 66
3332 66 -356 -9 103 74 -52 292 114 50 -119 126 -24 118 213 21 -93 178 -82 34 347 -29 -255
3353 -255 -117 80 -125 -54 355 92 -198 1 156 -244 40 287 20 -257 305 31 -203 120 -140 -147 112
3374A12o8J26o47N95M3n11L96j52m28M48J91j5p4K29m45l7K58j42K54J41j23n9
3396I2k54K72P8l49L37j16l29j4L60N6p4L05m12j00J42mj83J79M78m07J03m1k0
3419I9l44J82kq4L13N8j76l01R10l89k26Q1k70l5L58L0j85L1K39l35j34LK1J09
3443d7K0L17j94j17K53j81l43K51oN6j46M13k75j33L08k29j39J03L28m62K63J17
3465A57j3k75L98j12j70M4J66j32n01L79j56J94L2K17l59P3M3j99K92o2o4R8K73
3488C23k62o8L9K88n18k99P46l75K4L42k57j01oJ00P7J31k82J16j28M77k69m38
3510c40L27K87l41J72j08Q2k30M02m26k96P42J4m57J77k8j2R5j33J99Jk47M55
3532C35o04J20L14k39Oj89J41j73J40J59oJ76M9k60J0j44L78l54K52J04l63J10
$$ plain form
3374 112 44 170 -477 118 161 -350 46 -106 -534 -86 105 90 16 245 -200 -237 21 -121 133 274 151 92
3396 92 -162 110 188 -161 176 60 -269 -283 77 133 59 364 -48 -148 -6 -10 -193 -14 464 57 160 119 99
3419 99 -245 -63 -65 -149 164 222 46 -255 655 266 40 121 -149 -184 174 204 19 50 289 -46 -180 -177 -156 -47
3443 -47 -27 290 96 -21 232 51 -292 -41 -47 9 -137 276 1 -132 176 -53 -192 -89 239 -223 40 157
3465 157 144 -131 267 155 -15 29 195 63 -438 -59 -215 -21 11 228 -131 -58 -15 -214 78 16 -48 50 323
3488 323 61 -7 32 320 -198 -497 249 -126 -102 240 -17 -118 -124 -24 53 184 -98 18 -110 367 98 -340
3510 -340 -13 274 -67 105 -3 79 -151 251 -175 -471 271 285 -172 5 -23 -35 60 -73 126 127 -120 335
3532 335 -269 -149 165 -74 -68 -257 -116 -289 -149 10 4 180 229 -31 -21 -165 213 -141 111 215 -148 -38
3554c8k70L40l40L94J84m65N4K98l15j89M16p0n06K26L33R3j17J65Qm20K01j00
3576a18N5J30J89n22K90m4j48k25J56J77j1J72lO2m04M40j90m1n4k97K72K48J82
3599C16m19J34J2L10p36Q39n53K76l3k05n4L07j26l0l34M57K11l18P8j24j28J01
3621a9L56n83J95J36m0r8k7J22P8l09M22p6k45j20L23j55L8L72l60j18M47j12
3643B27k66NJ05l90K14L33k39K62k65L4l61O1R2J02J56R6k06K03Q1j64j92J67
3665E5L2j98K86J41l73m5L0K40P4m53Q5r0J15L51j33m5N2j12M0p5J80n19L13J86
3689A37j49J83j12j07k66M42L00m04J08L8l67K92n2j3k40Q5J65r7rL74o63K68
3711h7K73j20k63J87J45n40J78K23j21l29M54j66J90J83n9k27q9N30m19J84Kj29
$$ plain form
3554 -38 -308 32 -308 86 270 -195 -141 157 -158 -347 69 -1 -507 -281 52 145 28 193 201 -219 -18 -118
3576 -118 -63 67 256 -266 24 -20 -168 -393 -237 -60 -71 101 98 160 -244 196 6 -35 -89 -386 -114 134 316
3599 316 -103 31 43 353 -383 456 -97 179 146 -59 -113 194 68 38 -296 161 372 54 132 8 -120 -19
3621 -19 337 -246 -51 85 45 -53 -80 42 120 -189 233 157 -88 -208 115 -40 -2 370 10 -108 339 227
3643 227 -39 -34 71 -319 -105 228 -11 251 -14 20 -341 -280 -188 -86 70 166 -40 163 244 80 -112 55
3665 55 87 -111 175 316 -57 -102 -72 168 242 -211 -126 -216 -101 250 117 72 124 12 52 -23 157 -362 -49 137
3689 137 -12 171 59 -48 -314 128 428 24 132 170 -197 95 43 30 -210 -125 40 -57 -66 308 -355 -87
3711 -87 186 66 -197 -10 135 -405 -227 -4 -125 -454 0 -166 24 207 148 -79 -168 362 -57 127 129 0
3733@k92L91k74R6L8M13l81J04l3q9J18k10K16k38J91l86N15r4k38K83n13L27
3755e6Q5j40L32M3n55K6L50p2j55J86J14l08j14N61l94K57j03j5k0j38J99k13
3777a30K14O7p1k7J34J22m60O6J65j45k16M66k71J41K4j00n2Mj0N2M7J48J08l36
3801f0L48l49J11J26N8k97O9j89K51l14K83K00k52K96J05l27j91K04J26m64L55
3822H9J65m89K43J72n07j90O13j67J10J8j43j27oL79l0j66L16o00K67K75P4Rk31
3845G4J94m35%M32l50J60j68L72p47L89J87j56K31OJ11l64K08j21l20N22j18k31
3867a24J2J18K23k24j33J68j28j87M73k77o5K30k55J46j11k09N7K75R4N7n24M87
3889A03O9l25J85k04P0J18J35k90L6O05l25j98J27J16l13P6L15j59j18jk4j10
$$ plain form
3733 0 -292 99 -175 -79 -41 372 -9 95 62 -27 91 -119 97 -141 50 -336 179 85 -153 130 -383 -56
3755 -56 29 -111 221 264 -291 -265 85 13 -142 44 158 -150 -264 297 -97 160 57 42 22 -116 83 -130
3777 -130 84 151 80 53 187 309 -151 -85 80 -65 -281 185 -86 55 79 -21 -73 -69 -79 -27 20 168 276 -60
3801 -60 288 -61 50 176 234 -63 6 -183 68 -246 37 237 -15 281 386 59 -132 72 198 -266 89
3822 89 254 -235 8 180 -327 -517 96 -71 39 57 -86 -213 -219 160 130 -36 280 -320 -53 222 296 305 74
3845 74 268 -167 -167 265 -85 75 -93 279 -468 -79 108 -48 183 189 300 -64 144 23 -297 225 107 -124
3867 -124 -112 6 229 5 -128 40 -88 -275 198 -79 -144 86 -169 -23 -134 -343 -286 -11 83 140 -384 103
3889 103 172 -153 32 -172 -102 16 151 -139 -103 502 177 -21 106 222 -91 -15 300 141 23 22 -2 -112
3911a12R0M52k21o9n0k59J56J07r2j53K57n4j74K84m6k11j53L04Q4k65M8j37J03
3934a11Q4M30j95j06q1Lm04K90J65j02M7K75j99N9m9j59k68O49l34p1O7n2K78
3957B16j88j16L2J33k70L26l40J16K04qk12K75J20m68L62k74N8J60R5k65J0J60
3979A26Pl88K53Q5n8j87K35L1l42J65QR9Q8k46k0J23K47o22O22R9n68K33p1J32
4003E1k31K6P7J39J45l23J13k78Q6K96j66kK30p1o3L7n4k65K20J30J72J08l35
4026D2m00J60L35J86k66l9K03l00J72j07L33m49J56k7j88J71n7L55m65J72K8l29
4048c14J50M15m08J60k3k94J39K11k6k01J83k90L52o5or4K79M2L6k19J59j51j70
4071a35m6J68J36k58O9j75L38J97j84m53K93l28M01j6J16j11l16L87K56o54J36
$$ plain form
3911 -112 -22 430 209 140 90 -169 -13 94 2 -151 106 52 -122 162 116 -95 -248 56 140 -125 -77 -214 -111
3934 -111 -27 403 208 102 21 24 -380 -90 75 -27 20 295 96 155 106 -53 -321 328 -6 -77 -10 -62 216
3957 216 28 -88 -56 77 -193 133 -207 -91 113 105 -107 168 288 -180 182 -92 -34 126 221 -44 -34 126
3979 126 133 -255 -2 83 25 -162 73 104 -238 -73 -65 34 122 -124 -144 -21 226 -396 226 325 -243 -10 -81 51
4003 51 -180 -154 -77 62 207 -116 -3 -281 -195 101 -65 -67 163 92 29 66 12 -253 -33 97 269 377 42
4026 42 -358 -198 137 323 57 18 221 -79 93 -14 319 -130 26 -1 -189 -18 -75 280 -185 -13 15 -314
4048 -314 -164 251 -157 3 -20 -314 -175 36 10 -191 -8 -298 54 -11 -17 -111 168 210 246 27 186 35 -135
4071 -135 -181 -13 123 -135 -66 -241 97 294 110 -343 -50 -378 23 7 123 12 -304 83 339 -315 -179
4092a79M18k33j99M6M00o56L54L92l55m5P3ok32J09J66m7k02M1o4J38J91j45J01
4115F6p1J55j77j74K80jn3K44k54j0P7N3k36J30J77m67K30j42m2j78K50L46k19
4138a6M7J38k91N6J68Pj93L98k20j11n5L15m27J63k07K11l78N95k68l4J38J90
4160B26m58R2P4N4r8L11j42j21R7R3j59L65m41J38o9%o1n6K29J50n33K50j29J23
4184f5j60J89L50k33l3k13K60m37J20M8r1K35j76K09j43K72K48o58J71j6J67k83
4206b39M99l98J40N7j17Q0j26Q8j33J16M3k90K43m8j69K22M08n83j10N24j04j37
4228c4R2j6K96m65L68k96l43L75J42k70k40M74j26k3J86K08m14J19O7l25J08J86
4250F9l28K84j73K64J88l72J95k54o6M52j38k89K10l3k68J64l4r6O6k13L35j03
$$ plain form
4092 -179 239 6 -193 -147 253 -403 -49 343 -12 -57 16 10 -222 -113 53 6 -196 -155 -219 -81 110 -35 66
4115 66 -5 150 -27 -201 79 78 25 269 15 5 82 135 -101 29 206 -261 -31 -173 -215 -393 -143 203 -16
4138 -16 31 169 -122 -66 102 109 -84 314 94 -17 -72 243 -184 -21 -228 -17 -395 200 -68 -102 36 226
4160 226 -232 -140 -66 -12 -110 201 59 -62 35 128 -31 334 -107 31 -38 -38 -99 -155 74 224 -309 -59 -188 -65
4184 -65 -225 -36 314 81 48 -165 95 -342 -222 -174 -265 -30 -206 3 -140 132 380 -278 -107 -123 44 -239
4206 -239 260 -138 2 59 -58 22 -104 -16 -149 -33 10 -280 -37 -85 -254 -32 376 -207 -317 207 103 -34
4228 -34 58 42 338 -127 241 -55 -398 -23 119 -151 -391 83 -43 -66 120 328 -86 33 100 -225 -117 69
4250 69 -259 25 -148 116 304 -68 127 -127 -193 259 121 -168 42 9 -259 -95 -129 -225 -159 -372 -37 -140
4272a40N17l79J22K5j8m5o2J70k97j53K88R8j00p1L39k76m7J28j24J42n1J95m45
4295a84L9L09n9k41J61k30J13J59j54k6J1K49j55k05M67l25j06n4L05pNj63O1
4318c0Q5l11J87J96l07M34l08j22J61M8P5R8k9k36J43k97K5p7J55J28J61m28K72
4341B3Q1j28Q4j89K14K19j30r9J28k12j28K95O1n07O5N30m14J13J10J57l58J44
4363E9m8P1L4j41J9l9R2J63l33K1M07j64k81J14N7Rj49K27k4j26Q6k34q1J29K79
4388A47l56K70l06rJ50K46l01J00R0K2j88pJ18j74K52j83L9J25N3l48M59k61K2
4411d0j07K82q3l90J19L81k76Q9Q3r5K11k49M71m03K80j48k38K34l7J31m01m5
4433b31K55j95K91K5K9j97O2l63j00L26K18n0j33J27j36%K39L58n88l2L59m05
$$ plain form
4272 -140 377 -2 120 145 127 82 20 190 -107 -260 28 126 26 -45 294 18 -29 99 -25 117 66 261 -184
4295 -184 -145 164 105 -136 25 -205 -92 67 -87 -113 -102 147 -8 -213 254 -71 -177 -231 74 67 72 -91 -30
4318 -30 55 -256 -69 127 -180 254 -54 -176 -15 33 108 206 177 -59 84 -213 -188 -265 -110 18 179 -249 23
4341 23 104 -24 60 -129 85 304 174 75 203 -9 -137 158 219 -288 -223 307 -107 6 116 273 -85 59
4363 59 11 82 116 -25 -6 -45 47 210 -123 -102 305 141 -140 -26 31 40 -109 118 94 -32 54 -180 -261 -132 147
4388 147 -209 61 -245 -254 -104 142 -159 -59 31 53 -135 -142 -24 -198 54 -129 -90 35 88 -260 199 -62 -40
4411 -40 -147 135 52 -338 -219 162 -114 -25 58 -37 174 -75 396 -7 273 125 -113 121 84 215 -186 -231
4433 -231 24 -171 120 145 174 -23 39 -324 -424 -98 120 70 -63 64 -72 -72 167 525 -63 -95 264 -141
4455a41o1LL01J5O7j72k26L57j15J20l63N94j40l52P9L10k27k44L89k41o5M02
4477B90m34J07K12j45l61M90k06J85m7j6r2j20PJ06j10K12J20m28L53k93K77j86
4499g9qL72k67k21K76l05J78k96M43k71K12J07q9M3k05m0j9j32L18k37J95Q4j0
4522D9N8k16J36j47K48L3k79J69M0j08L6J67j82JL78j60k39q2M1lJ3K35p9j06
4546Cl21K21P0o7L83l12k60L09N3N1p8J05j96O4j32K22K4K1j37l75O2K98j05L09
4570B12k21J32p3K65k1l70J18k45Q4q6L38j59M2J55j72j13L7J59j69M9K92k17
4592C7K16l03j34J80l2l24K35N5J50qk38J18l8J16J27K3l0J2j21k21R5K58r7k61
4616a85J51J52k11j43L22k43L36k54L8L30j29Q0m76L62L7j42J20k38j21L69j98
$$ plain form
4455 -141 -202 -199 102 117 184 12 -214 143 28 148 -215 379 239 -113 -34 276 49 -195 194 -47 -112 290
4477 290 -144 -37 175 30 -331 159 -47 138 91 75 -17 -137 -130 -24 -134 78 198 -230 123 -170 107 -79
4499 -79 -87 285 18 -203 73 -232 -54 -350 93 -178 34 141 52 95 -110 -150 -169 -301 17 -220 -25 59 49
4522 49 107 -109 27 -120 128 161 -118 51 91 -17 19 186 4 5 383 223 -16 -98 -57 -60 -47 188 109 3
4546 3 -318 -97 -27 -94 289 -23 -283 26 79 130 52 157 -39 25 -107 115 139 160 23 -352 -290 8 -97 212
4570 212 -9 123 50 315 294 -76 42 -203 -119 -205 133 -26 16 171 -1 -114 -77 82 -87 -38 254 37
4592 37 253 -50 -184 -4 -36 -360 -125 -70 80 72 -166 -48 -86 30 157 180 150 162 41 -180 -85 173 76 -185
4616 -185 -34 118 -93 -236 86 -157 179 -75 -37 293 164 244 -232 130 167 25 145 -93 -214 155 -43
4637d3L91m31J52K23l52p7J43j12n9J05LP5K75j10N0l99K94k04N9L04j51r2J95
4660B39l51j26K79K3M09o57L59j83l0j56K27n8l5K52K8j37j48j43J48PO6oJ3K00
4684B20k50m5K92k25K70l08K90l46J0J04j82K1K76j03k15J37R4M3j99l4J27o6
4706h9J74O1r6J80m02J39l8K26j35P3L3K71o18M36j69o8j41j05L88j34J23r0J72
4729A91k46j24P8j47K9K65l18L3L85j93J9K74l33K46j71j15j73L76N9j13J6J28
4751A66R9l7o03M08m1N7K68l80R0po8L4K13j83q5K3J64j88l1O9j39j1L09j28j1
4776a2j22J84j78L24j77k1l8P8L19k77k72K29lq2k34L98j79Km8j6K49q9r4k00
4800b59M93k99j00J72N1j19j06J14m2l6q5K61k05J9K7N5J41j77J69k58L52j54
$$ plain form
4637 -43 348 -83 69 292 -60 -137 6 -106 -165 -60 -57 18 293 183 233 -166 128 -76 -17 287 136 44 239
4660 239 -112 -238 41 64 473 -184 175 -8 -38 -194 33 -25 -60 192 220 83 -65 -208 -60 -53 13 7 20 220
4684 220 -30 -75 217 -8 262 -46 244 -102 -92 12 -170 -149 127 24 -191 -54 40 83 -116 -150 -23 -89
4706 -89 85 146 50 230 -172 -33 -71 155 20 93 126 397 -221 215 46 -22 -163 -268 120 -14 109 19 191
4729 191 -55 -179 -101 -248 -219 46 -272 -239 146 -47 -28 246 -87 159 -12 -127 -300 76 135 22 38 166
4751 166 265 228 -375 33 -8 49 317 -63 27 20 -48 -14 199 16 -69 -46 118 -70 -101 -32 -171 -182 127 -1 -12
4776 -12 -134 50 -128 196 19 -2 -40 38 357 80 -192 37 34 -48 -282 116 -63 -61 -109 -125 124 35 -59 -259
4800 -259 234 -65 -165 7 58 -61 -167 -53 -95 -131 -216 45 -160 -141 -114 -59 82 -95 74 -184 168 14
4822A4K71p2m11J15j9n9K60Q1o3O4k88Q5J32q0j13K04n15J81N13q5j34P6m22J82
4846h3K1K15m5o3m00K77j21L88j34P5l11L80k51r3K93m43M13j07J12j24K8j6N5
4869F6o9J79k96L48j19l4n4J36j95N1N7K04l93J84n3j07J52k07K01j30k88O12
4891B45k48k56K86l88L17M3j84K09J2J2K55m92L02j32L4r8J3jP2N7n8l21N37l5
4915A81j30j80K95j35k37K57O9k77J95R4j30k08P8M60l44K89n6l6j98j70L61o9
4937A09p8L30n10J42k1R4P9k71pR3J2J34o2k32K16k14K71j70K52jk90pQ5K31m73
4962b88K35J30J1p5OK81j17k1k95K59k09j54M64l92m6L02l72N03j64K2k23N6K62
4985A75q4m3j27o8Kp0L20j82rJ26o0lK13j86p3L58j28m07j3K56K34l98J71J33
$$ plain form
4822 14 285 213 -198 -83 -102 -161 99 180 117 181 -107 -22 110 30 -83 121 -394 -213 300 215 81 157 -265 -83
4846 -83 -62 153 108 45 -355 -78 -199 189 55 130 -181 199 -52 -145 148 -295 118 11 123 -1 27 11 66
4869 66 -3 176 -120 228 109 75 21 157 -38 13 70 274 -119 65 12 -95 57 -150 51 -79 -367 245
4891 245 -3 -259 27 -361 -44 -1 -185 24 36 48 303 -189 113 -19 15 -83 -70 -71 1 58 0 -321 216 181
4915 181 51 -129 166 31 -206 51 120 -157 38 132 2 -206 -128 332 -12 277 221 185 -13 -183 178 109
4937 109 31 361 -149 -7 -28 66 145 -126 -133 -40 -28 106 44 -188 28 -186 85 -85 167 166 -124 -131 -46 185 -288
4962 -288 -53 77 88 13 19 300 183 162 -133 126 -83 -237 227 -165 -211 91 -281 222 58 80 -143 -87 175
4985 175 91 48 -79 -147 -145 -215 105 -77 -86 40 -20 -23 190 4 -69 289 161 -246 -259 -3 231 -167 4 137
5009A37k38J80j84k82M37R2j05j08k8J40l1m0K52k44k11K97k56j66L32K27l33
5030a32J84j91L44k89L7p9M2L31k38J04j01q9j25L35j37M0j05j1J73j82q1P4J5
5053h1J61O1J9n7k79j7K45j28J05L3n5J26J17k99O3J25n24M30J27J05j65PJ41
5076B60j03J00l54J59j47ok14L41J02k14L53l84K78l26L72k09oM7k63O49n29P8
5098a6r6J81j30m7k09L93l11k9K33j62r3k3L50k5p6K27k25o0M2M22l35K9q9J85
5122A36qq1J01k52K05mR3k07J75j59K44k29K70p3j01j13K68l09R8K15k04R4J05
5145B64k29j2k9q8J31j95J85K74k80j45j74K47j67K16J21j65NJ86l01L52j17j81
5167a02K45L7M3m40J40l1R2m4l6K7q3P2J40n9L50n14L23k06q5j18Q8J4L58k22
$$ plain form
5009 137 -101 79 -105 -387 50 142 37 -71 -99 41 10 -30 222 -22 -233 64 -192 -358 -26 201 -132
5030 -132 52 -139 205 -84 -47 -126 -84 247 9 113 12 -77 -202 133 -4 36 -69 -80 93 -89 -170 -96 -81
5053 -81 80 141 160 103 -176 -193 52 -76 29 62 7 133 250 -49 14 139 -385 45 172 277 112 119 260
5076 260 157 257 -97 62 -85 -91 -305 36 138 -76 277 -107 171 -155 217 8 2 49 -214 435 -94 -16
5098 -16 -112 69 -61 -108 -317 76 -235 -264 -31 -193 -286 -309 41 16 -60 167 -58 -118 -76 346 11 40 -49 136
5122 136 128 47 148 -104 101 97 190 -17 158 -1 243 14 284 211 110 -3 265 -44 54 269 65 159 264
5145 264 35 23 -6 -94 37 -158 27 301 21 -124 -298 -51 -218 -2 119 -46 -41 145 -156 196 79 -102
5167 -102 143 180 223 -217 -77 -108 -16 -60 -96 -69 -152 -80 60 1 351 -163 160 -46 -131 -249 -161 -147 211 -11
5191a1K88l33J25M7L02o33L55N9j67j62j89L67l9M5l26j25M61j09p1K96l81N54
5213C53n73J80K11j44J2oL1j40j75J70k1J63j13k2J6MK0K8J72l25L2j98L93N1
5237A19k02l1J04K50q6k35K84n0j18K18k33j18n3r3N85k84q3K6Q8j62L96K4m40
5260i4K44k69K18r0j92L34l11K97j03k82L95J22j40j79J06k99M72n98M31r9j01
5281a38K5M1R1j81L84l09RJ30k42j11J23J43J32l46J04K41M3K30m63K15m51M41
5303A11j50K93m64J40L34j48m6m71M91M3p3L1N0j08K01k07k35M24l43j92N62j45
5325I8j33J81j24k73N23n08K00J33LnK95j46l93L59K8l79J38n0j16R7J59Q2j92
5348b3K12o9k13J06k70K84J06k20n4k4K35J17k41K18k49O6k21L69m9j14L3J98
$$ plain form
5191 -11 277 -56 69 116 418 -215 140 199 32 -130 -319 48 9 54 -272 -397 64 -45 -116 180 -201 353
5213 353 -220 -40 171 27 39 33 64 -76 -251 -81 -102 61 -52 -74 -58 -54 -34 -6 166 -159 -127 -325 68 119
5237 119 -83 -114 -10 240 154 -81 203 153 35 253 20 -98 -151 -244 341 57 -26 0 88 -74 322 346 -94
5260 -94 150 -119 99 9 -183 151 -160 137 34 -248 147 269 129 -50 56 -243 229 -369 62 -37 -138
5281 -138 -113 -72 19 -162 222 -87 -78 52 -190 -301 -178 -35 97 -249 -145 96 139 369 -94 121 -330 111
5303 111 -39 254 -210 -70 264 116 70 -401 90 133 60 91 141 33 234 27 -208 216 -127 -319 243 98
5325 98 -35 146 22 -251 272 -236 -36 97 100 95 390 244 -149 210 238 -141 -3 -53 -169 -72 87 169 -23
5348 -23 189 120 -93 13 -257 27 133 -87 -141 -165 70 187 -54 164 -85 -19 -240 129 80 -34 -1 197
5370A97p6k44K88j1m4lKo1m6K06j8l35J8J87k30K68l05O2L1R6n1K90k1j91J19
5395A28k19L8j8j21J28N9q3L43j12k04r5K67o1J68j68Qm87L10J29l14K35j4j48
5418b31L05j4L4j28j27J98q5O1j15J31Q4p4l56J29%J68K52j73j43k4L26j07l30
5441b19K09%J01j17J85j02o6R5k68J65j46J37J63O5m20K26m1J42j58N6q2K14k52
5464a13J30r4l5J28K7j38P8J14j08P0K7k76o6J66R3n1m6J1J48k06k3P9L14k36
5488gNJ18j23K4qj02J02k09L08L0o3M7n13O26j12l83L2K19P9j01J75J23l82J55
5512D0n4j34q5M87k60J31k27p0J88R2j13k19K36j65M08n01J15L32m01J30j24R9
5534i5J81j69J80l35L64l3n9j33L2%Q1J98j84j57M42l72j9k25N11j14M0k97K66
$$ plain form
5370 197 121 -123 165 154 110 107 109 48 2 208 190 -145 -127 60 -170 98 -207 -145 -114 -18 -69 221 200 9 128
5395 128 -91 -53 -71 -192 -64 -5 -88 255 143 -61 -156 111 50 218 50 58 -429 -119 10 -304 -69 -83 -231
5418 -231 74 60 94 -34 -161 37 -48 13 -102 29 113 39 -317 -188 -188 -20 232 59 -84 -108 218 111 -219
5441 -219 -10 -10 91 -26 159 57 -9 86 -182 -17 -163 -26 137 202 -218 8 -33 109 -49 7 -75 139 -113
5464 -113 17 -77 -112 16 43 -95 -17 97 -11 59 86 -190 -256 -90 3 -48 -94 -83 65 -141 -164 -85 229 -7
5488 -7 -2 116 -7 17 9 -93 9 -200 108 138 75 122 -391 235 123 -260 -228 -9 70 -31 144 267 -115 40
5512 40 -14 -148 -233 254 -6 125 -102 -172 16 108 -5 -224 12 -153 255 -246 -131 201 -200 -70 -194 -95
5534 -95 86 -83 97 -238 126 93 34 -99 -67 -67 14 212 28 -129 313 -59 -78 -303 208 94 134 -163 103
5557A03k61K65J2n88L85r8K29j39L41k80M2j22J39J33o0m5Q3n42J59M94l65J67
5579E2J42j01K47q6j02k28J62k94K1J42k52L13%R2l61J78N0P7p0l2K08j89j3p
$$ plain form
5557 103 -158 107 119 -469 -84 -182 47 -92 249 -31 11 -111 28 161 101 56 139 -403 -244 250 -115 52
5579 52 194 93 340 254 152 -76 86 -208 -187 -45 -297 16 16 108 -253 -75 -25 52 -18 -50 158 -31 -44 -51
$$ [...]
8191a26
##END NTUPLES=NMR FID
##END=
