##TITLE=1H_T-3936
 DMSO-d6+CDCl3, 8 sc, 
 22.8.2019
##JCAMPDX= 6.0         $$ Bruker NMR JCAMP-DX V2.0
##DATA TYPE= NMR FID
##DATA CLASS= NTUPLES
##ORIGIN= UXNMR, Bruker Analytische Messtechnik GmbH
##OWNER= root
$$ XWIN-NMR		Version 3.5
$$ Thu Aug 22 16:10:02 2019 Russian Standard Time (UT+4h)  she@DPX200
##.OBSERVE FREQUENCY= 200.13155
##.OBSERVE NUCLEUS= ^1H
##.DELAY= (6, 6)
##.ACQUISITION MODE= SIMULTANEOUS
##.ACQUISITION SCHEME= undefined
##.AVERAGES= 8
##.DIGITISER RES= 18
##SPECTROMETER/DATA SYSTEM= spect
##.PULSE SEQUENCE= zg30
##.SOLVENT NAME= DMSO
##.SHIFT REFERENCE= (INTERNAL, DMSO, 0, 15.7039)
##AUDIT TRAIL= $$ (NUMBER, WHEN, WHO, WHERE, WHAT)
$$ ##TITLE= Audit trail, XWIN-NMR		Version 3.5
$$ ##JCAMPDX= 5.01
$$ ##ORIGIN= Bruker BioSpin GmbH
$$ ##OWNER= she
$$ F:/spectra/data/she/nmr/H-F/1/audita.txt
$$ ##AUDIT TRAIL=  $$ (NUMBER, WHEN, WHO, WHERE, WHAT)
(   1,<2019-08-22 16:07:46.14 +0400>,<she>,<DPX200>,
      <created by zg, POWCHK disabled, PULCHK disabled
       configuration hash MD5:
       00 E9 B6 7A A2 85 ED C7 34 08 36 98 17 FE 4E 26
       data hash MD5: 16K
       AD 57 12 1D 72 2A A2 59 62 47 06 34 06 01 03 DB>)
$$ ##END=
$$ 
$$ hash MD5
$$ 2E 3B B0 BD 3A E9 60 32 70 0C B1 81 D4 AC CF E7
##$RELAX= 
##$RELAX= 
##$RELAX= 
##$RELAX= 
##$RELAX= 
##$RELAX= 
$$ Bruker specific parameters
$$ --------------------------
##$DU= <F:/spectra>
##$EXPNO= 1
##$NAME= <H-F>
##$PROCNO= 1
##$TYPE= <nmr>
##$USER= <she>
##$AMP= (0..31)
100 100 100 100 100 100 100 100 100 100 100 100 100 100 100 100 100 100 
100 100 100 100 100 100 100 100 100 100 100 100 100 100 
##$AQSEQ= 0
##$AQ_mod= 1
##$AUNM= <au_zg>
##$AUTOPOS= <>
##$BF1= 200.13
##$BF2= 200.13
##$BF3= 200.13
##$BF4= 200.13
##$BF5= 200.13
##$BF6= 200.13
##$BF7= 200.13
##$BF8= 200.13
##$BYTORDA= 1
##$CFDGTYP= 0
##$CFRGTYP= 5
##$CHEMSTR= <none>
##$CNST= (0..31)
1 1 145 1 1 1 1 1 1 1 1 1 1 1 1 1 1 1 1 1 1 1 1 1 1 1 1 1 1 1 1 1 
##$CPDPRG= <>
##$CPDPRG1= <>
##$CPDPRG2= <>
##$CPDPRG3= <>
##$CPDPRG4= <mlev>
##$CPDPRG5= <mlev>
##$CPDPRG6= <mlev>
##$CPDPRG7= <mlev>
##$CPDPRG8= <mlev>
##$CPDPRGB= <>
##$CPDPRGT= <>
##$D= (0..31)
0 1.2 0 0 0 0 0 0 0 0 0 0.03 0 0 0 0 0 0 0 0 0 0 0 0 0 0 0 0 0 0 0 0 
##$DATE= 1566475665
##$DBL= (0..7)
120 120 120 120 120 120 120 120 
##$DBP= (0..7)
150 150 150 150 150 150 150 150 
##$DBP07= 0
##$DBPNAM0= <>
##$DBPNAM1= <>
##$DBPNAM2= <>
##$DBPNAM3= <>
##$DBPNAM4= <>
##$DBPNAM5= <>
##$DBPNAM6= <>
##$DBPNAM7= <>
##$DBPOAL= (0..7)
0.5 0.5 0.5 0.5 0.5 0.5 0.5 0.5 
##$DBPOFFS= (0..7)
0 0 0 0 0 0 0 0 
##$DE= 6
##$DECBNUC= <off>
##$DECIM= 24
##$DECNUC= <off>
##$DECSTAT= 4
##$DIGMOD= 1
##$DIGTYP= 9
##$DL= (0..7)
0 120 120 120 120 120 120 120 
##$DP= (0..7)
150 150 150 150 150 150 150 150 
##$DP07= 0
##$DPNAME0= <>
##$DPNAME1= <>
##$DPNAME2= <>
##$DPNAME3= <>
##$DPNAME4= <>
##$DPNAME5= <>
##$DPNAME6= <>
##$DPNAME7= <>
##$DPOAL= (0..7)
0.5 0.5 0.5 0.5 0.5 0.5 0.5 0.5 
##$DPOFFS= (0..7)
0 0 0 0 0 0 0 0 
##$DQDMODE= 0
##$DR= 18
##$DS= 0
##$DSLIST= <SSSSSSSSSSSSSSS>
##$DSPFIRM= 0
$$ [...]
##$SUBNAM2= <"">
##$SUBNAM3= <"">
##$SUBNAM4= <"">
##$SUBNAM5= <"">
##$SUBNAM6= <"">
##$SUBNAM7= <"">
##$SUBNAM8= <"">
##$SUBNAM9= <"">
##$SW= 24.9336996594482
##$SWIBOX= (0..15)
0 0 2 0 0 0 0 0 0 0 0 0 0 0 0 0 
##$SW_h= 4990.01996007984
##$TD= 16384
##$TD0= 1
##$TE= 0
##$TE2= 300
##$TE3= 300
##$TEG= 300
##$TL= (0..7)
0 120 120 120 120 120 120 120 
##$TP= (0..7)
150 150 150 150 150 150 150 150 
##$TP07= 0
##$TPNAME0= <>
##$TPNAME1= <>
##$TPNAME2= <>
##$TPNAME3= <>
##$TPNAME4= <>
##$TPNAME5= <>
##$TPNAME6= <>
##$TPNAME7= <>
##$TPOAL= (0..7)
0.5 0.5 0.5 0.5 0.5 0.5 0.5 0.5 
##$TPOFFS= (0..7)
0 0 0 0 0 0 0 0 
##$TUNHIN= 0
##$TUNHOUT= 0
##$TUNXOUT= 0
##$USERA1= <user>
##$USERA2= <user>
##$USERA3= <user>
##$USERA4= <user>
##$USERA5= <user>
##$V9= 5
##$VALIST= <valist>
##$VCLIST= <CCCCCCCCCCCCCCC>
##$VD= 0
##$VDLIST= <DDDDDDDDDDDDDDD>
##$VPLIST= <PPPPPPPPPPPPPPP>
##$VTLIST= <TTTTTTTTTTTTTTT>
##$WBST= 1024
##$WBSW= 4
##$XGAIN= (0..3)
0 0 0 0 
##$XL= 0
##$YL= 0
##$YMAX_a= 190652
##$YMIN_a= -248285
##$ZGOPTNS= <>
##$ZL1= 120
##$ZL2= 120
##$ZL3= 120
##$ZL4= 120
##$ABSF1= 10
##$ABSF2= 0
##$ABSG= 5
##$ABSL= 3
##$ALPHA= 0
##$AQORDER= 0
##$ASSFAC= 0
##$ASSFACI= 0
##$ASSFACX= 0
##$ASSWID= 0
##$AUNMP= <proc_1d>
##$AZFE= 0.1
##$AZFW= 0.1
##$BCFW= 1
##$BC_mod= 2
##$BYTORDP= 1
##$COROFFS= 0
##$CY= 11.3945322036743
##$DATMOD= 1
##$DC= 2
##$DFILT= <>
##$DTYPP= 0
##$F1P= 20.1720416913024
##$F2P= 0.152960286110954
##$FCOR= 0.5
##$FTSIZE= 0
##$FT_mod= 4
##$GAMMA= 1
##$GB= 0.15
##$INTBC= 1
##$INTSCL= 1
##$ISEN= 128
##$LB= 0.24
##$LEV0= 0
##$LPBIN= 0
##$MAXI= 10000
##$MC2= 0
##$MEAN= 0
##$ME_mod= 0
##$MI= 1.114404
##$NCOEF= 0
##$NC_proc= 0
##$NLEV= 6
##$NOISF1= 3.799351
##$NOISF2= 2.8
##$NSP= 1
##$NTH_PI= 0
##$NZP= 0
##$OFFSET= 15.70392
##$PC= 1
##$PHC0= -9218.771
##$PHC1= 20.20096
##$PH_mod= 1
##$PKNL= yes
##$PPARMOD= 0
##$PSCAL= 0
##$PSIGN= 0
##$REVERSE= no
##$SF= 200.130013532006
##$SI= 16384
##$SIGF1= 3
##$SIGF2= 2
##$SINO= 400
##$SIOLD= 16384
##$SREGLST= <1H.CDCl3>
##$SSB= 0
##$STSI= 0
##$STSR= 0
##$SW_p= 3612.71676300578
##$SYMM= 0
##$S_DEV= 0
##$TDeff= 0
##$TDoff= 0
##$TI= <>
##$TILT= no
##$TM1= 0
##$TM2= 0
##$TOPLEV= 0
##$USERP1= <user>
##$USERP2= <user>
##$USERP3= <user>
##$USERP4= <user>
##$USERP5= <user>
##$WDW= 1
##$XDIM= 8192
##$YMAX_p= 0
##$YMIN_p= 0
$$ End of Bruker specific parameters
$$ ---------------------------------
##NTUPLES= NMR FID
##VAR_NAME=  TIME,          FID/REAL,        FID/IMAG
##SYMBOL=    X,             R,               I
##VAR_TYPE=  INDEPENDENT,   DEPENDENT,       DEPENDENT
##VAR_FORM=  AFFN,          ASDF,            ASDF
##VAR_DIM=   8192,          8192,            8192
##UNITS=     SECONDS,       ARBITRARY UNITS, ARBITRARY UNITS
##FACTOR=    0.0002004,     1,               1
##FIRST=     0,             0,               0
##LAST=      1.6414764,     0,               0
##MIN=       0,             -248285,         0
##MAX=       1.6414764,     190652,          0
$$ Real data points
##PAGE= N=1
##DATA TABLE= (X++(R..R)), XYDATA
$$ [...]
1874C7J90j81K33l07K46j18l49K40o0P3L89m17j93R6k19N55J08l00k45j31M36
1895H3J05L7j50j08j77J98J90j19R4j85j71JM56k03l23OM3K21p7j8J82J34l52
1918a33K67j57K48j1k50p6R6l51L52N1N9l13J52L32k21K31J38m49k02K95J07J01
1940B66k92qj59R1J98k72K82j5j32J03k50k23L77J11j34r4p8K23J08L52l83n2
1962A9j78M10l48O7J64k49K1L40Q3n2j92k29K70k16K73N3k26k89M11n80P29q2
1984A99j26j57q9M11j49p4q8K73j59k21J27L52l43K02k60K22l40N90n25K55k34
2005a34K19j13r3K12k14L4k02L26L30j67k00k38k59P81k45m8Q8M9J41l82J34P2
2027I1m7K7k5l2L03j77M03l33k32j53j34K11O0K78j30n8l20M80j22p1M5l61K65
$$ plain form
1874 37 227 46 279 -28 218 100 -249 -9 -69 4 393 -24 -217 -121 -340 215 323 23 -222 -353 83
1895 83 188 225 75 -33 -210 -12 178 59 153 -32 -203 -202 254 51 -272 -266 -223 -2 -79 -97 85 219 -133
1918 -133 134 -23 225 214 -36 -112 -16 -367 -15 36 95 -218 -66 266 45 276 414 -35 -237 58 165 266
1940 266 -26 -34 -193 -102 96 -176 106 91 -41 62 -188 -411 -34 77 -57 -151 -229 -6 102 454 71 19
1962 19 -159 251 -97 -30 134 -115 -94 246 329 277 85 -144 126 -90 183 236 10 -279 132 -448 281 199
1984 199 73 -84 -173 238 89 15 -73 200 41 -180 -53 299 -44 158 -102 120 -220 370 -155 100 -134
2005 -134 85 -28 -121 91 -123 -89 -291 35 365 198 -2 -240 -499 282 37 -11 77 126 267 -115 19 91
2027 91 44 71 46 14 317 140 543 210 -22 -175 -309 -98 -38 240 110 52 -268 212 90 19 64 -297 -32
2050c2O9J75l72J11J88K40k4l28j18J9Q3K80l03j35K14J02j77n06L37J90k33N16
2072B96O8n38J08J58O4J27k8n56K05m5K76Oj21j93K41j17K86r0k0m03J5o5L77
2095E1j74M21j91rj50JoJ18L50j88k56j49M05k80J93l64N6P0O9R3j73N6k52p4
2119c83K56K57j75n5k1J02j66M93k29k61p5j8M05r8K2M4j78l8j26K52o3J70p3
2142D2k50O5J16J82k05N5o3q4K73J68j39K65j88n40K74L31j72J71l18K52n1j71
2164A3K22m00m49N60M4J91j14j37J89j28J29j61k27M86k07j32p4J3K38l07K89
2185C8k76L0j23N65j74M4l87k32J47N15j54r0K46l71K09N5M3k48L29l73R5p1M21
2208B38j65r9j78L30O4k51J09J55l35J48m8J18j40K74k4n73K83p2k0K83M1j66
$$ plain form
2050 -32 37 212 -160 -49 139 379 355 27 -91 -72 11 291 -12 -147 67 169 -8 -514 -177 13 -220 296
2072 296 364 -174 -66 92 156 283 255 -301 -96 -141 135 141 20 -173 68 -49 237 147 127 -276 -261 -326 51
2095 51 -123 298 107 98 -52 -51 -57 61 411 223 -33 -182 223 -57 136 -228 -172 -102 -33 60 -113 -57 -309 -383
2119 -383 -127 130 -45 -100 -121 -19 -185 308 79 -182 -257 -275 130 32 54 98 -80 -118 -244 8 -55 115 42
2142 42 -208 -143 -27 155 -50 5 -58 -142 131 299 160 425 237 -303 -29 302 130 301 -17 235 184 13
2164 13 235 -165 -614 -54 -10 181 67 -70 119 -9 120 -41 -268 218 11 -121 -195 -182 56 -251 38
2185 38 -238 -208 -331 234 60 104 -283 -515 -368 147 -7 -97 149 -222 -13 42 85 -163 166 -207 -112 -183 238
2208 238 73 -26 -204 126 190 -61 48 203 -132 16 -32 86 -54 220 196 -377 -94 -166 -186 97 138 -28
2230b8K04j20J26Q4k20J03m4n4R4j30k3N3k75K25JK48o51L83j5O4jl9j83K52O1
2255A15L3j80R3O4l39N20o02K11M13J13l10K4n08N99l42J78j62NM43o86N09l59
2277a68K33j47j8K56n20J88K50r3L5l16K7K44j8J64L1N8l93J10J01k0j8j58J57
2300a5P2j1O6k20K57l12K67q5J27j46n6J23j9O9J56k37n8m5K3K43k67l2K84m42
2324b58K96q0J23M9j01j58K6k34K52L71l1k54k29N8L32j12m2p9j34L07J76j81
2346I7p2j33K2J05p6L5J51l36L64l9M5j24kJ62k99Qp1qP3J45k84L09j14L9nL10
2372C02p76M99n56K71J21O2K67m42Q6L73m6L0k99n4N1m9K0J44k91M73p0j17L7
2395C6j20N4O5J9l91M64j49Q7K04n45J03K35L0j5l67L65r1J14M7j84M5qk16k94
$$ plain form
2230 -28 176 56 182 266 46 149 105 51 145 15 -8 45 -230 -5 -4 244 -407 -24 -39 25 24 -15 -198 54 115
2255 115 148 -32 61 125 -214 306 -296 -85 328 441 131 155 -353 246 -96 82 -80 -75 368 -318 191 -168
2277 -168 65 -82 -100 156 -364 -176 74 -19 16 -300 -273 -29 -47 117 148 206 -187 -77 24 4 -14 -172 -15
2300 -15 57 46 112 -108 149 -163 104 19 146 0 -56 67 48 117 273 36 -22 -67 -44 199 -68 -100 184 -258
2324 -258 38 -42 81 130 29 -129 -103 -337 -85 286 255 1 -228 -170 162 50 8 -71 -205 102 278 97
2346 97 25 -108 -86 19 -57 -22 129 -207 157 118 163 39 37 199 -100 -92 -163 -171 -98 47 -237 72 -42 -3 -8 302
2372 302 -474 25 -531 -260 -139 -77 190 -252 -166 207 161 191 -108 -162 -111 -160 -140 4 -287 186 116 -1 36
2395 36 -84 -30 35 54 -337 127 -22 65 269 -276 -173 62 92 77 -290 75 -16 98 145 -39 6 -2 -218 -512
2419e12L13J64j23K76k12J99l62J11j14j86L64M19l2j13j7J55l90K73k05J6K30
2440B54ok77J57l97J79R3k65R6M26L9k41r0j78K83j84K37K1j3m4Jk34R4R9J33
2464A83l30M13k64k4Pj21J56k68L81j89o9k68J4N12M2l16J43NJ40O4j19J90l93
2487a11K99l50M19j52j69j29K05J58l71J55j99K22N7K06k23L1k48J54k48N06M4
2508B56j8k96n4J45k65J99q3L9p0J34l3j09M88n31j3J52kR3Q1q0L8k71j73L96
2532B3J79l53L86m27J30K24R7l31k6J00J01k31K66j72Rk73L85Pk22J56OJ61l02
2555a07R8o6j09J06J43J27O9k10Q2p8m7P8j39P8K36k66M19k18j26o3mPj80J16
2579e4j33L11J2qmk27J46j10j0J06K6j75N7N1K9j51n1M33l38K10k40P2k20L29
$$ plain form
2419 -512 -199 -35 -158 118 -94 105 -257 -146 -260 -446 -82 337 305 192 175 330 -60 213 8 24 254
2440 254 248 -29 128 -269 -90 3 -262 -166 260 299 58 -32 -210 73 -111 126 147 134 90 91 -143 -49 50 183
2464 183 -147 266 2 -22 -15 -136 20 -248 133 -56 -125 -393 -379 133 175 -141 2 7 147 211 92 282 -111
2487 -111 188 -162 257 105 -64 -193 12 170 -201 -46 -245 -23 34 240 17 48 -200 -46 -294 212 256
2508 256 238 -58 -112 33 -232 -33 -116 -77 -147 -13 -46 -155 333 -198 -211 -59 -61 32 113 33 71 -200 -373 23
2532 23 202 -151 235 -192 -62 162 259 -72 -98 2 103 -128 138 -34 -25 -298 87 94 -128 28 34 195 -107
2555 -107 -9 -75 -184 -78 65 192 261 51 133 55 8 86 -53 25 261 -5 414 196 70 7 3 10 -170 -54
2579 -54 -187 124 136 128 124 -103 43 -67 -77 29 55 -120 -63 -12 17 -134 -185 248 -90 120 -120 -48 -268 61
2603F1k21M13l70J70O5j45K15m18o4O70l94j98J84k14J28j58J89K37Q2m82M14
2624A64k82K18J34m29J67j0n6K55m20L99K44k63k06p3K64K5k84K29l83L6M39j8
2646A50j98r3J98k40mK42m4l56K95M0j28J25j07k7R7J84l32K18N8Q1k25j29J10
2669h5M01m4j5l09k60J86K83j33j42j62J72K9k05L97j39p6J84j15j9o2K55o5j86
2692a10j0J43J86n6q2J49j60R8j96n3L04j42j80J93J33j05r6nn0m4L1J63L2j19
2716B4k55J41K74l99M95k65j94M8j63K96O7J1j40j2j06N8K11KJ69l01k2L8j54
2739a77N6kJ07J35q2J68j97K25k31p9L8L23l11P4M4j98N3K34k75n7P7k95O06k31
2763EJ25j3k83N3L12m4l54L37J07j08j64R7j17L1Q5jR9k13J18J04m13J46j07J16
$$ plain form
2603 61 -160 253 -117 53 118 -27 188 -230 -294 376 -18 -216 -32 -246 -118 -276 -87 150 232 -250 164
2624 164 -118 100 234 -195 -28 -38 -94 161 -259 140 384 121 -85 -158 106 131 -153 76 -307 -271 168 150
2646 150 -48 -141 57 -183 -187 55 11 -345 -50 -10 -138 -13 -120 -147 -50 134 -198 20 78 159 -66 -195 -85
2669 -85 316 272 257 -52 -312 -126 157 24 -118 -280 -108 -79 -284 113 -26 -102 82 -33 -52 -114 141 76 -110
2692 -110 -120 23 209 153 71 220 60 158 -38 -91 213 71 -109 84 217 112 16 11 -39 -83 -52 111 143 24
2716 24 -231 -90 184 -215 280 15 -179 -131 -294 2 69 80 -60 -72 -178 -120 91 93 262 -39 -61 -23 -177
2739 -177 -121 -123 -16 119 37 205 8 233 2 -77 -39 284 -27 47 91 -107 -54 180 -95 -152 -75 -370 236 5
2763 5 130 117 -166 -113 199 155 -199 138 245 137 -27 70 -47 -16 69 68 167 -46 72 176 -237 -91 -198 -82
2787h2j00r3M16k9l16K82k29J72Mk65O0k5J58K59n95K51J12l01M21k58K1N21k21
2810A63m27N67k73P5p8k31r1L83l2M6k3k55j13J10K86j49K9K99r6o7j33J45j04
2833C1J9l7j5j61K67o6j96p5J30J26j45J34J50j38K35km92J98l8kL09j63p5K35
2857B29l63k29K09j34K44J46Nj13j5j12K0j58N98n01p4M90n46J80Q5m4J34k10
2879a59K65Qk37J34j07K20k95K0K12j97M6k91K71j38Q9P5J19O5n97P28k39O1J22
2902A75k02N9j89R0J41j05J38M6m39O7L06k35J88k02L15K48k88j23J6NJ28Jk37
2925i7J36K15r0N6l60L19k14oj00J87k73K15N63n02J49n27k16R47k05m5k11n8
2947a17L51k78R0J03P2l59J09r8J24r8J8N32n88K24p8j13K4P5J24K0j25o8j82
$$ plain form
2787 -82 -182 -275 141 112 -204 78 -151 21 25 -240 -180 -205 -47 212 -383 -132 -20 -321 100 -158 -137 384 163
2810 163 -264 303 30 105 27 -204 -295 88 56 102 79 -176 -289 -179 107 -42 -13 286 190 123 -10 135 31
2833 31 50 13 -2 -163 104 38 -158 -233 -103 23 -122 12 162 24 259 257 -235 -37 -75 -77 232 69 -6 229
2857 229 -134 -363 -154 -288 -44 102 107 -6 -21 -133 -113 -271 327 -174 -248 242 -304 -124 -39 -83 51 -159
2879 -159 106 114 -123 11 -96 124 -171 -151 61 -136 -90 -381 -110 -248 -159 -84 35 100 -497 231 -8 53 175
2902 175 -27 32 -157 -67 74 -31 107 153 -286 -219 87 -148 40 -162 153 401 113 -10 6 11 139 140 -97
2925 -97 39 254 164 220 -140 179 -35 -41 -141 46 -227 -12 551 49 198 -329 -545 402 197 152 -59 -117
2947 -117 234 -44 46 149 221 -138 -29 -127 -3 -101 -83 449 -139 85 7 -106 -82 -7 117 137 12 -56 -238
2970b38K11M8k25R2J06l99N68L5l72J74O4J6j22j3J16m79L50L0M0nl79L73n2J32
2994G1L2om5M2K01k77Q1qk94K15j48n8K28J57k47nj7K28N3k29MJ31l38K60k38
3019b07K95r3k7J01o2K65l07l93K77P4q4N0O3j82N76n83L71j60Q1R6J67j71J02
3042B49k20K0O1m4j66j22J64L14j20k08k29L39j3k66L38k86L85m69L94jk9L6j67
3065d0K22j16j39K25j09j52J76l28K37L4oJ21k13L92n09K81j8k38L54m31L02J70
3087B15k2o0k63L07m14L58J34m72M02n03L55k22j6L55J26l07p2K56J30j95l1j45
3109h4J17p2j35K85j02J47l25J62o4j02L13k62R2M6J77q8q9q2J64l92L95j42J4
3132b7L50k29l24J36K46j68J25m9k4j97M4Q7j27M17k72j15l1r6K30r0K85j65p0
$$ plain form
2970 -238 -27 21 -204 -112 -6 -405 163 198 -174 0 64 80 -42 -55 61 -418 -68 -38 2 -3 -382 -9 -61 71
2994 71 103 97 52 94 295 18 99 91 -203 12 -136 -194 34 191 -56 -61 -78 150 203 -26 -22 109 -229 31 -207
3019 -207 88 -5 -32 69 7 272 -35 -428 -151 -77 -161 -111 -48 -230 346 -237 134 -26 55 151 318 147 249
3042 249 29 49 110 66 -100 -222 -58 256 136 -72 -301 38 25 -241 97 -189 196 -273 121 120 91 127 -40
3065 -40 182 66 -73 152 43 -109 67 -261 -24 10 4 125 -88 304 -205 76 58 -180 174 -257 45 215
3087 215 193 133 -130 177 -237 121 255 -217 185 -318 37 -185 -201 154 280 -27 -99 157 287 92 61 -84
3109 -84 33 -39 -174 111 9 156 -169 -7 -71 -173 140 -122 -30 16 193 105 16 -66 98 -294 101 -41 -27
3132 -27 323 94 -230 -94 152 -16 109 60 36 -161 -117 -30 -157 260 -12 -127 -158 -254 -24 -114 171 6 -64
3155f4J71lK1M6m8k29L57l52j96N40k43J76l48L13j25R7j63K37r6k63J93j69K49
3178A01j84Q8m8pJ58k62o7M05k23j20N9L98j10k75J28m1qo5N6K62o5J97k32j3
3202A32j87k6L02p2l34Q5n4LL57o5o2q6J79O2n08j7M13J6J85l72Q9J05j02L3k78
3227b02L45l70L42j9N9p1k08O4K84o0j26K04k26jK51l88j6Q4O9L40n19K07j53
3250a10L3k9K28l96L86o5m6k07K01O3k47l9J05o3L46m4k72N7j68K60N2j81J49
3273A3k13pK50j80K52m70L49lj07L1m1K05j27n6M6M43j22m57O8M31l47K60k15
3296CK21l31j36J04L77P1l33m0N5k74K17L04k13j23L14j42k27J65Lj94M7K81n9
3319I0k69K83l15J68O7m1J93l12J35j25K31j68N4L9L41l73Nk4j85L43j97j02m0
$$ plain form
3155 -64 107 104 125 171 123 -106 251 -101 -297 243 0 176 -172 141 16 113 -50 187 91 -172 21 -148 101
3178 101 -83 5 -43 -50 108 -154 -221 184 -39 -159 -100 298 188 -87 41 0 -8 -73 -17 245 180 377 145 132
3202 132 -55 -81 221 149 -185 -100 -154 -151 206 141 79 -7 172 234 -274 -291 122 138 323 -49 40 145 43 76 -202
3227 -202 143 -227 115 96 155 84 -124 -60 224 164 38 242 16 15 266 -122 -138 -54 15 355 -164 43 -110
3250 -110 -77 -106 122 -274 112 47 1 -206 -5 58 -189 -228 -123 -186 160 116 -156 -99 -267 -7 45 -136 13
3273 13 -200 -207 43 -137 115 -355 -6 -9 -116 -85 -126 79 -48 -104 -58 385 263 -194 -126 305 -42 218 3
3296 3 224 -107 -243 -139 238 309 -24 -64 -9 -283 -66 238 25 -98 216 74 -153 12 15 -179 -132 149 90
3319 90 -179 104 -211 -43 24 -17 176 -136 -1 -126 105 -63 -9 30 371 -2 3 -21 -206 137 -60 -162 -202
3342b02J66M1J39k41K5l8k0K70k26n8J9k3R7K31j91R1j03J52m08K1J9K38J38l47
3366b10L15l50K80j5N9m2J1k58n4L73l8Oj41M5J5K44k68n4J32r6J71j60J66q8
3390D3m38K53%K33n1nk5j61p1P7qJ28n1M7M3J59m83K06J27j55K50j60K03k68J22
3415A5L5l9q2p5J67l0l23L09K49l35j24K41k81J66K29l6k46L23J2k43R1J03j74
3438d8J62L5k25L13o24O32l43j11L52k35l8k04L5M98L58n28l04K16j2p9J65M8
3460F3l01M59m64L68k78j62K40N4k7J60l82k3N73j44L02k72k10J05K25K1l03k79
3482b75K47l24L24J27n6Om46O12l26K40l17o4K89J1j49O9L12p7R6k61k04J46M3
3505B3lj85L45j03J24k35kQ7j71L48j09j60K25l70J02J35k40L95j7k80p7J57K02
$$ plain form
3342 -202 -36 5 144 -97 -72 -110 -130 140 -86 -144 -125 -148 -51 180 -11 80 -23 129 -279 -258 -239 -1 137 -210
3366 -210 105 -245 35 20 79 37 48 -210 -264 109 71 77 -64 -19 -4 240 -28 -82 50 -46 125 -35 131 43
3390 43 -395 -142 -142 91 40 35 10 -151 -222 -145 -153 -25 -76 -29 14 173 -310 -104 23 -132 118 -42 161 -107 15
3415 15 50 11 -71 -146 21 -9 -332 -23 226 -109 -233 8 -273 -107 122 86 -160 163 175 -68 23 126 -48
3438 -48 114 149 -76 237 -387 245 -98 -209 143 -92 -130 -334 -299 199 557 29 -275 -59 -71 -150 15 63
3460 63 -238 221 -243 125 -153 -315 -75 -21 -48 112 -270 -293 280 136 438 166 -44 61 286 307 4 -275
3482 -275 -28 -352 -28 99 43 49 -397 215 -111 129 -188 -252 37 48 -101 -32 280 203 299 38 -166 -20 23
3505 23 20 -165 180 77 201 -34 -36 51 -120 228 119 -41 184 -186 -84 51 -189 206 189 -91 -168 -11 191
3528A91J38k11k90j80N90m72K68j29L38R6j25n51L41o2j9kP8j18Q3mqo9N9J8k03
3553b43L74j06k28L40l60L45p9lJ6K40j87k61K00m46N27l40M06%k68R1J82j27
3575G3k32L99k26l7m5R8o0j36K17k19K71O6k61J26j79j55P9J08K31j11J60l08
3597a41J04ok91L16j88K01j21J20M9n8M7k30J77J20o5R7M9r2j03j1K5J66o0J41
3621B46k33m1J94N8j0k73K3J14L6m41O36l15j99M62l94M2K40mr6j63L56O6l06
3644bL4j81M19m46L71k10l1O2j86j7K7J55J73k28J45J36k56Qmj16j66M22J5j8
3668A06M0j72Q3L3n1J82j69J0J12l47J58L7o7O7n1J4m49M98j58OM33j98m36K31
3692h8J52K60k32K2p2k15K03l6J07j09j42L50l71J89o3n3p4j8M1j1K03j05p2L32
$$ plain form
3528 191 329 118 -172 -352 238 -234 34 -95 243 339 214 -337 4 -58 -77 -79 -1 -119 -36 -40 -48 -117 -58 -40 -243
3553 -243 131 25 -203 137 -223 122 43 40 56 296 109 -152 48 -398 129 -211 195 195 -73 18 200 73
3575 73 -159 240 14 -23 -68 30 -30 -166 51 -168 103 169 -92 34 -145 -300 -221 -113 118 7 167 -141
3597 -141 -37 -43 -334 -18 -206 -5 -126 -6 43 -15 32 -198 -21 99 34 131 180 88 -15 -26 -1 165 105 246
3621 246 13 -28 166 224 214 -59 -36 78 114 -327 309 -6 -205 257 -137 -95 145 141 45 -118 238 304 -2
3644 -2 32 -149 270 -176 195 -15 -46 16 -170 -187 -160 -5 168 -60 85 221 -35 -27 -31 -147 -313 109 124 106
3668 106 146 -26 57 90 39 221 52 62 174 -173 -15 22 -45 22 -29 -15 -464 34 -124 -118 315 117 -319 -88
3692 -88 64 324 92 114 42 -173 30 -6 101 -8 -150 200 -171 18 -45 -98 -172 -190 -149 -160 43 -62 -134 198
3716A98r9j72k15K53K9k46L77j43J6Q6j51p9K65j14k02K05Q0K1k45M10J2k76k1
3739a1q7k35L40J56j47l06K46P0o1M4P0P9j66r8j40K2M49n4k1Q9J8j26l24M46
3763B53l51J49K13m62K67L2o6k62M22N5R7k12p3K06k89J02l8R7k30K02l10L7J51
3786a0Q0k0j05J98j22K74j76K2k54j73K41j00L27J18k63l32m3M26o2k28K32k59
3808b29K87j00J5M02n13L29k83J9j40K00J46o0M0j01j88J29K32r9j21k19K13j2
3830e3q6Q6j08L00j67J52j33J84l58m7J41L6L1K88l93n8K08M2o3q9K38j84J58
3853A25Ll52K18J2J43q7l6j55L46k99O2J05l08J02K57J29l31P4L1N6j12K06k82
3876i3L41l75J3K50l09K12j47L17k40j65L3L60k05q3M9K13k56k54M30N4p3j69
$$ plain form
3716 198 99 -73 -288 -35 -6 -252 125 -18 -2 84 -67 -146 119 5 -197 8 88 109 -136 274 286 10 -11
3739 -11 -98 -333 7 163 16 -290 -44 26 -35 9 79 158 -8 -106 -246 -224 225 171 150 239 257 131 -193 253
3763 253 -98 51 264 -198 69 101 35 -227 195 250 347 135 62 268 -21 81 43 140 -90 112 -198 -161 -10
3786 -10 70 50 -55 143 21 295 119 141 -113 -286 -45 -145 182 300 37 -295 -338 88 26 -202 30 -229
3808 -229 58 -42 -27 375 -138 191 -92 -73 -213 -13 133 73 113 12 -176 -47 185 86 -35 -254 -41 -53
3830 -53 -139 -53 -161 139 -28 124 -9 175 -183 -230 -89 -53 -22 266 -127 -185 23 65 2 -87 151 -33 125
3853 125 128 -224 -6 6 149 62 26 -129 217 -82 -20 85 -223 -121 136 265 -66 8 39 95 -17 189 -93
3876 -93 248 -127 -114 136 -173 39 -108 209 -31 -196 -163 197 -8 -91 -42 171 -85 -339 91 145 72 -97
3898i7K8N5j92M39k15j79Q9j2K24j75o3J35J40n90K36J37r2K69J97l6m30N5K46
3921A69l35O7K50o2k51K5L9J71k51K22j0j65J35p2K01j71j06k4M18k45J12j11
3943FK55m5l16J52R3P7k41J53p2Mk12J13n4L34j78j16J74l12K61J00j29k06L80
3966B21q8m8l60L82l33K68O4m57L00lJ01q1jq7L11R3m28m7J78K1J78j81J08m02
3990b91J91J58k6l53O04m82q5J69J25k64m7J32M58l21K29l51J36Jn3K47K26j55
4012B48r9n3r0J21j76J40k60o3jJ0O3K80K37l69o6L37k46q3K25j89j45J58mK13
4036A88l25R%l2J36M8j0m6J68m43K36m9L50m0q4k27J26j45J83k79K61n05N47k97
4060b30QJ95J17k45J58l01N01p1j68Q2n5j35K38k41J57r3L56l82m1J98k94K55
$$ plain form
3898 -97 -69 -14 -206 233 18 -161 -72 -84 140 -35 -98 37 177 -413 -177 -40 -132 137 334 298 -132 -77 169
3921 169 -166 -99 151 89 -162 -137 -98 73 -178 44 34 -131 4 -68 133 -38 -144 -168 250 5 117 6
3943 6 261 216 -100 52 145 222 -19 134 62 66 -146 -33 -87 247 69 -47 127 -185 76 176 47 -159 221
3966 221 133 85 -275 107 -226 42 106 -351 -51 -54 47 -34 -35 -122 189 282 -146 -193 -15 6 184 3 111 -291
3990 -291 -100 58 32 -321 283 -199 -284 -115 10 -254 -301 -169 289 -32 197 -154 -18 -17 -70 177 403 248
4012 248 149 96 6 127 -49 91 -169 -232 -233 -223 -160 120 357 -12 -78 259 13 -70 155 -34 -179 -21 -25 188
4036 188 -137 -128 -128 -160 -24 24 14 -32 136 -307 -71 -120 230 190 106 -121 5 -140 43 -236 25 -480 67 -230
4060 -230 -222 -27 90 -155 3 -298 203 132 -36 46 -9 -144 94 -147 10 -83 273 -109 -150 48 -246 9
4082Il44N63o73J04N63Rk7k23L45l68M5k8O8J73j3k3J22k13j47j95K31p7J43m0
4106DJ11r9lJ09j20j64r4M34q0p73Q22k47J37K35k13p2Pn6J76j2p0j28l08Q0K53
4131g1L85j06m14J23K59j33J49k06O0j29n6r3J71K30m50%O4K23q7J10l27k0J38
4154a80l2r5L07m5k01M02l27J02N0o2j41J65L1L9J9l76L47m4m01M12J10m36K49
4177a07K93k1l36J87L3k94M42k19l47L24J33m80L91J42j59j28M6J89k39L47n5
4198A42M5k95mm2K5jOJ31q7j63K60j21J53k6R0P2k1k01J81m1j34k68K68J93k17
4223e5J41j82q2k11M62k15j48P9L26j05k72J29K82k07K25l32O5J91n4l06K55K07
4245A93n4J8j22q1l1K31l25oJ51q7J63Q6%k12OP7Q1L2r8R2l23K93j96J07o9J88
$$ plain form
4082 9 -335 228 -445 -341 222 231 204 -19 326 -42 3 -25 43 216 203 180 302 89 -58 -253 -22 -99 44 4
4106 4 115 16 13 122 2 -162 -256 178 98 -675 147 -100 37 272 59 -13 -6 -62 114 102 32 -96 -404 -324 -71
4131 -71 314 208 -206 -83 176 43 192 -14 46 -83 -139 -232 -61 169 -281 -281 -217 6 -81 29 -298 -318 -180
4154 -180 -212 -307 0 -45 -246 156 -171 -69 -19 -81 -222 -57 -26 13 32 -344 3 -41 -442 -30 80 -356 -107
4177 -107 186 165 -171 16 49 -245 197 -22 -369 -45 88 -392 -1 141 -18 -146 -100 89 -150 197 142
4198 142 187 -108 -112 -154 -129 -130 -124 7 -80 -243 17 -104 49 23 113 185 164 -37 144 103 -31 -299 -31 162 -55
4223 -55 86 -96 -178 -389 73 -142 -290 -211 115 10 -262 -133 149 -58 167 -165 -100 91 37 -269 -14 193
4245 193 139 157 35 -46 -77 154 -171 -177 -26 -113 50 136 136 -76 -70 7 88 120 22 114 -209 84 -112 -5 -74 114
4271A14l4Q8N7r9Nk07L86k23k0K97m71J78J04m14M13Q6l73J61Q3J26O1r5k24R0
4295H9j21rN8k18K9J18j33M18Ll53lJ42Q3P1l11J86j83L81l87o4J99l0K67q4k30
4320h2J67Q8k68L01l81Q9j1K15p0K17l12p1k2N14m96K8J60j60Q8L6L1mQ4p7N1
4345A15j8J15k39j8l23M14k27M2K52j58m3P3j03o5N5j59K21N9J38j5l74K49J10
4368A01k70J54k80o0M33l98L93j17R3J70q0k83MK52j48J17j17RRq5L8m8L46j72
4392F1R8pr3l51K66K60l35J55k63m4L64j51J76k97J55j43K29N6k92p3M96n32K83
4415A8P6MJ05m31K41J09k94P4J89k12J92jO0j95o7K32O8k04O6J43j60K10k34K19
4439B08n29J15M03o1j08J31j2k62L03j99j2J05l66J42J56RK2J14j23N6m4k23%
$$ plain form
4271 114 80 168 225 126 131 -76 310 87 67 364 -107 71 175 -239 174 260 -113 48 131 257 318 223 -1 89
4295 89 -32 -41 17 -201 -172 -54 -187 231 234 -119 -122 20 103 174 -137 49 -134 247 -140 -204 -5 -35 232 148 -82
4320 -82 85 173 -95 206 -175 -86 -97 118 48 265 -47 -118 -140 374 -122 -94 66 -94 -6 30 61 57 141 64 115
4345 115 97 212 -27 -45 -368 46 -181 -139 113 -45 -88 -15 -118 -183 -128 -287 -66 -7 131 116 -258 -9 101
4368 101 -169 -15 -295 -355 78 -320 73 -44 49 219 139 -144 -140 112 -36 81 -36 -27 -18 -103 -65 -113 233 61
4392 61 159 152 59 -292 -26 234 -101 54 -209 -253 111 -40 136 -161 -6 -149 80 136 -156 -229 267 -265 18
4415 18 94 98 203 -228 13 122 -172 -98 91 -121 71 70 130 -65 -132 100 168 -36 30 173 13 223 -11 208
4439 208 -321 -206 197 136 28 159 147 -115 188 -11 -23 82 -284 -142 14 23 45 159 36 92 48 -175 -175
4462a75L72l00M1o5M3J43p9Rj17j07K39l7M38j43n20J43M0j8n4K42j50P6j45o4
4486a88k5N39l45N2m0Q8j1j22l0J4R2m45M83j99L35l06M37m1m24J68p7J47NN4
4510A61m44L58k82Q2K65j34k35J67L50k82k9K8j02K22J3R2n70N23k15J6K9K18
4532B31k51M9j5P0K6j76j70J56%J26L50j13rk95j0P4k19L65j52j25K83m24K85
4555E6P2J5j82K94m12mJ81K88j57jk71J64k64r6M17j40OO5k04K59P9kj73j09j78
4580b97K76r5PL05Q5l46OK76j74J19l78L33j86j76L36k99K18J30J30l46k92J05
4602b63J84K20l16l7J18l2L33l25j02j2M98q4j25l04L67j65K09l07M22j5k72J09
4624A01Rl80J31L34n64K70k7J22m5m1K61l34N2J60k28L97m77K03Q4j98K1L1L87
$$ plain form
4462 -175 197 -103 -62 -127 -84 59 -20 -11 -128 -235 4 -33 405 262 -258 -115 -75 -93 -147 95 -55 21 -124 -188
4486 -188 -213 326 -19 33 -7 81 70 -52 -82 -68 24 -421 62 -137 198 -108 329 288 -136 32 -45 102 107 161
4510 161 -283 75 -207 -125 140 6 -229 -62 288 6 -23 5 -97 125 138 230 -340 183 -32 -16 13 231
4532 231 -20 29 14 84 110 -66 -236 -80 -80 46 396 283 274 -21 -31 43 -176 189 37 -88 195 -229 56
4555 56 128 143 -39 255 -157 -161 20 308 151 150 -121 43 -221 -317 100 -40 -34 31 -173 86 165 163 -10 -119 -297
4580 -297 -21 -116 -109 196 281 -65 -59 217 43 162 -216 117 -69 -245 91 -208 10 140 270 -76 -368 -263
4602 -263 -79 141 -175 -212 -94 -126 207 -118 -220 -232 266 182 57 -247 120 -45 164 -143 279 264 -8 101
4624 101 110 -270 -139 195 -369 -99 -126 -4 -49 -90 171 -163 -111 49 -179 218 -259 -56 28 -170 -149 -118 269
4647B69j54q9J62j20K25k72k32M74j32l10J32l27K67l0J8M1Nr1Q7K16J05Ql52
4670a00J43P2qj27M3J8J42j09j23K81M8m96J29k39O49l07L40k41j51N2O5k9Kj08
4694e4m4K8J6J43j74K01k68M09j27m0n1J24k0k11J74k27l22K45L39k22j60Q7L56
4717B02j54J29M6j87j77J89rm7l71K13J54k64K62j65J81O4j6j5j10l4K00K25k35
4740H1P0m3L3k18K31j53K2l6l06J23J37m8j03P8M3J89j16K05j74k85K06J09q0
4763c5K84k87l46L58J16J02J02k90j45K45J24k75K5j6j38o0J10K09p8K5r1J17
4785E6j46N4q2J70J4j09j4P4J70lj66O2k37J10m9J26k55L50n4J55j24q3k76J47
4809a10J21J23J86m8j99J40l48L59n0j75K48l33J96l33J23N01k50n23M37j41j82
$$ plain form
4647 269 115 26 188 68 293 21 -211 263 131 -179 -47 -374 -107 -137 -119 -78 -73 -164 -77 139 244 252 -100
4670 -100 43 115 107 -20 23 41 183 74 -49 232 280 -216 -87 -326 323 16 356 115 -36 16 81 52 54 -54
4694 -54 -98 -70 -54 89 -85 116 -152 257 130 90 39 163 143 -68 106 -121 -443 -198 141 -81 -241 -154 202
4717 202 48 177 223 36 -141 48 39 -8 -379 -166 -12 -276 -14 -179 2 66 50 35 -75 -109 91 316 81
4740 81 151 108 141 -77 154 1 23 -13 -319 -196 -59 -107 -210 -132 -89 100 -16 189 15 -270 -64 45 -35
4763 -35 249 -38 -384 -26 90 192 294 4 -141 104 228 -47 -22 -38 -176 -236 -126 83 5 30 -61 56
4785 56 -90 -36 -118 52 66 -43 -57 17 187 184 18 80 -157 -47 -96 30 -225 125 71 226 102 19 -257 -110
4809 -110 11 134 320 272 73 213 -135 224 174 -1 247 -86 110 -223 -100 401 151 -372 65 -76 -258
4830b58K13J31J0J06K1j67K81k45p2J7J20k10J27K8L5P6j13j5O9k29K2k9j54L78
4854A42k29n7j04J57O1J29J72l99o4L29L5M6j69j03N38k91j1k61j97N7J91K98
4876B70l08Q9j88K9J80j48o7q6O6k33L92M92m60j62J71K6K93j97l23J12K99l46
4898i9j13M25j43J56m80K98k1J83k60J68m3J4q0n1j86K74k0j75L07j07j09Q3L8
4921E9m3M2l45N39k36m5L21m39J33R0q6Qk66K32L52q4q1k26J37K0j31J79Q5l14
4945i9K4j3L16R4r6n48L85r6R8J08O7l57q7K36k37L24j73K70k62L8j99K72l79
4968c14M56j68j35K00q5J63j05q4J27o1L9j55J6q5J17J44j91%Lr3L75j05M2N8
4992A59j11l02K11J03l05M56j03Q8k65j06N9K69k09P3J95k38K80k26k43J21N9
$$ plain form
4830 -258 -45 86 96 202 223 56 337 92 20 37 157 -53 74 102 137 213 100 85 154 -75 -53 -82 -236 142
4854 142 -87 -144 -248 -91 -30 99 271 -128 -192 137 172 218 49 -54 484 193 182 -79 -276 -219 -28 270
4876 270 -38 51 -137 -108 72 -76 -143 -229 -163 -396 -4 488 28 -134 37 63 356 159 -164 -52 247 -99
4898 -99 -212 213 70 226 -254 44 23 206 -54 114 71 85 5 -46 -232 42 22 -153 154 47 -62 21 59
4921 59 16 58 -287 252 16 -29 292 -147 -14 76 -10 -2 -268 -36 316 232 151 -75 62 82 -49 130 215 -99
4945 -99 -75 -88 228 322 226 -322 63 -33 65 173 240 -117 -204 32 -205 119 -54 216 -46 -8 -207 65 -314
4968 -314 142 -26 -161 39 -46 117 12 -72 55 -6 33 -122 -106 -191 -74 70 -121 -121 -118 -211 164 59 101 159
4992 159 48 -254 -43 60 -245 211 108 196 -69 -175 -116 153 -56 17 212 -26 254 28 -215 -94 -35
5013c5Q3r9K91k22o5J23j23j16K56k09K70m38p6R3K54q2K54l48R8J39k93L95p8
5036G2j05j44K40j06j83J89k94N44l08J65k29L81kj3k86k5L23k40J9K13j41q5
5058a5J8K05l09k81L39j73J18K61k90K17J7%m9k41L46k66R4j58J92K4n7M5k42
5081b05L26j57J63rk59OJ65q6J88m01R3l2R8K97j76j11L12k43J7K3L8j75L79k68
5105a7j30lK24M0p3J29j10m91M13K33j77p1j91P9K12N3k34L57l66n3L54k31J94
5128A41M3m34N04m68J69Q3k94L64k97n6N10k14J58j66N3j29R2m5J19m51L13J21
5150A16k05Qn2K85m0l4l3j17rJ48p9J8k21J92Q4k47J24N3r6LL97m87q1J21M08
5175B56k59j85J00P6L3J69p7J03k40J59j57J19J65k99q5M6n8j98L16J01p1J38
$$ plain form
5013 -35 48 -51 240 18 -47 76 -47 -163 93 -116 154 -284 -360 -267 -13 -95 159 -189 -91 48 -245 150 72
5036 72 -33 -177 63 -43 -226 -37 -331 213 -95 70 -159 222 220 207 -79 -104 219 -21 -2 211 70 -15
5058 -15 3 208 -101 -382 -43 -216 -98 163 -127 90 107 107 58 -183 163 -103 -9 -167 25 49 -8 37 -205
5081 -205 121 -36 127 118 -141 -135 30 -56 132 -269 -176 -208 -110 187 11 -100 212 -31 -14 9 47 -128 251 -17
5105 -17 -147 -150 74 114 41 170 60 -431 -18 215 38 -33 -224 -145 67 120 -114 243 -123 -176 178 -53 141
5128 141 184 -250 254 -214 -45 38 -256 108 -189 -245 265 51 209 43 96 -33 59 14 133 -318 -5 116
5150 116 -89 -81 -133 152 112 78 45 -72 -81 67 -12 6 -215 -23 61 -186 -62 -9 -105 -102 295 -192 -273 -152 256
5175 256 -3 -188 -88 -12 21 190 113 216 -24 135 -22 97 262 -37 -122 -76 -134 -332 -16 85 14 152
5197A52k15J3j25K70Ql08lj24L01J74m42J06K15q9K06r3j4Qj25r4K90j76L23m70
5221b12j20L12k73L16k29J34k31L91k9L43m90N9J11o2P6J91m67K12l32L81j0j24
5243e3R4r4P6r1RJ68m8j91N4j55K09O8J7j92P3q9J0m1L93j76l49K26K82n14K68
5268d6J23l8k11q6J59r8J55rJ13l0r1R9k82MK57J26l43%L07m8J3j17N3J36O7j95
5294A8Q8m01K98K19m22J66P0k09O1M00k46n5Q6l21K21J23k61J53n2J41KJ45k83
5317e9k23M24J48r4l41P5N1J14m20M35m4r3K49l17J13N1m8n4l9j32R2m7r9N22
5341B64k93R3j54j42L03l29K17j26J78J48j76j37J57R4J27l42P4j46J77J39n7
5362F9k19J62L6L3J5j15p4J62k8q8k4k3L06j48k77O32k80j91K51p4l28R4p6j3
$$ plain form
5197 152 -63 -50 -175 95 103 -205 -208 -332 -31 143 -299 -193 22 -67 139 46 32 40 -85 -179 111 -65 258 -212
5221 -212 -332 -20 -293 23 -206 -72 -303 88 59 402 -88 -29 82 20 96 287 -180 32 -300 81 71 -53
5243 -53 41 -53 23 -68 -59 109 61 -130 -76 -231 -22 46 63 -129 -56 -145 -135 -176 217 41 -308 -82 200 -314 -46
5268 -46 77 39 -172 -258 -99 -197 -42 -51 62 32 -59 40 -242 -238 19 145 -198 -198 109 61 74 -43 10 146 213 18
5294 18 106 -295 3 222 -200 -34 36 -173 -112 288 42 -13 73 -248 -27 96 -165 -12 -64 77 79 224 -59
5317 -59 -282 142 290 196 -145 -70 -19 95 -325 110 66 -27 222 -95 18 69 21 -33 -72 -204 -112 -159 -258 264
5341 264 -29 64 -90 -232 71 -258 -41 -167 11 159 -17 -154 3 97 224 -118 -44 -190 -13 126 69
5362 69 -150 12 48 81 96 -19 -93 69 41 -47 -71 -94 212 64 -213 419 139 -52 199 125 -203 -109 -185 -198
5386a98L98l14J00O6J0Q9j70j02K67j79o8M6m6K49M1P4l66o1K03j63P7J05n9P1
5410G0l3RJ78l20K29j14O7l30p3K63m6L9L7K71k26j36M23l36J02J46K9j40R2l13
5434a12R7K42j88J54j68J96j43p5k53J77PJ71n5P3j99l7K92j70l5j47J02j51M10
5457A88j87P7r1k5j66J88pk78M80m45L96j2l98N56l55Q1j0P5m1j09J55k73J71
5480c0MJ59k48o4K41L4l49J06J15q9J48K11Ml64K92o3N5j18k5K01k88J5j2j57
5504b22K91j96L35l15k66J68j78K46J18K12m55M42R5l79K8N7l67L54M8p2K07n4
5526I7p0J72l37k36M17j35k4m5J28P4J2m8N9m11M99k66J63K11l63K3O3K8j12L05
5550B04m5m25J09%K35j52Q1O4j16L4J64k78M8K46j78j66M60m3k5o9m3j02k84L85
$$ plain form
5386 -198 200 -114 -14 52 62 151 -19 -121 146 -33 -101 -55 -101 148 189 263 -103 -164 39 -124 -47 58 -1 70
5410 70 37 46 224 -96 133 19 86 -244 -317 -54 -100 -61 -24 247 21 -115 308 -28 74 220 249 109 201 -112
5434 -112 -15 227 39 193 25 221 78 3 -250 -73 -66 105 50 123 -76 -113 179 9 -26 -173 -71 -222 188
5457 188 1 78 -13 -38 -204 -16 -23 -301 179 -266 130 118 -280 276 -79 2 -8 67 26 -83 72 -201 -30
5480 -30 -26 133 -115 -179 62 96 -253 -147 -32 -121 27 238 242 -122 170 107 162 44 19 220 -68 -53 -65 -222
5504 -222 69 -127 208 -107 -373 -205 -383 -137 -19 193 -262 180 275 -104 -76 -19 -386 -32 16 -56 151 97
5526 97 27 199 -138 -374 43 -92 -116 -161 -33 41 53 5 64 -347 152 -114 49 260 -103 -80 -17 11 -101 204
5550 204 159 -266 -157 -157 78 -74 7 71 -45 -11 153 -125 -77 169 -9 -175 285 242 217 148 105 3 -281 104
5574A04k97J53O1o3J13k51Q5R6k29L75l01J77Q1m2j12q0J4J03L5k40K08J30Q6
5597B06k70K90j64j12J64J07p9j70m8J7K29q9m02J97J81m8q1k32J0K4J57j08J76
5620d5N2j25j84L41K43l73L73l65q8L16k38J58M9Lm29K06K71j97L47j66j42j01
5642i4j21J17K93k59K93m44K76L6j53O6j17K78jj23k8l75N50k90j43L54k00K74
5664A89m84J40K83K59m13J48J73j59mm38J36M63j34L4j80j0rMj48L0J6K3K10L9
5688A68m45K01j99K67j14L51l19qK95k43J80j10l20L41P4j64MJ0JK22l26J81j02
5711e5J16n05L76K21j09m1j37l52N60j7J68K8n16K42K09j45K27m62P5J13j00J95
5733I1L7J41j25p9k61K60m5m3K26j03l01p6L63r0K11o5j89K68n01J48R6K40L6
$$ plain form
5574 104 -193 -40 21 -42 71 -180 -95 1 -228 147 -154 23 104 62 -50 -130 -116 -13 22 -218 -10 120 206
5597 206 -64 226 62 -50 114 221 142 -28 -76 -59 170 81 -321 -124 57 9 -72 -304 -294 -270 -113 -221 -45
5620 -45 7 -118 -302 39 282 -91 282 -83 -171 145 -93 65 114 117 -312 -106 165 -32 315 149 7 -94
5642 -94 -215 -98 195 -64 229 -215 61 97 -56 10 -107 171 170 47 19 -356 194 -96 -239 115 -85 189
5664 189 -295 -155 128 387 -26 122 295 136 132 -306 -170 293 159 193 13 3 -6 -2 -150 -120 -104 -81 129 168
5688 168 -277 -76 -275 -8 -122 229 -90 -98 197 -46 134 24 -296 45 119 -45 -41 -31 -30 192 -134 47 -55
5711 -55 61 -444 -68 153 44 3 -134 -486 74 57 225 253 -263 -21 188 43 270 -192 -117 -4 -104 91
5733 91 128 269 144 65 -196 64 19 -24 202 99 -202 -278 85 -5 206 141 -48 220 -281 -133 -37 203 239
5756B39l50K02J99k89Qj31k3J85k38J10R2K45k75k4q0n6L51j16j43K51j05Q4j08
5779B8jj64M69j63k44j88K03P6l5J79n6m7l4j77K55N7L1J82m69kkj40M04k06n
5804d9R6o4Q7l29L09J38j1l83K22l4QJ46j19L1k33K93j21Q6J00k76j26K71k41
5827a99N18k68k08J58L6j19K77K5q4k12j5M4L26k02j16J36k53j7J28O5J13k28
5849i5J21q9K58j69l07J94J18j13M47j24l38O8J6j76pN7J66k70N8L7K52l52L53
5872A05K0m55J69K2K73j07L7n6J99ml69L91Lk40K53q0k65J19k21K9R2m4L55j6
5896B10M5l12J24q5j51N59n20J05k65L95M4k01J33p4Ol95N15J65r1k70j72K60
5918B5k00K13p2j0n5K3J61K2j88K17k02j04L99k32k12N7P0%q4L51q5k42L7Q6J76
$$ plain form
5756 239 -111 91 290 1 9 -122 -145 40 -198 -88 4 249 -26 -50 -130 -186 165 49 -94 157 52 136 28
5779 28 27 -137 332 169 -75 -263 -60 16 -19 160 104 57 23 -154 101 158 189 371 -98 -100 -102 -242 162 -44 -49
5804 -49 47 -17 70 -259 50 188 177 -206 16 -18 -10 136 17 48 -185 108 -13 73 173 -103 -229 42 -199
5827 -199 319 51 -157 1 37 -82 195 220 136 -76 -91 -47 279 77 -39 97 -156 -173 -45 20 133 -95
5849 -95 26 -63 195 26 -281 -87 31 -82 365 241 -97 -29 -13 -189 -196 -139 27 -243 -185 -148 104 -248 105
5872 105 125 -330 -161 -139 134 27 64 8 207 203 -166 225 228 -12 241 161 -104 15 -206 -177 -85 -129 226 210
5896 210 255 -57 67 -18 -169 390 -130 -25 -290 105 149 -52 81 7 13 -382 133 298 207 -63 -235 25
5918 25 -175 38 -34 -44 -99 -76 85 107 -81 136 -66 -170 229 -3 -215 -158 -88 -88 -172 179 94 -148 -111 -25 151
5943A51j57Lp0p7J15J95k27Q6j9r9j00L22k66rL70l69J31L07nl84j86N01k41k77
5967c05K82j66J10K70k50K48k03J94j60K98k09k15J42K64l37j58L22j78J96k12
5987f7L4r3J1%J9J51j88J89L3J3r5j43j14j25K79L5m5M6L44q8l44K59k49L84k7
6012B19J8l47l07Q6L92n1n8l2K80K5j25Q9k84J81l38K89j63K37m66L29l3J24j78
6035a13j26K05J18q6q6L0Q0j11K9j60K33k53J49M8p5J97K6j18K14K0j2j46l26
6058b63K95o8J95l22J89k92R8K11N1K07l62J47m7M5J9l27J96J63l32L8J4k9O8
6081a06Q1O1j48J29k8J60l54r8J88j40J55J87m0j31J34r8m4J90k32J46OJ68l92
6104b06L33M8j81P2L3k29L02k35P7j89K13k78K36J23j67r8J86k56N00m13J48q5
$$ plain form
5943 151 -6 -3 -73 -150 -35 160 -67 19 0 -99 -199 123 -143 -152 218 -151 -20 287 282 -102 -288 213 -28 -305
5967 -305 -23 -189 -79 191 -59 189 -14 180 20 318 109 -106 36 300 -37 -195 127 -51 145 -67
5987 -67 -33 -126 -115 -115 -96 55 -133 56 89 102 7 -136 -250 -375 -96 -61 -106 -60 284 196 -148 111 -138 246 219
6012 219 237 -110 -417 -331 61 10 -48 -80 200 225 100 189 -95 86 -252 37 -126 111 -355 -26 -59 65 -113
6035 -113 -239 -34 84 -2 -88 -58 22 -89 -60 -220 13 -240 -91 -43 -118 79 105 -13 201 221 209 63 -263
6058 -263 32 -36 159 -163 26 -266 -168 43 94 301 -61 86 39 84 103 -224 -28 135 -197 -159 -145 -174 -106
6081 -106 -25 36 -112 17 -11 149 -205 -303 -115 -255 -100 87 47 -84 50 -48 -92 98 -134 12 18 186 -206
6104 -206 127 175 -6 66 99 -130 172 -63 14 -175 38 -240 -4 119 -48 -146 40 -216 284 -129 19 -66
6126f6n6j60M45k97m4Q3Q5R7j70J56k42R5L09k62O7k4r3P6O7j55L28k15O5l8n05
6151d54K94J28O9j65L86k24k15K15o8l06K33K38j72J33m20P30k75j16j64J89j18
6172h2L02k1l47J67L1k98PJ84O4J40k26l5J65k8k42K99K9j32K5j28r1J32J28q0
6196c7J39j2J38m86L78l41N2M13j46K80%l63K28k34r6LQ9j00J5j59j9L32j22q
6220e6K30k10J58j39K47l20n6J46J0P9M3P9j35k15l2K87J5j80P3K48k44j93mo2
6244b31J37K56r2l2k04J50K45l38L48l7l62L16j00J79l11o0l1K63k0ok07Q3L04
6267B50n0j98K28j24k12J43q9R9l77r3P71l27J16N4k23J17l1K2j33j6o3Q5K99
6290B48p8k08mn8oJ43K36m55K24j16J71m6K5j84k4j3l27O50Ok17k2L25Jj0m7k95
$$ plain form
6126 -66 -122 -282 163 -134 -178 -95 -10 87 -83 73 -169 -74 235 -27 40 16 -77 -1 66 -89 239 24 89 51 -454
6151 -454 -160 -32 37 -128 258 34 -181 34 -34 -340 -107 131 -41 92 -328 402 127 11 -153 36 -82
6172 -82 220 199 -148 19 50 -248 -241 -57 7 147 -79 -114 51 23 -219 80 109 -23 2 -126 -217 -85 43 -37
6196 -37 102 90 228 -258 120 -221 -169 244 98 378 378 15 243 9 -87 -84 5 -95 -80 -239 -258 74 -48 -56
6220 -56 174 -36 122 -17 230 -90 -146 0 10 89 132 211 76 -139 -171 116 131 -49 24 272 28 -165 -169 -231
6244 -231 -94 162 70 38 -166 -16 229 -109 239 202 -160 156 56 235 -76 -136 -167 96 76 70 -137 -54 250
6267 250 200 2 230 106 -106 37 -52 47 -330 -423 348 21 137 191 -32 85 54 76 -57 -73 -136 -51 248
6290 248 170 -38 -42 -100 -106 37 273 -182 42 -74 97 51 76 -108 -132 -145 -472 178 184 -33 -55 270 271 261 214 -81
6316h1j44K53o8J94o8k76J98j53L52k37rJ18k79K60j17M6j16J27J47j3m25K56
6338c5J6j30K46j72K02k92j32K99q7M68l65j16Pj98M19l8J53k27k46K16j60Q7
6360h5J34j49J80j10j65J60L58k84q0O3j5k10j2J80J64K3k85M1r8K09l50K93N
6383c3m1P5L8R4J17o2o4k62K57p80P13K3M4k87J93k36J55j38jK29j17K80l48p2
6407b23J87R9J60l02K58k06JJ36j59K9J80j31m56K66J90m9oR3J48k16k22L88K43
6430D08m50l6k4K05K71j51j93R9J08j55J40l37K08K7K04n13K42r1J79j39j30M03
6452B75m16K11k32PL54j13j15O56o13mk80K45J55j25L2q5J98p0l6K55k58J2J42
6475A95j74J24j03k5M7j10j23j9J18K44k36j40L3K54J03m91J3K84J56j17j40K02
$$ plain form
6316 -81 -225 28 -40 154 86 -190 8 -145 207 -30 -39 79 -200 60 -57 -11 -127 0 147 134 -291 -35
6338 -35 -19 -149 97 -75 127 -165 -297 2 -85 383 18 -98 -91 -289 130 92 245 18 -228 -12 -172 -85
6360 -85 49 -100 80 -30 -195 -35 323 39 -41 22 7 -203 -215 -35 129 152 -133 -92 -190 19 -331 -38 -33
6383 -33 -74 1 39 133 250 188 124 -138 119 -661 52 75 119 -168 25 -211 -56 -194 -195 34 -83 197 -151 -223
6407 -223 -36 63 223 -79 179 -27 -26 110 -49 -20 160 29 -427 -161 29 -20 -26 67 215 -1 -223 165 408
6430 408 -42 -78 -102 103 374 223 30 129 237 82 222 -115 93 120 324 -189 53 -38 141 2 -128 275
6452 275 -141 70 -162 -155 199 86 -29 627 14 10 -270 -25 130 5 37 -48 150 80 44 299 41 53 195
6475 195 21 145 42 17 64 -46 -169 -188 -70 174 -62 -202 -169 85 188 -303 -290 -6 150 33 -107 95
6497I5l23Q3J49j30P3nK62l08K77k48K7L1L6O3k42M2M2k54M20Q7j61R8j10j36
6521a32O0%L05l01J04j02o8R5j10J05J86m55L31k33K58o9j49N20l00K67j51j14
6543D7j03K28j59K92m42j22K68m4J97k00J38k65J36N4q4J52q5j44K25k61K17R9
6565A44m2q7j40J41N2k95L31l8k61K97j00J5m3j18L55k60L20r9l07L31k65k07
6587b76M41r1k10J58Ll29Q8J85K33l73K80j07L3lJ2j6j17k6j61K76jk71L57j68
6611h3J6K47j24l88J75P7n3mL05k76K7j61K52Q8%j22j16N3J11J57n1q3l9K0J60
6636A88j93o3K4j95n5K91L8K11k00Pq2K51j21j9r0O4j36J3K44l27K99k71J51j12
6660h3J24j28K6pj81L53j80q6K19Qq3m7N1p3j39K18K53q2l32K0j54K33J41N1r5
$$ plain form
6497 95 -228 -145 4 -126 -53 -58 204 -104 173 -75 -48 -17 19 82 -160 -118 -76 -330 90 177 16 114 4 -132
6521 -132 -72 -72 233 -68 36 -66 -134 -39 -149 -44 142 -313 18 -215 43 -26 -175 345 45 312 161 47
6543 47 -56 172 13 305 -137 -259 9 -35 162 -38 100 -165 -29 25 -59 93 8 -136 89 -172 45 144
6565 144 102 15 -125 16 68 -227 104 66 -195 102 2 17 -26 -144 211 -49 271 172 -135 196 -69 -276
6587 -276 165 74 -136 22 25 -304 -216 -31 202 -171 109 2 35 32 44 28 -89 -115 -276 0 -1 -272 85 -83
6611 -83 -67 180 56 -332 -157 -80 -133 -137 168 -108 -81 -242 10 98 98 -24 -140 -87 24 181 130 47 8 28 188
6636 188 -5 -68 -44 -239 -294 -3 35 246 46 53 -29 222 101 82 -8 56 -80 -67 177 -150 149 -122 29 -83
6660 -83 41 -87 -61 -68 -249 104 -76 -162 57 65 -18 -65 -14 -87 -226 -8 245 163 -169 -149 -303 -70 71 122 27
6685B7n7J21K8m13J95Q1q6KL91k91J16o7l2J61m99K64J85k48J80rj9J7r0j63J90
6710a6j04J10J76m02N6K85l92K19J66r7L9J3k78K3J80k63J89N3l52O06p7n24O31
6733B41j68j69n3K74l86K57J99J0l42O5J04Q1p0q7R5j14O9J70K0l36L08r0j25
6756d7k09K45J40O9k74J59n4r5M8j87N46l56rJ4J8m9k1K76k62L7P3Pj80J55j45
6781a01J46k11K18l1P7k65j1M03k91J87m2P3k21o2K0J49J82l78r6J67K7L51o25
6804c34K67N3M01j01J39j37m13k2o8K90m5J70k21J34P6K2m4n9R3k84J56q0J76
6827A69J7l20L1P6LL27n01l6M5N0J59k95O11k92J1L7j89J74m2k4j51LJ51O8j23
6852d1K4K02k17R9M3j98P7p2J83O6j47k71K91k10J93K2o3J42n4j09M9l18L43J22
$$ plain form
6685 27 -30 91 119 -294 -99 -18 -104 -102 289 -2 114 47 15 176 -323 -59 126 -122 58 49 30 47 -43 -206 -16
6710 -16 -120 -10 166 -236 -180 105 -287 -68 98 1 40 53 -225 -202 -22 -285 -96 -43 -395 211 134 -390 241
6733 241 73 -96 -149 125 -261 -4 195 205 -137 -72 32 113 43 -44 51 -63 6 176 196 -140 168 78 -47
6756 -47 -256 -11 129 198 -76 83 29 -66 -18 -205 341 -15 -24 -10 8 -41 -62 214 -48 -11 62 69 -111 44 -101
6781 -101 45 -166 52 21 98 -167 -178 225 -66 121 79 152 -69 -131 -111 38 220 -158 -254 -87 -60 291 -334
6804 -334 -67 -14 387 286 425 288 -125 -147 -215 75 30 200 -21 113 189 211 167 108 201 -83 73 -7 169
6827 169 186 -134 -103 -27 -24 303 -198 -234 -189 -139 20 -275 336 44 55 92 -97 77 35 11 -140 -137 14 82 -41
6852 -41 -17 185 -32 67 110 -88 -11 -83 100 166 19 -252 39 -171 22 44 -19 123 69 -40 9 -309 34 156
6876A56m2k38QK98k64n6J9K55j69l2j0L08l1m11J65j73q9J23J43K18l30Q2J34
6899F4j61n4J12J0K11k17O9J80j84M8P7m2k48J55j12J34k3l43L59q6P2l3j42j08
6923b62K49j04J29l21K96J88q9k57K83k88Q6K75k87M52l45K6J6n1K38l70KN07
6945C73k87k74L2J03k6J97j8j59NL19j38k97J9J36K48k01j6k05L71k82Q3J69k7
6968A25j50L33l02j05J39j29K15o1l17l3J60K33J08m69L5M01l57J28L37m31N4
6989h6M7J01o4n8J39J25K5n28J33J91j71K37j74R7m94L24M16m93J58L2P5l16R8
7012a86N2L54j28J03l88J43j11m7M25j86k48L32j37K11l35J21J38k66L01m55Q19
7033E12m73p6J1j89NL36k7K5q2J32l31q7K51O5Q8j64J2n9j12L92l78K22P3q9j81
$$ plain form
6876 156 114 -124 -116 182 -82 -138 -119 136 -33 -65 -75 233 202 -209 -44 -217 -306 -183 -40 178 -152 -70 64
6899 64 -97 -151 -39 -29 182 -35 34 214 30 78 155 113 -135 20 -92 42 19 -324 35 -51 21 -12 -154 -262
6923 -262 -13 -117 12 -309 -13 175 86 -171 112 -176 -90 185 -102 350 5 31 47 -4 234 -136 -134 373
6945 373 86 -188 -156 -53 -79 118 100 -59 -54 265 127 -170 -151 -15 233 32 16 -189 182 -100 -17 152 125
6968 125 -25 308 6 -99 40 -89 126 65 -252 -285 -125 108 216 -253 -218 183 -174 -46 291 -140 -86
6989 -86 -39 62 -2 -60 79 204 229 -299 -166 25 -146 91 -83 14 -480 -156 260 -233 -75 -43 32 -284 -186
7012 -186 -134 220 92 195 -193 -50 -161 -208 217 31 -217 115 -22 189 -146 -25 113 -153 148 -307 512
7033 512 39 -37 -26 -215 -210 126 99 124 42 174 -157 -244 7 72 160 -4 8 -51 -163 229 -149 73 146 57 -124
7058a24j68K84R3j91L65o46K36O0Q6o9k04M21n12N23L3l64Rl4L58k13J97m0J15
7081B15n54lJ80J83j50k88K94j10R7Q2K21l16K63l08L07j42n0j03K48l29L76J21
7103B34j59j41j92J11j16L41o3q2k5l0j09K24j03o9N14m38j37K32J29J20j42K14
7125C13k84K63o8l56J78K6Q7k71l3J84Oj35K85k11L8k1j1k17J21l3K04j65N3R4
7149D7P4j03l1r1%J42j98K39k49J63K00k12Q3J57j59n6J5J2k47L89o2j11J47l46
7173a97k8P6J07o4L65j90k2k33K36j24Q4K03l18l12M19k08O00k61rr3M2N0k70
7196a47J46j3j30j54L58m7p6p5j25K26j21J68m2J00M18n17Q0k4J1o4N7k00K01
7219C0J6j2k41J92K53l45J10j42K97j79l2J62k68n8Q2j39L68k82L28j02n9jJ37
$$ plain form
7058 -124 -292 -8 85 -106 259 -387 -151 -91 -5 -74 -278 143 -369 154 187 -177 -168 -202 156 -57 140 100 215
7081 215 -339 -342 -162 21 -129 -417 -123 -233 -136 -54 167 -149 114 -194 113 -29 -79 -182 66 -263 113 234
7103 234 75 -66 -258 -147 -263 78 15 -67 -92 -122 -231 -7 -110 -179 335 -103 -240 -8 121 241 99 313
7125 313 29 292 224 -132 46 72 159 -112 -145 39 45 -90 195 -16 22 1 -10 -227 -106 -139 65 -100 -47 47
7149 47 121 18 -13 -104 -104 38 -160 79 -170 -7 193 -19 64 221 62 6 21 33 -214 175 113 2 149 -197
7173 -197 -225 -149 -42 -106 259 69 47 -186 50 -74 10 213 -105 -417 2 -206 394 133 124 31 73 123 -147
7196 -147 -1 -14 -144 -298 60 13 -63 -138 -263 -37 -158 10 -32 68 486 -31 49 25 36 -28 29 -171 30
7219 30 46 34 -207 -15 238 -107 3 -139 158 -21 -53 109 -159 -217 -135 -274 94 -188 140 38 -21 -22 115
7242A15j31O8p7M0k6J25k98J54j03J01j44K39j40J90k36L4N0r8L28k2l14K26m6
7265C5r1K39m55M57k60Q9k31K14O9l80M83p9l09L26l9K6L63m88P0J14O5l11j12
7288b05L71k52K07n2m00L88pP4n14L18R7K14j30m2j25k17K21j05j38K86L6k06
7310a81J76O9k61J09pJ98J78j90j16k36L65M4m2N0o7k9N5j70J38o0p3L16n34L11
7334D3l18K64j48M67k30q4N3p8L09l50J90j15Q5L8J38m10K62j33K93j44m53M59
7356A38j03M9oO2j39k5l9J51l62J6M59j23N9k16J18O0j58q4J78j5ro5K13k11n
7381e7m20J72J78k39J78R4o3qK84J87k90K14Oj85o0J46j86J57J7J84L9m03J69
7404A14Jj68L7k67M01m26M92l11%K58j11N4m9l68M2J60qL87l64J88j02K12l47
$$ plain form
7242 115 -16 52 -25 15 -11 114 -184 -30 -133 -32 -176 63 -77 113 -123 -89 -39 -137 191 169 -145 81 35
7265 35 -56 183 -272 185 -75 14 -217 -3 66 -314 169 90 -219 107 68 94 457 -31 39 153 218 -93 -205
7288 -205 166 -86 121 69 -331 57 50 124 -390 -72 25 239 109 67 -58 -275 -54 -159 -297 -11 25 -181
7310 -181 -5 64 -197 -88 -95 103 281 91 -25 -261 104 148 106 156 89 60 115 -55 83 23 -50 266 -268 43
7334 43 -275 -11 -159 308 78 -6 47 -31 278 -72 118 3 88 126 264 -146 116 -17 276 132 -321 138
7356 138 35 84 78 140 1 -24 -63 88 -274 -258 201 78 137 -79 39 99 -59 -143 35 20 11 -54 159 -52 -57
7381 -57 -477 -305 -127 -366 -188 -94 -157 -165 119 306 16 230 236 51 -9 137 -49 108 125 309 348 -55 114
7404 114 115 -53 -16 -283 118 -308 184 -127 -127 131 20 74 25 -343 -301 -141 -149 238 -126 62 -40 172 -175
7427a75L79k41k30M91k13j47l5K32j29J10k83K18M7M8R4k16jJ13P0k01Q0R3k08
7450a04P0r1L19n25L44K6q9J8j40j69M48k6N9k5k95L45L9l03K11o3N2j77K5N4
7474CO3k64J72k34K95j69K73K58m56L39l16J61k09J08j66J56Kl18K17K27P4l36
7496a20J37L2r7k75M33P8k9j57k36J52J54l6Q4j45k2K33m8n5O4l9k87O1J79J3
7520G4l94L92R4M2k3k25L3M6j17K13j94K0j82o1K94o5J39j16K28l27J22J11K56
7543C60l12j76L44l08P6jk88M64l01k9J14O6j76J60p1j11K66M5p5k55J00L05k82
7566h5J49j17J41j64K08j81j85K4P6K48k87K93k14l2K80O7j91j14J44J95l26n0
7588a21J20R4q0NJ49k37M7K13k14p7M12k58j82J07J80l39L13k1k8J32m8j53L12
$$ plain form
7427 -175 204 -37 -267 224 11 -136 -171 61 -68 42 -241 -23 24 72 166 -50 -51 62 132 -69 11 104 -104
7450 -104 -34 -125 194 -331 13 39 -50 -32 -172 -341 107 81 140 115 -180 165 204 -99 112 49 101 -76 -51 3
7474 3 66 -198 -26 -260 35 -134 139 397 -59 280 -36 125 -84 24 -142 14 16 -302 -85 142 216 -120
7496 -120 17 49 -48 -323 110 188 159 2 -234 -82 72 36 120 -25 -47 186 138 83 147 108 -179 -118 61 74
7520 74 -320 72 166 208 185 -40 -7 39 -78 135 -59 -39 -221 -282 12 -53 86 -30 198 -129 -7 104 360
7543 360 48 -128 216 -92 -16 -17 -305 159 -142 -171 -57 9 -167 -7 -78 -189 77 122 47 -208 -108 197 -85
7566 -85 64 -53 88 -76 132 -49 -234 -210 -134 114 -173 120 -94 -126 154 221 30 -84 60 255 -71 -121
7588 -121 -1 93 13 18 167 -70 -23 190 -24 -101 311 53 -129 -22 158 -181 132 111 83 215 167 14 326
7611C26m29L09q2Ql14K79k95K6J86O1R9m90K93K02j54q2q1j10L70k48j02K55j1
7634A6k00M3K67q2r1j35J0Q4L29l24M2j17J17M06l49J3L79m13j58J96K7j19N1
7657hJ91q9P1l38J40p3J37R7j38j57k2K16l9J86n09K82N0Or7mp2K04j30o4K82
7682A22o7k8jN8r0K43k84r3K0n7j12M14j58q6k34K00J60j72K94k62L80m84M46
7705B09l79Rj29N48m66L47l05P8J26J53k54Q2o5K17k10KJ90k65J49k8K1L0j6L84
7729D28l25k04K00k31K39L4j61j11J57o8q5j49J94L53n95L49J05p9R2j37N5j69
7751a08L45k74R6L9k43j53J65J13J13J13n9k33L3j89r1L45k2k1j3j36M45l64K13
7774A14k29L01p0j37L6j85L36l09N6J34P7l39K58L74l78j6k2p7R6j60K77j5j18
$$ plain form
7611 326 -103 206 124 132 -182 97 -198 -172 14 75 174 -316 -23 179 25 -57 -138 -248 122 -126 -228 27 16
7634 16 -184 -141 126 44 -47 -182 -172 -88 241 -83 -41 -158 -41 365 16 29 408 -5 -163 33 60 -59 -8
7657 -8 183 94 165 -173 -33 -106 31 128 -10 -167 -189 27 -12 174 -335 -53 -3 3 -94 -98 -170 34 -96 -160 122
7682 122 55 27 26 84 -6 237 -47 -140 -120 -177 -289 125 -33 -119 -353 -153 7 -165 129 -133 247 -237 209
7705 209 -170 -161 -290 258 -208 139 -166 -88 38 191 -63 19 -46 171 -39 -37 153 -112 37 9 30 60 44 428
7729 428 103 -101 99 -132 107 141 -20 -131 26 -42 -127 -276 -82 271 -324 25 130 51 143 6 61 -108
7751 -108 237 -37 59 98 -145 -298 -133 -20 93 206 147 -86 -53 -242 -333 12 -10 -31 -44 -180 265 -99 114
7774 114 -115 186 116 -21 15 -170 166 -143 -87 47 124 -215 43 417 39 23 1 -76 20 -140 137 122 4
7797Dk63K59j73K5Q4L32k17j64L07L6l40J45m23J26M82m07O2J5m2J12K11m03N7
7820a75K92k46k3P8r5j9K16j28k1M38p6k00p2m7P3j10O8Q1j63J81m8R6N9P0l15
7845h6K69J04l15j03L86k05P0j78k7J09q1L22m57L05j52M53n52l5K46k45J24l20
7867c68L99j56M78o81L51L0k34K49KK10m03J61J46rN8l48N3J11j84K28jL4j96
7890g0J6M0J10r5k02J22J49p6o7O5j1J17j49j17KJ88j76K23j73q2J10K9k56J14
7914a89K67J9N2j49j57L74p1l88N75m01k39R9L73m2J47l06K20m3j22J3l14N54
7936B72l27J60n9J60l94K51K29m01J98Nj54j10L86m71L25j53L7J73J58k23K5j0
7958G7j74K51J54l10r1L18K6l78J38q4Q1k17O0J40J2k85K56J95k11J11j5p0J35
$$ plain form
7797 4 -259 0 -173 -148 -64 268 51 -113 194 230 -110 35 -388 -262 220 -187 -125 -110 -152 -40 171 -232 -175
7820 -175 117 -129 -152 -74 -169 -188 28 -100 -121 317 241 41 -31 -78 -5 -115 -47 34 -129 52 4 100 159 229 -86
7845 -86 183 287 -28 -131 255 50 120 -58 -85 24 -57 265 -192 113 -39 414 -138 -173 73 -172 -48 -368
7867 -368 31 -125 353 -328 23 53 -181 68 70 280 -123 38 184 175 233 -115 -62 49 -135 93 92 126 -70
7890 -70 -54 -14 96 1 -201 -79 70 -6 -73 -8 -19 98 -51 -168 -166 22 -154 69 -104 -186 -76 -47 -303 -189
7914 -189 78 97 149 0 -157 217 146 -242 333 -68 -307 -208 165 123 270 -36 184 141 19 32 -282 272
7936 272 -55 105 46 206 -188 63 292 -109 89 94 -60 -170 216 -255 70 -83 -46 127 285 62 87 77
7958 77 -97 154 308 -2 -93 225 251 -127 11 -73 8 -209 -149 -9 3 -282 -26 169 -42 69 54 -16 119
7981A19p2kr1j7O3k16M75l84K21j21Q6k50K61N3j50j42L36j67j4%j68K50k04M04
8005B70j46O5j34p2o0J31J4k17K20o0j33L67l49j32K76k57K81k49J53O6K8j76
8027a14K32k36L35R3m11K72j21j06j0J68N5j92Q2m6N2j75R6Q5r4j73Q0L3k6K10
8051H9J26k22L7k1J80j46j34Qj68L45J49k48J15n37O9K72L10k83k32L84j81Q7
8073aK18m24K56o5J83M4k52J1K01k98j46L24n8K44k47R2m6j86J69K00J5j95m02
8096c63L24J63l24L25j17K4k56J03J16r2K54p7PJ23l06J86Q2j51j02J60l12J2
8118b21K83m6k90K36K41l34LP0K68j57L42m72L03k28K35n0m8K00m02J08j98J00
8140e7k21K70k84J45M79k43j20J58k69J46k11L38j69k1J17j52Q7j39L79m00m2
$$ plain form
7981 119 47 45 -46 -63 0 -216 259 -125 96 -25 61 -189 72 125 -25 -167 169 2 -12 -12 -180 70 -134 270
8005 270 124 189 55 -17 -77 54 68 -149 71 11 -122 245 -104 -236 40 -217 64 -185 -32 34 62 -114
8027 -114 118 -118 217 310 -101 171 50 -56 -66 102 157 -35 47 1 53 -122 -26 59 -35 -208 -128 -95 -121 89
8051 89 215 -7 30 9 189 43 -91 -83 -251 94 243 -5 110 -427 -358 -86 224 -59 -291 93 -88 -1
8073 -1 217 -207 49 -16 167 211 -41 -30 171 -127 -273 51 -7 237 -10 82 36 -150 19 219 234 39 -363
8096 -363 -39 124 -200 125 8 32 -224 -121 -5 -97 157 80 87 210 -96 90 172 21 -81 79 -233 -221
8118 -221 62 16 -274 -38 203 -131 -128 -58 210 53 395 -77 226 -2 233 183 135 335 -67 41 -157 -57
8140 -57 -278 -8 -292 -147 332 89 -31 127 -142 4 -207 131 -38 -59 58 -94 -7 -146 233 -167 -209
8161b09J59M4K33k86k84M59j98J99k37J01n8j4m7J51k74L48J84l16J37J03j89
8182Fk00qL67p5K0m4k48L17l17
$$ plain form
8161 -209 -50 -6 227 -59 -343 116 -82 117 -120 -19 -77 -91 -138 13 -261 87 271 -45 92 195 6
8182 6 -194 -202 165 90 110 66 -182 135 -182
8191a82
$$ Imaginary data points
##PAGE= N=2
##DATA TABLE= (X++(I..I)), XYDATA
0@%%%%%%%%%Qj6J6j6J6j6K4l2L6m4N3o1P0q3R3j06J25j43J61j82K05k30K59k89
33a52L22l61M03m48M97n51O10o75P47q26R16j017J126j249J392j557J748j973
51a048K246k581L002l553M313n430P229j0612J9138p7874j83115J27153K24468
64A03336Q7316j44734j83329k8682J42763J29880p403j10648p6395J9742Q3544
75A5390N8917q919o1214n5433l466O2686P0853j729q3888p4674J7035R1490O2232
88H9280l8838r4819l6682N5596P3223Q301n1433m2524J2067M1283J7675j7177
100A5952k0586l920O092J1842J0088l365j8821k4004l005L1035L3960r357m9928
113b4017l5151K1329N6776K9588l1324n4518j3594M0542M5835N966l4236l6533
$$ plain form
0 0 0 0 0 0 0 0 0 0 0 8 -8 8 -8 8 -8 16 -16 20 -24 29 -32 38 -45 48 -58 67 -76 85 -97 108 -122 137 -152
33 -152 170 -191 212 -236 261 -290 320 -355 392 -434 482 -535 591 -658 734 -823 925 -1048
51 -1048 1198 -1383 1619 -1934 2379 -3051 4178 -6434 12704 -65170 -248285 -121132 103336
64 103336 190652 45918 -137411 -166093 -23330 106550 99147 -11501 -87896 -68154 15390
75 15390 74307 65388 4174 -51259 -54725 7961 78814 77085 -6803 -81477 -64442 27048 89280
88 89280 50442 -44377 -81059 -25463 47760 56061 4628 -37896 -25829 15454 33129 15952
100 15952 -4634 -8554 -2462 9380 19468 16103 -2718 -26722 -29727 1308 35268 25911 -24017
113 -24017 -59168 -37839 18937 48525 17201 -37317 -50911 -10369 35466 41432 7196 -29337
125b9337R00L8289L3079p133m1297l3314J1193M9124L1467k7104n7981k5350L5512
138b1952N5756J2309m4866m5398N097L9452K3094j1570k2658m807J2311N531q724
151f425k058J2178P212r505j3490K74J5043Q653j0730j3284N708J5205J824j1947
165a342p670O779J1581j310j0274K65J2178K897j5288j2696R187K2947R286k0238
179F302k7175J546K5706J5114r070j7298n092P654O037n098l119Q873P025q753
193B652j6174l229J5526J7400l584k1607j1041J2798J8671K905j3637j3149K606
206i863J6612J0124o614j2939o013N306J2027N873n541r564n688R0M974O503l51
221D936n574n464l335N22M883M501j344k941j044K11J372J09m4M582O500k100
$$ plain form
125 -29337 -28437 9852 42931 35798 -5499 -38813 -27620 21504 52971 25867 -32114 -57464 -21952
138 -21952 33804 46113 1247 -44151 -39054 398 23492 11922 -10736 -15543 -3232 2299 -6425
151 -6425 -8483 3695 10907 1402 -12088 -11814 3229 11882 1152 -12132 -6424 8781 10605 -1342
165 -1342 -9012 -2233 9348 8038 -2236 -1971 10207 13104 -2184 -14880 -5693 17254 26540 6302
179 6302 -20873 -19327 6379 21493 12423 -4875 -9967 -2313 3724 -1374 -4493 4380 11405 2652
193 2652 -13522 -16751 -1225 16175 12591 -9016 -20057 -7259 11412 14317 680 -12469 -9863
206 -9863 6749 16873 10259 -2680 -8693 -3387 8640 14513 8972 -592 -6280 -6190 -1216 5287 4936
221 4936 -638 -6102 -9437 -8915 -4032 469 -875 -3816 -4860 -4649 -3277 -3168 -3212 1370 7870 5770
237E770j0612o153O890J3903N041j2366j8635J42J9172J3405j0181k0157o794
250b0575J5922J8906j881j7186r444P366J2474N497l837n457j051k24l066K606
264E0R341M863r929j3731m521J0835J3611m23j2801r609J597P425O051K617k176
279C200m920n044j9R533J2762r57j6352j1432R217J9723O838j6196k0518J83J9467
294E485J1480q078j6331n869Q166R555j427o097n49L502j221l315J733N278K786
309E098k388m655O3L568N18j758J927K544l704p417l054P739R921j882j5750q275
325a7505J1350J5713l52j4889j0686Q582J6469J418j3291o653Q354R666k523j0316
339d663j500J1077P337r514j4269J472J4749P571p776j3862l572R556Q787j367
$$ plain form
237 5770 -4842 -10995 -4105 9798 14839 2473 -16162 -16020 3152 16557 6376 -13781 -20575
250 -20575 -4653 14253 12372 -4814 -14258 -6892 5582 11079 7242 1785 734 510 -2556 50
264 50 9391 14254 4325 -9406 -13927 -3092 10519 10096 -2705 -12314 -10717 -3292 2759 5376 3200
279 3200 -1720 -6764 -6783 2750 15512 14555 -1797 -13229 -4012 15711 22549 6353 -14165 -13982 5485
294 5485 16965 8887 -7444 -13313 -5147 4408 2981 -3116 -3665 -163 -1384 -4699 -2966 2312 5098
309 5098 2710 -1945 -1882 1686 2204 446 2373 4917 1213 -6204 -9258 -1519 8402 6520 -9230 -17505
325 -17505 -6155 9558 9206 -5683 -16369 -7787 8682 10100 -3191 -9844 -1490 8176 5653 -4663
339 -4663 -6163 4914 12251 2737 -11532 -10060 4689 12260 4484 -9378 -12950 -3394 5393 4026
353D026m472k281j767j637L276R082N538o206j4998l455J6145J7231n159k0759
367e436j0190J1811J8587J213j7093j1744P636J1240m88q845k811O878M122o710
381a830q681N813J3935K936j2679j1239M514J5597P024q671j2229j113P696N302
395F375k03k663l954l328j852K380P862L427q976j2065J847J3246Q465o051j3527
410i017k518J2285R369n458j0358m19Q910M454o647q266L060J0063J562j0202
424c182q253M244J0084L084p142p518P64O616L822q00j072j086j605n47L258N382
440F049K178n958p558J227Q915L850n670p449l72N805K884m763m643M011M861
455C367l148o883o24Q327Q228l659j2583m270J0982J2096k89j1779q926L218J0889
$$ plain form
353 4026 -446 -2727 -4494 -6131 -2855 6227 11765 5559 -9439 -12894 3251 20482 15323 -5436
367 -5436 -15626 -3815 14772 15985 -1108 -12852 -5216 6024 5536 -3309 -6120 758 4880 -1830
381 -1830 -10511 -4698 9237 12173 -506 -11745 -7231 8366 15390 6719 -5510 -6623 1073 6375
395 6375 6172 3509 -445 -3773 -5625 -3245 4617 8044 -932 -12997 -11150 2096 10561 4510 -9017
410 -9017 -11535 750 10119 4661 -5697 -6116 2794 7248 601 -7665 -4605 5458 7020 -3182
424 -3182 -11435 -7191 2893 5977 -1165 -8683 -7919 -1303 2519 1719 647 -439 -2044 -2591 667 6049
440 6049 8227 2269 -5289 -4062 4853 8703 3033 -4416 -4788 1017 3901 -862 -5505 -1494 3367
455 3367 219 -6664 -7288 1039 9267 5608 -6975 -11245 -263 11833 11544 -235 -9161 -5943 4946
470D946N780m596p419l689P47N628N118k94n136n634j330N926P667k37q078n278
486e879K677O321L224l723m992P92K797j099k236J394L103L3m853m644J683Q272
502B870L887o513q417q77O970P298o7o890n196J842N090L560M12l539m438n3M162
519A01L631J20k965m186J331M595J135l349k090J257K340p4l723k345L904L980
535C662k321n537k898L970N770J423n406n484J115N728M448n14m152l783N66M067
551F54M270J342l324n182j096M298M343j71l493l360j26L196P46j571K52J176
567A954r49k390j121K494N643J2n875n329K971P504K701m532p645k382N200O266
583D522K39n341n045j619L371N678K542l093n409l408L702P940L195m805o095
$$ plain form
470 4946 10726 6130 -1289 -4978 -4231 1397 6515 6221 1085 -4549 -5879 47 7714 7477 -601 -5879
486 -5879 -3202 3119 6343 2620 -2372 -1580 1217 118 -2118 -724 2379 2412 -2441 -7085 -5402 2870
502 2870 6757 244 -8173 -9050 -2080 5218 5151 -1739 -6935 -5093 -3 3557 3969 430 -4008 -4061 101
519 101 3732 3852 887 -3299 -1968 2627 3762 413 -1677 -420 1920 1846 -1877 -4222 -318 3662
535 3662 1341 -4196 -7094 -3124 2646 4069 -1337 -6821 -5706 22 4470 3956 -196 -3979 -3413 654
551 654 4924 6266 2942 -2240 -3336 962 5305 5134 1641 -1719 -1845 1351 2097 526 778 1954
567 1954 1005 -1385 -2506 -12 5631 5643 -232 -5561 -2590 4914 7615 3083 -4562 -6944 -1744 4522
583 4522 4761 -580 -5625 -7244 -3873 1805 4347 1254 -4155 -7563 -3861 4079 7274 2469 -3626
598c626N8M850M519j583l764r81K562M84l051j758K015L066j740m805k724M116
614b362N444r67o270k928K690N992K318l530m228l39K952K898J715o12l220k706
630c153j58L300L712k09m867l912K272M654P58k916j517K193L220j011m665n0
646b349N994M307l448o736k108O115O308k209p879l542L782N658O27m795m690
661d965M1M056K504k2j493k847j758J873M097L271j793m547k254K876M707k0k054
678A672j875R94M41j545j169J968M029o24o386m401M287P337K024o323p396J004
694e963Q328M489m197p178j754M562N372j45m338l244o5K034K740J308j553k973
710b577j680P05L548K311j490k713k55J851N91j046K22K042K096j827m599j153
$$ plain form
598 -3626 -3568 1282 5801 4218 454 -527 2035 2519 -532 -2290 -275 2791 1051 -3754 -6478 -2362
614 -2362 3082 2115 -4155 -7083 -4393 1599 3917 387 -3841 -4180 -1228 1670 3385 2773 -447 -3153
630 -3153 -3311 -11 3701 3492 -1375 -5287 -3015 1639 2397 -519 -2036 157 3377 2366 -2299 -2349
646 -2349 3645 7952 4504 -2232 -4340 1775 8083 5874 -2005 -5547 -1765 3893 4520 -275 -4965
661 -4965 -4924 -868 1636 1614 121 -2726 -4484 -2611 1486 4757 2964 -1583 -3837 -961 3746 3726 1672
678 1672 -203 791 1232 -313 -1482 486 4515 3891 -2495 -6896 -2609 4728 6752 429 -6967 -5963
694 -5963 2365 6854 2657 -4521 -6275 -1713 3659 3514 -824 -4068 -4133 -2099 641 1949 396 -2577
710 -2577 -4257 -3552 -4 2307 817 -1896 -2151 -300 291 -755 -533 1509 3605 1778 -2821 -3974
726c974N090N040j653n851l760L304O273P09n710m092J638M941K032k799l714
741b526n05K989J374m98q62l25r42k9J053K51J402O3j669L43l06o01M23K272J991
760C898j200l897k731K267O237K271m882o392k88N623M833j857o159k661L873
775a065L884l44k946j999R10J737P29n27p54M40r69j092N46K006J135j352k497
792b158p98J548J289O14M50n79k692j380J397L625K450j181n017k550L574N732
808D324P32m422m352M76M691K608k573l802J2J852J252Oj476m96L88k12Q4J098
826A90Q48m76j003r73L30J284J164j56m31m23j430m72J647K909L58k613l469j42
844b858L646L468j187m306j508J658L009Q42k369j164P38J042l40j68kM29l35
$$ plain form
726 -3974 1116 6156 4503 -1348 -5108 -1804 4469 5178 -532 -4624 -2986 1955 3987 1188 -2526
741 -2526 -3031 -42 1332 834 -28 -353 -1295 -1324 -271 -20 1382 1445 -224 119 -187 -788 -365 1907 3898
760 3898 2698 -1199 -3930 -1663 4574 6845 1963 -4429 -4717 906 5739 3882 -2277 -4938 -1065
775 -1065 2819 2475 -471 -2470 -1560 177 906 379 -375 65 -904 -1996 -1450 556 1691 339 -2158
792 -2158 -2956 -1408 -119 495 945 366 -2326 -3706 -2309 1316 3766 2585 -2432 -4982 -1408 4324
808 4324 5056 634 -3718 -3242 1449 4057 1484 -2318 -2306 -454 798 804 -672 -1168 -780 -992 -908 190
826 190 1038 562 -441 -1414 -1084 200 1364 1208 777 354 -1076 -1548 99 3008 3366 753 -2716 -2858
844 -2858 788 4256 3069 -1237 -2745 -1087 1922 2764 395 -769 -31 1011 671 503 501 930 595
861E95q46m06Q85J520n77j992p34J040P56M09k13p46o29m88l81K370K083l13m169
880a836k399K167M466K163l140n079k11L597L492n72l501j471O29J866L19r79
896d89J68j61n22k79N82Q43Q91j372j527P58J056J387l65n78j387k24J10J259
914A50J279O29j761k848j8L192K807r49l763k910J997M437P53j971k744k33J843
931a10J647l83j615K84M12N0lM87r7J32n22p66K56J095l8l32k53o1r31J12J044
952D08J412r5k066k475J199L755J904k733l580o82K898L326o01l477j640J322
968a125J893K90j127o66J60O41j016l93J195R59k76j365r49K85J880R03r57p55
986d23r52K84Q29J837J48j655k041m58K144L112l10l751k249J246L500J806k307
$$ plain form
861 595 -251 -657 228 1748 1171 -821 -1555 -515 241 650 437 -309 -938 -1426 -1807 563 2646 2333 -1836
880 -1836 -4235 -2068 2398 4561 1421 -3658 -3869 -272 3220 2648 -853 -2324 -1695 171 490 -489
896 -489 -321 -482 -1004 -1283 -701 142 1033 -339 -1866 -1108 -52 1335 970 392 -995 -1219 -1109 150
914 150 1429 2058 297 -2551 -2569 623 3430 2481 -1282 -4192 -2195 2242 2995 1024 -1720 -1953 -110
931 -110 1537 1154 -461 -177 235 285 282 769 672 804 282 -484 -228 867 829 497 244 183 -748 -636 408
952 408 1820 1725 -341 -2816 -1617 2138 4042 1309 -2271 -2953 -55 3271 2670 -807 -2447 -1125
968 -1125 768 1058 -69 -735 -575 66 -950 -1343 -148 811 535 -830 -1779 -1494 386 1289 332 -423
986 -423 -1375 -1091 -262 1575 1723 68 -1973 -2431 -287 2825 2515 -1236 -3485 -2239 1261 3067 760
1003G60l038l66K283K083o71j501m92M00P81k65o24O69P72n36j581M13J002J165
1021A254O4j220j041n1Q67J270K65k49k036n83J147K382R97j906k913k91L120
1038A076J783l99k517k056J237K532L22j715j192Q45M15l90n54R7O89R39j149
1055c7j693O82J336Q05n17r83j059N92J137Q10j62q90j377o25K111J930k07k046
1073a93j725N7K949J459j473k435p44J823J487N2j635j000J143N94q00n09P98
1090a52P08l89j412n77O98J703O89j761j317j33J267J422N20j366j419j8J292
1107b45J678O52j242k427k4J737J839J20j908j718Q40K148M87r27j299K73N78
1124E62J07n70l01P39R2o98r66L07J265R94j053j241n66R30J149L22o98j234k10
$$ plain form
1003 760 -2278 -2644 -361 1722 1051 -450 -942 -542 239 -26 -650 19 791 255 -1326 -913 89 1254
1021 1254 1318 98 -943 -994 -127 1143 1408 1159 -877 -1460 -313 2069 3066 1160 -1753 -2044 1076
1038 1076 2859 2460 -57 -2113 -876 1656 1978 263 -929 -84 331 -59 -613 -516 173 1112 -37
1055 -37 -1730 -1048 288 1093 576 -407 -1466 -874 263 1073 911 21 -1356 -1981 130 2060 1853 -193
1073 -193 -1918 -1861 1088 2547 1074 -1361 -2105 -282 1205 1257 -378 -1378 -235 359 -441 -950 -152
1090 -152 556 167 -1245 -1822 -1124 579 1268 -493 -1810 -1943 -676 746 1266 -100 -1519 -1537 -245
1107 -245 1433 2085 843 -1584 -1608 129 1968 2088 180 -1538 -698 1450 1937 1010 -289 -16 562
1124 562 669 99 -202 537 629 -69 -1035 -728 537 1531 478 -763 -1329 -399 750 1072 374 -860 -1070
1143a070M50J186O24l12j407q46N70J822R93j509j418m66J503J689m78j353q78
1160i00R66M84J36j050J14Q69j17n59j390M52J575N20r38k007O7J412J434m44
1178F24o93j264j03J143J004P6r55j096l90J445J576J55j569j095J21J517Q82
1195A378n99j013l02Q51J71n62N27P2J09o65n06PQ36J306q22j390p67P54J402
1214G87N54r65j309k41M22J082P14n57j341l90L78J576Q46p16j726j2J101J135
1232A338M6j105r23P90J018k10j055M29L32J75p63n04L8J485L28j140j330O9J080
1251I8R96j62j284q13M95N50M11P0n20j116j11J110J029J6q53j193J26J085R78
1270I12o22n64p26Q26O35j38o32M15L28k48m99j76M99P18N20j899o38O61J247
$$ plain form
1143 -1070 -620 566 1190 878 -529 -1375 -805 1017 2010 501 -917 -1383 120 1809 1331 -22 -900
1160 -900 66 550 686 -364 -250 619 502 -57 -1447 -995 580 1100 162 -1845 -1778 -366 1068 624
1178 624 -69 -1333 -1436 -293 711 787 -168 -1264 -1654 -209 1367 1522 -47 -1142 -1021 496 1378
1195 1378 779 -234 -536 315 486 -76 451 523 632 -33 -539 -532 304 1610 788 -602 -1369 -615 787
1214 787 1341 376 -933 -1174 -752 330 1044 487 -854 -1244 -866 710 1556 840 -886 -898 203 1338
1232 1338 1384 279 -644 146 1164 954 -101 328 660 835 72 -432 -394 1091 1419 279 -1051 -982 98
1251 98 1094 932 -352 -1165 -670 -120 291 361 -159 -1275 -1386 -276 753 769 -84 -1277 -1151 -66 912
1270 912 290 -274 -1000 -174 461 323 -309 106 434 186 -313 -489 10 728 1248 -651 -1289 -628 619
1289F19O05m41j529n66Q51J141L35q02p53o12P53J109K22m06j178l55O18J195
1307H06L50j149o33L28O53L48p46n4K28K69k72n68L85J265R3o12j248j20J287
1326F10R59k34j982l68K35J196O66n15q16n43J69N16P63K6j211j21J3P94O06k06
1346E57r21k59N80N69l52l60N0L30l1m8j137Q06O94P5q23r79O65J199N83o08j528
1367i38j09J107Q63Pj152m76j28P23N72J17n47m43k81J77M71l7J86o66J70J13
1387b71N40m02k34P20J4m22m08N4J104L83p36p79Q2N27O14P9j112j004P30J022
1407E01P56m34j204k80J62O07M92l84l04n24M87J09R29m07p38J73Q8J97j32J00
1427A94l26K20J3k38k57O53K70N0j018n82M57J185K93j069n08l54J206Q96m08
$$ plain form
1289 619 1224 783 -746 -1312 -461 680 1015 213 -540 -1152 -399 710 932 526 -652 -1007 -389 806
1307 806 1156 7 -626 -298 355 703 -43 -97 131 400 128 -440 -55 1210 1303 691 -557 -677 610
1326 610 1569 1335 -647 -1015 -780 416 1082 567 -249 -792 -623 -107 656 682 -529 -650 -637 157 763 557
1346 557 -364 -623 -43 526 174 -186 -136 194 163 115 -1022 -216 478 553 -270 -1249 -584 615 1198 590 -938
1367 -938 -1047 60 923 930 -222 -698 -826 -103 469 586 39 -404 -685 -508 -37 -74 112 -554 -384 -271
1387 -271 269 -133 -367 353 367 -55 -463 -409 695 1078 342 -437 -355 172 786 865 -247 -1251 -521 501
1407 501 1257 823 -381 -661 -499 108 600 216 -88 -612 -125 -16 913 506 -232 -59 29 226 94 194
1427 194 -132 88 101 -137 -394 259 529 579 -439 -1021 -564 621 914 -155 -663 -1017 189 1085 677
1446F77p13p78L82N19L91l66j54m45J62m8O26j20j81k79j78M15r1M67l01M6q5
1467e4N3k11j53M48L63m32l86n53P34R53J08j127p05N10P82j2K00j227K0O69j04
1488a24M55j08o48J07j31N37M02m65N9l79L54Q9J32j10K01j38Q4m15RJ62M62k43
1510B92k21p40N54N42L68n59o66j49O62O94l27j93q01N8N62O42n05k64l08j82
1530e41M67L77J31m87j93K96k55L58Jl07J07J27m35K23R3J92K90n28k48m63J033
1551B38L49n0p57m91P0O71P91o10p31O3N06k02L05l88l31L80k2L27M70m01k60
1572g3j52kj5L78J1o6l52L88j66K03q3M46M9o29n47K60R15m6k74m99k48K80Q84
1595F62q3l49n49K10K84K28n5m45k11L17K81l53J73Q5j72r6J60j07K96k48o0j57
$$ plain form
1446 677 -36 -814 -432 87 478 112 -42 -487 -325 -373 253 133 -48 -327 -505 -90 -181 286 -15 31 -54
1467 -54 -1 -212 -365 83 446 14 -372 -925 -191 762 870 -257 -962 -452 330 318 518 -709 -689 -20 -124
1488 -124 331 223 -425 -318 -449 88 490 25 84 -295 59 148 280 170 371 233 317 -98 -89 73 535 292
1510 292 71 -669 -115 427 795 236 -430 -579 83 777 450 257 -544 -486 76 718 213 -51 -359 -541
1530 -541 -74 303 434 -53 -246 50 -205 153 154 -153 -46 81 -354 -131 -38 154 444 -84 -332 -795 238
1551 238 587 537 -220 -711 -641 30 821 211 -520 -457 49 -153 152 -236 -567 -187 -209 118 588 187 -73
1572 -73 -225 -227 -242 136 147 81 -271 117 -49 154 71 517 566 -63 -610 -350 565 519 245 -254 -502 -222 662
1595 662 579 230 -319 -109 175 403 348 -97 -308 9 290 -63 110 195 23 -73 87 -20 276 28 -32 -189
1617a89lK41j15Q0L69m59j92j8O75R3M3m16o80J33P39K78j27o54k26L88M13m6
1639C27n74j01O53k41M6J68p10K31j5n2j76O72k54r9o0k85K73NM55R2m75K97p61
1662e84O56M72k3m11k52n01L78N61j99j57m19L03K36N46m55l69j52K08K23Qp9
1683a0J3LJ26j33j01j9L74Ol43k1k82O45k39R5m95K85n20O95JJ96m61k00K32L99
1707B46M11k22n11K6L92k64N55m85m34J70K9Q7K95k79pj89P4Q2m5j11K74j67k76
1730c49K57k6K59j57L86l58l18JM51K63l71k57l76M17M64J96n97m36K17L07L10
1751B83P1n52l59O34K56j17k60J70n2R1k03j56L20r2l2j93r9k08N53j7j03r8m88
1774f51M49O90k10j90o0o3N4K65K43m62k23K5L69L15l12j22m08O1J79J05L3l43
$$ plain form
1617 -189 -192 49 -66 14 383 -76 -268 -286 389 482 525 109 -571 -438 301 579 452 -202 -428 -40 373 327
1639 327 -247 -348 305 64 110 278 -432 -201 -216 -268 -444 228 -26 -125 -185 -470 -197 -192 263 355 -120 177 -584
1662 -584 72 544 521 110 -142 -643 -265 296 97 -60 -479 -176 60 606 151 -218 -370 -162 61 69 -10
1683 -10 3 6 132 -1 -102 -121 253 259 -84 -105 -387 258 19 114 -381 -96 -616 79 80 276 -185 -385 -153 246
1707 246 657 435 -76 -50 342 78 633 148 -286 -116 -87 0 295 16 9 -180 -106 -24 -69 -180 94 -73 -349
1730 -349 -92 -118 141 -16 370 12 -306 -305 146 409 38 -219 -595 -178 286 482 -115 -551 -334 -27 283
1751 283 354 -198 -557 77 333 216 -44 126 74 165 -38 -194 126 34 2 -191 -290 -498 55 38 -65 -163 -651
1774 -651 -202 488 278 88 28 -35 19 284 527 65 -158 -133 236 551 239 117 -291 -230 -51 54 87 -256
1796b56K61k3q4J67j16L29k0K48n97l4K62K76m41k59J43j48K79Q5j04oRk45K86
1819A2K02k03K0k00K23Q2K36j44j21k96K53J16n1k90L44j95j10NK79K6k31J81
1841A38l80j10K73k4M41m38J38J06k00L8K61j62k87k6j1M31j98K48m03J6P6J11
1863C8J80j12J3m62L38K47j81J2k5m1K67m31J29J66k45L2J01l98M46J51k42qk80
1886c05Q0R1K90q3k47L53j46o3J74mk9q2k03L43O5M6n49J73J53k16nJ26n71R92
1910C83o23L22M0m25O03j68M6m92K99N43O0m36j49j74K16J82K11n25Ol09J25K47
1932a8J40N0m06l43M77K06N3l41l51K14K84J47N9j59j91j2j3J5K57j60J12J4k23
1955a89jK02KJ27j50l63N26j26N6J09m63J88R3L46k22j2j18j41J27J23r6P7m43
$$ plain form
1796 -256 5 -18 -102 65 -51 278 258 506 -91 -125 137 413 -28 -287 -144 -292 -13 72 -32 -38 -29 -274 12
1819 12 214 11 31 -169 54 136 372 228 107 -189 64 180 129 -161 183 -12 -122 -117 162 188 -43 138
1841 138 -242 -352 -79 -103 338 -100 38 144 -56 -18 243 81 -206 -232 -243 188 -10 238 -165 -149 -73 38
1863 38 218 106 119 -343 -5 242 61 73 48 7 274 -157 -28 138 -107 -75 26 -372 74 225 -17 -25 -305
1886 -305 -225 -134 156 73 -174 179 33 -30 144 140 111 29 -174 169 234 280 -269 -96 57 -159 -164 -38 -609 383
1910 383 -240 82 122 -303 300 132 178 -314 -15 528 588 152 3 -171 45 227 438 -87 -81 -390 -265 -18
1932 -18 122 172 -234 -577 -100 106 159 -182 -533 -319 -35 112 171 12 -179 -191 -204 -189 68 -92 20 34 -189
1955 -189 -190 12 14 141 -9 -372 154 28 84 193 -270 -82 11 357 135 123 5 -136 -9 114 18 95 -348
1978c48J55K42o4j24J04Q1j31J70J83j49O6k61N0K14J3k67K46Jj94r1k02M21j05
2001A0J77qk28k06K52n5J92j5m42K23QM96n51k69K38J19K03Q4l14k88L40N2K27
2024B45l02j34J19j86J94J46j76P0J67l69P2J22L0R4J33k93k07J58K6K67N1l64
2046a37r7J87P7J41m4j25j1j62K03J26j51j86K16K6l37L16M2K31n22K67l1l92
2068c63J24N76j28k70m5k29M17q2L41m46j52K38K5j74J41j15K85k34OJ93j07j62
2090a61L50j35K02j94M6J4k85L46l09k8J71M1j02P3k84P5J61O8K33l77o8J06J92
2113A35j39Q3l68K29M2l41L37kk75K67k50P98m32j68Q9j88J49J99k89M03m71P5
2135a17J44J88m08M20k76K09k53%O1j61L53j55k62p4K20L30K2n80J29L26O2N7
$$ plain form
1978 -348 -193 49 -15 -139 -35 46 -85 85 268 119 185 -76 -26 188 201 -66 180 181 -13 -104 -306 115 10
2001 10 187 179 -49 -255 -3 -58 134 119 -323 -100 -92 404 -147 -416 -178 -59 144 228 -86 -374 -34 18 245
2024 245 -57 -191 -72 -258 -64 82 -94 -24 143 -226 -154 -32 -2 92 225 -68 -275 -117 -91 176 227 -137
2046 -137 -234 -47 30 171 127 2 -9 -171 32 158 7 -179 37 63 -274 42 84 315 -207 60 29 -363
2068 -363 -239 337 209 -61 -106 -335 82 0 341 -105 -257 -19 6 -168 -27 -142 143 -91 -85 108 1 -161
2090 -161 189 54 256 62 108 122 -163 183 -126 -154 17 58 -44 29 -255 -180 -19 49 282 -95 -163 -57 135
2113 135 -4 79 -289 -60 -18 -359 -22 -24 -299 -32 -282 516 84 -84 5 -183 -34 165 -124 279 -192 -117
2135 -117 27 215 -193 227 -49 160 -93 -93 -32 -193 160 5 -257 -331 -111 219 241 -339 -210 116 178 235
2157B35n4m09j0J96J05j8M9j68K33o8l15N09m09J39L62l37j0l7J91r4K30k38j47
2180f5j18j6K04o0k44M47kJ82j2k65q4j04k14N64l67N5O7k18L01k11N05m32J52
2203F5k04O05k24k8l28K65o05L07K05l55K28j08K67q1k9l6j6L5J28l31j76O67
2225B51l04K11n53K00J05K20m4m2J6Kk17K25j44o8L1jL5K7j37N49l86K3j6R9J10
2250A92k44J94Q2k32j4J1L97qm48m5j43K75K03k73k76M14j6R4j78L05l35j38l9
2273b22J81J55o8k65J79K7p3O7j11J33n6m7J13J10m6M5l32P5J12Nj33L54j60L68
2297D11o41K5K16K65k02l74J55Q7L86J3n20N4j24K33R9q8o5n5NJ71l74L96Mj72
2321i5K9N0m5K01j18j24m6J80l85M86j37K8P5m7l19K5M69k20J5k14J21M1L6jp3
$$ plain form
2157 235 181 -228 -238 -42 63 45 94 -74 159 91 -224 285 -124 15 377 40 30 -7 184 90 320 82 -65
2180 -65 -183 -199 5 -55 -299 148 146 328 316 51 -33 -137 -351 213 -154 -99 -32 -250 51 -160 345 -87 65
2203 65 -139 466 242 214 -114 151 -454 -147 58 -297 -69 -177 90 9 -20 -56 -72 -37 91 -240 -416 251
2225 251 -53 158 -395 -195 -90 130 86 44 60 62 -155 70 -74 -142 -111 -112 -77 -50 -187 362 -24 -1 -17 82 192
2250 192 -52 142 224 -8 -22 -11 386 378 -70 -115 -258 17 220 -53 -329 85 69 163 -15 290 -45 -183 -222
2273 -222 -41 114 46 -219 -40 -13 -86 -19 -130 3 -53 -100 13 123 77 122 -210 -135 -23 -18 -151 203 43 411
2297 411 -230 -205 11 276 74 -300 -145 -58 328 341 -179 -125 -249 -16 83 -5 -70 -125 -120 51 -323 73 77 -95
2321 -95 -66 -16 -61 140 22 -102 -148 32 -353 133 -4 24 99 52 -267 -242 227 7 22 -192 -71 -30 6 5 -68
2346f8j55N8L09J73j50k47K7o6J0l5O9l1J23J6j40K95k09j02M8J48j99J17J8j33
2370a24J17k8J01j78L96j74j95j89J56J02J5J14j46j48q5M60l0l40n1L26j86k
2392h9K47k89L76k76J63k82k39L43J42n0k38j6M7K15ml6j64o9M14j66K0r9p4J14
2416a0O1M5M1J30j4l31p3M61m70K73n7k1k24N10n46K49J17j17j13l1K1r3K64r9
2440b7k8j95J3J14L81j86K29l19l86M29j24j56K34J6L85k83j49J41o7l23P7M32
2462B08k68N8k14q8K04K44l50K62K27o51N45P7k42M5j50P9J5j09K58j65M23l57
2484E1L8l92K40J98Q1k38L1l12K16K63l42J68Q5J37j37N1j3j53kLJ3K8j04L73
2508B83l26j66L64M1k77kl3K52k04qk02L77QN8l70K63j77K37l7j49R3J22q1O8
$$ plain form
2346 -68 -223 -165 144 317 167 -80 -53 -119 -109 -144 -75 -106 17 33 -107 188 -21 -123 -75 73 -126 -9 9 -124
2370 -124 -7 -35 66 -112 284 110 -85 -274 -118 -16 -1 113 -33 -181 -266 194 164 -176 -227 99 -87 -89
2392 -89 158 -131 245 -31 132 -150 -389 -46 96 46 -192 -208 -161 54 50 14 -150 -219 195 29 49 -50 -124 -10
2416 -10 51 96 137 267 253 -78 -151 310 -160 113 56 35 -189 321 -225 24 141 24 -89 -120 -99 -192 72 -27
2440 -27 -55 -250 -237 -123 258 72 301 -18 -404 25 -99 -255 -21 -5 380 97 -52 89 22 -301 -224 208
2462 208 -60 -2 -216 -304 -100 144 -206 56 283 -368 177 254 12 57 -93 -14 1 -108 150 -15 408 51
2484 51 89 -303 -63 135 216 -22 9 -303 -87 176 -166 2 87 224 87 138 125 -28 -30 -27 -14 14 -90 283
2508 283 -43 -209 155 196 -81 -83 -116 136 -68 -76 -278 99 107 165 -205 58 -119 118 81 -68 25 147 66 134
2532A34l34n8L06O4j32kK11Q8l39J39J3l27K75k57J91j01J29k5K30m28K78K59
2554C14k93P4j55J04j52P2P7J38j13k43j43L00J9n0J38r8J6l51L18j92M26l37
2576a31K5K27l5o0K3L24k7j73Nq9k9j11J28m7J59l55M7L94l76K97j14J39o2Nk42
2601g8l7J52L23m12L8j13J31j8j22L02J42n7l18n1K18l66K91j56O4q7m0q9L81
2624I8l3lL9l19K99M1J52n97N68l21K1Q0K49l40K35k33k15K75K3J06J52L4m91
2647a80L0J6K95j07o1k74M56k08J06nQ6l01K28m9N1j7k88L65k43n8K36k17K17
2670G8p2k9k1j88M60j20j10o9J13l07K53rL45j07j49k56K71k43q4L72j60L91n37
2693a78M23m95K4L71k21M2j8m0K9k91M21j44r4K92j91o0j55J44K96j93%L2j24
$$ plain form
2532 134 -200 -258 48 112 -20 -22 189 277 -62 77 90 -237 38 -219 -28 -129 0 -25 205 -223 55 314
2554 314 21 95 -60 44 -108 -36 41 179 66 -177 -320 -20 -1 -51 87 -11 5 -346 -28 -220 206 -131
2576 -131 -106 121 86 26 49 373 346 173 178 89 60 -51 77 30 189 -166 -119 275 -101 196 82 221 159 164 -78
2601 -78 -115 37 360 -52 -14 -127 4 -14 -136 166 308 251 -67 -118 100 -266 25 -131 -67 -154 -194 -283 98
2624 98 65 62 101 -218 81 122 274 -323 245 -76 -55 25 274 -66 169 -64 -279 -4 19 125 277 311 -180
2647 -180 -150 -134 161 54 -7 -281 175 -33 73 68 154 -147 81 32 83 66 -222 143 -100 -158 78 -139 78
2670 78 6 -23 -44 -232 228 108 -2 -71 42 -265 -12 -21 324 217 68 -188 83 -160 -244 128 -32 359 -178
2693 -178 245 -250 -226 145 -76 -34 -52 -92 -63 -354 67 -77 -171 121 -70 -130 -285 -141 155 -38 -38 -6 -130
2716a30J98r4J07J98k36K5j32J40j62Q1K57k80J85k07j27N9L69q7Rp4R2l08n8
2739a75L27k51K67ql4J65k18j56j19M01j54J95l47j8K67p0J39m50M01j31r3J69
2761A07k32L28j94K5J22Lp9L20k45j7pn13N53k10J01l11M36k20k8R3J16m7K11
2784C12n30J22L44n79M37k46J74o2k09J76J36j48j4L46Kk95J20k90J7m4L40j06
2806CJ74m30K65J66j15L4J44m30L80k80j52N33l59nk6J29Qj49k37L35k95L49q5
2829d3k5K81k42k21J08K5Q9J23K90m95L0L85n18J64j55J28J06l0J46l30K84j51
2851e1J04J9rR5N9J27l23j35k2M81n43J71J16q2j28j59K37N3l9j95L33l0j41k17
2875b79K05k08L29q3n6J73k57J28K29n11K5K66n1L49k58pJ79R5m4l00l08N87l4
$$ plain form
2716 -130 68 -26 81 279 43 68 -64 76 -86 -5 252 -28 157 -50 -177 -118 251 164 173 99 191 -117 -175
2739 -175 152 -99 168 160 126 291 73 -83 -202 199 45 240 -107 -125 142 72 211 -239 162 31 -62 107
2761 107 -125 203 9 34 156 159 80 400 155 138 131 -382 171 -39 62 -249 187 -33 -61 32 148 101 312
2784 312 -218 -96 248 -331 106 -140 34 -28 -237 -61 75 -73 -87 259 261 -34 86 -204 -187 -231 109 3
2806 3 177 -253 12 178 63 97 241 -189 191 -89 -241 292 -67 -72 -98 31 39 -110 -347 -12 -307 42 -43
2829 -43 -68 213 -29 -250 -142 -117 -28 95 385 -110 -80 305 -213 -49 -204 -76 30 0 146 -184 100 -51
2851 -51 53 72 63 158 217 344 21 -114 -136 345 -198 -27 89 7 -121 -280 -43 10 -29 -224 109 79 -62 -279
2875 -279 -74 -282 47 -36 -92 81 -176 -48 181 -330 -305 -39 -90 259 1 -6 173 268 224 -76 -384 203 169
2898A69L32n14L3K88k43k17N01k51k27L79k57p9J03mJ87j24k09J92P7J92k10k84
2920a66K3J74j61q6O9j6J86j15j29K96K0j97k0n4J47j4L68m47L76l09oM36l51
2943B4p6l4K56k64j52K53k3JK2q8K1RPJ00l88L50o7J06o1k38J92O8K09n0O8J22
2969C67m48L57k88j62J19K26j79K01j70Q3O2k19J28k32O7k28K9L3K65p8l7K2K60
2992A78k61N6j78K49r9K26K0j24k29k6J92J4r9q2J74n7j4J23k46K09P6J17L0q9
3016A60l56K95o0j82PP2K06k03R2J37j59K92j77j53j23J18p2K13l38L29j00K07
3038B05l70j6m1J35K20j65J51j56J50j34o0R3k6J63j03Qk6k34O9j32K68J76k56
3061h1L16l52k0K57j04J4J18r0j67j1O3o5K52N8j79k4n8j79M29J8j02J09k13J
$$ plain form
2898 169 501 -13 20 308 65 -152 349 98 -129 250 -7 -86 17 13 200 76 -133 59 136 328 118 -166
2920 -166 -143 31 -130 -216 -147 -163 23 -92 -221 75 95 -102 -122 -176 -29 -43 325 -122 254 -55 -61 375 24
2943 24 -52 -86 170 -94 -246 7 -16 -15 7 -81 -60 -51 -44 56 -332 18 -49 57 -4 -242 -50 18 227 177 245 367
2969 367 -81 276 -12 -174 -55 171 -8 193 23 106 168 -51 77 -155 -88 -316 -287 -254 11 -67 -104 -82 178
2992 178 -83 -27 -205 44 -55 171 191 67 -162 -188 4 18 -81 -163 11 -46 -60 63 -183 26 102 219 249 160
3016 160 -196 99 39 -143 -136 -64 142 -61 31 168 9 301 124 -29 -152 -34 -106 107 -231 98 -2 205
3038 205 -165 -181 -222 -87 133 -32 119 -37 113 -21 -81 12 -14 149 46 54 28 -206 -137 -269 -1 175 -81
3061 -81 235 -117 -137 120 16 30 148 58 -109 -120 -57 -122 130 188 9 -15 -73 -252 177 195 93 202 -11 -10
3085a0k44M68k36L2M4j95N6M01m17R1M2k09L85j04k1n5J6m01J63J13J14j35j05
3108b07L06k46J2J41j96R4m9l8J33J88N1j29k01J91p9J6N1k72K81J27k72J4J66
3131H2r5K49m48L74k02L3J27j68o9K36k3o7L8j08K06j83l8J88j95J27J01k72K58
3154A51Q3j94O9r4l26J88J8J57k3K1J52l13l3K73l03K24j18l5J33k09n1J17J32
3177A9k7J58l93j65P29l00lj0k85K12k87L92k9l1q6R5j0K38l73P3L00q4J48j39
3201A42m74O36k37J17J45k78J35om07M85l45j8n1j21M45j12O2j58J48l51J47K5
3223g1J92j98j15j7K19J16j30J00J49j49R5j54j09Np9K76k88M0J82J18j57j2k60
3246b47L02J25j31K26l12J04k82J25J54j14m8J11L78l06j52p2L31k94K33k75M22
$$ plain form
3085 -10 -254 214 -22 10 54 -141 -85 316 -101 -10 32 -177 208 104 83 28 44 -357 -194 -81 33 -102 -207
3108 -207 99 -147 -135 6 -190 -96 -145 -183 -50 138 189 60 -141 50 -29 -13 38 -234 47 174 -98 -84 82
3131 82 -13 236 -212 162 -40 -7 120 -48 -117 119 96 29 67 -41 165 -18 -56 132 -63 64 165 -107 151
3154 151 234 40 109 15 -311 -123 -105 52 29 50 202 -111 -144 129 -174 50 -68 -103 30 -179 -230 -113 19
3177 19 -8 150 -243 -408 321 21 18 8 -277 -65 -352 40 11 -20 -106 -11 -21 217 -156 -83 217 133 281 142
3201 142 -332 304 67 184 329 51 186 180 -227 258 -87 -105 -156 -277 168 56 118 -40 108 -243 -96 -71
3223 -71 121 -77 -192 -209 10 126 -4 96 245 96 191 37 -72 -67 -146 130 -158 -118 64 182 25 13 -247
3246 -247 55 180 49 275 -37 67 -215 -90 64 -50 -98 13 391 85 -67 -139 192 -102 131 -144 278
3267B78k34J02j02k24J32J70j53k81K61K03m73L38k03J15L9J43n0j74J38N5k9
3288E1m6L8k81L42l4k26K44j72K9K44l33J98N5j77j07J3J05J8J70j58r5%K06k8
3312E6j67L56l42J59j18L46n31K12j2K0J47k44j96M18o5J02o9O7o3n3Q0j20J99
3335A82l38L51P7j89P4n8J67j69pN0J5j11n3j01K06Q2l27J2j59J82Q5k4J18lj61
3360i9j47K14j43K68j56N5o9J56J44j08q7o8K62rk32K6qP9K30j92m9o5j47O8l08
3385c85K13J03J08j87p2M23j13j90j14N86m05j20J47j25N4J37k56K94K9j34j29
3406a36j20L33o8j79K70k44J44q4N3qL7j26K47J63l15j49J74J55j61P4N3j73J60
3429A00J08J62l76o2J96o3j73o2J91J02J3j79J97j48nn9J06r1J45j65R4l34L22
$$ plain form
3267 278 44 146 44 -180 -48 122 -31 -312 -51 152 -321 17 -186 -71 -32 111 61 -113 25 80 51
3288 51 5 43 -238 104 70 -156 88 -84 -55 189 -144 54 109 -68 -175 -162 -57 -39 131 -27 -122 -122 84 56
3312 56 -111 245 -97 62 -56 290 -241 -29 -41 -21 126 -118 -314 104 39 141 72 139 76 23 103 -17 182
3335 182 -156 195 272 83 157 99 266 97 90 140 155 44 -9 -110 96 178 -149 -137 -296 -114 -29 -53 65 62 -99
3360 -99 -246 -32 -175 93 -63 -8 -77 79 223 115 28 -40 222 213 -19 7 -1 78 308 116 67 2 -145 -77 -385
3385 -385 -172 -69 39 -148 -220 203 90 -100 -214 372 -33 -153 -6 -131 -77 60 -196 98 127 -7 -136
3406 -136 -256 77 9 -170 100 -144 0 -84 -31 -39 -2 -128 119 282 -33 -182 -8 147 -14 60 113 -60 100
3429 100 208 370 -6 -68 128 65 -108 -170 21 123 136 -43 154 6 1 -58 48 -43 102 -63 31 -303 19
3452A9j04K1M1j8j74k30N22J9j47L01m73L54k66L2M2L45j17l22j00Q5N26l5n91
3475b70N63%J05n20P2K19L3k77j91M04k91L73m36K15q2LJ27N9k43K08j07q2LJ89
3499G4j23J01J18r4j30J66J5j79M5R2J52o22M74j19j71P5m0L10l29K93o0k78J41
3522h9J22r3J87K50m60N12q20N14m35M4KL70k17N0j15J27Mr1J97j64L31J45k76
3545I5l6k51K26M3j31j34K65r4J72k26m6MK02m29N77l5o4j07J31j52p7N1q9k1
3569a26J54j02P9j7p7J17qK5j56N6J84q7J00k93K39j83L44j04k22l5J17k4J03
3592H4k80J63K79j92Q3m38L39j65K39J08l72L50r8q8J73l87O4O15l19j51mq4K95
3615B14j13J32j95k04J45k3o8K56N4J4k77Q3K8j49k69M13k40J01Q9m9k17K18o8
$$ plain form
3452 19 -85 -64 -23 -41 -215 -445 77 96 -51 250 -223 131 -135 -103 -61 284 167 -155 -255 -170 356 321 -270
3475 -270 293 293 398 -122 -50 169 202 -75 -266 138 -153 220 -216 -1 -83 -80 47 106 -137 71 -36 -118 -115 74
3499 74 -49 52 170 76 -54 112 127 -52 -7 85 237 -385 89 -30 -201 -126 -166 144 -185 108 48 -230 -89
3522 -89 33 -60 127 377 -83 429 -391 123 -312 -268 -266 104 -113 -63 -178 -51 -47 -138 59 -105 226 371 95
3545 95 59 -192 34 77 -54 -188 77 -17 155 -71 -117 -113 89 -340 237 202 138 31 162 10 -67 -16 -105 -126
3569 -126 28 -74 5 -12 -89 28 20 45 -111 -55 129 42 142 -151 88 -95 249 145 -77 -112 5 -19 84
3592 84 -196 -33 246 54 137 -301 38 -127 112 220 -152 198 100 12 185 -202 -138 477 158 7 3 -81 214
3615 214 101 233 38 -166 -21 -44 -112 144 198 212 -65 18 46 -103 -372 41 -199 -98 -9 -58 -275 -57 -125
3638a25l44O33j71K44K00m47j35N12j79l03J51M03n15k7L64k30K19j24j38Q3M7
3659A18r6l1J19j48K70j93J44j54o4J71l08K21k19M63j42k67L44j37l4k99%K77
3681C5j48M1J0j37J57L51k76k79J64o2l5M56J50l71j57k10K56k29N44l23K6J02
3703F5j22k36L76j64j3k19L80j81o4L35k77J28J76l93K88J10n01K83J00J7L0j98
3725h0J05j90K81k04J47k48K76l58J65Oj72K87M1J76l71M92m35J79m5n6j90pL56
3748A55p0k97K85j22M8Jm0Q5J1k20J24J7K15k72J34J22k44L6K30j34k16K21k00
3771a31J31q4K12j91l3Q7J0K4j18n5M8N9O1Q6M3k31K37n0m1K14j69k22J25P3j98
3796a13Mj32L50j56N0l09K85J13R6j30L1j46j26K12M7O5j08K2J80J4j73l5o8J39
$$ plain form
3638 -125 -469 164 -7 237 437 -10 -145 367 188 -115 36 439 -76 -103 261 31 250 126 -12 71 118
3659 118 22 -9 110 -38 232 39 183 29 -35 136 -172 49 -170 293 151 -116 228 91 57 -242 -242 35
3681 35 -113 -72 -62 -199 -42 309 33 -246 -82 -144 -179 277 427 56 -101 -311 -55 -284 260 -63 -37 65
3703 65 -57 -293 83 -81 -94 -313 67 -114 -178 157 -120 8 184 -209 79 189 -312 -29 71 88 118 -80
3725 -80 25 -165 116 -88 59 -189 87 -271 -106 -100 -272 15 56 232 -139 353 -82 97 52 -4 -194 -201 155
3748 155 85 -212 73 -49 -1 0 -40 45 56 -164 -40 -23 192 -80 54 176 -68 -32 198 64 -152 69 -131
3771 -131 0 -84 128 -63 -96 -9 1 25 -93 -148 -100 -41 20 106 149 -82 155 105 64 278 109 -113 12 85 -113
3796 -113 -109 -241 109 -47 3 -306 -21 92 188 58 89 -57 -183 29 76 141 33 55 235 249 76 41 -27 112
3820A12j6J48K2j59j29j03q3M81k30K78k86R2o30L49K14O8K67k67%k33J04k4j18
3843a43J83Nk59J35J92J23j23j55K3l1J9j5Q0J85m70L89l03K59p8j64J57k44M05
3866A70l89K64r2k4J09l07L38Q7j47r0k28L39K96k80j18K27l00K23M4k43J77M9
3888A05j13qMr0K7kP1M1j0o9q7qJ97n5j87K16pJ02l58K61J6J29r2LO4N6j22m0
3916D4O8j99k9n5L03r9J02k25l4K02J13O6l32K1J99j40J52Q4p2j97j14k41J85
3939a98O8JK4K98p4j77o1L04l21L59j93J42k61J7J58j49Ro0L43k87k91K66K01
3962A18k9k06J86J82j53j50o2m6NJ01J67J74l52l7J6M2oK81m55K90k83J21L33
3985B37k88J86k93L8Mj6J34q3j05J20K56k31j29L05j9J5k33Q6P6j58P3K37l44
$$ plain form
3820 112 96 244 266 107 -22 -125 -208 273 43 321 35 127 -503 -154 60 128 395 128 128 -105 -1 -25 -143
3843 -143 40 45 -214 -79 113 236 113 -42 -19 -50 -31 -46 34 219 -251 138 -165 94 16 -148 9 -235 170
3866 170 -219 45 -47 -71 38 -269 69 156 9 -81 -309 30 326 46 -72 155 -145 78 122 -121 56 105
3888 105 -8 -16 -12 -102 -75 -77 -6 35 25 -44 -131 -139 58 3 -184 32 25 127 -231 30 46 175 83 86 150 206 84 44
3916 44 112 -87 -116 -171 132 33 135 -90 -124 78 191 257 -75 -54 145 5 157 241 169 -28 -142 -383 -198
3939 -198 -130 -129 -105 193 119 -58 -119 185 -136 223 30 172 -89 -72 86 -63 -54 -114 229 -58 -349 -83 118
3962 118 89 -117 69 251 98 -52 -114 -160 -155 -54 113 287 -65 -102 -86 -44 -50 231 -224 66 -217 -96 237
3985 237 -51 135 -158 -120 -116 -132 2 -81 -186 -66 190 -41 -170 135 116 131 -102 -16 60 -98 -25 212 -132
4008a32M8M51l05k70N9Q9MQ3l33N30m59M33k39rK84r7Pr7l00K51k9L53o25N47
4032B44j15K02m66J70J35k79R7m9J67j16pJ5j8M69m33k2J67l0l18M68j75k56M4
4055a06J16P4J4n6K62l20Q5L03l19l83L61k70OK37J10j92j28L55p7j45J97p3J13
4078A64m3l0P3k29L96n52K08k37L28j72J76l24J99k68L40j34J01k62J15J97n9
4099a3p2j85L16Q4J13k8l12J20J17l25J81M9l3l5R9j0K94m67L69k92r2L1rJ99
4123I9n0j24J27q9K50l37J81j34j35J79N3K31j55j29k1m25P02k15l1M2j75M47
4145B91r5n55K66J56J6O5l42N26m03O9j5O7K92j61k66J12N2J85O8m05K05k33Q5
4168b0L2k32pL55J51m55m7j47N28k54J27p0J9J90l4R4l60J98j22R1r0j64L25J23
$$ plain form
4008 -132 -84 367 62 -208 -149 -60 -56 27 -306 224 -235 198 -41 -50 234 137 144 47 -253 -2 -31 322 -303 244
4032 244 129 331 -135 35 170 -109 -12 -61 106 -10 -17 -2 -20 449 16 -6 161 131 -187 281 106 -150 -106
4055 -106 10 84 98 42 304 -16 69 372 53 -330 31 -239 -233 4 114 -78 -206 149 72 -73 124 51 164
4078 164 121 91 164 -65 331 -221 -13 -250 78 -94 82 -242 -43 -311 29 -105 -4 -266 -151 46 -13
4099 -13 -85 -270 46 130 243 215 -97 23 140 -185 -4 45 12 -23 76 66 360 -107 262 -30 -122 -91 -100 99
4123 99 49 -75 52 -37 213 -124 57 -77 -212 -33 20 251 96 -33 -54 -479 223 8 -23 19 -156 291
4145 291 196 -359 -93 63 79 144 -198 328 -75 -6 -21 46 338 177 -89 23 75 260 328 -77 128 -105 -20
4168 -20 12 -220 -227 128 279 -176 -223 -370 158 -96 31 -39 -20 170 136 230 -130 68 -54 37 -53 -217 108 231
4192B31l76N7Q5L10l49k9K06l38M15j50Mj75K19l6k12J28j04K47k28L50j17m26
4214b88K53m6L56k81j8m9O1j66M43j52m69L54K82k34J00l30J86j86J34J47O5j20
4236D2j90J00K1N6m63L42R1J10j78J79j12p3q7J18j47J86o3J57m8q4rJ8k33K65
4260bJ7p5K49k12J96k77j44J49K80o3J9l44L15N2M9q5q0NL38m05M6j49K60l68
4284b29K84o2j47J9m5J98P3M7Q5l31J94K13J16j61l27M13m94J91j39q7K12O7j16
4307b6Nq1J14O9J05k34P5J20j13j24N1j37O5J6k1p4L35k52j43J76L8J65k56K25
4331I8j53J83r9L02m15J99k22k6L20l78K74K06k16l26L01l74K76J7l6j36J59q0
4353a26K30j0j27o2q8J63L6J62m25K63r3K41j02J82j74j42J4kK10j83J10j99j74
$$ plain form
4192 231 -145 -88 -3 307 -42 -71 135 -203 212 62 66 -109 110 74 -138 -10 -114 133 -95 255 138 -288
4214 -288 -35 -81 275 -6 -24 -73 -12 -178 265 113 -356 -2 280 46 146 -184 2 -184 -50 97 162 42
4236 42 -148 -48 -27 29 -434 -92 -1 109 -69 110 -2 -75 -162 -44 -191 -5 -68 89 41 -43 -52 -34 -267 -2
4260 -2 15 -60 189 -23 173 -104 -248 -99 181 118 137 -207 108 160 209 124 44 49 387 -18 28 -121 139 -229
4284 -229 55 -7 -154 -135 -180 18 91 138 223 -108 86 299 415 254 -73 340 -154 37 -102 -189 23 90 -26
4307 -26 -21 -102 12 81 186 -48 27 147 34 -90 -39 -176 -111 -95 -116 -190 145 -107 -250 -74 -36 129 -127 98
4331 98 -55 128 29 331 -84 115 -107 -133 187 -191 83 289 73 -253 48 -326 -50 -33 -69 -205 -46 -126
4353 -126 104 94 -33 -95 -183 -20 16 178 -247 16 -77 164 62 244 70 -72 -58 -60 150 -33 77 -122 -296
4376b96l7L47r4P7m1mM00l48L14j57m15K73J81j19R4N7j98J40k1k73K56j32K7
4399C1J27l53N5k0L57k59K70Ql55K6L8nL53j07r7l47M91k5k19k00J8j94O37m03
4423a73O1L37j70p0p4K63k93K51j85j56K04j25QL57l57L1k50L28q8J22k12M93
4445C02l01O6J30l7k44M0K75m11M22k41J42J53n8r7k69J75n1j53L43l9k40P1J41
4468A19K0j87lP9J00k18M3j25O8K28p2O8l32L61j14J00k31K64k00oO3k4K07l54
4492a46J93j8R1l16J39K50L4m02K12m8K7r3k11K70J23J42l87M06o3l41M46j73
4514A35n97N62L1No6j80M15l80J43j0L3k98Q1O9L49o6n41J83L41q2k02j07R3l1
4538a20J4R0j13L17N4J50k55m8l16J78J04j0K16m45M57j61k36L72p41L92J94M7
$$ plain form
4376 -296 -333 14 -80 -3 -44 -48 352 4 318 161 -254 19 200 81 175 232 34 174 153 -120 136 4 31
4399 31 158 -195 -140 -160 197 -62 208 216 -139 -113 -75 -80 273 166 69 -278 213 188 -31 -231 -213 -407 230 -173
4423 -173 -112 225 55 -15 -89 174 -119 132 -53 -209 -5 -130 -122 235 -122 -91 -341 -13 -101 21 -191 302
4445 302 1 67 197 160 -84 -44 231 -180 242 1 143 296 238 141 -128 47 -4 -157 186 147 -93 -22 119
4468 119 139 -48 -51 28 128 -90 -47 -172 -104 124 52 120 -212 149 35 135 -96 168 -32 -38 25 1 208 -146
4492 -146 47 29 120 -196 -57 193 227 -175 37 -11 16 -77 -288 -18 105 247 -140 266 203 -138 308 135
4514 135 -462 100 131 136 70 -110 305 -75 68 58 91 -207 -126 -57 292 226 -315 -132 209 127 -75 -182 -89 -120
4538 -120 -106 -16 -129 188 242 392 137 89 -227 -49 55 45 261 -184 273 112 -124 248 -493 -101 93 140
4560A40k13P9P0k35L03p1J82n89M52P2j34k6K76j89J5Q6o7q6J16l4k42J99l72
4583b68M93m57J73K49l70M15l44M40j54l37J41Q8n1j24J70J07l50ML48K43l72
4604D4L7j16l1L9j63K83j27K18ok58j6K06j59p5P0n2J80o3k5J45j41k6K7J6J46
4629A53q6K18l90J05j35N4J69l1j65k00L04N27l79l62p5K80K0j96Q2m6L40k07
4651b0K20j47j06L23Nl28J91l79O14k39j09o4J54j29R5l30J11J35K23k83l37J65
4673b35j8K25j37M9j43L01k51J23j01K37j88J63J53k85k7K21j47J65j46j1J3L20
4695B81k88l26K55K46k67M12j59m6l46J76m4Q5J47j46J88k81K61j09qj44j99O94
4717C82l94j80K86j97J23N2j44J73L0K6k45l1K04p1k8J12j71J09O5k11k7N1J6
$$ plain form
4560 140 -73 6 76 -159 144 73 255 -334 118 190 56 30 306 117 132 218 151 65 181 147 -95 104 -268
4583 -268 225 -232 -59 190 -180 235 -109 331 177 -160 -19 69 18 -106 64 171 -179 -175 173 416 44
4604 44 81 -35 -66 -27 -190 93 -34 184 178 -80 -96 110 -49 -124 -54 -106 74 11 -14 131 -10 -36 -9 7 153
4629 153 67 285 -105 0 -135 -81 88 57 -108 -308 -4 523 144 -218 -293 -13 7 -189 -107 -153 187 -20
4651 -20 200 53 -53 270 275 -53 138 -241 373 134 25 -39 115 -14 81 -249 -138 -3 220 -63 -400 -235
4673 -235 -253 -28 -165 -116 -259 42 -209 -86 -187 50 -138 25 178 -107 -134 87 -60 105 -41 -52 -39 281
4695 281 -7 -333 -78 168 -99 313 154 108 -238 -62 -106 -21 126 -20 168 -113 148 39 31 -113 -312 382
4717 382 -12 -192 94 -103 20 72 -72 101 131 157 -88 -119 85 14 -14 98 -73 36 101 -110 -137 -86 -70
4740g0J32L50n05K90P0j34m5qN8k81l7K59n8Q9j20k87L13l9J23l56R2K24j58R9
4764AQ4m02K88J7J75k35L62k24m2O4j53P6J21N7k80J23M4j7L5k44L11m7J94n4
4788B54l24K5n4J67k35O9J50k83L50j66L5k53L51r0q6j0J76j30J0J85n52O12L8
4811B39l44o0J45J18k97K32K35l11j84L43j40K56l43j88K94J45rl53K72Rr7N2
4833A4j4J18K40m49n1J62k6R7k07R0M3j35M6L39j44j1M0k1N0k20J00J3j22M28
4857C80l13j40k9n2K16j23l45K99K91j3m46J86k56J74K07R6k64J88j08J76k20
4878i6k31M48j1q0P9j52J43p3o5J7J20J25k86L89o70m0L31K18k61r7M31R0l29
4901@p2j6M6j86J01J15l9j0o2P6J75j6q0J31q1j25L0L2k12J77J02R9j30n3q7k31
$$ plain form
4740 -70 62 412 -93 197 267 133 88 80 138 -143 -180 79 21 110 -10 -297 16 -23 100 -256 -164 60 -98 1
4764 1 85 -317 -29 -12 163 -72 290 66 24 88 -65 11 132 189 -91 32 76 59 94 -150 161 114 308 254
4788 254 -70 -45 -99 68 -167 -98 52 -231 119 -47 -12 -265 86 -4 -90 -100 76 -54 -44 141 -411 201 239
4811 239 -105 -165 -20 98 -199 33 268 -43 -227 116 -24 232 -111 -299 -5 140 131 -222 50 59 -38 14
4833 14 0 118 358 -91 -142 20 -6 91 -116 -26 17 -118 -72 267 123 112 152 131 181 -39 61 74 -48 380
4857 380 67 -73 -102 -154 62 -61 -406 -107 184 171 -275 -89 -345 -171 36 132 -132 56 -52 124 -96
4878 -96 -327 121 110 30 109 -43 100 27 -38 -21 99 224 -62 327 -343 -383 -52 166 -95 -192 239 329 0
4901 0 -72 -88 -42 -228 -127 -12 -51 -61 -123 -47 128 112 32 163 82 -43 -13 19 -193 -16 86 185 55 2 -85 -316
4927c16J06J66j89L10K62l11on7k32N16k29j18J51j3k02m8K89k29L26k89K06j57
4949f4J95j19j36J91j13j97L85l20J40o5L04r8j00J31l08K66n0K3k65K51k89N6
4971a82p4J16J33j76K43j58J85p9l02K47M8J10m8j48J94j37J02lL8k16J73k81
4993b15L49l92M19l62j5K11k11K27J31k14J14n8j1j98L64k3l9q7j8J8j5K07O1
5016B43l92k58L95k73j48M15j09k4M6L48J77l67j90J34j33Q1Q8m3J07M2m72K64
5038f9K98j99q4m2k58K38K82K6l1k37K46J8k20K47j35J26k44p0L24j48j53K8j85
5061b42M97j37Q5p0j01j10m5J35P7m7L08k96j26P9n3K18J55n71L28k25J30P5o9
5084eJ40j93l0P0P8j33J64J44k38j27J51rj58M2K13k61K54p6J24n7k90K54O0K3
$$ plain form
4927 -316 -210 -44 -233 77 339 28 22 -35 -267 249 20 -98 53 40 -162 -210 79 -150 176 -113 93 -64
4949 -64 131 12 -124 67 -46 -243 142 -178 -38 -103 201 103 3 134 -174 92 42 65 -200 51 -238 -182
4971 -182 -256 -140 -7 -183 60 -98 87 8 -294 -47 1 111 63 -85 109 -28 74 71 109 -107 66 -215
4993 -215 134 -258 161 -201 -216 -5 -216 11 142 -72 42 -16 -27 -225 139 116 77 -10 -28 -10 -25 182 243
5016 243 -149 -407 -12 -285 -433 -18 -127 -151 -105 243 420 53 -137 -3 -136 -55 33 -10 97 139 -333 -69
5038 -69 229 30 -54 -96 -354 -116 166 192 161 -76 170 188 -32 215 80 206 -38 -108 216 68 -85 -57 -242
5061 -242 255 118 203 133 32 -78 -123 12 89 42 350 54 -72 7 -46 172 327 -244 84 -141 -11 64 -5
5084 -5 135 -58 -88 -18 60 -73 91 235 -3 -130 21 12 -146 -104 109 -152 102 26 150 93 -197 57 117 140
5108A40n7L2m4l19J59J74P0n1j57l4k56K75R1J5r2J00Pj68J35k9L00m83J91%o0
5133f1O2P6J48l16mQ7K48k07r3q4m8Q5L12q3j69J41j14K68j92k6k80L80K5J53
5157C08l09J51j2R5k19j86M18k24K0j49K48O6j01k49J87j8P7M1r7j75J64o9Nj80
5181b08m1L75l87J20j14J41j13K21J53j83Q9m5Q0q3j47Q9J86J9j20j98K95n5k43
5204a69K48O0j40q3j0R6k87M16k21L5Q9j09m4K36j85P8l9Q6j99N3L54k38P6j06
5228cJ88r5J18l67K96k02K47k23J06N4j32j51J59l7M6Ok35K81o1l8j3R0o7k39
5252b72J17J77j88o1n4L02k20j19M52j88j1O9o3K71rJ57k55j23O3K06m46L62j15
5275E2j99P5Q0m1Q6j84J84J18k50L2j15J76j25K0l9R0L02k06k36M9j20M44j42
$$ plain form
5108 140 83 115 71 -248 -89 85 155 104 -53 -87 -343 -68 23 38 -54 46 53 -115 20 -9 291 -192 -1 -1 -61
5133 -61 1 77 225 -91 -95 -8 240 33 -60 -144 -192 -107 205 122 -47 94 -20 248 56 30 -250 130 155 308
5157 308 -1 150 138 233 14 -172 246 22 42 -107 141 207 106 -143 44 26 103 144 47 -128 36 -33 -28 -208
5181 -208 -249 126 -261 -141 -255 -114 -227 -6 147 -36 53 8 88 5 -142 -53 133 152 32 -166 129 74 -169
5204 -169 79 139 -1 -84 -94 2 -285 131 -90 -55 34 -75 -119 117 -68 10 -29 57 -142 -89 265 27 103 -3
5228 -3 185 90 208 -159 137 -65 182 -41 65 119 -13 -164 -5 -42 4 10 -225 56 -5 -43 -56 34 -33 -272
5252 -272 -155 22 -166 -227 -281 21 -199 -318 134 -54 -65 4 -59 212 203 360 105 -18 45 251 -195 167 52
5275 52 -147 -72 8 -33 53 -131 53 171 -79 -47 -162 14 -111 -91 -130 -40 262 56 -180 -131 -251 193 51
5298E1j93K03k62N88j38k04Q8r2j19K12l49J50Q1j02K43l16J00m9K11j93L47k75
5320a8k46L40P1k76oJ27j4k26L96j00K1Q0j82L15j29m68J79rK48j26l0N6p4p4
5344a45M13Q4l07j1l18P9K31K45k08l54J02K93l16R2j8j03j25L99k86j13J17K96
5366D7M62o49R5k34N25l46m6L36l35P8K12k49J49n5K7K58m24M52l72j17K32M5
5388I1l5m80M47j78n9L12O8j79j5k4J63j41K12K19m34N6j24k54N21p9l1J97ll42
5412i2k72K32j02L26J91l63m6M13n16N57n97K83R3k1J49J6K8k18J8j11R4J57l51
5435a32L15j86p8K36q6j24J08j17o3K98j23k7P7k41J75K6k31L99k99K54l60L96
5457B17l50J2L72o4n4l67L22q6J22l10j1L33n7k47K93J15l86P4K2R9l64K01K20
$$ plain form
5298 51 -142 61 -201 387 249 45 133 41 -78 134 -215 -65 16 -86 157 -159 -59 -108 103 -90 257 -18
5320 -18 -264 76 147 -129 -135 -8 -22 -248 148 48 69 149 -33 282 153 -315 -136 -145 103 -23 -53 3 -71 -145
5344 -145 268 352 45 34 -284 -205 26 271 63 -291 -189 104 -212 -120 -138 -241 -366 33 -253 -366 -249 47
5366 47 509 -140 -45 -279 246 -100 -146 190 -145 -67 145 -104 45 -10 17 275 -149 303 -69 -186 46 91
5388 91 56 -424 23 -155 -214 98 166 -13 -28 -52 111 -30 182 401 -33 23 -101 -355 166 87 56 253 250 -92
5412 -92 -364 -132 -234 92 283 -80 -126 287 -229 328 -269 14 107 86 235 251 279 61 79 -32 62 219 -132
5435 -132 183 -3 -81 155 69 -55 53 -64 -127 171 48 21 98 -143 32 58 -173 226 -73 181 -179 217
5457 217 -133 -121 251 187 133 -234 88 2 124 -186 -197 136 79 -168 125 240 -146 -72 -50 49 -315 -114 106
5480A06k86K56j17M0J65j35j43J57J21j97k5J86j51N4Lr9jK01n1o5M1L0o9J36
5504A57k15j68nJ80J77k56K31R8k58j23M3J35k2J2j61K19j41K55j7j31l4K57j39
5527I4j76K93j19K4Pj95K64r2k26L22m90K4P1J32L21m76K24J85o8qk38L86k7k41
5551ip0j46L45Q7k50L33l18k26L94j59o5MR7k16K70j67K61n06N30q9r9o3N3j9
5575b8L97m02m6K21j45J24p2Qj41M27k34j32K03k24K65l9k99o6R0K27k36J75J67
5598B40k47Q0rp3R7j56K02j49l17K97j94L99l8j00j16J48j62K81N1n01K66r0N14
5621D23o53J57M1J08j63j7J65J4l28K61j16J23L40k92n6J46j44J9k17KNK19n2
5644a5q2j00K16J97o49M42P5J8p0J18K7k58J41j14K1J54l43p6K35O5J06ol4n2
$$ plain form
5480 106 -180 76 -41 -1 164 29 -114 43 164 -33 -58 128 -23 31 34 -65 -66 135 84 19 60 90 21 157
5504 157 -58 -226 -231 -51 126 -130 101 199 -59 -182 -139 -4 -26 -14 -175 44 -97 158 141 10 -24 233 94
5527 94 -82 211 92 116 123 -72 192 100 -126 196 -294 -270 -199 -67 254 -222 2 187 119 111 -127 259 232 -9
5551 -9 -79 -225 120 207 -43 290 -28 -254 140 -19 -84 -80 17 -199 71 -96 165 -341 189 100 1 -62 -9 -28
5575 -28 369 -33 -79 142 -3 121 49 57 -84 343 109 -23 180 -44 221 182 -117 -183 -93 134 -102 73 240
5598 240 -7 73 64 -9 88 -68 134 -15 -332 -35 -229 170 132 32 -84 64 -98 183 234 -267 -1 -91 423
5621 423 -230 -73 -32 76 -87 -104 61 75 -253 8 -108 15 355 63 7 153 9 28 -189 -187 -182 37 -15
5644 -15 -97 -197 19 216 -433 9 84 102 32 150 177 -81 60 -54 -33 121 -222 -298 -63 2 108 102 68 16
5668A6j19p6o6J03J32k92J49L39p2p9J6K5r9R1j86R0J83m4J00L5k52n5J73l86
5692b74L65m9j90M2J65k15L1Q0l1l18K41L30J9j84j51j1Q3j43L28O1j2P0l60J61
5716C8J71l27j51L73j69j9J28r5J89j62k06j62N24k69J65J43j45K35l07L14k77
5737iJ29k47J46j9k86J94M79m86L14K8k88m03N77r3j68j24K36j71K60k15K17j41
5759g0j07L91k43j02J3J41o4q5L02J56l96k07M50j69m39L79j78K09K88l39J09
5780C9m8j10J44J69j69K0L1k01r6K72q4J50j98J47N7o9j7r7J7r8K69k4O4j58K78
5805B88k63j01K14k69J44nJ27Q4j54r0j59J45J11j70j85L60J48l67K30J25k84
5826g1K60j53K85p0k88M02k90J45mm10J47j55j8L91k99K03r3k44L49j07k5M5N9
$$ plain form
5668 16 -103 -179 -245 -142 -10 -302 -153 186 114 35 51 76 -23 68 -118 -28 155 111 211 246 -6 -61 112 -274
5692 -274 91 42 -148 -106 59 -156 -125 -45 -76 -394 -153 177 196 12 -139 -150 -67 -210 118 179 167 237 -123 38
5716 38 209 -118 -269 104 -65 -84 44 -51 138 -24 -230 -392 132 -137 28 171 26 261 -46 268 -9
5737 -9 120 -127 19 0 -286 -92 387 -99 215 243 -45 -448 129 36 -132 -256 -20 -191 69 -146 71 -70
5759 -70 -177 214 -29 -131 -118 23 -41 -126 176 332 -64 -271 179 10 -429 -50 -228 -19 269 -70 39
5780 39 -9 -119 25 194 25 45 76 -125 -221 51 -33 117 -81 66 123 54 37 -60 -43 -141 128 104 168 10 288
5805 288 25 -76 138 -131 13 8 135 219 65 -25 -184 -39 72 -98 -283 77 225 -142 88 213 -71
5826 -71 189 36 321 251 -37 365 75 220 216 -194 -47 -202 -220 171 -128 75 -18 -262 87 -20 -45 0 59
5849E9k01L12l45M45j53q3qk14M7P2J50j24J83p9r6l11K84j59J40K43p8K4k06
5872i8K75l82M3L40k71K06j41N4J35j42j89L08j73J42o8k45L42k03r3J53P8j02
5894c1k76L87J31j22j40q7J55k68k2L08p8o2J11Qk27K91M3k13J48j43K30J38m63
5917a82J80K5j34J99p7n0K93k99Q3r1J76o2j81L1M2J71l04R9K75p6r5N4j74q6
5941a83M9n2J63J77l35J58K35n0j97R7J17k16j17J71j08J9K47k99L54k33K45j4
5963B28m45K91j05K48l3k37J45j69o5P1M2J71o3l00M8P3L03m24K99K9j93J47j77
$$ plain form
5849 59 -142 170 -175 270 117 34 26 -188 -141 -69 81 -43 140 61 -35 -346 -62 -221 -81 162 84 108 -98
5872 -98 177 -205 -162 178 -93 113 -28 26 161 19 -170 138 -35 107 39 -206 136 -67 -160 -7 71 -31
5894 -31 -307 80 211 89 -51 -138 17 -251 -273 35 -43 -105 6 14 -213 78 121 -92 56 -87 143 281 -182
5917 -182 -2 23 -111 88 11 -39 254 -45 38 -53 123 61 -120 -89 -47 124 -180 -81 194 118 23 77 -97 -183
5941 -183 -134 -186 -23 154 -181 -23 212 162 -35 62 179 -37 -154 17 -91 -72 175 -124 230 -3 242 228
5963 228 -217 74 -31 217 184 -53 92 -77 -142 -71 -29 142 79 -221 -173 -100 203 -221 78 107 -86 61 -116
$$ [...]
8191I1
##END NTUPLES=NMR FID
##END=
