##TITLE=1H_T-3929
 aceton-d6, 8 sc, 
 5.4.2019
##JCAMPDX= 6.0         $$ Bruker NMR JCAMP-DX V2.0
##DATA TYPE= NMR FID
##DATA CLASS= NTUPLES
##ORIGIN= UXNMR, Bruker Analytische Messtechnik GmbH
##OWNER= root
$$ XWIN-NMR		Version 3.5
$$ Fri Apr  5 15:29:50 2019 Russian Standard Time (UT+4h)  she@DPX200
##.OBSERVE FREQUENCY= 200.1316
##.OBSERVE NUCLEUS= ^1H
##.DELAY= (6, 6)
##.ACQUISITION MODE= SIMULTANEOUS
##.ACQUISITION SCHEME= undefined
##.AVERAGES= 8
##.DIGITISER RES= 18
##SPECTROMETER/DATA SYSTEM= spect
##.PULSE SEQUENCE= zg30
##.SOLVENT NAME= Acetone
##.SHIFT REFERENCE= (INTERNAL, Acetone, 0, 15.7039)
##AUDIT TRAIL= $$ (NUMBER, WHEN, WHO, WHERE, WHAT)
$$ ##TITLE= Audit trail, XWIN-NMR		Version 3.5
$$ ##JCAMPDX= 5.01
$$ ##ORIGIN= Bruker BioSpin GmbH
$$ ##OWNER= she
$$ F:/spectra/data/she/nmr/H-F/1/audita.txt
$$ ##AUDIT TRAIL=  $$ (NUMBER, WHEN, WHO, WHERE, WHAT)
(   1,<2019-04-05 15:28:55.48 +0400>,<she>,<DPX200>,
      <created by zg, POWCHK disabled, PULCHK disabled
       configuration hash MD5:
       00 E9 B6 7A A2 85 ED C7 34 08 36 98 17 FE 4E 26
       data hash MD5: 16K
       BE B9 08 C9 EE D3 60 82 13 AC 58 4D C2 D1 2C C3>)
$$ ##END=
$$ 
$$ hash MD5
$$ 47 2E 0A 28 AC AC DE C3 74 3E 86 FE FF 1A FD 38
##$RELAX= 
##$RELAX= 
##$RELAX= 
##$RELAX= 
##$RELAX= 
##$RELAX= 
$$ Bruker specific parameters
$$ --------------------------
##$DU= <F:/spectra>
##$EXPNO= 1
##$NAME= <H-F>
##$PROCNO= 1
##$TYPE= <nmr>
##$USER= <she>
##$AMP= (0..31)
100 100 100 100 100 100 100 100 100 100 100 100 100 100 100 100 100 100 
100 100 100 100 100 100 100 100 100 100 100 100 100 100 
##$AQSEQ= 0
##$AQ_mod= 1
##$AUNM= <au_zg>
##$AUTOPOS= <>
##$BF1= 200.13
##$BF2= 200.13
##$BF3= 200.13
##$BF4= 200.13
##$BF5= 200.13
##$BF6= 200.13
##$BF7= 200.13
##$BF8= 200.13
##$BYTORDA= 1
##$CFDGTYP= 0
##$CFRGTYP= 5
##$CHEMSTR= <none>
##$CNST= (0..31)
1 1 145 1 1 1 1 1 1 1 1 1 1 1 1 1 1 1 1 1 1 1 1 1 1 1 1 1 1 1 1 1 
##$CPDPRG= <>
##$CPDPRG1= <>
##$CPDPRG2= <>
##$CPDPRG3= <>
##$CPDPRG4= <mlev>
##$CPDPRG5= <mlev>
##$CPDPRG6= <mlev>
##$CPDPRG7= <mlev>
##$CPDPRG8= <mlev>
##$CPDPRGB= <>
##$CPDPRGT= <>
##$D= (0..31)
0 1.2 0 0 0 0 0 0 0 0 0 0.03 0 0 0 0 0 0 0 0 0 0 0 0 0 0 0 0 0 0 0 0 
##$DATE= 1554463734
##$DBL= (0..7)
120 120 120 120 120 120 120 120 
##$DBP= (0..7)
150 150 150 150 150 150 150 150 
##$DBP07= 0
##$DBPNAM0= <>
##$DBPNAM1= <>
##$DBPNAM2= <>
##$DBPNAM3= <>
##$DBPNAM4= <>
##$DBPNAM5= <>
##$DBPNAM6= <>
##$DBPNAM7= <>
##$DBPOAL= (0..7)
0.5 0.5 0.5 0.5 0.5 0.5 0.5 0.5 
##$DBPOFFS= (0..7)
0 0 0 0 0 0 0 0 
##$DE= 6
##$DECBNUC= <off>
##$DECIM= 24
##$DECNUC= <off>
##$DECSTAT= 4
##$DIGMOD= 1
##$DIGTYP= 9
##$DL= (0..7)
0 120 120 120 120 120 120 120 
##$DP= (0..7)
150 150 150 150 150 150 150 150 
##$DP07= 0
##$DPNAME0= <>
##$DPNAME1= <>
##$DPNAME2= <>
##$DPNAME3= <>
##$DPNAME4= <>
##$DPNAME5= <>
##$DPNAME6= <>
##$DPNAME7= <>
##$DPOAL= (0..7)
0.5 0.5 0.5 0.5 0.5 0.5 0.5 0.5 
##$DPOFFS= (0..7)
0 0 0 0 0 0 0 0 
##$DQDMODE= 0
##$DR= 18
##$DS= 0
##$DSLIST= <SSSSSSSSSSSSSSS>
##$DSPFIRM= 0
$$ [...]
##$SUBNAM2= <"">
##$SUBNAM3= <"">
##$SUBNAM4= <"">
##$SUBNAM5= <"">
##$SUBNAM6= <"">
##$SUBNAM7= <"">
##$SUBNAM8= <"">
##$SUBNAM9= <"">
##$SW= 24.9336934301222
##$SWIBOX= (0..15)
0 0 2 0 0 0 0 0 0 0 0 0 0 0 0 0 
##$SW_h= 4990.01996007984
##$TD= 16384
##$TD0= 1
##$TE= 0
##$TE2= 300
##$TE3= 300
##$TEG= 300
##$TL= (0..7)
0 120 120 120 120 120 120 120 
##$TP= (0..7)
150 150 150 150 150 150 150 150 
##$TP07= 0
##$TPNAME0= <>
##$TPNAME1= <>
##$TPNAME2= <>
##$TPNAME3= <>
##$TPNAME4= <>
##$TPNAME5= <>
##$TPNAME6= <>
##$TPNAME7= <>
##$TPOAL= (0..7)
0.5 0.5 0.5 0.5 0.5 0.5 0.5 0.5 
##$TPOFFS= (0..7)
0 0 0 0 0 0 0 0 
##$TUNHIN= 0
##$TUNHOUT= 0
##$TUNXOUT= 0
##$USERA1= <user>
##$USERA2= <user>
##$USERA3= <user>
##$USERA4= <user>
##$USERA5= <user>
##$V9= 5
##$VALIST= <valist>
##$VCLIST= <CCCCCCCCCCCCCCC>
##$VD= 0
##$VDLIST= <DDDDDDDDDDDDDDD>
##$VPLIST= <PPPPPPPPPPPPPPP>
##$VTLIST= <TTTTTTTTTTTTTTT>
##$WBST= 1024
##$WBSW= 4
##$XGAIN= (0..3)
0 0 0 0 
##$XL= 0
##$YL= 0
##$YMAX_a= 48713
##$YMIN_a= -63949
##$ZGOPTNS= <>
##$ZL1= 120
##$ZL2= 120
##$ZL3= 120
##$ZL4= 120
##$ABSF1= 10
##$ABSF2= 0
##$ABSG= 5
##$ABSL= 3
##$ALPHA= 0
##$AQORDER= 0
##$ASSFAC= 0
##$ASSFACI= 0
##$ASSFACX= 0
##$ASSWID= 0
##$AUNMP= <proc_1d>
##$AZFE= 0.1
##$AZFW= 0.1
##$BCFW= 1
##$BC_mod= 2
##$BYTORDP= 1
##$COROFFS= 0
##$CY= 11.3945322036743
##$DATMOD= 1
##$DC= 2
##$DFILT= <>
##$DTYPP= 0
##$F1P= 18.9103706918063
##$F2P= -1.10871071338519
##$FCOR= 0.5
##$FTSIZE= 0
##$FT_mod= 4
##$GAMMA= 1
##$GB= 0.15
##$INTBC= 1
##$INTSCL= 1
##$ISEN= 128
##$LB= 0.24
##$LEV0= 0
##$LPBIN= 0
##$MAXI= 10000
##$MC2= 0
##$MEAN= 0
##$ME_mod= 0
##$MI= 1.114404
##$NCOEF= 0
##$NC_proc= 0
##$NLEV= 6
##$NOISF1= 3.799351
##$NOISF2= 2.8
##$NSP= 1
##$NTH_PI= 0
##$NZP= 0
##$OFFSET= 15.70392
##$PC= 1
##$PHC0= -8861.713
##$PHC1= 27.20028
##$PH_mod= 1
##$PKNL= yes
##$PPARMOD= 0
##$PSCAL= 0
##$PSIGN= 0
##$REVERSE= no
##$SF= 200.130013532006
##$SI= 16384
##$SIGF1= 3
##$SIGF2= 2
##$SINO= 400
##$SIOLD= 16384
##$SREGLST= <1H.CDCl3>
##$SSB= 0
##$STSI= 0
##$STSR= 0
##$SW_p= 3612.71676300578
##$SYMM= 0
##$S_DEV= 0
##$TDeff= 0
##$TDoff= 0
##$TI= <>
##$TILT= no
##$TM1= 0
##$TM2= 0
##$TOPLEV= 0
##$USERP1= <user>
##$USERP2= <user>
##$USERP3= <user>
##$USERP4= <user>
##$USERP5= <user>
##$WDW= 1
##$XDIM= 8192
##$YMAX_p= 0
##$YMIN_p= 0
$$ End of Bruker specific parameters
$$ ---------------------------------
##NTUPLES= NMR FID
##VAR_NAME=  TIME,          FID/REAL,        FID/IMAG
##SYMBOL=    X,             R,               I
##VAR_TYPE=  INDEPENDENT,   DEPENDENT,       DEPENDENT
##VAR_FORM=  AFFN,          ASDF,            ASDF
##VAR_DIM=   8192,          8192,            8192
##UNITS=     SECONDS,       ARBITRARY UNITS, ARBITRARY UNITS
##FACTOR=    0.0002004,     1,               1
##FIRST=     0,             0,               0
##LAST=      1.6414764,     0,               0
##MIN=       0,             -63949,          0
##MAX=       1.6414764,     48713,           0
$$ Real data points
##PAGE= N=1
##DATA TABLE= (X++(R..R)), XYDATA
0 0 0 0 0 0 0 0 0 0 0 0 5 -8 8 -8 9 -13 16 -17 21 -25 29 -33 38 -46 53 -60 69 -78 87 -98 111 -125 140 -155
34 -155 174 -195 215 -241 267 -296 328 -362 402 -446 495 -547 608 -676 755 -847 956 -1086
52 -1086 1244 -1442 1702 -2054 2564 -3373 4864 -8552 41082 23906 -33101 16858 48713 33178
66 33178 -6353 -4575 16082 26565 4199 -5200 1741 3690 -4182 852 1353 -6126 -11242 -8211
80 -8211 -98 6554 -10545 -27100 -5415 19216 -3876 -31934 -16600 13076 7685 -21487 -27462
93 -27462 2367 15989 -12260 -25931 1788 13315 -6881 -13097 2712 8578 51 -6746 -241
106 -241 10851 3987 -11795 -4750 11114 3098 -14120 -12755 949 6478 -8297 -24969 -8676
119 -8676 14124 -3293 -28312 -9744 14209 203 -19070 -9288 9669 6222 -12659 -12303 8859
132 8859 8846 -13183 -11947 7152 4939 -9527 -10607 -1257 5956 693 -12364 -7294 11724 7520
146 7520 -11297 -6931 11286 11033 -3540 -7996 5821 17183 1327 -13800 4723 19633 272
159 272 -13343 4882 16384 3720 -6921 1369 15172 11875 -3557 -277 17918 15452 -215
172 -215 1825 13671 14287 6392 -772 2850 14795 10007 -8312 -4294 13597 7373 -10016 -6891
186 -6891 8208 8358 -6263 -10436 5790 12738 -5287 -12234 6019 10989 -5422 -10036 1480 5687
200 5687 -1174 -9471 -7896 2943 2141 -11510 -11049 1719 1619 -8549 -10098 -2363 4484 -1279 -12117
215 -12117 -5316 9520 1027 -13686 -4266 9050 538 -11289 -6581 4047 3704 -9010 -10989 3698
229 3698 6377 -8085 -8851 5066 5835 -3047 -3740 1070 6847 5066 -3484 -2755 8428 7194 -4739
244 -4739 -4448 4547 5725 -2899 -8155 -741 7208 -1809 -12133 -1071 9448 -1871 -10058 810
258 810 8024 1033 -4998 -1417 6351 5595 -3548 -3768 6096 5968 -3069 -3315 2744 3858 1101 -3344
274 -3344 -1899 6079 5195 -5159 -2832 8704 6247 -3605 -1598 6315 7270 -741 -4795 3259 8469
289 8469 -2254 -8500 2396 5704 -4275 -6937 148 2498 -849 -4244 -3623 2920 3950 -3577 -3293
304 -3293 4026 4401 -791 -1719 517 4916 2679 -5161 -3369 6752 2062 -8083 -2620 5288 488
319 488 -5939 -3409 2579 2972 -3306 -4943 2693 5063 -3172 -4131 3123 2568 -1851 -1914 -824 1012 1161
336 1161 -3682 -4416 2119 1681 -4272 -3745 1683 1974 -868 -3202 -164 5393 1507 -4537 716 7452
352 7452 370 -4749 1542 4439 -61 -3012 -1595 1932 1848 -3025 -3802 2123 1924 -2728 -1334 1556
368 1556 1347 991 -494 -1424 3282 4065 -2312 -1870 4624 2529 -2968 -2039 1814 1710 -1469 -4144 221
385 221 3519 -1695 -4433 1806 3739 -2001 -1799 2321 2181 677 -228 -609 2255 2628 -1695 -1716 1909
402 1909 688 -1652 -1416 -1054 277 671 -2873 -2249 3009 1099 -4245 -410 3629 710 -1691 -163
418 -163 1939 1810 -738 -2254 1663 2663 -2498 -2311 1743 97 -2129 -713 -67 -333 1077 -516
434 -516 -1102 2201 2505 -628 -143 2129 1715 587 -522 -113 2574 679 -3577 -710 2546 -1794 -4107
451 -4107 108 723 -2069 -2016 -1021 168 449 -1738 -1537 1618 826 -1686 -243 956 -854 -379 -315 -1569
469 -1569 -33 964 -2437 -1803 1675 331 -2018 -366 1281 960 92 -1078 1206 3282 410 -1664
485 -1664 2241 2573 -1122 -654 1775 665 -392 -128 -216 491 803 -1099 -648 1482 513 -174 1064 519
503 519 1396 2175 216 -118 3282 1674 -1381 1115 2326 24 -1148 470 656 430 -1007 -1292 947
520 947 1060 -2106 -1171 1862 -18 -1532 581 565 -127 199 -181 -798 483 -7 -1682 -415 601 -811
538 -811 -638 -877 -1006 982 -320 -2110 -80 1745 -1213 -2046 1359 1316 -1110 -374 406 -121 -380 -1729
556 -1729 -1421 557 -952 -2698 -1286 -864 -2177 -1513 -889 -2263 -1090 47 -1849 -1265 997 -158
572 -158 -1495 156 828 -57 -52 -468 294 1509 -758 -1876 1235 1491 -1365 -373 1924 88 -322 838
590 838 719 1641 1411 152 1037 2280 1007 665 1335 1401 978 1690 565 -129 2302 1423 -849 1086
608 1086 2684 885 444 1701 1628 1454 1021 489 2029 1982 -347 -5 2201 285 -1098 506 29 -908
626 -908 -551 -960 -1543 -351 -565 -2107 -1099 -74 -955 -805 -647 -496 795 350 -1395 348 1953 -407
644 -407 -1067 1147 1087 -836 -595 164 354 -41 -584 -535 526 -39 -1522 -54 240 -1208 -625 -109 -1670
663 -1670 -1299 -403 -2081 -2302 -979 -1562 -2687 -1901 -1695 -1983 -2254 -2469 -1609 -439 -1431 -2058 157 367
681 367 -1276 -280 936 425 6 655 707 713 1405 360 628 1263 1187 773 1187 795 867 1534 537 2 1922
702 1922 1607 -37 1112 2238 555 330 1445 1532 1044 570 -39 1257 1845 134 205 1854 1033 -172
720 -172 905 1057 641 1031 1198 446 1152 1493 493 747 1352 166 283 -42 -634 141 470 -1823 -1086
739 -1086 386 -1115 -1705 -346 -347 -1098 -792 -503 -677 -432 -811 -787 100 -225 -998 -60 174 -905 -172 -180
759 -180 -1317 -680 237 -762 -1249 9 145 -930 -125 -152 -173 -86 -727 -774 144 -596 -1621 -153 -80 -1517
779 -1517 -938 -199 -930 -599 -446 -1017 -890 -29 -960 -919 -54 -476 -350 -5 -739 61 682 2 -877 1021
799 1021 732 -619 100 785 -156 -212 87 -83 709 721 -281 555 1120 96 99 1567 823 497 1233 756
819 756 322 1280 1135 164 927 1173 129 579 490 251 756 557 -320 578 1194 -308 -275 1318 168 -298
839 -298 539 356 -115 142 -164 -398 116 -204 -633 -124 -96 -774 -394 -137 -854 -52 209 -867 -194 918
859 918 108 -408 456 334 -178 -79 27 -43 251 -605 -682 212 252 -1273 -326 40 -224 -532 -66 -847 -690
880 -690 695 -593 -435 317 -357 -693 63 22 31 44 -368 -384 814 -163 -790 339 660 -317 -47 432 -175
901 -175 -57 510 -376 286 447 -237 191 754 -254 -222 -7 -322 -513 335 -153 -630 342 242 -866 -224
921 -224 237 -42 -213 -130 -268 320 288 -403 543 718 -263 -317 692 361 -191 22 234 -13 165 -19 -221
942 -221 361 409 -360 -155 230 -290 238 420 -349 456 292 -664 -405 829 4 -590 51 -24 -111 8 -507
963 -507 -253 392 -51 -477 414 109 -510 107 201 -193 191 261 -529 -165 783 -118 -242 387 120 -244 -337
984 -337 -144 58 584 -262 -493 796 441 -671 84 641 -198 -353 107 -176 -183 503 -436 -43 136 -85
1004 -85 -113 -49 -185 -249 452 -192 -281 431 254 -627 357 259 -359 -204 171 203 217 53 -52 248 45 -221 -63
1027 -63 480 -96 -432 537 297 -281 552 -90 -164 416 -126 -599 284 405 -39 326 182 28 -71 -63 -446 139
1049 139 916 -637 -439 434 39 -809 -120 -63 99 126 -205 -38 348 89 -453 217 102 -427 557 251
1069 251 -539 -127 425 -387 -171 658 -118 -156 522 97 -396 263 -153 6 443 -167 -444 475 50 -463
1089 -463 45 270 -276 85 283 -271 -196 313 -9 47 24 -192 -139 14 -61 -146 463 -130 -723 242 16 -551
1111 -551 -274 380 -496 -169 23 -151 -395 -114 -382 175 310 -348 45 25 -260 -265 222 -126 -430 179 12
1132 12 -215 276 21 -210 171 -107 -284 391 -77 -357 75 142 29 -220 344 43 24 371 -166 117 271
1153 271 115 -196 87 165 176 106 366 -108 223 131 -306 209 309 -259 -44 583 27 -224 243 1 37 97
1175 97 220 75 387 -203 -98 455 -190 10 297 7 -325 78 -107 -540 118 472 -202 -318 179 25
1195 25 -220 -33 -70 49 192 -762 -489 262 -151 -402 -13 -119 -606 35 -88 -505 -255 -2 -451 -183 302
1216 302 -281 -646 -117 -622 -146 -107 -444 306 155 -324 -377 447 -20 -462 161 78 -127 143 289 -198 607
1237 607 259 -171 69 -78 49 56 215 -59 134 519 -243 -181 416 124 -484 285 -116 -34 -116 -150 -29 178
1259 178 32 -524 297 426 -18 -245 478 -269 -135 350 41 19 416 -78 8 470 334 -59 430 279 -101
1280 -101 423 -386 275 545 361 -326 144 702 -290 4 457 271 -25 105 -64 181 191 -398 -245 247
1300 247 36 -696 -38 107 -116 263 -203 -360 -322 98 -692 -379 -37 -285 -305 -85 -278 -332 -33 -496 -426
1321 -426 -30 -120 -223 171 32 -437 -253 -166 -324 -41 -346 -263 93 -158 -348 -94 41 15 -15 200 -84 -184
1343 -184 441 87 -128 210 470 85 25 539 211 258 -141 -61 222 320 -586 87 451 -198 -25 102 176 -79
1365 -79 33 173 226 318 40 -147 146 11 -29 190 189 -31 52 -145 -153 454 193 -198 -216 354 -91 -267 72
1388 72 -62 412 31 -399 285 587 -126 -29 472 130 11 313 126 -156 167 257 -298 436 592 26 -6
1409 -6 400 -92 -47 -117 51 20 320 -271 -526 595 -3 -384 -280 17 -160 -155 -138 -147 200 -533 -292 -150 39
1432 39 -425 -486 -50 -283 -269 45 -661 -290 153 -532 -349 89 236 -385 109 -364 -243 -247 -133 -244 460 30
1454 30 -292 189 359 22 40 310 43 138 400 -58 -136 531 161 48 145 70 110 83 311 95 257 -112 -285
1477 -285 157 427 -180 222 307 32 -242 263 -309 29 69 -269 249 117 -307 -227 243 -105 -167 63 -223
1498 -223 -233 314 408 -199 -121 81 -107 -128 374 222 82 116 -237 97 368 -224 7 377 -283 -116 27 108
1520 108 -236 95 15 -160 33 142 -161 112 161 -17 213 162 -391 26 195 -325 -288 184 179 -2 106 -35
1542 -35 107 202 -99 343 247 -39 -3 185 -28 -89 10 220 -217 -65 55 246 245 -3 34 -59 346 -86 -311
1565 -311 108 -224 188 89 -399 -196 312 29 -381 17 237 -115 -379 523 221 -68 219 -152 -162 222 -246
1586 -246 -95 5 -110 -271 184 147 193 268 -108 -610 -182 131 -143 94 266 49 -167 238 -104 34 419
1607 419 -250 84 363 90 -386 -29 -74 -274 -3 12 -31 249 -85 -307 172 51 81 157 430 125 -163 -244
1629 -244 -141 145 133 43 -520 241 256 -298 -102 173 -65 56 54 -186 483 171 16 14 135 -192 -189 272 159
1652 159 -16 116 -377 -19 203 -37 281 169 247 139 -118 19 114 210 -106 -281 17 -291 -171 -171 107 -144
1674 -144 -217 -117 -238 142 142 -428 -145 45 -193 -91 166 148 198 256 -122 -177 257 147 -342 313 215 33 -105
1697 -105 66 -34 99 303 100 -15 42 -366 46 225 29 -189 283 14 -266 -48 -33 -77 181 263 -350
1718 -350 -15 77 -85 13 323 76 72 29 -33 338 213 7 -158 363 44 -90 260 85 -54 -99 -72 -36 195
1741 195 -70 -61 -68 -112 -171 91 248 -201 -138 455 -210 -329 -18 -23 -271 120 -14 -115 -141 -132 -77 49 39 -247 402
1766 402 4 -242 290 -142 0 -45 -39 102 148 228 -469 42 -2 -340 137 199 -31 -15 50 -213 -89 116 -105
1789 -105 -431 147 44 -318 163 -219 -8 -15 2 22 -4 95 -426 27 -135 -241 -159 37 262 -277 210 125 -163
1812 -163 7 -33 -35 151 -7 174 263 318 -71 343 148 -287 -14 207 -142 43 232 188 47 67 -368 73
1834 73 132 87 -294 -49 29 1 101 -208 50 234 175 73 -268 -112 -218 -384 37 -527 9 -138 -266 -110
1856 -110 116 -134 -117 167 -156 45 87 -365 -261 288 251 -14 -164 148 -184 -206 211 40 -292 381 35
1877 35 151 -220 -64 47 19 -51 -73 -59 -118 -199 -144 -107 -176 333 70 7 -154 303 201 -157 -89 -315 191 -190
1901 -190 -42 -59 190 -91 -164 97 100 -223 -50 103 -83 303 -103 -309 260 191 -98 91 107 285 173 98
1923 98 -163 62 480 162 -126 472 301 35 -137 65 -49 137 -410 101 359 -41 -361 -88 177 56
1943 56 -431 -65 -57 -138 -135 -117 176 150 -60 109 184 -123 181 21 -297 -41 78 102 -82 398 58 96 -178 82
1967 82 -4 -42 -394 -367 259 -199 -248 -48 233 -122 -68 -117 362 -71 -310 -7 -179 128 -258 -288 -195 -72 -72 -154
1991 -154 -93 271 -206 112 -102 -166 -145 -220 -96 465 351 -327 -151 -83 -45 -134 47 324 105 194 -83 58 213
2014 213 331 -164 77 161 -162 119 133 -147 363 -140 -79 66 140 -225 -325 -141 -41 -230 -342 95 208
2035 208 109 -191 -5 -146 15 -70 267 -52 189 354 -233 132 447 301 130 267 297 173 -338 -49 85
2056 85 167 -64 -261 406 230 -237 -263 151 353 -300 -76 123 147 165 46 12 -194 -152 -79 174 314 8 13
2079 13 -352 -65 231 -128 -297 93 -73 -286 -293 193 288 -64 -287 -324 88 -178 -142 -84 291 141 -79 33
2101 33 373 252 184 -137 -88 246 98 -313 -150 234 11 -256 28 -45 75 -76 -111 -290 0 2 -373 -124
2123 -124 225 182 -169 -340 -91 -111 -41 -96 145 122 -395 -66 196 -59 -232 -94 -207 99 127 -381 -231 268
2145 268 -13 -310 -178 236 186 -155 -444 186 261 -344 -84 301 516 -183 -184 62 341 104 -224 -202 158 -56
2167 -56 -201 -308 209 321 -301 -102 208 94 3 -430 124 26 8 -209 108 252 100 -20 165 353 410 -257
2189 -257 -103 165 317 -169 -375 167 223 138 36 336 537 -37 -113 -144 186 258 -317 -132 286 21 -295 -244
2211 -244 195 -90 12 -59 39 184 -112 -282 42 250 -274 -118 -54 432 231 -174 -8 123 47 -186 156
2232 156 334 -44 -377 -166 230 97 125 -294 -24 440 205 57 93 196 -113 -263 -86 -145 -18 95 -174
2253 -174 25 268 29 159 -65 167 -13 250 -92 119 10 -527 -29 54 122 -767 -362 135 -91 -87 102
2274 102 -297 25 -205 -155 -38 87 246 -37 104 154 -85 -147 -247 400 503 -347 -100 40 336 -104 130
2295 130 -258 162 2 -136 83 56 220 -220 258 54 17 -206 -42 -30 203 -71 -142 -228 149 -285 72 -249
2317 -249 -9 -180 -120 11 466 -138 -50 -488 47 193 23 -121 90 272 -44 -56 157 71 -34 -240 -203 261
2339 261 127 -227 -82 -38 332 -211 -13 75 210 -99 -198 -306 455 -108 -408 46 223 -42 -159 46 100
2360 100 34 -161 91 32 -65 86 123 40 -105 -99 178 307 -2 -189 -116 -298 304 103 -210 -134 45 106 -53
2383 -53 312 201 138 -156 -193 100 -150 76 28 -156 166 219 254 23 172 54 -147 48 282 49 -343 74
2405 74 25 -391 -260 -132 47 209 -115 75 163 1 -113 -276 -257 177 4 -150 -135 -38 95 -86 -113 252
2427 252 -146 -189 -216 -15 164 77 -140 -39 195 -95 -289 -89 13 172 -360 -1 119 360 -144 -159 64
2448 64 33 72 -262 13 -250 74 57 0 83 83 -171 -308 43 101 160 195 -117 113 -47 101 -85 260 11 -44
2472 -44 199 -122 -263 -86 -25 -162 157 -8 -212 97 68 -181 30 123 385 59 131 23 44 -244 -179 145
2494 145 100 132 24 -150 226 -192 -272 -15 -107 -94 -157 15 105 168 46 -323 27 131 -280 -129 121 -64 239
2517 239 -135 -130 103 50 -99 -94 389 -234 227 -56 17 100 -22 -149 -105 200 -25 -131 194 -170 -6 327 145
2540 145 223 398 -124 -376 -31 281 -132 114 59 182 37 46 -37 226 -39 -156 98 -2 -185 -265 47 110
2562 110 -60 99 -124 -95 118 -14 -29 -382 61 -142 -127 -216 202 412 142 -267 -95 -319 58 -213 -15
2583 -15 133 -98 78 -184 137 -2 217 142 -293 -337 -461 94 -332 165 -256 43 45 71 181 -302 16 290
2605 290 -284 16 -153 -45 -106 -31 -31 -182 377 -62 176 -60 -90 -70 -209 233 179 -85 -217 -217 -7 146 -143
2628 -143 -132 156 21 291 189 -54 39 -25 266 -65 123 168 208 -91 330 -120 -142 323 -103 64 25 -36 103
2651 103 -20 -205 -22 267 40 80 106 95 123 -279 -218 -33 -26 157 -87 -205 546 47 17 312 -57 -95 114
2674 114 10 -81 -166 -30 -117 -9 246 -249 -105 -17 226 3 -538 -6 -57 53 -390 195 22 -118 -102 -136
2696 -136 253 47 175 -520 -27 22 40 -148 3 160 118 -189 99 -184 225 14 130 105 -204 182 -40
2717 -40 37 42 62 257 -41 -81 -13 75 -46 -6 -47 151 -79 -120 -54 -60 78 -363 345 70 -69 298 270 -301 2
2742 2 -81 34 12 52 137 91 172 316 -81 88 51 -162 -255 119 216 -25 -145 62 68 0 -337 -367 225 55 154
2767 154 -241 103 79 38 401 126 -113 14 95 -26 2 -37 40 66 -158 32 150 -166 -3 -45 -132 75 184
2790 184 62 -85 123 113 220 233 -265 200 -151 -117 155 67 -2 -261 -85 -245 -128 85 -98 66 -26 -187
2812 -187 -143 -361 203 359 -82 -71 255 200 290 -182 41 235 222 -257 60 23 223 222 -143 350 -249 -110 249
2835 249 43 149 -140 -142 254 -3 108 208 74 -72 30 -31 55 154 -51 86 -119 76 -117 121 -82 138
2857 138 80 -65 -89 313 272 261 -6 -93 366 -274 -35 448 98 115 -54 -85 284 3 -190 17 -116 -45 81
2880 81 -22 68 -370 305 -58 173 221 80 -178 247 15 -92 44 -6 354 -117 194 -42 34 -84 -151 35
2902 35 202 -74 -62 -114 206 -145 -25 133 1 -30 113 34 178 -238 -53 -66 74 -198 -274 196 -106 195
2924 195 -121 -27 104 133 -73 7 343 -198 -47 -74 -149 77 224 -228 144 360 6 119 256 289 98 -42
2946 -42 -90 -79 192 -193 169 331 56 -208 -68 -13 79 -75 365 -69 -45 77 -192 79 82 161 106 -105 -65 182
2970 182 116 139 79 99 -72 -126 188 253 73 190 221 13 -226 198 106 -86 15 119 -98 142 -100 163 108
2993 108 -304 -63 142 64 95 -47 143 -93 180 -144 0 -72 68 170 -108 57 50 -484 -35 80 -134 444
3015 444 -181 68 276 215 -12 -85 -242 -110 56 48 -322 -267 29 -92 84 416 26 160 80 -285 -89 74
3037 74 152 -125 331 -369 -261 -133 3 31 -156 -46 190 71 -189 -28 -228 322 8 -146 226 202 66
3058 66 -123 327 -56 -183 -224 -7 -65 -76 112 -293 -162 188 165 223 152 102 -2 163 19 9 43 -221 162
3081 162 -103 -313 49 -51 -55 7 2 62 -144 -51 217 136 -385 144 46 103 -67 -163 140 -125 97 -131 445 159
3105 159 70 -63 40 -267 -228 185 -183 -142 -91 5 149 -37 31 -89 73 96 -180 12 -110 195 -153 -41
3127 -41 -250 -112 -32 40 -130 194 107 8 -66 266 -119 72 187 55 178 -199 53 -33 -62 -47 104 -124 204
3150 204 48 204 -134 -310 231 242 -74 193 -13 -103 37 -137 -100 -89 78 137 -43 -96 -23 72 50 -163 -304
3173 -304 192 148 271 -88 -198 -56 284 -39 -141 21 106 88 -44 216 -20 44 148 -39 152 -9 21 6
3195 6 -15 280 71 36 -108 -12 192 46 320 -21 202 192 -164 186 -70 89 84 32 168 376 -136 -106 -172 158
3219 158 122 264 61 46 -131 45 -207 -197 182 16 -98 -71 -121 -65 -29 -183 -1 -53 206 -212 286 -290 -118
3242 -118 -211 -132 -20 81 -19 -123 81 -161 49 -66 67 -74 135 123 261 167 11 -394 -148 57 -243
3263 -243 -19 5 244 -180 284 -294 -171 -41 104 106 -280 -174 -260 -124 24 -104 203 211 149 44 -133 -123 87
3286 87 148 -107 -67 71 111 -203 111 -187 -175 52 330 -317 -25 -311 -1 -86 446 300 -28 83 284 519
3308 519 57 -117 -113 76 -7 -232 -192 216 -76 105 189 114 -42 -12 141 -94 54 68 297 22 -70 109 76
3331 76 -14 -98 -1 114 214 52 46 -96 -172 -331 -39 -195 21 253 -183 -339 -24 -19 -247 -80 -70 -100 -113 -55
3355 -55 70 5 -102 -69 -13 -153 175 -119 -383 -252 121 -348 13 141 -100 287 -59 123 27 -134 224 108
3377 108 17 -214 114 -337 -219 -217 -203 132 7 88 204 45 41 51 109 96 404 88 -49 -168 51 62 -72 -13
3401 -13 -256 136 21 -127 -34 -182 101 -271 -51 -127 32 -14 116 4 139 -193 -65 -134 -257 -117 -318 -97
3423 -97 -14 34 19 -25 4 -99 -382 66 263 -71 -174 -205 100 -145 -253 -14 9 -181 241 136 -71 -13 93
3446 93 35 -244 202 -145 -125 61 71 -256 177 -13 31 66 146 122 -42 102 28 56 -124 -19 -178 -4 4 219
3470 219 -137 -322 -64 -203 76 -12 162 185 -79 -292 92 -35 -18 203 139 262 166 239 -113 10 -155 -14
3492 -14 64 -73 163 -208 -370 -169 113 -111 92 53 -11 58 141 422 -231 140 -272 -54 -341 0 -142 4
3514 4 80 -4 -48 -107 94 64 275 121 -101 155 -29 -233 -120 159 33 1 -17 -110 -338 359 314 51 -44 -49 -2
3539 -2 -226 -203 28 -40 -230 -77 116 -11 -187 -10 -191 -110 -106 -121 -81 -127 92 -116 4 75 106 194 -41 87
3563 87 -157 -295 -287 -50 63 190 -29 -215 105 94 -98 -394 40 181 -27 4 18 252 -66 93 -40 -195
3585 -195 6 33 -62 310 -43 170 31 -138 -136 -231 30 35 69 -16 -125 -219 33 -24 -67 303 -21 -128 37 59
3609 59 308 -148 -23 -20 29 -172 -15 39 261 -316 -239 -80 -49 -174 -149 -257 -93 -174 -259 -195 -255 2 37 -5 -83
3634 -83 -57 85 185 -146 28 98 -342 -10 4 -80 -11 179 111 -79 -12 229 -174 -58 100 60 -28 -70 -297 128
3658 128 29 -246 -241 268 -77 30 -214 15 88 63 -117 -150 -27 4 -115 -78 103 109 123 -300 -98 108 80 27
3682 27 -48 -51 19 156 146 12 -124 195 1 104 -48 -64 -204 347 -82 -41 117 163 23 -73 -169 -5 68 -141
3706 -141 -31 -104 -105 27 -32 226 169 276 88 441 -65 -152 241 91 40 -72 179 -5 -206 -68 -114 -118 81
3729 81 5 -144 3 211 -234 41 -170 -24 1 -83 62 -37 132 119 -183 -126 -158 138 -93 -102 42 262 74
3752 74 -359 -6 -273 -104 111 149 243 116 -242 -53 -23 -101 32 -14 -270 10 123 202 -157 -9 -165 -291
3774 -291 314 -400 63 95 -68 117 487 59 -157 215 72 50 -29 -10 16 182 121 -16 -101 -6 76 -132 -119
3797 -119 -80 197 237 -168 36 -126 219 96 11 -299 113 37 -156 -179 126 -1 -213 -218 -130 63 112 79 -57
3820 -57 253 -46 -404 159 -8 273 42 -10 -38 94 -343 -4 12 -43 251 -190 -82 112 43 89 191 -5
3842 -5 -23 -165 28 -98 10 353 312 194 -22 -97 329 126 -223 -154 -267 236 190 -93 -29 -209 -170 -138 186
3865 186 75 155 -31 230 70 81 -159 84 -107 3 396 117 -114 -106 -78 -28 185 -286 284 21 -194 1
3887 1 5 -28 92 232 316 26 -156 504 -221 50 41 -149 26 199 146 -298 -45 53 -201 43 34 111 -214 -42
3911 -42 42 -51 107 153 -53 31 -27 18 101 140 -50 -65 -68 91 -230 -209 345 -118 -158 442 151 -116 -58 83 -118
3936 -118 69 -17 307 -100 34 -34 -46 42 -148 64 -136 64 198 188 118 -103 -219 26 179 -107 -74 46
3958 46 175 183 -211 29 -108 -185 121 -161 -62 71 -14 -127 -2 -183 -183 -73 -47 173 -12 -147 -14 -14 -488 -364
3982 -364 -33 171 241 -33 -158 -61 92 119 -230 -35 120 231 65 71 18 -215 142 71 -363 -77 129 -84
4004 -84 82 -3 -21 -56 -111 106 -274 -27 171 58 -65 -76 -274 -12 162 -169 -203 296 -58 181 175 23 -110
4027 -110 -117 343 315 348 -147 -136 167 304 190 146 15 35 12 8 -100 138 160 96 -42 -335 178 -120 112 134
4051 134 -37 -418 -282 -273 237 -61 -31 207 -200 -227 -156 -64 -232 25 195 -25 77 143 -45 35 27 219 110
4074 110 -17 -38 -52 -80 253 109 -107 -53 -50 -276 70 -129 -92 -55 -32 97 251 -7 206 35 77 181 -212
4097 -212 171 128 4 -86 110 -235 -93 282 92 -92 -1 112 -141 -237 322 198 341 -78 -90 -38 -194 70
4119 70 0 -129 -239 49 250 160 166 158 -10 26 -69 158 53 85 -161 1 -38 118 186 -112 -67 -16 -152 -97 112
4144 112 283 61 70 253 -75 203 -332 153 -260 278 70 -32 149 255 -296 -359 311 57 -262 -135 -160
4165 -160 -244 -161 211 364 -68 -168 -23 -292 -15 -61 96 -235 -32 478 23 53 -6 38 141 -114 -80 84
4187 84 281 4 171 126 124 -147 -322 214 -170 -204 -107 -55 -396 -10 -119 222 55 100 -41 217 -12 -127 -120
4210 -120 -125 -285 -135 137 -1 299 160 -191 185 -70 -302 59 -61 -109 -318 60 56 152 -322 67 123 35 139
4233 139 268 50 116 -27 85 279 -121 -120 -50 149 112 -67 -111 -348 115 -200 -6 -25 -166 33 -185 117
4255 117 -9 2 -47 -177 -114 -115 317 -47 -29 77 32 -51 -17 -37 -373 61 252 16 -18 -215 -169 -11 -90 -41 -370
4280 -370 128 156 -50 165 313 31 49 -36 1 -163 154 -172 108 -159 118 13 138 340 -146 51 -73
4301 -73 99 263 199 179 206 -225 -108 -85 312 59 -174 -59 -29 -4 187 -75 -277 47 -164 68 401 -294
4323 -294 -75 -70 213 234 -191 -123 241 -117 26 -41 -368 10 -130 -194 -47 -130 139 -131 215 196 -273 -184 -46
4346 -46 72 -374 129 35 -398 -62 -140 -210 -138 85 -87 -40 104 -6 131 141 -57 -54 -64 153 -229 -171 -125 168
4370 168 -95 -142 -13 -213 53 -190 -218 44 -213 255 -82 -49 -355 138 47 -121 -297 61 -72 1 104 -212
4392 -212 55 -212 -29 76 -11 109 -336 -108 271 6 34 201 -269 36 -138 -19 104 -218 -110 74 -133
4413 -133 -124 -57 -33 -155 223 -65 89 83 -66 84 155 -160 -17 -61 -154 -60 -101 -79 298 227 137 -47 -59 -155 109
4438 109 -134 -31 -36 47 -52 25 106 40 -306 -45 23 52 209 114 -65 -29 -2 -111 214 -74 -84 -28 -90 -348 248
4463 248 117 91 -189 149 287 216 -121 -162 -86 -62 76 -162 -163 321 -54 -290 -125 -130 139 -51 -42 -29 66 -8 49
4488 49 -87 -95 105 135 -309 -320 -38 -97 35 126 250 190 432 -114 -44 -117 -298 38 -14 -219 0 87 -159 -77
4512 -77 78 -21 251 -32 -166 -499 342 82 -143 -60 -123 174 134 -43 59 182 137 147 -104 -129 -118 -236 3
4535 3 -123 -87 469 -61 -109 149 30 94 -70 18 90 -51 107 63 -231 -21 -193 23 -13 -265 -16 -133 17
4558 17 -44 184 214 -129 -51 287 170 -130 143 -131 -152 -16 -1 112 22 215 -150 -185 101 49 78 -97 -17 -86
4582 -86 -362 -516 -271 -11 11 -336 152 120 69 -94 21 229 -161 134 -169 37 206 300 43 168 -33 51
4604 51 181 113 52 94 -51 98 -180 364 74 34 -91 -157 -18 -246 1 -46 -87 56 -489 -406 41 -278 -69
4627 -69 -18 41 96 -192 22 -118 77 189 103 76 -118 -254 59 134 183 -57 -69 -288 -26 -121 329 -110 -213
4650 -213 123 141 86 119 -138 -372 54 191 75 -166 -79 190 -121 -80 -88 72 -78 62 51 -47 367 135 -79
4673 -79 99 212 -154 -63 173 314 40 -309 -76 -29 30 178 -11 -303 227 -321 103 13 -60 -12 169 98 -175
4696 -175 -12 -131 77 73 -8 24 -65 -82 -230 -25 -146 -116 -45 74 45 -90 132 -82 -182 170 11 43 213
4719 213 122 -36 22 68 -93 -34 155 108 89 190 -43 -105 223 138 -12 -135 -28 -34 -64 -2 83 290 14 -1 -341
4744 -341 252 139 -78 -153 154 108 53 -19 47 -173 -38 -181 -22 173 -168 -90 0 -143 -172 76 -153 101 192
4767 192 78 120 3 100 68 8 355 -171 85 14 190 205 23 302 52 64 -480 -146 -92 -76 -184 10 -158
4790 -158 -144 20 100 -134 -119 -72 147 -111 23 128 47 -70 -21 17 83 -12 167 -388 -30 263 -175 55 -439
4813 -439 205 16 220 -240 -48 -76 -61 -154 -237 -100 -12 -132 -35 -42 29 74 -83 -181 -139 -192 -279 -128 -102 -84 -46 230
4839 230 -60 123 50 175 80 -40 278 39 -49 -117 -101 -119 391 -144 -218 -158 -70 56 133 108 -17 6 -130 35
4863 35 -164 63 -238 181 -200 -251 -244 13 -20 40 103 -47 131 41 152 57 185 -231 152 278 139 -21 110
4886 110 -41 -34 -258 -180 -99 218 -14 36 59 -51 92 -144 10 358 -268 -240 175 73 41 -128 151 -104 -211
4909 -211 -163 89 -183 -78 -319 183 -246 -354 -212 -15 -23 46 -37 -112 -101 207 58 92 116 231 385 -171 -264
4932 -264 -29 218 -119 -118 -106 -112 -98 -47 -54 -158 245 -154 -378 360 61 70 100 -102 171 31 -221 -166 -142 109 180
4957 180 125 13 183 -107 245 -5 7 -152 14 1 -107 -37 148 49 -240 113 138 -18 -106 -141 80 249 42
4980 42 127 102 124 113 -68 -131 -105 129 -18 52 23 23 -362 214 -120 -99 -141 133 40 175 54 154 60 183 -189
5005 -189 -178 -491 -276 -25 -37 -38 261 2 88 15 24 8 -174 356 72 134 -342 280 113 136 -40 -290 -54 40
5029 40 -132 -323 307 113 -134 169 -104 347 67 -204 165 52 -23 139 335 -72 -122 -105 282 -49 -99 212
5051 212 -117 97 -57 171 -82 -303 -95 -303 -149 -27 -27 -52 3 -72 -224 37 130 -318 118 -94 -391 132
5073 132 60 353 -148 17 -197 -74 134 163 -104 -156 180 62 228 91 -64 -248 50 31 -332 -311 -7 -153
5095 -153 192 23 44 282 -236 -40 271 197 90 144 69 75 -105 -222 -9 -15 -29 -205 -143 91 -42 189 138 164
5119 164 -153 52 235 -59 -93 61 -29 -121 25 130 212 -34 66 -30 52 35 -349 44 230 -219 113 44 -118
5142 -118 378 -64 -238 294 169 -121 -158 219 -315 -20 161 281 36 -32 46 6 -77 163 -8 -274 64 -50
5164 -50 89 23 162 -1 83 -45 62 -111 -345 18 0 -30 212 -295 166 204 -104 69 156 -46 -72 -23 -33
5187 -33 -5 -100 35 294 63 287 234 20 175 -2 -88 -153 -78 28 317 -58 54 -106 104 -17 19 -37 192
5210 192 114 -36 114 114 -41 -138 343 72 -187 195 -256 -148 -448 -57 -41 27 228 -118 119 -260 -31 -52
5232 -52 -84 242 108 -14 -36 30 -243 -25 -105 92 -171 90 -10 -162 -99 -299 44 -214 126 209 -192 89
5254 89 -99 -232 -106 -18 274 -72 -104 46 -144 136 247 -98 50 53 -2 26 16 -65 -45 53 -81 -115 81 -237
5278 -237 296 -102 -71 -132 33 9 -85 -274 -134 -199 202 323 118 47 -221 31 -31 -103 134 -111 1 32 -220
5301 -220 -141 -149 -38 179 91 -99 -27 117 42 -64 -356 -119 133 38 296 -126 -31 -73 -165 -23 206 -15 9 99
5325 99 -181 74 23 173 -66 150 52 -308 -117 -220 75 153 304 -73 -81 -4 -302 -12 230 52 30 128 360
5348 360 313 84 -225 74 -160 -364 188 -63 277 337 28 -98 -137 -182 52 229 -257 -64 116 -178 159
5369 159 223 58 88 -30 166 -308 -278 -90 -136 -150 195 15 172 128 22 110 111 123 264 118 200 43 197 -51
5393 -51 -200 -113 43 237 152 308 -167 183 64 188 -286 75 7 190 327 86 -68 146 -147 115 129 54
5415 54 -212 -17 -188 -363 -164 -91 -123 -37 11 -303 -68 3 -221 -260 -126 48 72 441 121 -96 188 121 -199
5438 -199 -214 -7 86 -25 44 218 175 0 183 320 128 40 -180 144 -111 152 -411 -31 -37 97 -75 246
5460 246 26 102 118 -54 -238 -46 262 -4 322 -93 -437 39 -112 33 177 47 82 96 5 219 171 -178
5482 -178 204 -76 -219 84 202 -158 -13 220 -244 -242 -121 -33 57 -251 80 -58 141 161 101 327 75 -127
5504 -127 -53 -253 175 9 322 8 -29 244 -214 -35 127 -130 -53 -225 104 103 -97 -167 -116 197 -64 -203
5526 -203 -265 -30 -243 360 -186 -7 -96 -17 172 -157 135 46 -150 -83 136 -288 -159 71 -119 112 105 49 -323
5549 -323 92 -38 -150 84 96 -174 146 51 -45 281 55 153 -214 1 289 -51 42 78 100 127 156 225 135 61
5573 61 13 88 57 -124 74 -58 -216 -326 68 149 11 109 -104 -213 -125 393 -176 42 -85 -161 98 -44 -89
5596 -89 -253 -59 -51 153 35 -75 -152 282 -130 148 -137 -12 333 -147 -159 -92 -93 -39 -291 220 30 -2 209
5619 209 -48 127 -158 -75 136 -46 -64 -22 -164 73 280 -5 -76 -214 117 276 -58 -267 76 26 33 402
5641 402 -181 122 64 8 -129 30 8 -89 -40 38 103 164 192 200 -136 -11 38 -29 -107 -95 -40 -79 -151 10 -167 119
5667 119 123 82 -88 -61 43 -275 1 176 -148 -43 -149 18 -255 65 265 144 243 -263 124 186 89 74 -25
5690 -25 68 220 43 243 144 87 286 114 -110 -129 -349 243 -11 -195 -106 4 -50 -108 99 42 -37 -266 -58
5713 -58 2 -186 161 -142 -62 110 -23 -27 183 -149 -35 40 -67 -201 49 -313 171 107 13 -5 -40 41 -300 3
5737 3 53 -9 135 -108 -92 -35 43 -69 147 -153 176 -54 68 183 -57 -37 183 -173 226 -55 90 23 17 -41
5761 -41 -150 143 -125 359 -341 101 126 11 59 -15 -97 -16 -160 74 -77 -165 -216 -129 -45 365 241 84 -301
5784 -301 -64 310 -96 -92 52 189 -246 156 241 13 150 -93 31 138 -103 -260 -162 -241 -60 309 147 128
5806 128 -114 114 -106 4 -138 -121 -114 -172 76 23 -439 40 107 165 202 -184 50 80 206 4 -158 151 -395
5829 -395 -235 -56 2 244 209 -87 220 -267 50 158 59 -60 -126 -26 -244 -238 143 -46 249 -62 -65 220 109
5852 109 -123 -50 -78 108 135 -256 68 -84 -118 20 45 -134 -260 -246 -206 7 81 311 97 -27 -195 -2 -305
5875 -305 131 61 -36 35 35 147 375 253 -171 -198 -22 -54 -152 -152 9 47 2 81 -105 304 565 -14 95 127 66
5900 66 -124 -317 195 232 35 20 15 167 225 15 236 -148 151 120 -173 -282 34 225 -2 217 210 121 11
5923 11 -18 2 14 -60 36 9 0 -43 48 209 -165 -124 93 -103 -247 112 40 -172 245 366 -11 -132 160 16
5947 16 82 0 159 147 -268 -30 218 84 2 4 -174 140 -24 97 115 101 33 236 -81 55 84 270 -21 123
5971 123 53 92 119 -95 -156 51 -17 175 25 -418 16 -149 335 -247 50 -204 87 18 -145 118 -46 55
5993 55 121 64 -195 -208 115 238 -25 -58 131 -260 -190 -77 86 -126 5 49 196 21 272 -4 209 31
6015 31 -59 95 224 -205 -277 333 25 172 -201 -138 202 57 -239 34 -191 -14 -105 188 -198 16 75 170
6037 170 198 -30 -2 -39 -71 186 83 -153 -31 -462 158 -89 -69 -193 -142 -144 32 -59 184 150 -69 308 -58
6060 -58 -203 -27 39 72 97 -123 49 -324 254 -111 -77 -178 -136 8 -205 296 -292 -120 -30 77 27 -126 118
6083 118 -194 -42 87 -94 -169 58 74 161 -18 -2 87 -309 -98 -15 27 -28 188 80 134 211 -333 51 47 -226
6107 -226 164 174 52 95 3 -362 -237 -284 48 193 -81 -161 163 169 -113 -151 81 -229 99 1 -175 40 -206
6130 -206 -350 160 -230 191 56 205 233 -207 -8 -107 -175 113 74 83 4 54 -362 -317 -256 -183 114 109 153 -309 178
6155 178 199 -114 6 -131 -127 -48 -333 -99 -17 167 87 9 -71 -19 26 172 36 154 -40 90 129 232 -27 -254
6179 -254 140 -151 -29 -72 -35 -24 24 358 219 -75 -314 174 -250 -18 -250 -357 -14 -145 -313 124 90 270
6201 270 112 84 372 328 234 25 -129 112 14 101 52 -93 -7 -99 -210 170 87 134 -111 128 14 -35 -124 -129 -199
6226 -199 -405 -10 -74 -208 -112 159 178 97 -154 -19 -263 187 61 -99 -200 83 148 60 130 -11 143 -78
6248 -78 -188 27 134 -87 -7 18 -13 -333 -42 198 -243 -67 -50 -88 -15 107 173 18 45 -219 74 -43 -18
6271 -18 91 -17 -39 5 157 -145 -52 161 48 -295 -92 -143 -304 -299 455 114 1 -4 158 15 -132 -136 -207 -122
6295 -122 159 86 64 42 206 -236 -356 23 165 -160 6 -123 -189 45 253 -176 43 147 -37 27 492 25
6317 25 -50 -42 81 35 190 34 286 -279 163 24 79 118 -294 235 73 181 -44 102 19 218 -263 -33 -108
6340 -108 -12 247 -63 157 240 17 -11 50 -234 -175 226 -25 -36 210 74 -249 -32 247 -188 97 -85 -83 94
6363 94 149 -61 -174 -190 219 121 220 63 128 62 248 -133 101 -57 -168 -187 108 293 60 -170 -334 46 266
6386 266 324 -248 157 -275 -19 238 -21 0 -512 69 50 -106 50 299 -72 31 -33 -59 62 114 -282 -301
6408 -301 225 65 171 156 311 -9 87 113 215 -94 -126 308 -80 -239 -91 250 176 -78 -184 -242 -78 77
6430 77 240 612 74 -42 75 367 256 -223 145 126 65 30 215 -11 63 136 -63 -288 -391 301 -76 176
6452 176 41 -137 41 4 15 -51 30 -21 -269 -95 175 52 204 84 137 -314 -2 86 257 -86 16 53 69
6475 69 74 93 -15 -64 202 -47 255 -173 -70 -275 5 237 -184 79 -25 -178 -125 248 -198 39 -21 -67 -104
6498 -104 -108 98 126 3 -146 132 49 -327 110 168 -87 -278 20 348 264 -72 212 -196 338 181 280 -351
6520 -351 -165 77 -96 -111 47 -60 -8 -94 -77 273 87 -57 -221 130 -93 54 34 167 233 -43 70 28
6542 28 -140 38 51 -207 91 1 522 87 38 -240 -267 -10 236 -267 113 -78 288 114 -50 -243 193 -43
6564 -43 154 -36 -34 33 -52 -57 -33 97 -190 124 -154 -209 -81 34 105 -22 18 -229 -187 112 1 -114 -65 67
6588 67 25 90 55 -220 141 207 58 8 -154 162 -174 33 224 -72 -22 -48 -57 -110 -62 297 116 152 -138 -10
6612 -10 128 37 -15 83 22 99 255 -113 -225 80 12 14 -36 167 -195 155 107 -39 155 -43 -196 -267 -126 161
6636 161 38 -124 359 249 -49 182 -234 -74 -80 23 49 -32 -124 -193 -134 363 -20 -233 -48 0 288 169 272
6659 272 -256 -164 194 21 -92 153 78 100 -65 30 103 -170 221 64 -194 -81 -14 -95 110 -183 62 108 -84
6682 -84 -113 -191 119 -56 220 -71 -38 -136 74 392 -137 -101 -16 40 -167 -51 -237 -201 33 209 123 193 -135 31
6706 31 180 139 -127 -227 85 51 -175 83 122 -75 37 71 31 387 -2 -284 -89 83 84 113 -265 36 -161
6729 -161 143 -32 113 -18 -200 -65 50 98 46 -200 85 42 -238 160 32 46 -307 184 71 35 45 -62
6751 -62 153 36 -5 -7 -119 -19 2 26 -239 229 50 -241 68 305 134 161 124 -58 0 86 -143 -133 -273 255
6775 255 -158 113 -81 146 95 17 -95 13 -253 -179 -80 -194 -119 -95 -138 -122 80 -96 7 -69 160 119 -23
6798 -23 -66 94 -148 -292 17 181 124 98 207 322 -256 134 -156 112 -174 39 -388 -173 25 -254 -93
6819 -93 58 -16 108 154 -245 -301 -73 94 -320 13 -99 83 -150 29 -195 143 -177 306 44 246 8
6840 8 -289 -45 -329 -289 -155 -207 68 216 72 9 -290 -77 284 -127 149 -95 -137 87 184 75 137 -234 -310
6863 -310 201 -52 -80 46 -213 -203 90 277 197 101 344 52 9 135 -33 169 296 -10 230 -148 -113 68
6885 68 62 -218 -120 -182 90 -36 -43 13 298 -165 15 -69 117 -54 -121 39 141 182 -204 49 -151 143 210 -258
6909 -258 -216 -258 30 -52 19 161 111 -103 38 71 -147 128 251 -98 -32 4 -286 23 -119 65 43 -170 -148
6932 -148 177 -138 -43 11 -3 343 210 -337 25 -129 47 396 -319 -119 309 133 218 -69 127 250 -83
6953 -83 310 36 -224 141 -199 62 158 -260 -190 128 -100 -133 113 172 249 -48 -71 -317 -382 69 36 -179 24
6976 24 -109 269 -4 66 -116 282 99 278 -110 -348 54 64 -81 -139 -84 162 117 -247 -15 -153 173 -118
6998 -118 163 -10 -25 91 41 312 90 62 -252 -3 23 265 205 92 153 267 146 -208 194 89 -42 27
7020 27 64 179 46 31 -179 238 137 -3 -245 156 60 -351 118 34 237 -6 64 -16 321 -115 -267 132
7042 132 -512 -237 9 -24 -127 -141 232 203 -139 72 209 47 124 -227 10 -21 -12 61 252 53 215 184 96
7065 96 -39 -194 -82 62 -34 -172 -59 -54 48 -176 269 225 -115 -89 -135 -35 -336 33 124 156 -87 -141 61
7088 61 -171 -143 237 50 -99 242 55 73 48 138 -317 284 176 56 343 -130 -2 -196 -110 -35 -148 2
7110 2 285 48 -72 -49 36 37 35 -49 -29 -101 10 -304 -169 -271 18 35 233 -167 -59 -164 -134 -116 54 6 -173
7135 -173 -43 -102 36 -100 -12 -13 14 24 -130 216 -148 97 75 -176 286 -271 -74 39 -113 -4 -71 -67 3 -122
7159 -122 13 -172 65 163 127 15 -185 54 51 -48 93 -189 5 -192 39 -34 160 242 -16 -11 -45 -130 -36 50
7183 50 -128 56 -60 -118 -114 79 -51 -187 -198 198 -243 274 -148 -138 427 -366 -63 -38 -5 175 179 -59 219
7206 219 261 -60 -102 -132 -21 164 -183 140 178 152 -67 -274 -286 -133 255 112 73 81 -84 40 75 41 -94 79
7230 79 141 -33 167 29 50 199 36 53 46 -88 -104 -51 -50 -415 -287 129 127 231 248 -171 -400 7 -175 -263 35
7255 35 48 112 346 -254 84 24 -12 247 19 -160 -65 102 -33 34 -56 -123 -120 101 15 -58 178 -31 -157 155
7279 155 263 239 164 29 -161 17 -128 -177 -49 -113 146 -359 -109 -23 303 176 318 112 92 -62 0 50 -114
7302 -114 -33 -181 -242 -9 16 162 18 -105 -322 -116 -121 175 90 31 100 -237 -16 148 185 159 37 146 -15
7325 -15 -144 181 348 -184 112 -252 -187 113 92 -1 -40 2 -57 -186 -70 18 -87 124 -10 -9 286 -304 -188
7348 -188 82 221 -88 -7 357 44 357 -139 79 -216 128 259 -197 33 84 -29 387 -58 54 -53 -53
7369 -53 146 37 159 350 -25 14 222 -14 -168 -74 166 15 17 49 109 20 -246 21 11 21 206 21 351
7392 351 -298 -15 138 -127 -162 50 30 -120 310 173 -290 -246 211 3 -37 -157 -152 -153 -148 -131 255 357 42 77
7416 77 37 -2 -37 -27 0 59 -120 -11 117 -158 146 328 27 -36 40 -118 -17 12 172 52 26 1 -160 -40
7440 -40 -59 -269 -23 295 -202 -67 -36 -95 -22 -96 69 -244 18 -85 49 -64 -193 92 -1 -148 45 185
7462 185 -58 258 -157 46 12 65 -201 26 246 217 68 105 358 4 158 39 307 -29 -75 51 -111 -216
7484 -216 186 109 85 29 195 -77 86 -20 -146 -268 20 -35 230 -100 -49 -43 -99 -14 -358 -113 234 -8 275
7507 275 70 -40 111 54 304 -96 -249 7 -199 -148 120 147 -213 -97 -2 -104 57 87 104 -106 181 -90
7529 -90 103 -35 -157 -155 191 -156 41 43 -120 -304 17 23 288 35 64 95 240 -369 188 -139 -109 -39 -304 -295
7553 -295 -130 196 -146 28 -21 141 -215 108 221 23 -1 44 -32 -41 -164 92 48 9 225 -4 -174 -206 340
7576 340 -28 -123 -260 -187 -148 -106 25 -81 -432 82 43 -382 377 -257 110 -74 -250 -75 126 205 -435 87
7598 87 -128 -133 -115 307 91 18 72 18 199 -91 53 -18 106 191 -202 -133 -3 -264 -193 144 -117 -3 -230 97
7622 97 18 -269 -139 -158 137 -131 160 -134 -207 262 -22 186 -160 -247 -267 -199 123 98 -227 -108 41 206 -165
7645 -165 29 127 -158 148 147 -321 -106 -92 310 -83 70 -134 -162 -189 42 55 -145 -212 -182 86 84 -43 47 -117
7669 -117 76 47 -112 134 160 -246 -28 161 -29 -129 306 -67 -109 -225 26 -403 162 17 225 53 -73
7690 -73 -28 -240 92 -65 -215 -293 -92 147 -22 -83 -74 367 33 -298 35 -118 -93 -138 88 -160 149 -176 212
7713 212 114 -160 206 -195 -382 -34 -211 -168 198 -10 -179 223 -52 -164 275 -71 489 16 158 118 70
7734 70 100 -94 -17 252 -95 73 280 26 215 92 79 46 189 212 201 442 312 363 39 -192 455 302 152
7757 152 -129 -50 -142 130 86 44 -19 -64 -135 100 -66 -282 44 -117 97 -66 89 460 -24 107 222 114
7779 114 -131 34 77 -155 -94 169 -143 -13 -242 -80 63 -326 338 -114 -118 182 133 154 -309 143 46 -81
7801 -81 0 -224 -118 -217 -210 109 29 289 109 -57 17 243 -198 -65 68 -125 302 52 201 -215 56 -52
7823 -52 163 261 -192 232 -132 160 -198 193 134 38 -151 -89 63 -220 75 -8 -268 127 314 167 162 51 -38
7846 -38 -63 79 101 70 -122 174 169 15 28 207 -171 231 373 -269 164 -192 -34 -195 366 80 -241 -245 -120
7869 -120 31 200 -47 238 -82 381 211 -298 167 -71 -130 -260 -42 16 -91 64 291 -221 -9 131 -80
7890 -80 -62 42 -384 47 -116 108 -54 8 2 90 6 91 137 51 31 -177 -216 -344 144 -8 -151 -142 41 -244 -254
7915 -254 36 199 36 -14 -308 -85 127 -7 60 77 -32 -28 47 -276 -71 26 140 251 212 -154 306 66 119
7938 119 64 54 30 -86 23 205 192 -31 -128 -18 -78 115 106 6 -17 245 128 -136 72 -25 -202 -104 -228 -51
7962 -51 264 206 -151 -213 -73 -345 -397 -67 184 95 -94 126 -110 116 -18 -55 201 -173 -57 -24 96 -84
7984 -84 194 3 -204 186 188 -171 116 301 13 148 -80 -103 82 176 109 -153 -265 -263 95 52 61 -13 148 222
8008 222 -163 -225 168 258 -246 202 -166 43 -151 308 237 -141 13 170 -121 24 400 -182 -107 77 -50
8029 -50 -323 -226 -100 -189 -115 -17 -217 226 209 -73 -140 -20 -192 108 118 -143 -28 15 2 272 -80 230 -348
8052 -348 110 84 149 -126 16 -150 -48 -67 92 -230 94 87 -9 -148 21 -155 144 -9 138 -12 2 164
8074 164 19 -137 106 -271 53 229 -243 38 38 343 -87 -181 224 44 -193 54 95 75 -170 41 -360 345
8096 345 147 57 -51 54 193 -9 176 -57 113 430 -154 -201 -126 -366 110 -113 21 -191 107 -10 -71
8117 -71 -58 -72 -77 242 -60 -132 -125 -191 86 62 126 -67 -193 269 15 -5 184 -168 -160 140 498 -32 -368 -367 -64
8142 -64 93 117 123 33 24 -198 -151 26 -23 53 95 -126 -116 95 208 1 55 132 -283 224 -206 -71 -225 -77 203
8167 203 295 -229 138 -149 17 -61 -130 283 -103 -216 -136 158 -12 7 -246 182 261 -20 -171 -54 -86 77
8189 77 75 -208
8191b08
$$ Imaginary data points
##PAGE= N=2
##DATA TABLE= (X++(I..I)), XYDATA
0 0 0 0 0 0 0 0 0 0 0 0 0 0 0 2 -7 8 -8 8 -8 9 -10 16 -16 18 -22 26 -26 33 -34 41 -47 51 -58 65 -73 81 -90
37 -90 99 -109 122 -134 150 -165 184 -203 226 -251 280 -313 353 -399 454 -525 614 -730 895 -1141
57 -1141 1550 -2354 4525 -21737 -63949 -2902 35840 7146 -31032 -20621 9170 16652 -5938
70 -5938 -16281 -3191 2909 -5470 -3968 -1183 -8556 -12042 -5733 -128 1107 -11583 -22689 -2440
84 -2440 19539 -3250 -29484 -8938 20845 10060 -19003 -19456 10437 21072 -7961 -22702 5469
97 5469 18837 -4499 -13332 5648 11580 1039 -4319 4131 14140 8841 -3974 3778 20488 12438
111 12438 -4507 610 15019 15400 249 -12858 1411 19831 1584 -24137 -6788 16686 -774
124 -774 -22346 -10766 8405 2604 -15338 -13232 7533 8278 -12729 -11615 9955 8563 -8509 -7285
138 -7285 5120 8515 1110 -8809 -3753 12897 8515 -10686 -5714 13455 11667 -3990 -5533 9144
152 9144 18106 3503 -9576 7209 22442 3006 -11885 6357 17697 1392 -10118 -757 10911
165 10911 4222 -10895 -7821 8807 5724 -10785 -7692 6359 5433 -3754 -6747 -1062 8764 5143
179 5143 -10760 -6916 11084 5301 -13493 -8689 6241 3988 -11023 -13747 1583 7349 -9608
192 -9608 -16345 2814 9618 -7781 -11474 3020 7723 -819 -6334 -2037 7760 6309 -6581 -5633
206 -5633 7277 6857 -5182 -6160 2314 6270 -73 -8681 -2194 10804 3288 -11248 -1530 13191
220 13191 3798 -8737 -2366 8901 6010 -5823 -7531 5543 7808 -7845 -10001 4017 4736 -7189
234 -7189 -7991 -554 2695 395 -6256 -4696 6279 6176 -5566 -4150 7182 7193 -1664 -4188 2888
249 2888 8696 896 -9343 -19 10259 -1560 -11661 -386 7506 -1567 -7258 -2360 4967 3733
263 3733 -4565 -4631 5460 5959 -3761 -3387 4036 4003 -367 -2989 -1322 4577 3768 -5927 -4332 7053
279 7053 4414 -6198 -3133 5813 5663 -1879 -3811 4450 9681 97 -6132 5091 9458 -1662 -5152
294 -5152 2991 4648 -1029 -4458 -3191 2024 1955 -5258 -5283 2228 2134 -3775 -3829 273 3494 1503 -4198
311 -4198 -1755 7088 3093 -6566 -1696 7147 1498 -5822 -2476 3040 1917 -3762 -5202 1698 3980
326 3980 -3920 -5000 3402 3374 -2198 -1643 995 2527 2187 -1758 -2172 3284 3190 -3568 -3705 1962 1688
343 1688 -2530 -4144 -1032 2763 -70 -6062 -820 6006 38 -5409 1750 5568 371 -2397 589
358 589 3312 2655 -1926 -2507 2825 2559 -3145 -2800 1242 269 -1092 -1791 -2085 1342 2353 -3108 -2596
375 -2596 3976 2992 -2727 -1068 3283 2641 -818 -2818 586 3705 -1531 -5089 954 2715 -3354 -3984
391 -3984 856 718 -1325 -1503 -1013 1169 2147 -1323 -1386 2772 1936 -679 -491 660 1294 1007 -1729 -2177
409 -2177 2491 769 -4336 -1329 3485 -66 -3059 -98 2367 1772 -397 -1002 2395 3790 -874 -1442
425 -1442 3035 2226 -1893 -211 645 -263 141 -877 -1976 765 1425 -1897 -1702 1522 800 -176 -418
442 -418 801 2471 1780 -2118 259 3876 -79 -2999 1306 2514 -1470 -1901 -331 110 -201 -2011
458 -2011 -2096 945 628 -2035 -1043 1411 -149 -131 548 -494 371 1756 -984 -1025 2443 744 -1974 -513
476 -513 1462 -138 -483 -1158 70 1854 -373 -2309 1661 2690 -1107 -810 2393 1105 -426 508
492 508 269 -64 297 -1482 -1552 217 -828 -2553 -1449 -1147 -1401 -578 -1656 -2396 510 215 -2486 -237
510 -237 2389 -350 -1824 276 1335 432 -561 -529 778 1294 -1314 -1411 1573 594 -1814 279 1006 -312
528 -312 202 612 30 1463 1514 -305 -162 1872 303 -157 -137 -8 572 204 -1685 -620 1953 -785
546 -785 -2441 727 1324 -1379 -1004 961 933 352 -58 -238 1617 975 -1342 775 1431 -810 -829 405
564 405 -597 -811 745 -909 -1373 953 306 -1549 220 1203 505 23 403 993 1861 509 -245 2154
582 2154 2239 -806 -54 2259 873 -699 2 480 303 -270 -953 -465 945 -107 -1533 388 -185 -525
600 -525 -181 -512 -1398 161 -19 -2631 -1091 630 -1458 -2598 -453 -366 -906 -1346 -1235 387 895 -1340
618 -1340 -685 1822 406 -878 669 1531 337 819 723 -8 491 808 -853 -375 665 -448 -860 -630
636 -630 -598 -209 -78 -1678 -992 1274 -450 -1448 653 1037 -958 -587 229 277 -25 -388 -482 556 195
655 195 -1508 90 823 -586 -131 869 -175 -118 1065 -203 -376 1005 739 -850 124 612 -196 -538
673 -538 -592 -340 105 -958 -1913 -3 519 -1746 -1035 1180 208 -619 764 1011 986 1352 853 1274 2151
692 2151 1653 790 1658 1499 1213 1685 968 593 1865 1235 -448 603 1970 248 -517 146 611 -163
710 -163 -402 -732 -221 472 -1167 -1522 175 -781 -1964 -1022 -454 -1587 -1073 -853 -1676 -538 -118 -1046 -397
729 -397 176 52 -327 372 -63 864 1365 -544 -147 1657 -47 -1131 435 976 -1021 -743 127 -100
747 -100 -335 -513 -578 -37 151 -795 -581 172 -732 -623 206 -416 -329 346 -511 -1545 -25 -60 -1421 -923
767 -923 -480 -888 -660 -481 -484 218 -134 -1294 25 949 -279 -334 638 265 -410 271 75 -256 401 72
787 72 -713 172 439 -48 548 65 -15 591 550 -268 1339 1513 -65 125 1517 1026 180 326 729 427
807 427 625 62 34 1038 282 -355 899 946 -485 734 526 -123 730 794 -93 422 866 -8 -75 592
827 592 306 -69 261 -228 2 913 -645 -912 1016 -62 -971 -30 491 -98 -162 228 -383 136 -132 -578
847 -578 -30 148 -884 -495 -79 -932 -357 122 -1170 -1014 671 -361 -1352 -112 134 -632 -317 43 45
866 45 675 -301 -661 562 322 -523 -102 894 -177 -168 239 -198 47 559 -520 -883 262 164 -685 334
886 334 -112 -165 154 -463 -455 443 49 -1222 105 419 -615 -710 317 -2 -272 -335 -128 132 445 9 31
907 31 1016 338 124 880 841 425 775 636 -49 918 935 -362 39 611 157 -287 -299 96 -194 -109 -443 22
929 22 422 -478 -608 488 468 -379 -55 204 -240 436 576 -358 338 336 -220 -104 224 -223 -29 -19 95 251
951 251 635 -148 -434 960 405 -678 126 545 -107 -141 -97 -158 164 -59 -534 -22 -9 -628 -147 608 -409
972 -409 -334 206 -271 -398 728 -107 -119 511 767 -156 -458 67 143 755 -299 -383 646 435 -924 63
992 63 490 -547 -391 280 5 -190 -113 -445 52 341 32 -323 105 -255 -207 21 -76 -506 45 30 -306 301
1014 301 479 -404 -673 610 141 54 -1 -156 208 105 -418 -246 614 -254 -544 338 549 -481 251 117
1034 117 -226 434 84 -487 65 335 -430 -387 -76 -159 -26 363 -323 112 280 -128 -546 333 6 -447 169
1055 169 57 -436 174 -174 -61 38 -70 -284 134 477 -314 249 125 -222 203 608 -239 3 -55 -26 -462
1076 -462 -20 438 -313 -19 131 -57 467 25 13 445 360 -306 52 630 -230 -256 235 -317 -302 207 -113
1097 -113 -309 111 -299 -490 49 -128 -28 316 -46 -277 282 250 -683 373 372 -279 -233 124 -198 86 137
1118 137 5 -162 385 -385 -212 285 -267 -347 188 165 -471 52 193 -139 -38 354 -130 -144 242 22 305
1139 305 252 -315 265 274 -94 62 277 239 72 340 23 -131 347 -89 -201 283 121 -113 -145 129 -171 351
1161 351 93 -226 115 140 -218 -297 246 -111 -156 27 -282 -345 88 -235 -241 105 -67 -131 -69 -267 -196 -50 246
1184 246 -181 -134 11 -530 -95 224 -454 -700 -164 3 -291 -41 -114 5 329 20 -374 183 -167 -295 -107
1205 -107 504 -299 248 248 -290 19 52 -84 -179 393 -54 -44 375 15 11 246 -200 -76 505 -223 -130 632 227
1228 227 -428 -200 350 -100 183 38 -134 293 157 7 -206 315 -23 -116 378 -219 -242 6 37 -354 274
1249 274 306 -233 484 111 118 -108 145 -14 276 350 -324 -4 586 -29 -466 523 314 -92 153 208 22 -38
1271 -38 1 159 603 2 -380 -227 294 -95 186 158 -233 388 352 -124 -79 160 -333 -359 -51 196 94 -50
1293 -50 -112 -53 -37 -644 -711 141 -88 -724 -137 -52 -530 -449 -302 -492 -271 -14 -582 -145 -213 -402 -274 63 74
1316 74 -37 102 -201 -213 445 -16 -299 371 691 -224 -116 411 105 216 147 253 258 392 126 52 439 216
1338 216 292 267 -48 211 140 39 -137 617 452 -262 -155 62 5 248 -42 -519 20 195 -224 186 429
1359 429 4 -356 314 -265 -209 -39 -157 -85 410 -70 -122 270 241 112 70 -70 47 -19 270 -397 183 338
1381 338 -207 80 475 19 -551 43 64 0 -235 -54 145 152 -38 -466 305 145 -144 -78 -61 -189 -37 234
1403 234 -140 246 91 -349 -322 -104 64 -106 -156 -285 -90 -138 -143 -285 206 40 -709 -177 74 -257 -180 -122
1425 -122 19 -116 -62 -349 -33 99 -280 -99 152 -116 -40 104 -129 -67 396 39 -187 252 134 185 181 13
1447 13 184 -85 -15 95 270 341 -282 102 229 30 -23 111 202 77 83 197 24 201 -74 -14 320 -17 58
1470 58 17 137 -84 274 5 -321 247 194 -451 -186 -79 -161 -243 130 202 -118 187 -344 -160 485 -302 -155
1492 -155 127 -181 -200 31 -169 10 538 -97 -376 105 42 -252 -81 533 47 256 -153 -212 -255 245 -320
1513 -320 -425 27 -47 -244 -72 -101 203 -42 11 241 -165 264 -379 4 31 -164 -95 36 -230 -282 -25 -228
1535 -228 18 224 -8 -253 -184 -288 -20 91 -128 351 -25 -159 -649 -4 144 -236 -169 64 28 -52 83
1556 83 91 56 172 66 68 -35 -200 -147 10 216 348 260 -341 -111 162 77 -314 25 418 -107 120 134 27
1579 27 245 146 -105 -40 -95 -241 -279 151 -23 24 -529 21 -107 383 248 -107 -173 134 120 -460 211 -3 -392
1602 -392 -102 185 -89 107 -268 120 107 202 -261 249 -115 -100 -103 -122 -237 294 154 -223 -280 102 -120 -191 119
1625 119 -93 -114 36 203 -91 78 -172 -338 436 128 62 36 274 -2 154 199 125 120 77 -30 125 28 107
1648 107 273 -3 164 -237 240 -32 -87 170 -305 -105 340 191 33 50 2 -125 82 355 -236 309 372
1669 372 -20 178 271 -83 22 53 118 -213 80 132 67 4 -3 180 -272 -408 10 -72 83 -38 120 -252 -154
1692 -154 1 257 -418 -7 25 194 -41 -239 -70 -400 -92 -370 -190 324 188 -94 25 40 -33 208 93
1713 93 186 38 -64 46 170 140 -210 60 59 228 -107 -80 -139 72 -37 -32 -58 241 -107 -280 77 348 -20
1736 -20 -276 3 -86 19 55 -106 -31 122 -52 1 135 -14 -257 93 57 -60 -228 -65 48 371 203 -27
1758 -27 23 -139 -128 266 -117 59 60 14 -18 -171 179 -271 204 -88 125 398 27 -130 -183 -9 139 17 123
1781 123 -56 85 95 395 -110 -100 27 -59 -122 9 -155 -79 287 -52 -67 -5 36 -201 252 -268 -95 184 -121
1804 -121 29 228 -16 -148 318 169 -261 25 -31 -26 13 134 70 110 199 -5 18 418 99 30 -122 -195 -135 44
1828 44 -87 -190 91 91 -63 -163 72 -10 98 -243 -234 4 -76 -127 -91 187 -21 -361 -208 94 97 -3 309 -9
1852 -9 -251 -234 -62 -9 35 -60 -134 270 -210 60 231 -45 139 36 -101 -103 74 105 -161 201 -80 -21 249 16
1876 16 48 153 -84 -253 -34 270 -20 -119 102 252 -151 -245 -58 142 423 -57 -270 109 215 -100 236
1897 236 -85 211 168 -444 -295 125 79 -313 272 24 -217 -263 222 -32 15 -126 -280 -87 241 -238 -41
1918 -41 -169 -112 98 -197 -64 188 1 -62 119 50 63 9 -80 138 -324 149 70 -44 131 152 -214 -83 189
1941 189 8 -236 21 258 -169 -404 -352 16 42 -52 -242 -55 215 -181 -456 -34 -227 219 -114 -293 374
1962 374 423 -238 -358 482 163 -218 172 77 253 -128 -352 -217 -108 -32 65 -49 166 128 -279 -231 35 236
1984 236 -186 -129 -33 173 -216 -231 6 259 0 -115 -39 117 255 -6 -136 -250 -18 58 258 355 247 -253
2006 -253 105 132 44 124 -377 387 290 145 -463 -77 281 311 278 -13 236 278 -22 -192 252 161 -263 -125 -7
2029 -7 127 345 -60 -156 79 201 -144 -248 219 -2 -24 5 227 107 -26 -333 76 300 115 -88 309 211
2051 211 -75 290 -363 300 14 -395 -196 -213 65 -273 -169 306 -75 -69 -260 3 120 -48 -263 3 220
2072 220 237 -127 0 138 7 -132 -209 175 183 -72 -333 52 176 105 -340 -69 158 -54 -152 -84 182 163 -251
2095 -251 -261 639 553 -52 -277 424 223 149 -37 244 361 -77 10 -70 160 -113 -210 226 143 -61 -284 154
2117 154 -5 221 -223 44 154 261 -186 -246 -102 482 100 270 -214 155 3 -272 -417 -170 31 -109
2137 -109 -147 219 271 -127 51 -33 97 261 -540 44 227 -60 -180 -345 5 121 -76 -213 199 140 -39
2158 -39 -69 167 285 169 -125 265 243 289 -853 -337 -15 105 -336 -7 192 101 -170 -280 221 217 129 -322
2180 -322 -135 364 -324 3 353 146 -190 -126 -483 165 -15 -216 23 134 127 57 -140 14 -31 -135 -518 -275
2202 -275 245 202 -431 -351 118 134 -348 -266 148 -5 -156 -101 -13 495 -58 -290 276 -11 -126 -267 183 317
2224 317 47 43 133 257 226 -343 21 371 302 -130 -27 80 120 38 -27 11 71 -194 -182 -231 115 385 -348 275
2248 275 -90 191 -219 -376 444 336 45 -244 120 40 -222 -171 -109 283 343 -157 -124 366 72 -268 -157 169
2270 169 -151 -171 -81 -150 197 -131 -295 -170 81 -291 -463 -165 89 24 -316 -455 36 213 85 -428 -115
2291 -115 48 -213 -370 400 239 -99 -62 -200 269 27 -286 -17 160 -34 -70 -128 -8 -141 -153 -169 13 257
2313 257 -49 -229 -134 164 -18 44 -69 124 -45 -206 39 171 -36 -7 -207 90 123 130 129 26 240 51 402
2336 402 -237 145 151 110 -116 -214 33 -89 -3 -4 278 255 -405 -281 206 -211 -230 153 125 -119 -308 115 97 180
2360 180 -118 -225 21 81 -135 68 229 -68 -203 -236 128 146 -145 -412 159 334 100 -79 131 306 334
2381 334 160 -189 124 248 -202 -298 98 -2 -88 -393 86 2 77 -22 26 246 -207 296 149 121 149 -114 -188
2404 -188 78 88 -211 -216 265 153 198 -291 -69 258 201 -202 160 39 295 -230 -273 -154 277 -135 -51 207
2426 207 -169 -108 -254 -285 153 -9 -114 -138 25 -52 45 -272 339 102 -189 66 44 200 103 -106 60 68 -9
2449 -9 -289 -148 19 -138 -136 -79 25 -44 -15 107 369 108 -85 -138 -5 488 64 103 368 300 312 -245 -165 173
2473 173 -104 -18 18 164 15 -80 182 -33 361 147 -301 -245 -82 -294 -356 67 114 -86 -43 115 130 124 54 -68
2497 -68 108 -25 -265 7 59 -90 300 27 -66 101 -213 43 -131 237 146 -23 -144 24 -4 51 -117 221
2519 221 223 -192 -192 117 6 -72 -141 -5 170 1 -122 -277 -161 -123 -93 -106 43 -27 188 173 128 -120 50 86
2543 86 -93 324 -104 226 -94 -152 -68 -11 -77 -149 134 -153 116 87 18 -144 216 136 -166 -316 -99 528 -215
2566 -215 89 -16 135 127 156 14 263 278 -83 -465 -249 -40 79 -172 148 220 -208 208 -276 -151 80 -169
2588 -169 -105 -183 206 118 -94 139 69 -72 -149 -99 -35 33 -220 117 295 -55 -201 36 170 -216 231 233 146 96
2612 96 -194 -90 54 193 52 -162 70 -54 -188 -318 -10 -96 -92 85 -294 -19 168 363 -10 76 -18 -266
2634 -266 21 283 -22 80 60 -118 -70 -1 155 -193 296 24 197 90 20 121 -140 -177 49 -195 -206 -108
2656 -108 -180 292 -202 13 33 246 -3 404 -162 187 144 19 -6 196 310 -75 -304 299 -251 -163 62 -61
2678 -61 113 -26 -249 55 -226 318 96 -264 220 -117 248 0 -342 -80 173 165 98 104 61 275 88 -53
2700 -53 -208 -108 -166 -46 201 -69 -407 435 285 -100 27 -168 462 -84 -11 -14 -101 -58 98 163 -96 -37 -46 199
2724 199 311 85 -178 363 -180 -18 184 -85 -213 -226 -183 -39 237 -72 283 -410 121 455 135 -133 187
2745 187 105 -190 -61 145 -8 -116 22 87 -163 67 124 130 -27 4 109 -11 124 -48 290 327 -5 -59 -67
2768 -67 -92 -74 -136 79 77 -310 62 -69 77 158 141 32 298 98 -17 115 37 -393 -49 -150 -3 40 -24 158
2792 158 -167 261 -242 -11 -31 117 -151 -197 -80 144 162 -80 -25 -274 -108 -227 -124 -13 -3 102 -73 30
2814 30 135 77 73 248 34 -51 -321 -117 172 126 -179 -30 377 117 110 90 100 171 -95 357 65 1 10 128 -116
2839 -116 -137 63 -59 116 -343 57 -82 -181 156 -145 64 -194 315 128 -67 -13 188 -159 -59 -405 -133
2860 -133 -220 6 -170 132 97 -211 180 194 17 39 -191 42 -18 -62 -188 -202 14 91 53 -57 -28 84 -302
2883 -302 19 -252 -28 141 109 -101 -80 -245 175 262 -334 176 -126 142 -484 -246 -123 66 -175 -154 293
2904 293 -47 -339 -99 162 55 -11 358 -89 -24 95 -87 -47 -389 458 6 -171 -4 -184 -18 184 23
2925 23 201 -2 86 -118 150 -143 -55 89 396 210 -164 128 -107 -126 130 -110 86 174 205 75 286 337
2947 337 -110 -119 299 -230 48 26 148 11 -182 91 -95 -61 10 -322 206 45 -49 -125 -22 -344 -52 44 252
2970 252 127 -84 82 -40 -256 -106 -120 -125 -13 120 -108 -153 254 -288 -17 140 289 159 5 64 100 -72
2992 -72 -32 -55 391 -32 45 232 349 -176 24 13 -55 109 291 -117 143 73 114 175 -27 197 61 301 23
3015 23 504 133 -210 232 -178 -193 249 456 -2 -107 299 -80 -74 -258 0 -19 18 108 -28 0 112 -94 14
3038 14 50 -338 -227 -1 137 39 89 151 34 111 -172 168 106 -42 -10 -126 -227 78 -258 -120 1 -103 50
3061 50 40 -192 -296 -406 -152 -193 311 -42 -169 57 -176 -104 -103 -79 283 -88 111 -210 -157 403 -7 -65 -145
3084 -145 -239 -109 -50 -113 -71 -4 -9 87 173 -122 141 -190 113 -60 53 -137 40 27 107 132 139 -10 -413 -69 -266
3109 -266 -199 -191 314 102 108 -203 -62 -239 33 -22 204 267 131 63 -223 72 -5 55 -381 218 -60 -17 166 39
3133 39 -156 27 202 110 -256 -111 196 -48 -169 33 -106 107 -253 223 195 197 -56 -272 -83 -94 79 32
3155 32 71 -96 9 -28 -72 86 141 -187 -85 -35 77 156 -167 -46 73 77 54 -153 223 64 -340 -46 -35 -95
3179 -95 60 -442 -183 -23 -88 -140 81 -118 -120 -108 -68 170 -170 -281 42 60 68 -153 150 297 264 -251 -83 176
3203 176 61 150 407 121 45 501 40 -91 271 24 106 -140 -335 207 47 -3 12 -18 -217 84 -191 -185 -81
3226 -81 -204 -87 -135 3 -189 120 23 -60 43 -300 -193 -23 82 173 117 -158 26 -28 -35 140 312 80 -119
3249 -119 -66 105 248 26 272 -151 27 269 -152 -65 -94 -274 463 242 -47 98 67 190 -73 277 -62
3270 -62 135 219 469 134 -5 -346 -45 23 -177 286 36 12 -118 -88 -109 -349 -280 -62 133 12 23 -50 -113
3293 -113 46 294 148 133 2 -200 431 167 94 63 -50 21 -60 -133 -87 22 81 151 -136 -107 64 -134 -146 -69
3317 -69 199 196 -19 21 -25 -221 -36 -18 -283 14 90 248 -22 171 -297 -75 -156 -44 301 101 -63 -79 -15
3340 -15 186 -65 -56 -38 -18 -90 331 25 71 147 -240 85 106 170 -45 -125 115 -326 -65 199 161 55 12 -153
3364 -153 -106 314 -122 64 25 -305 -20 -57 -53 216 204 198 9 83 -209 135 12 -42 17 -122 -20 0 -228 -23
3388 -23 -53 -134 65 -146 41 123 -4 -201 299 90 -171 -12 400 75 34 106 96 -31 171 333 2 342
3410 342 213 124 -35 237 87 -331 207 181 -220 -299 196 4 -225 -288 116 254 -128 -37 -78 -303 -20 -206
3432 -206 -168 -323 -194 -55 136 86 85 88 81 -27 115 192 120 -65 -295 85 61 -189 -42 -81 -107 98 -266 234
3456 234 2 -249 -413 -198 387 143 -74 168 -325 -220 30 -177 49 340 -99 30 162 -144 123 198
3476 198 -26 74 53 -239 -11 -273 -101 -4 299 -129 -402 -30 428 -204 292 90 100 -62 130 -35 -213
3497 -213 387 -83 126 -39 207 -258 84 97 191 -21 271 180 16 294 -31 -139 13 45 135 -48 104 186
3519 186 98 137 235 302 26 145 172 195 -82 256 -385 15 -58 59 -250 -189 56 170 82 -48 -138 -53 -136 -51
3543 -51 89 -15 -21 186 553 -67 -18 69 -143 60 -8 224 114 79 -292 -117 -101 87 -179 -23 -118 -6 -22
3566 -22 -21 -167 -69 -104 56 128 286 73 190 74 22 9 28 126 199 182 -19 99 201 393 -71 -45 -54 12 -313
3591 -313 -2 -72 -22 -121 232 119 -398 278 154 -12 -201 -17 5 437 127 -99 -59 150 -153 -274 -4 -231
3613 -231 -107 220 295 23 -148 67 -272 71 -171 -146 -157 73 216 162 -181 -97 -130 -5 -192 -117 229 91
3635 91 248 103 155 -166 187 91 54 94 94 -33 -98 -37 70 150 63 284 40 168 196 -285 -3 -182 -187 115 219
3660 219 1 -64 78 -261 -27 -209 34 -76 105 -131 44 80 75 3 115 57 223 18 -37 235 122 31 332
3683 332 103 -106 -18 132 131 -273 196 36 -340 -4 42 107 181 114 100 207 101 42 34 166 -136 274 80 -241
3707 -241 -1 346 52 79 -30 193 121 -142 -137 57 -205 -250 36 233 66 -45 -310 -13 -42 55 -30 -35 -237
3730 -237 -106 -197 -364 105 159 254 -44 -108 3 -190 142 338 172 -18 132 216 54 28 -346 -430 130 110 179
3753 179 49 133 -173 81 73 4 -40 -8 130 201 7 -6 63 97 131 299 18 -58 -40 -75 -130 33 -170 -34 -112
3778 -112 -75 -97 262 322 -10 127 63 191 -97 -109 -76 -114 268 97 -91 -50 -54 405 56 103 -333 -129 -256 -134
3802 -134 124 -267 -85 -73 12 7 66 21 -38 -286 278 -2 44 -43 -178 -13 -375 76 152 -50 -345 53 -46 26
3826 26 -65 -55 43 45 -53 -131 67 33 100 -138 -18 -108 -100 -78 -131 175 154 510 136 -163 -165 -12 140 -62 -115 102
3852 102 50 -39 -53 55 -246 -71 357 189 158 -130 -12 27 27 -103 -360 -273 153 -190 103 219 -69 -31 -146
3875 -146 303 -76 -255 151 -153 -2 121 290 -196 24 41 -176 -101 128 -25 -114 193 -106 21 -141 -321
3896 -321 -92 -225 -140 -15 107 93 -158 147 -42 -54 300 77 -91 42 177 -217 152 -80 23 -61 -4 -123
3918 -123 154 70 -126 92 -20 0 -139 258 52 -78 -47 -49 -201 -18 -70 -164 152 39 -270 275 -37 -99 -276
3941 -276 145 -219 49 130 35 -41 -81 50 131 107 259 25 236 61 37 15 218 120 -8 -164 98 -150 33
3964 33 -261 -51 104 -193 -271 -397 162 -427 130 68 -184 -14 -1 374 -16 -43 -16 90 28 234 119 -302
3986 -302 174 -103 -416 274 39 71 -178 -183 35 -356 -12 -209 -28 -269 -108 249 -238 231 -335 -200 234
4007 234 -164 -61 -67 188 34 -74 -119 44 -167 -227 180 -223 59 -11 89 243 -119 -177 87 -14 -437 234
4029 234 59 55 -71 310 393 -35 -236 -157 -127 -25 -162 -124 93 -171 250 77 234 -172 258 -99 45 118
4051 118 258 28 0 -70 143 -19 201 66 -109 -102 13 -78 79 -35 15 55 -166 154 -217 3 -92 9 -79
4074 -79 -156 9 140 -189 306 27 136 105 49 -43 332 -58 200 -17 -222 -181 208 -34 113 -236 115 105
4096 105 -50 -267 63 -158 -194 -172 253 111 177 274 -97 308 -170 -69 -40 -140 -168 213 85 144 68 140 166
4119 166 -28 -120 6 30 239 -254 156 -166 -202 -177 -43 -45 -145 224 -194 -130 24 -153 -100 257 5 184 -242
4142 -242 164 185 -26 133 -203 45 77 22 -260 195 2 31 -146 -182 -66 -62 -236 -117 -63 73 336 77 34
4165 34 33 -41 11 41 27 -205 -257 94 60 -44 -228 104 -7 255 -268 60 -18 -109 -76 -252 -327 65 9 -138 -58
4190 -58 48 34 -27 220 60 -83 175 174 221 -62 -51 18 -167 244 -6 -177 31 164 180 324 25 63 66 -261
4214 -261 350 70 100 382 172 -190 -166 315 -73 -151 145 -39 190 59 -11 -179 -215 131 143 -24 32 296
4236 296 215 34 -71 -63 142 212 114 41 86 -204 -13 -390 -224 -144 115 204 -34 -114 181 30 -227 116 -93
4259 -93 157 164 -101 -203 52 124 132 74 -60 -168 -302 165 206 -129 34 100 36 -51 -238 -28 -33 61 9 -92 71
4284 71 83 244 -97 177 -53 11 -553 166 399 -353 66 201 49 251 -46 -392 133 -47 -168 -144 -50 -65
4306 -65 -113 47 120 -167 295 57 84 117 378 236 155 -60 256 238 -128 127 -58 -71 -63 246 99 80 -38 74
4330 74 -38 -10 -25 184 -66 93 104 79 119 -444 -106 301 -85 22 258 -127 -66 139 -36 -217 45 -39 -108
4353 -108 -129 87 28 -188 136 -76 21 -86 191 6 302 -93 247 -20 136 58 -316 -4 109 -473 -150
4374 -150 62 -212 243 -170 -91 -27 -57 141 -214 -51 -253 52 -231 116 29 -153 108 148 -174 4 -139 183
4396 183 -73 -172 253 34 207 36 231 165 40 19 47 45 1 39 126 -83 -8 -22 192 34 -245 52 111 -126
4420 -126 -158 -159 257 93 -24 44 94 -98 63 101 -153 -5 68 -8 -11 44 -114 136 -207 -154 -115 -253 230 13
4444 13 15 -33 40 -5 143 1 -198 -256 -109 184 93 -78 198 -35 -95 -90 18 90 220 -7 214 8 -33 -21 -75
4469 -75 79 -38 102 -158 -296 -144 -118 95 279 16 -145 8 59 177 -63 -146 -15 132 -44 177 -114
4490 -114 -10 -337 114 29 -115 -156 0 146 186 163 78 261 -105 267 120 -376 62 16 -123 0 158 225
4512 225 115 -13 102 30 124 -94 -240 -157 86 135 -292 -142 121 15 171 79 -260 112 -126 264 10 -66
4534 -66 -86 -120 259 179 -64 -135 213 -39 199 -169 50 116 74 172 -173 -46 -225 23 38 182 72 -9 -148
4557 -148 0 29 -17 -64 -167 -163 -44 -136 192 32 31 80 -62 -12 -14 493 -212 171 -154 296 -46 55 58 142 25
4582 25 -263 33 238 -97 74 142 -258 -62 224 219 23 -10 -27 -38 -48 -73 78 355 -96 -226 -135 -162 -10 -9
4606 -9 225 40 30 74 -71 284 -59 -51 165 -225 20 -167 190 107 -82 277 41 -102 -48 135 -120 310 280
4629 280 -193 -216 -54 78 -40 -72 -130 -19 97 13 26 -62 -7 9 386 207 274 62 -154 55 152 -295 56
4652 56 -148 61 51 -61 59 48 -66 -7 -360 98 110 -125 -155 -55 -97 92 177 98 220 32 183 -26 -248
4675 -248 123 -235 67 -55 21 -334 -112 -51 21 143 -152 -44 264 173 -150 356 129 17 99 -348 -25 175
4697 175 94 138 -149 -3 -133 160 19 38 -92 121 27 -104 -438 152 -37 -3 -236 299 82 111 -106 -346
4719 -346 24 50 -234 99 52 171 179 229 -257 -346 -224 199 -70 -44 78 17 -10 -158 -106 216 -195 -33 -57 -157
4743 -157 212 202 44 291 -96 -157 -14 -40 185 -155 50 -2 -80 6 71 -70 -195 87 -147 -220 -67 -175 -120
4766 -120 -125 60 -19 17 201 -13 32 -64 105 -90 -56 -441 -186 101 179 -202 150 103 -114 -457 258 177 -247
4789 -247 -108 -34 -120 153 78 105 60 -16 43 79 256 -217 -43 294 -41 87 -78 -108 -28 287 116 62 51 -90
4813 -90 67 -51 138 139 -43 -136 16 203 -380 219 -68 -58 -27 -78 -99 -55 70 -74 352 -163 84 114 -98
4836 -98 -99 -22 31 15 -159 -157 111 31 194 -106 57 149 -173 -42 213 -49 149 97 -103 100 23 156 -118 -142
4860 -142 -75 113 33 30 -57 175 -26 201 112 67 66 85 -187 57 31 147 -201 -54 -219 -166 -5 123 -161 105
4884 105 133 -166 -156 -253 -116 23 -164 169 180 -176 -4 -56 -31 277 191 -157 93 -136 -261 -51 249 -173
4906 -173 -195 134 36 -5 -60 -163 -89 -211 260 -41 -28 -102 -215 138 -160 -70 -82 -181 -123 171 5 200 -81 150
4930 150 -103 -234 34 -155 -78 280 42 360 97 113 50 5 -51 263 107 129 -41 127 -97 14 95 -34
4952 -34 -113 34 -12 90 -40 -17 233 100 -161 42 30 181 -63 -211 -106 -85 -203 45 -137 -207 91 -28
4974 -28 -243 -154 31 172 252 -162 163 -261 -219 197 -137 42 -3 -106 263 -147 -34 152 -130 469 87 89
4996 89 -244 49 -189 85 66 376 -171 58 -234 -55 -106 95 -164 388 229 -137 -88 -366 119 -17 19 -169
5018 -169 134 47 -93 138 -72 -93 85 -157 -216 -342 122 -44 -146 -241 -227 9 29 196 -288 12 -154 -44
5040 -44 112 13 -165 -166 138 230 -13 -137 102 -221 271 193 215 -221 -88 -42 62 -24 238 -345 -61 -66 -122 294
5064 294 -281 -147 -144 -305 253 -126 22 122 -52 -217 75 76 -86 37 -39 -194 -1 196 298 -152 -18 46
5086 46 -157 167 11 142 72 81 107 -246 93 -93 -49 435 -164 137 -101 -262 -123 -61 189 350 54 -129
5108 -129 -339 11 91 232 -94 155 -38 -337 86 -377 224 -179 -40 -70 -56 -288 -79 49 74 -38 81
5129 81 -38 -7 253 161 -240 41 69 23 136 -41 179 -176 50 -26 -318 -197 -28 -153 210 -135 25 -89
5151 -89 37 110 312 160 -56 -142 169 -7 243 -119 -200 -45 -89 150 89 164 -84 142 19 256 116 312
5173 312 172 -194 219 182 244 61 6 137 125 48 144 23 213 -231 170 66 158 380 247 25 -410 356
5195 356 181 -16 -117 151 81 27 -191 21 225 79 46 -41 71 -239 4 -44 -82 91 211 71 -44 100
5217 100 -462 -104 -145 99 53 -65 -368 -76 -349 -219 99 49 -72 -129 -266 99 -210 258 143 -46 6 27
5239 27 47 -127 360 67 13 80 -43 -7 117 193 152 -11 -217 -488 238 -161 -181 411 19 -345 6 121 -58
5262 -58 -271 111 -196 -71 -92 -64 -123 -33 167 76 -148 -98 23 -11 96 -306 225 -150 382 23 7 188 86
5285 86 -51 185 -10 197 -22 39 -117 -122 64 -120 39 263 12 156 -265 -95 41 -179 86 138 -252 -17
5307 -17 199 182 -110 -121 229 -235 -67 67 96 -142 77 374 -41 188 139 250 29 -278 51 150 98 -169
5329 -169 105 22 -189 83 154 -200 498 321 180 38 78 198 -154 -23 4 -240 2 88 8 -175 107 -45
5351 -45 -179 225 -68 190 -19 103 -64 8 185 -204 6 78 -31 233 254 -53 176 56 -254 -231 155 220
5373 220 102 -84 353 -362 100 -29 -190 12 241 -116 -345 70 -66 56 145 -237 253 56 108 -51 -350
5394 -350 81 -30 227 99 -5 172 -139 63 209 -68 255 -62 283 66 104 -54 190 -10 1 55 -154
5415 -154 66 -147 130 -117 -411 19 -117 188 -185 -268 -124 136 -162 -16 156 -126 72 -71 50 -72
5435 -72 -170 -52 -115 -142 165 -2 -27 -4 20 -58 -79 0 -133 -228 -52 169 206 88 125 94 -29 -31 -155 72 -240
5460 -240 18 39 71 -149 -82 49 184 -3 -128 69 -262 -118 65 -136 87 177 33 -127 562 -205 -58
5481 -58 -115 134 -51 -412 91 48 151 -67 -38 -153 340 -44 -96 26 28 19 -211 -91 157 -82 93 -264 -52
5504 -52 132 -64 -179 49 181 68 162 -270 -71 37 273 -30 -59 -111 -166 198 -345 102 93 -9 134 -111
5526 -111 -124 -48 157 69 -165 -254 238 192 115 57 -113 241 107 55 125 -258 -26 72 -16 -178 -140 -16 -270 17
5550 17 -44 -47 135 41 -155 -47 26 57 -274 -68 46 316 305 -275 13 241 60 -64 -271 -104 300 125 -54
5573 -54 -118 -114 -185 82 -2 -180 281 -12 -142 192 94 128 -34 56 -34 149 75 -29 23 -126 79 79 26 -127 -157
5598 -157 -61 117 -2 205 -131 84 142 -69 15 166 232 74 188 157 -185 145 -144 -142 81 -140 -4 19 172
5621 172 30 173 115 -155 80 -104 -223 112 77 107 -61 -46 2 281 -43 60 120 371 -173 42 -89 -147
5643 -147 337 149 -367 -104 -96 -382 78 10 -112 -117 201 240 41 110 139 89 -143 70 -111 -43 -237 -10 3 10
5667 10 -84 271 40 22 70 -230 -43 28 -90 60 142 155 -141 96 13 -199 66 -184 -194 -24 -50 111 -238
5690 -238 -87 -14 196 221 -106 -52 290 -49 -5 83 215 -52 179 50 90 56 195 -357 -40 138 -32 19 72
5713 72 52 -203 -39 91 109 140 -32 -162 162 136 111 -53 -535 -59 78 192 299 207 56 167 -51 -363
5735 -363 175 -1 118 27 -84 -84 279 294 155 -133 -118 61 153 278 -40 278 -131 -18 0 -152 -37 65
5757 65 262 -298 -148 -164 16 43 55 -188 -65 -241 -9 105 73 438 -60 445 -46 -51 136 198 -187 101 -25
5780 -25 -106 -124 -48 -80 -379 -217 180 -30 -40 -125 -11 159 -182 198 219 186 140 134 -42 -103 -68 -152 316 -213 117
5805 117 275 136 -5 162 81 -230 -233 246 -121 -52 149 -103 -68 18 318 2 -48 -2 -135 4 -73 -54 152
5828 152 181 -200 -59 75 -85 -206 -30 -222 -100 -229 -19 -43 162 4 123 -239 6 -83 -26 122 -200
5849 -200 44 201 403 -174 -140 41 295 110 248 -2 -105 -246 24 -47 247 -217 110 257 -325 17 -88
5870 -88 -3 41 -254 -333 205 76 2 88 -91 257 360 -201 18 -248 -111 -151 313 -50 80 57 -29 -327 8
5893 8 215 -4 164 -187 419 42 -180 16 60 -407 163 152 152 13 157 27 24 96 198 15 -95 -66 50
5916 50 -333 -95 91 93 190 410 142 204 508 201 105 -7 -532 57 15 213 141 34 166 -139 -336 -328 65
5939 65 188 -49 12 -72 -142 -238 -348 -11 -262 81 259 -45 0 332 -48 -312 -61 -160 -169 -123 37 241 -220
5962 -220 118 -224 -167 -308 -134 185 -94 68 -30 -246 -15 145 -171 111 17 -113 -118 206 306 201 365 235
5984 235 -141 -198 219 -109 153 122 -81 -110 -272 267 -131 10 261 126 -44 192 -373 -113 206 115 -154
6005 -154 107 -156 -99 -48 272 90 55 139 -74 62 -324 3 -16 -63 282 -70 67 115 178 18 358 164 116
6028 116 63 356 3 -195 -26 139 83 56 103 151 52 -24 -48 -132 120 5 -399 -468 -74 -323 230 289 0 29
6052 29 -111 -178 18 85 141 156 -216 140 59 -300 304 0 224 -249 -140 139 133 -46 -182 -354 123 -262 -61
6075 -61 -209 -183 -27 189 -212 42 280 -64 207 -317 103 -332 -178 -176 245 241 -3 14 -242 161 136 -27 -41
6098 -41 -140 -157 29 -44 -41 20 -115 -210 209 -194 -60 -40 -48 -197 323 117 -246 148 -246 -68 -200 -129 134 -74
6122 -74 73 -27 130 33 22 238 -16 -78 -123 39 -137 97 -143 269 27 -54 35 120 -64 135 139 105 -174 -72
6146 -72 5 -95 -20 34 215 51 -30 -90 -62 -95 370 -3 -37 34 265 -253 -208 300 -220 12 76 -68 -126 -59 -6
6171 -6 -267 116 43 -217 -182 -113 178 -224 252 250 527 147 -157 16 -44 404 -38 209 -89 -114 92 -50 -35
6194 -35 -102 -218 -247 296 -111 -5 -27 96 59 -98 -42 -106 136 210 -54 -90 -120 65 -50 -72 -52 -237 -34 -35 48
6219 48 -264 34 -204 203 125 220 51 -292 104 -226 -144 -279 249 1 -70 90 71 -13 -6 -218 80 292 -72
6242 -72 213 -258 47 -82 349 241 -92 -183 -60 27 -194 33 -11 -91 -39 155 -135 -44 -160 148 -22 -316
6264 -316 159 -340 0 -33 21 -72 211 6 128 -161 326 74 -73 -8 -177 -42 72 -18 -316 89 48 -31
6286 -31 -125 260 -70 130 -100 52 -254 -59 67 80 -119 -110 -11 -6 114 26 77 -194 -175 -138 -45 -59 -15 179 -136
6311 -136 133 88 -348 -45 -302 -168 55 78 301 68 -76 -267 126 -233 -183 -195 -193 72 23 13 249 80 -71
6334 -71 -199 -71 -200 -56 -132 -131 63 220 -43 -14 44 172 -91 -100 -92 211 -160 -290 83 -59 -18 4 162 116
6358 116 191 41 -232 -184 374 140 73 -88 104 304 63 -27 -24 -22 -28 236 -229 147 -128 -126 -162 283 -34 -106 -292
6383 -292 -79 -147 65 -43 -9 -184 -177 247 54 -91 -370 31 -249 28 -118 164 -169 -47 152 157 -41 212
6405 212 -75 -68 61 -98 199 322 -57 -188 -186 -279 -29 168 -367 -221 -25 -114 90 -30 193 -66 100 -50
6427 -50 80 120 -183 -10 -357 248 -104 -154 66 108 -149 -20 -347 -71 -218 94 388 -467 -149 192 -266
6448 -266 -268 13 -123 -56 -231 -144 -18 213 -13 125 -228 -68 47 -61 84 -116 161 201 -215 192 -151 397
6470 397 -284 -354 380 -12 83 25 -54 -108 -115 0 -149 -47 71 -39 245 51 -3 -76 -51 -156 32 34 -8 -63 85
6495 85 -28 100 35 138 167 -111 72 256 -169 161 168 217 -149 382 144 -238 -160 108 52 202 54 -36 -79
6518 -79 176 123 79 -266 -90 -46 17 -20 -82 185 4 73 -59 -67 188 157 -51 -144 90 -16 -53 1 -79 277 -35
6543 -35 -121 -206 95 -278 150 59 119 -75 -161 -38 -224 209 101 -6 -361 57 10 -152 -271 -285 62 48 120
6566 120 -50 15 -81 -100 29 45 14 110 -318 241 103 -36 -86 -74 87 223 -14 105 31 -126 296 287 354 -73
6590 -73 355 -266 244 345 -258 212 -163 -17 169 -325 85 -22 -6 92 21 -116 -297 -43 -54 -226 -273 -135
6612 -135 115 -111 -64 54 256 257 -13 -18 -145 214 -168 -270 -53 -12 -14 15 29 -50 64 -142 -54 28 -275 -214 -81
6637 -81 100 -35 153 -196 97 -56 148 4 76 99 82 35 108 -45 40 -146 -154 177 84 -440 53 -52 -32 255
6661 255 -223 -124 142 89 148 -8 71 137 -327 233 -361 -286 -194 98 0 -58 123 -115 2 -109 -85 -109 -94 -61
6685 -61 -33 -30 163 -106 -224 32 109 -20 5 -55 475 -63 -268 -38 -199 102 211 -50 -366 -166 -34 92
6707 92 -160 9 2 -161 83 -12 -59 39 213 167 -31 183 -9 254 -262 381 69 -187 110 -90 -39 -38 -171
6730 -171 -117 80 354 102 -271 -125 -139 173 -31 -432 295 -451 41 221 -172 -100 -90 95 -294 110 49 118
6752 118 302 160 -38 -317 86 -452 -180 -243 16 136 -187 -180 -66 -260 -372 148 47 -388 -80 -178 26
6773 26 10 86 427 -45 -23 -15 -4 59 104 196 -30 -214 -39 -118 -238 -5 27 187 -10 -307 196 -63 -183 121
6797 121 203 -96 -36 158 42 294 7 65 -151 -174 41 25 -68 -115 -90 66 198 -92 -246 -1 123 69 41
6820 41 -218 214 17 54 -92 90 -165 114 -10 235 -97 -198 28 -125 -36 316 43 71 205 348 81
6841 81 111 209 -42 16 141 -58 -100 110 -189 100 258 19 137 -195 -188 -246 -20 31 14 16 -44 131 83 -106 -199
6866 -199 98 189 -48 -210 -339 -100 79 -74 -21 -121 -90 425 11 367 160 -199 -96 -51 -336 -38 28 -369
6888 -369 91 -27 86 138 128 -148 -154 -220 243 311 -16 -108 -212 21 -22 131 -79 19 -25 62 -55 -28 57 27 -329
6913 -329 -4 -72 -94 226 61 -13 -75 286 -192 122 207 -254 -167 144 -295 161 -95 81 -43 -228 161 173
6935 173 58 65 59 -216 27 -206 242 -146 -243 -85 -234 -194 148 -121 -170 74 225 -22 7 375 -62 6 183
6958 183 -99 244 397 -108 -5 -56 -155 -8 249 -8 -32 -120 65 208 158 -81 -27 -228 142 228 -79 -71 45
6981 45 -55 -38 52 -114 106 58 -119 -69 -1 134 333 43 104 104 -92 -300 159 -51 -31 114 107 -87 -96 -127 -128 196
7007 196 133 219 40 -26 133 208 -24 -6 -27 156 -26 -130 287 -107 4 -287 28 -105 -181 117 109 125 106 331
7031 331 -2 81 54 -404 -119 28 66 -225 -204 -176 218 240 -11 -122 142 132 -136 -144 -139 -92 2 159 -33 -98 101
7056 101 86 -35 116 3 23 -145 257 131 121 96 -164 -113 73 -58 -47 61 148 150 58 25 -301 42 -320 -322
7080 -322 34 -100 -100 23 253 -199 -166 70 -176 22 203 -36 37 52 -227 -248 -45 -204 -9 267 -165 -77
7102 -77 -150 -16 128 154 16 82 -363 -93 -131 197 177 74 430 -217 -190 3 -344 -149 97 -9 5 -219 -129
7125 -129 -151 50 -21 27 -216 -177 -102 33 -219 73 7 43 -48 24 147 -45 -97 102 -428 148 -48 115 87 -40
7149 -40 345 -18 5 -149 226 -277 4 166 95 -17 181 25 11 -233 149 180 176 124 -94 34 -7 -1 172 -63
7173 -63 52 57 218 -207 -392 -180 63 3 -194 23 -191 235 -113 -3 -69 -144 -15 134 123 55 -150 -13 -13
7196 -13 6 116 329 -30 -180 185 163 126 7 404 -344 70 -187 113 -186 -269 -17 96 40 237 -186 240
7218 240 -206 -19 -16 -315 -304 -247 99 227 69 -5 11 -122 188 -162 207 54 170 -192 135 126 -352 -224 -321
7241 -321 97 181 194 -231 -26 126 71 -201 -286 26 143 5 -20 18 79 -3 -358 -66 3 128 218 19 -129
7264 -129 319 -204 289 -40 -33 111 -42 49 -257 -17 353 -305 2 132 -58 137 254 -46 -85 -16 74 195
7286 195 -122 182 192 156 171 351 -135 96 56 265 -23 231 -29 -45 -4 -92 -184 -228 -295 -245 71 11 -180 -82
7310 -82 33 -58 3 216 155 77 64 -38 102 -258 -75 -156 67 79 -4 82 66 -132 -278 -56 -58 138 89 57 -11
7335 -11 17 -202 -12 183 -34 118 -40 67 242 -212 -91 183 136 33 15 -192 109 110 -189 214 -106 85
7357 85 -16 36 220 -147 70 -252 -63 290 -84 115 -44 180 88 -336 -21 -117 45 -292 139 -35 173
7378 173 124 -310 -87 -56 -108 -22 -97 -80 -65 74 173 -22 294 -260 -171 -75 -294 -68 -213 -60 -169 -2 -12 69
7402 69 0 284 189 196 341 43 316 266 -95 -61 -305 129 -29 164 193 -201 27 -17 -332 3 282 -44 70
7425 70 25 -52 -138 269 -115 -121 77 -123 322 -186 -144 70 -245 180 22 42 148 -160 77 86 -46 -218 38
7448 38 22 -48 267 -2 77 35 -212 36 -10 194 94 255 -216 -39 8 -76 -81 -69 -285 -228 137 202 242 217 222 25
7474 25 -12 -192 177 0 320 74 -110 257 -53 92 29 -319 125 33 -130 -47 -92 -6 -50 -15 -92 336 -4
7497 -4 -467 192 -380 -67 133 -182 119 -227 -24 32 86 101 -122 -222 -202 446 -2 -380 -246 120 0 -11
7519 -11 221 -68 156 171 -185 91 131 -33 9 195 -64 -15 134 -11 147 19 197 56 22 22 149 42 -90
7542 -90 -220 -143 -159 -49 288 126 -89 -94 -137 -346 -15 24 -186 -83 75 -11 -79 -20 126 295 -160 219 -232
7565 -232 -85 67 31 36 212 241 -163 243 -99 150 341 -184 215 69 47 260 -281 113 41 87 153 297 -212
7588 -212 -224 -50 46 67 94 59 -91 -83 171 94 79 224 -135 100 193 -194 -27 14 128 64 29 -9 233 39 -81
7613 -81 -48 -17 201 -51 321 137 -74 249 -296 220 -85 -158 31 -178 -220 -164 134 -132 125 38 302 46
7635 46 18 139 -153 96 168 92 -2 16 -188 131 1 25 97 -339 179 22 -80 -20 356 -71 89 286 197
7658 197 -151 455 -168 -160 -25 48 118 123 432 -79 97 -15 150 78 -128 315 -265 45 365 -78 269 186 -193
7681 -193 -54 79 -141 68 257 143 92 89 -112 39 -171 -113 -351 -135 50 -14 67 -113 23 -286 204 -170
7703 -170 97 -92 -90 33 18 150 -148 -120 79 -112 19 -97 252 255 103 -79 -6 -128 4 153 142 39 -311
7726 -311 -110 230 87 -58 -187 -137 283 -94 139 -111 94 -34 57 -119 -62 43 44 -216 204 162 171 -348 135
7749 135 340 -93 -5 80 -224 244 -93 -237 -148 -369 -227 109 85 -37 -337 147 180 -151 -401 38 184 132
7771 132 -66 -59 40 363 -10 -146 12 123 212 -127 -274 -42 176 133 -182 -356 -236 -30 -304 94 32 63
7793 63 -54 -233 100 -232 89 208 51 -167 -8 -53 -354 -237 -66 118 -277 139 209 -252 241 -27 388
7814 388 79 -67 212 21 -34 -108 48 40 -200 134 61 84 247 325 99 -57 -82 171 -141 -17 -87 -144 11
7837 11 44 143 -92 -41 164 -15 -179 -221 -32 66 -46 -99 8 62 108 82 -94 -12 102 178 38 20 82 -97 326
7862 326 83 -109 -83 84 -216 -6 32 -231 32 -30 -58 152 -296 -110 -377 92 -97 -200 64 93 -21 -119
7884 -119 -343 -222 -98 -115 -292 21 51 -422 -205 5 20 -60 42 342 -96 134 -219 63 -287 -176 208
7905 208 -125 100 121 187 13 -35 -140 -49 -144 91 136 14 126 379 -41 -343 -278 59 96 170 129 24 -172
7928 -172 229 267 5 126 324 -102 -56 234 133 18 16 -65 159 299 279 -218 7 -40 -7 -281 3 81 -164
7951 -164 -144 -62 -150 145 29 6 -22 -166 156 -408 21 -123 -387 225 -66 56 -78 -299 202 77 73 324
7973 324 151 116 236 36 0 224 -11 46 167 -158 -140 31 -177 -249 -40 -162 -33 66 36 2 63 199 -247
7996 -247 120 -33 -29 64 -26 224 -254 -250 153 56 120 -125 -153 154 -1 -7 -75 250 392 45 -71 -150 247 15
8020 15 206 -83 -28 162 6 67 57 -72 1 -227 40 -58 97 200 -17 -104 42 19 -21 -74 -129 108 228 -30
8044 -30 153 208 -116 261 -61 262 36 50 -87 112 -153 -231 182 55 113 18 49 -174 191 -43 -36 31 13 73
8068 73 -162 150 35 57 230 280 -72 54 -24 61 71 238 -31 -138 -6 230 49 -141 101 -172 -153 -163 -123
8091 -123 326 -321 6 12 -179 244 120 261 236 48 71 95 -81 124 -22 -254 214 -374 86 16 7 123 -24
8114 -24 -191 87 64 -150 -12 -90 68 93 -7 96 133 -169 -382 -28 5 14 370 293 100 123 -177 -54 121
8137 121 135 68 -46 -171 2 -302 -17 163 153 -255 -100 63 -231 103 120 -158 36 107 -60 -89 -23 652
8159 652 131 -155 47 -16 -100 60 93 134 -62 -180 66 87 -101 43 21 -250 77 126 -199 -32 65 -135 135
8182 135 32 -46 -233 -33 43 -52 271 -231 -172
8191a72
##END NTUPLES=NMR FID
##END=
