##TITLE=1H_T-3923
 aceton-d6, 54 sc, 
 18.1.2019
##JCAMPDX= 6.0         $$ Bruker NMR JCAMP-DX V2.0
##DATA TYPE= NMR FID
##DATA CLASS= NTUPLES
##ORIGIN= UXNMR, Bruker Analytische Messtechnik GmbH
##OWNER= root
$$ XWIN-NMR		Version 3.5
$$ Fri Jan 18 15:44:14 2019 Russian Standard Time (UT+4h)  she@DPX200
##.OBSERVE FREQUENCY= 200.1313
##.OBSERVE NUCLEUS= ^1H
##.DELAY= (6, 6)
##.ACQUISITION MODE= SIMULTANEOUS
##.ACQUISITION SCHEME= undefined
##.AVERAGES= 62
##.DIGITISER RES= 18
##SPECTROMETER/DATA SYSTEM= spect
##.PULSE SEQUENCE= zg30
##.SOLVENT NAME= Acetone
##.SHIFT REFERENCE= (INTERNAL, Acetone, 0, 15.7039)
##AUDIT TRAIL= $$ (NUMBER, WHEN, WHO, WHERE, WHAT)
$$ ##TITLE= Audit trail, XWIN-NMR		Version 3.5
$$ ##JCAMPDX= 5.01
$$ ##ORIGIN= Bruker BioSpin GmbH
$$ ##OWNER= she
$$ F:/spectra/data/she/nmr/H-F/1/audita.txt
$$ ##AUDIT TRAIL=  $$ (NUMBER, WHEN, WHO, WHERE, WHAT)
(   1,<2019-01-18 15:43:17.50 +0400>,<she>,<DPX200>,
      <continue with go, POWCHK disabled, PULCHK disabled
       configuration hash MD5:
       00 E9 B6 7A A2 85 ED C7 34 08 36 98 17 FE 4E 26
       data hash MD5: 16K
       29 07 3E 1D 8D 20 50 95 14 5F DC 6B B3 66 2A F5>)
$$ ##END=
$$ 
$$ hash MD5
$$ FE A6 8B AF 88 A6 DC DB 95 91 6A 4F 4C 94 05 D1
##$RELAX= 
##$RELAX= 
##$RELAX= 
##$RELAX= 
##$RELAX= 
##$RELAX= 
$$ Bruker specific parameters
$$ --------------------------
##$DU= <F:/spectra>
##$EXPNO= 1
##$NAME= <H-F>
##$PROCNO= 1
##$TYPE= <nmr>
##$USER= <she>
##$AMP= (0..31)
100 100 100 100 100 100 100 100 100 100 100 100 100 100 100 100 100 100 
100 100 100 100 100 100 100 100 100 100 100 100 100 100 
##$AQSEQ= 0
##$AQ_mod= 1
##$AUNM= <au_zg>
##$AUTOPOS= <>
##$BF1= 200.13
##$BF2= 200.13
##$BF3= 200.13
##$BF4= 200.13
##$BF5= 200.13
##$BF6= 200.13
##$BF7= 200.13
##$BF8= 200.13
##$BYTORDA= 1
##$CFDGTYP= 0
##$CFRGTYP= 5
##$CHEMSTR= <none>
##$CNST= (0..31)
1 1 145 1 1 1 1 1 1 1 1 1 1 1 1 1 1 1 1 1 1 1 1 1 1 1 1 1 1 1 1 1 
##$CPDPRG= <>
##$CPDPRG1= <>
##$CPDPRG2= <>
##$CPDPRG3= <>
##$CPDPRG4= <mlev>
##$CPDPRG5= <mlev>
##$CPDPRG6= <mlev>
##$CPDPRG7= <mlev>
##$CPDPRG8= <mlev>
##$CPDPRGB= <>
##$CPDPRGT= <>
##$D= (0..31)
0 1.2 0 0 0 0 0 0 0 0 0 0.03 0 0 0 0 0 0 0 0 0 0 0 0 0 0 0 0 0 0 0 0 
##$DATE= 1547811527
##$DBL= (0..7)
120 120 120 120 120 120 120 120 
##$DBP= (0..7)
150 150 150 150 150 150 150 150 
##$DBP07= 0
##$DBPNAM0= <>
##$DBPNAM1= <>
##$DBPNAM2= <>
##$DBPNAM3= <>
##$DBPNAM4= <>
##$DBPNAM5= <>
##$DBPNAM6= <>
##$DBPNAM7= <>
##$DBPOAL= (0..7)
0.5 0.5 0.5 0.5 0.5 0.5 0.5 0.5 
##$DBPOFFS= (0..7)
0 0 0 0 0 0 0 0 
##$DE= 6
##$DECBNUC= <off>
##$DECIM= 32
##$DECNUC= <off>
##$DECSTAT= 4
##$DIGMOD= 1
##$DIGTYP= 9
##$DL= (0..7)
0 120 120 120 120 120 120 120 
##$DP= (0..7)
150 150 150 150 150 150 150 150 
##$DP07= 0
##$DPNAME0= <>
##$DPNAME1= <>
##$DPNAME2= <>
##$DPNAME3= <>
##$DPNAME4= <>
##$DPNAME5= <>
##$DPNAME6= <>
##$DPNAME7= <>
##$DPOAL= (0..7)
0.5 0.5 0.5 0.5 0.5 0.5 0.5 0.5 
##$DPOFFS= (0..7)
0 0 0 0 0 0 0 0 
##$DQDMODE= 0
##$DR= 18
##$DS= 0
##$DSLIST= <SSSSSSSSSSSSSSS>
$$ [...]
##$SUBNAM2= <"">
##$SUBNAM3= <"">
##$SUBNAM4= <"">
##$SUBNAM5= <"">
##$SUBNAM6= <"">
##$SUBNAM7= <"">
##$SUBNAM8= <"">
##$SUBNAM9= <"">
##$SW= 20.0189088683792
##$SWIBOX= (0..15)
0 0 2 0 0 0 0 0 0 0 0 0 0 0 0 0 
##$SW_h= 4006.41025641026
##$TD= 16384
##$TD0= 1
##$TE= 0
##$TE2= 300
##$TE3= 300
##$TEG= 300
##$TL= (0..7)
0 120 120 120 120 120 120 120 
##$TP= (0..7)
150 150 150 150 150 150 150 150 
##$TP07= 0
##$TPNAME0= <>
##$TPNAME1= <>
##$TPNAME2= <>
##$TPNAME3= <>
##$TPNAME4= <>
##$TPNAME5= <>
##$TPNAME6= <>
##$TPNAME7= <>
##$TPOAL= (0..7)
0.5 0.5 0.5 0.5 0.5 0.5 0.5 0.5 
##$TPOFFS= (0..7)
0 0 0 0 0 0 0 0 
##$TUNHIN= 0
##$TUNHOUT= 0
##$TUNXOUT= 0
##$USERA1= <user>
##$USERA2= <user>
##$USERA3= <user>
##$USERA4= <user>
##$USERA5= <user>
##$V9= 5
##$VALIST= <valist>
##$VCLIST= <CCCCCCCCCCCCCCC>
##$VD= 0
##$VDLIST= <DDDDDDDDDDDDDDD>
##$VPLIST= <PPPPPPPPPPPPPPP>
##$VTLIST= <TTTTTTTTTTTTTTT>
##$WBST= 1024
##$WBSW= 4
##$XGAIN= (0..3)
0 0 0 0 
##$XL= 0
##$YL= 0
##$YMAX_a= 165609
##$YMIN_a= -268625
##$ZGOPTNS= <>
##$ZL1= 120
##$ZL2= 120
##$ZL3= 120
##$ZL4= 120
##$ABSF1= 10
##$ABSF2= 0
##$ABSG= 5
##$ABSL= 3
##$ALPHA= 0
##$AQORDER= 0
##$ASSFAC= 0
##$ASSFACI= 0
##$ASSFACX= 0
##$ASSWID= 0
##$AUNMP= <proc_1d>
##$AZFE= 0.1
##$AZFW= 0.1
##$BCFW= 1
##$BC_mod= 2
##$BYTORDP= 1
##$COROFFS= 0
##$CY= 11.3945322036743
##$DATMOD= 1
##$DC= 2
##$DFILT= <>
##$DTYPP= 0
##$F1P= 18.9103706918063
##$F2P= -1.10871071338519
##$FCOR= 0.5
##$FTSIZE= 0
##$FT_mod= 4
##$GAMMA= 1
##$GB= 0.15
##$INTBC= 1
##$INTSCL= 1
##$ISEN= 128
##$LB= 0.24
##$LEV0= 0
##$LPBIN= 0
##$MAXI= 10000
##$MC2= 0
##$MEAN= 0
##$ME_mod= 0
##$MI= 1.114404
##$NCOEF= 0
##$NC_proc= 0
##$NLEV= 6
##$NOISF1= 3.799351
##$NOISF2= 2.8
##$NSP= 1
##$NTH_PI= 0
##$NZP= 0
##$OFFSET= 15.70392
##$PC= 1
##$PHC0= -9055.144
##$PHC1= 11.60004
##$PH_mod= 1
##$PKNL= yes
##$PPARMOD= 0
##$PSCAL= 0
##$PSIGN= 0
##$REVERSE= no
##$SF= 200.130013532006
##$SI= 16384
##$SIGF1= 3
##$SIGF2= 2
##$SINO= 400
##$SIOLD= 16384
##$SREGLST= <1H.CDCl3>
##$SSB= 0
##$STSI= 0
##$STSR= 0
##$SW_p= 3612.71676300578
##$SYMM= 0
##$S_DEV= 0
##$TDeff= 0
##$TDoff= 0
##$TI= <>
##$TILT= no
##$TM1= 0
##$TM2= 0
##$TOPLEV= 0
##$USERP1= <user>
##$USERP2= <user>
##$USERP3= <user>
##$USERP4= <user>
##$USERP5= <user>
##$WDW= 1
##$XDIM= 8192
##$YMAX_p= 0
##$YMIN_p= 0
$$ End of Bruker specific parameters
$$ ---------------------------------
##NTUPLES= NMR FID
##VAR_NAME=  TIME,          FID/REAL,        FID/IMAG
##SYMBOL=    X,             R,               I
##VAR_TYPE=  INDEPENDENT,   DEPENDENT,       DEPENDENT
##VAR_FORM=  AFFN,          ASDF,            ASDF
##VAR_DIM=   8192,          8192,            8192
##UNITS=     SECONDS,       ARBITRARY UNITS, ARBITRARY UNITS
##FACTOR=    0.0002496,     1,               1
##FIRST=     0,             0,               0
##LAST=      2.0444736,     0,               0
##MIN=       0,             -268625,         0
##MAX=       2.0444736,     165609,          0
$$ Real data points
##PAGE= N=1
##DATA TABLE= (X++(R..R)), XYDATA
0@%%%%%%%%%%%%%%%%%%%Qo8J22j24J24j24J28j47K05k50K56k97L56l87M44n07
35b61N70o41P14q11R05j006J116j237J375j522J685j863K054k266K501k754L027
52A586l333L677m063M492m975N527o168O912p792Q863j0186J1873j4105J7229
66I537k1952L0036m7744J73830j25637r0916K10886m9104k4044r5787j35715J03062
78f3548J57240j50819k5186J12872p1946m1774J00778l9552M4210J19970j44465
89b220r2409K15289K5796j67799k9706k0221K0610J43580r5883j75263J60683
100a7543J24419j30622r507L4004l9492R9947L0771j45922O9638J12188j64499
111c6618q0333R2227k216N3684N6217j40545K0921J93669j08984j81854P2594
$$ plain form
0 0 0 0 0 0 0 0 0 0 0 0 0 0 0 0 0 0 0 0 0 8 -60 62 -62 62 -62 66 -81 124 -126 130 -167 189 -198 246 -261
35 -261 309 -332 382 -429 476 -530 586 -651 724 -798 887 -976 1078 -1188 1313 -1441 1586
52 1586 -1747 1930 -2133 2359 -2616 2911 -3257 3655 -4137 4726 -5460 6413 -7692 9537
66 9537 -12415 17621 -30123 143707 18070 -72846 138040 88936 64892 -30895 -166610 -63548
78 -63548 93692 -57127 -82313 30559 -41387 -83161 17617 -21935 22275 142245 -2220
89 -2220 -94629 120660 146456 -21343 -51049 -71270 -50660 92920 -2963 -178226 -17543
100 -17543 106876 -23746 -33253 751 -38741 61206 91977 -53945 15693 127881 -36618
111 -36618 -116951 -24724 -26940 26744 82961 -57584 -36663 157006 48022 -133832 -61238
122f1238M6633P769O0400r7030m4615J87807r616j69445P3730P6592o7594K5417
134B8810k9503q6175J32665N4808j86047L705J23381n6965k0093J5745o8116J08426
146B0641J30757j61667o6942J62179p529q0584K1922n1057O626R7451j22748j14942
158a65893J57070M9963q9129N3147K2396k4960J00402m3186j60123J00154J12410
169A12251j15893l7962L1890l5988O4447J1239j45185O3183J61202r9553p8834
180f9203Q2674p766J3826N8752j02799j9834J46921o0757j35967O5992K6278k6833
192b8716O0227n6947o1536J53484K6496j53678L9518Q4834n4777M069k5091q3594
204i5711J08530P9838j42717N18J24065n5642m4464K5558o3442M7036J17266j04425
$$ plain form
122 -61238 -14605 -6836 53564 -43466 -88081 99726 90110 -79335 -5605 70987 3393 28810
134 28810 -693 -86868 45797 100605 -85442 -81737 41644 -15321 -35414 -19669 -87785 20641
146 20641 151398 -10269 -77211 84968 77439 -3145 18777 -32280 -25654 71797 -50951 -165893
158 -165893 -8823 41140 -47989 5158 27554 2594 102996 59810 -100313 -159 112251
169 112251 -3642 -41604 -9714 -45702 18745 29984 -115201 -52018 109184 9631 -69203
180 -69203 13471 5705 19531 78283 -24516 -44350 102571 41814 -94153 -28161 -1883 -28716
192 -28716 31511 -25436 -86972 66512 93008 -60670 -21152 63682 8905 12974 -12117 -95711
204 -95711 12819 92657 -50060 -49542 74523 18881 -25583 -25 -63467 -16431 100835 -3590
216c590p3169J18408n733p1080L6063k9825J151J18721o5554j26210J10693N6811
228F6686r7110J5153K4001l0727P5056j2196j31793O6065R8133r4004j9923N8426
240A7767l7077L7057M5932j11343R750J29488o9890q7523N5829p587J301O5622
252D9326p1017l1315J33770k9275j29022N7109M4660l6243M6812k2908p0798R4143
264C5242K7139j27694K2634Q0025m2311J5923J2803q5176N6167Q4568j10012k7836
276e8528J09816k4543l9201K8766n6461J1516R8374p2719p1418J04799N842p3010
288c6767M2026l822k7920Q4979k5113j07213O9262N2906p8281J7700L0465m2365
300b4143N3918J5610j14601L3276R9747o6552l1708N8032k9014O403M0676q3088
$$ plain form
216 -3590 -76759 41649 35916 -35164 899 -28926 -27775 90946 25392 -100818 9875 66686
228 66686 -30424 -15271 8730 -21997 53059 40863 -90930 -24865 73268 -20736 -40659 17767
240 17767 -19310 17747 63679 -47664 -37914 91574 21684 -65839 -10010 -17597 -16296 49326
252 49326 -21691 -53006 80764 51489 -77533 -20424 24236 -12007 34805 11897 -58901 35242
264 35242 62381 -65313 -42679 37346 -4965 10958 23761 -61415 -5248 79320 -30692 -58528
276 -58528 51288 26745 -12456 16310 -40151 -28635 69739 -2980 -74398 30401 36243 -36767
288 -36767 5259 1437 -26483 58496 33383 -73830 -4568 48338 -29943 -12243 18222 -24143
300 -24143 29775 45385 -69216 -35940 63807 -2745 -34453 23579 -5435 968 41644 -41444
312d1444o135J11810m1066o9205N8722q807l0153N7796l7990n0381J01228P418
324E1793j00988L4881L6796m0100M0845k378p2025O5201M2189j05852R428P9152
336C8942m1418j066L3678o3550J7436P1199p3804k9691Q7994k1516l7502M3380
348B4082m0807k0973Q5585l5695p1939P8215J7796o8282K9115N370l3196O7605
360C6876K041q8914M7025N2032p3937O035M3645m5341K5510L5853q2975N410Q0558
373D3818m4296k4894N4022l1418j0945N0271n8397l0504R3599j2059o2835N2464
385A8826K824m4609M0733j7927n2768P0944J9279p9325L3118L6916n0335K6705
397D381K5950o3008L2631N0499p6147o108O5854l3456q558L9317n4024n741O6155
$$ plain form
312 -41444 -47579 64231 23165 -46040 12682 3875 -26278 31518 -6472 -56853 44375 51793
324 51793 -49195 -14314 22482 -17618 23227 20849 -51176 14025 56214 -49638 -40210 38942
336 38942 -2476 -3542 30136 -33414 -15978 55221 -18583 -48274 39720 18204 -19298 24082
348 24082 -16725 -37698 47887 12192 -59747 18468 36264 -32018 -2903 2467 -30729 36876
360 36876 38917 -49997 -2972 49060 -24877 -18842 24803 -20538 4972 40825 -42150 -36740 43818
373 43818 -478 -25372 28650 -2768 -13713 36558 -21839 -52343 41256 29197 -33638 18826
385 18826 21650 -22959 17774 -153 -52921 18023 37302 -42023 -8905 28011 -22324 4381
397 4381 30331 -32677 -46 50453 -25694 -31802 34052 596 -7962 31355 -22669 -28410 37745
410C7745n0698l7870P7766p921m4265M2919j6597l4293O6188p503n8562N4461
422B1370J6247o5483K2977R446m9065M7271L1425o6340K5011N1871n8660n646
434a9576M0504l8412J1173M5596n7705p987O7189l7738l3061N5541k0592l1463
446b6531M7936k6071l8352O5513Q28n2673M2241O580m6319L8217K156n5397M8475
459F603L2202o6051J4930M3667m4030J1852L4782n0652J0278M3956o1833j8032
471d2328N5875k8984j0685N8142k9700k2169N7820k7731m2919N5999j114m1400
483a9194L9053p604m7440M4518L767n8180M0565K8756n4716K1666L0490m3148
495b1467K3828L7239n1108J1186M6404m8767j4013M1283m0831j2685M5528l8296
$$ plain form
410 37745 -12953 -50823 26943 19022 -25243 17676 1079 -33214 32974 25471 -33091 21370
422 21370 37617 -27866 -4889 4557 -44508 2763 34188 -32152 -7141 44730 -13930 -19576
434 -19576 20928 -17484 -6311 39285 -18420 -26407 40782 3044 -30017 25524 4932 -26531
446 -26531 21405 -4666 -43018 22495 23323 -29350 12891 19471 -26848 11369 13525 -41872 6603
459 6603 38805 -27246 -12316 31351 -12679 -827 33955 -16697 -6419 37537 -24296 -42328
471 -42328 13547 -15437 -26122 32020 2320 -19849 37971 10240 -32679 23320 22206 -19194
483 -19194 19859 12255 -35185 9333 13100 -45080 -4515 24241 -30475 -8809 21681 -21467
495 -21467 2361 39600 -11508 -322 46082 -2685 -16698 24585 -16246 -28931 16597 -21699
507b1699k1449O1786j2633k7730N1577o880l5090L6750j8522m7714N0771J2592
519B1759m7650L7527J9459n3236J9289J5288m9027K4647L9751m4054J2274L8828
531C4855m5149l078L8763m3249m963N4399l5236k1694N2807k0689k9592M4232
543B1406j5327k9071M5690j3249m2155M5194N77m9574L3211J1051m6014L8155
555a06L1975m0191K6641L2374n2422j888J9866m7915P575M0974l7604Q82M9968
568C0129l7869k1589M5109k3033j7680N3129j0718k3833M5008j3576m3622L1958
580A3413q645m4368L4730O597m3111L7645K1270m1642K7575K9098m1579J3509
592D492K9672m1553P987L4078m6591r286L4861l7402j1117M8229j9211j0750M8584
$$ plain form
507 -21699 -43148 18638 6005 -21725 29852 22972 -12118 24632 6110 -41604 9167 21759
519 21759 -25891 11636 31095 -22141 -2852 12436 -36591 -11944 27807 -16247 -3973 34855
531 34855 -10294 -13372 25391 -17858 -22821 31578 -3658 -25352 27455 6766 -22826 21406
543 21406 6079 -22992 22698 9449 -32706 12488 13065 -36509 -3298 7753 -38261 -106
555 -106 31869 -8322 18319 50693 -1729 -3617 16249 -31666 -24091 16883 -20721 -19839 30129
568 30129 -7740 -29329 15780 -7253 -24933 28196 17478 -6355 38653 25077 -18545 13413
580 13413 4768 -39600 -4870 1727 -41384 -3739 17531 -24111 3464 32562 -9017 4492
592 4492 34164 -7389 598 34676 -11915 -21201 13660 -23742 -34859 13370 -5841 -16591 31993
605C1993k1842k9951L9158j5427l0956M4039j080l5989L9430o28m7886K6481J2566
618I908m0866K8102K4672l8852K1083K6622m3620R942K9212m3007j559L6155l5944
631a8152m968M6534k4324j2374M2553k2243k4708L9453j6643k9178L9114j0001
643E063l6250L6515J265l7362L5525J4220l6586K7094J6967m1170J6713K1832
655B3826m1261J2829K9013m0431L156L2124l9771l930M1964k5510r194M3142k1701
668D256j7562L9867j7700k4615L9147j4537l6288L3565n548l7358L5932J1771
680A0930l3553L1340J6805l8166K0269J8390m1721J4063K3925m0712O269L2685
692B0524l6391o14L7785k9161j0726L6531k4257j1957M0627j6524j8156L9332
$$ plain form
605 31993 10151 -19800 19358 3931 -27025 17014 15934 -20055 19375 18747 -29139 -2658 9908
618 9908 -30958 -2856 21816 -17036 4047 30669 -12951 -3009 26203 -16804 -18363 17792 -18152
631 -18152 -23120 23414 -910 -13284 29269 7026 -17682 21771 5128 -24050 15064 5063
643 5063 -31187 5328 6593 -30769 4756 18976 -17610 9484 26451 -14719 1994 23826
655 23826 -17435 -4606 24407 -16024 -12868 19256 -20515 -24445 17519 -7991 -17185 25957 4256
668 4256 -13306 26561 8861 -15754 23393 8856 -27432 6133 585 -36773 -841 10930
680 10930 -22623 8717 25522 -12644 7625 26015 -15706 -1643 22282 -18430 -12161 20524
692 20524 -15867 -16481 21304 -7857 -18583 17948 -6309 -18266 22361 5837 -12319 27013
704B7013j5191l3378L1803p323l4108L6930O464l5581K7799J3643l7189K0959
716A841J6862l4117J8371K2178m0090Q469K7112l7416J251L3610k8516l726L8602
729B4431k6022j3616L6088k0912j9570L5952j4815k4220L7508p628k7802L5397
741A4791j41l6689K6660P275l5239K5088J6381l3306J9969J8679m0500Q895K5930
754A7793l4693M389L2626k8759j210L4265k9306j0621L5443k0852j5564L4432
766A7943j5597k3115L5837j0484k8386L4114O76l0260K7497M937l2085K5888R665
779A6630l4970K0527J6401l7523J2985K5121l2423P774K7220l1664j655L0466
791A8889k7407p313L4335k0772j0271L2806k0951j8799L5344j1446k6240L3936
$$ plain form
704 27013 11822 -21556 10247 2924 -31184 5746 12210 -23371 4428 18071 -19118 1841
716 1841 18703 -15414 2957 25135 -14955 -6486 20626 -16790 -15539 18071 -10445 -14171 24431
729 24431 -1591 -15207 20881 -31 -19601 16351 1536 -22684 14824 7196 -20606 14791
741 14791 14650 -22039 4621 11896 -23343 1745 18126 -15180 4789 23468 -17032 -8137 17793
754 17793 -16900 -12511 20115 -8644 -9854 24411 -4895 -15516 19927 -925 -16489 17943
766 17943 2346 -20769 15068 4584 -23802 10312 10988 -19272 8225 13162 -18923 6965 16630
779 16630 -18340 2187 18588 -18935 -5950 19171 -13252 -5478 21742 -9922 -11577 18889
791 18889 -8518 -15831 18504 -2268 -12539 20267 -684 -19483 15861 4415 -21825 12111
803A2111j816k8496K7851P47l0652K6960Q388l2606J9621J4349l4362J5923J9983
816A8001l4526J2631K6993l3960k39L0194k6630m449L1122k3203r557L1877k0825
829b571j6305L4554j2518k1831L1073n676k6217K9533j269l0199K8165P360l1496
842a7397K0990J1993l1887J7349J6208l2850J1835K4576l2499J738K5667k4835
854i112p97K8665k5721p395L2791j9930j4818L2381j1906j8263K9976j0447k4552
867a9128L0213k824k8214K5222N318k7849K1957P184l1622K1313J5575l2291J2529
880b617K2650k9776M931K1467k7402K657K6322k5914o118L0310k0724j1118L1237
893A5905j6181j4638L1096j3078k3288L1546j363k6074K4761R51k5132K2331M400
$$ plain form
803 12111 10295 -18201 9650 10397 -20255 6705 15093 -17513 2108 16457 -17905 -1982 18001
816 18001 -16525 -3894 23099 -10861 -11100 19094 -7536 -11985 19137 -4066 -13623 18254 -2571
829 -2571 -18876 15678 3160 -18671 12402 6726 -19491 10042 8773 -21426 6739 14099 -17397
842 -17397 3593 15586 -16301 1048 17256 -15594 -3759 20817 -11682 -9944 15723 -9112
854 -9112 -9909 18756 -6965 -14360 18431 -1499 -16317 16064 4158 -14105 15871 5424 -19128
867 -19128 11085 8261 -19953 5269 10587 -17262 4695 11879 -19743 1570 17145 -15146 -2617
880 -2617 20033 -9743 -4812 16655 -10747 -8090 18232 -7682 -13800 16510 -4214 -15332 15905
893 15905 -276 -14914 16182 3104 -20184 11362 9999 -16075 8686 9637 -15495 6836 11236
906A1236l0351K1682J3266l0720J2261J7794k8787R625K0997k8179L510K7537
918A9871k4774m555K6413k1680p424K7289j7965j2452L1095j3245k0514K7508
930I567m409k1280K5663k336k4099K6542L651k9525K0213J0973k9126J3488J2960
943A2282k8626J2244K0622k9085M503K5300k2185k025K3939k2405m399K7830k1516
956c521j2551L0053j2268j8427K6184o756j8114K7001m297k3884K5636K658k5774
969a4060J9239Q451k7256J6185J0215l0397J2331J9120k6705N296K1386k2081
981h276L587K2204k2820j622K6786k0736j1521K5993j3671j5286K4263j0521j6630
994a8250K7827l469k2600K5056K131k2724J9741L409k6562K0285R658k8906J2168
$$ plain form
906 11236 -19115 2567 15833 -14887 -2626 15168 -13619 -3994 17003 -11176 -7666 19871
918 19871 -4903 -9458 16955 -4725 -12149 15140 -2825 -15277 15818 2573 -17941 9567
930 9567 5158 -16122 9541 7205 -16894 9648 13299 -16226 3987 14960 -14166 -678 12282
943 12282 -16344 -4100 16522 -12563 -8060 17240 -4945 -6970 16969 -5436 -9835 17995 -3521
956 -3521 -16072 13981 1713 -16714 9470 2714 -15400 11601 7304 -16580 9056 11714 -14060
969 -14060 5179 13630 -13626 2559 12774 -17623 -5292 13828 -12877 -7581 13805 -8276
981 -8276 -4689 17515 -5305 -6927 19859 -877 -12398 13595 -76 -15362 8901 -1620 -18250
994 -18250 9577 6108 -16492 8564 10695 -12029 7712 11121 -15441 4844 14502 -14404 -2236
1007b236J6457k4435N717J6926k3803M619K1830k3057r43K5913j8380r110K4114
1020A3612j5656j1212K5555j1652j5444K6226m260j9999K1475j058k1712K1451
1032G326J474k5781J9155Q668k7032J2660J3540k1919J0955J5524k2359O347K0172
1045A8730k1864k188K1087k0875n532K1230j6698r254K6018j2090j4913K4234
1057G885n333j3536K2397k927j7511K2402J5k4212J5839M641k4960J1225R857
1070E782k3057J1217J6377k3318Q566J9847k0134L047J9732k0099k208K1505k0691
1083c434q977K3266j3593j2887K1470q454j1936K3686m799j6907K2053J354k0867
1096a0025J7367K974k1528J4935O375k4395J1625J3517k2448O519J6362j9805
$$ plain form
1007 -2236 14221 -10214 -4497 12429 -11374 -6755 15075 -7982 -8925 16988 -1392 -10502 13612
1020 13612 -2044 -13256 12299 647 -14797 11429 7169 -12830 8645 7587 -14125 7326
1032 7326 8800 -16981 2174 10842 -16190 -3530 10010 -11909 -954 14570 -7789 -1442 18730
1045 18730 -3134 -5322 15765 -5110 -10642 10588 -6110 -15364 10654 -1436 -16349 7885
1057 7885 2552 -10984 11413 8486 -9025 13377 13392 -10820 5019 9660 -15300 -4075 5782
1070 5782 -17275 -6058 10319 -12999 -4433 15414 -4720 -1673 18059 -2040 -4248 17257 -3434
1083 -3434 -12411 10855 -2738 -15625 5845 -2609 -14545 9141 4342 -12565 9488 10842 -10025
1096 -10025 7342 10316 -11212 3723 10098 -14297 -2672 10845 -11603 -5084 11278 -8527
1108h527M777J8680k0909l75K0560j6743p744K1855j2975r297K1704j0603j1662
1121a1259K2092n604j7715K0811k203j8158J6740K321k1387J6446N810k1695J2548
1134a253J2385k0608R966J2124k0115O705J6402k0600r18J9729j9837m577J8292
1147G695j3876o221K1467j0691j0186K2891n978j3143J9509m043j7146J7895j087
1160G086k0095J5399M077k0190J1443Q948j8719J0805J2489j9546P731J5832j9870
1173d610J755J6670j7746l690J7827j5791n568J9618j1896q455K0208p759j0485
1186i922K0337n535j4446J9102j462j8832J4443M205k0218J1987P052j8110J0493
1199i06J0625j9673Q128J3028j7678M235J4391j7697n96J7980j5427m653J7692
$$ plain form
1108 -8527 -3750 14930 -5979 -6354 14206 -2537 -10281 11574 -1401 -10698 11006 403 -11259
1121 -11259 10833 5229 -12486 8325 6122 -12036 4704 7025 -14362 2084 7894 -13801 -1253
1134 -1253 11132 -9476 490 12614 -7501 -796 15606 -4994 -5912 13817 -6020 -10597 7695
1147 7695 -6181 -12402 9065 -1626 -11812 11079 5101 -8042 11467 7424 -9722 8173 7086
1160 7086 -13009 2390 6467 -13723 -2280 6668 -12051 -1246 11243 -8303 -572 15260 -4610
1173 -4610 -2855 13815 -3931 -7621 10206 -5585 -11153 8465 -3431 -11886 8322 563 -9922
1186 -9922 10415 4880 -9566 9536 8074 -10758 3685 7890 -12328 -341 6711 -11399 -906
1199 -906 9719 -9954 -1826 11202 -6476 -2241 12150 -5547 -6143 11837 -3590 -8243 9449
1212I449j1792p724J8821q732r843J8083n304j3061J7809k640j6323J6146R97
1225E886j6346J3563N213j8980J1503R883j9040P619J1218j8184M849J3133j6786
1238f469N78J6379j5033l137J6619j1693m959J7269r406q683J8750o842j2065
1251h692J6651m845j3119J4820l04j4810J2027L999j6095J1305P265j6128Q471
1264E45R729j7457O110J2148j6632J126J4242j4583k190J5542j3074k096J5654
1277I064r911o848J6751p415r990J6923n051j2957J5839j034j5366J3192K174
1290E371j5207J0796M775j4532Q849Q437j5895O302J0779j5809K747J3169j4454
1303d672l37J4261j2780l718J6048j0311o115J5309q394o483J4838o042j0725
$$ plain form
1212 9449 -2343 -10067 8754 22 -9821 8262 2958 -10103 7706 5066 -11257 4889 5886
1225 5886 -10460 3103 8316 -10664 839 10722 -8318 -699 10519 -7665 -2816 10317 -6469
1238 -6469 -5891 10488 -4545 -7682 8937 -2756 -7715 9554 148 -8535 10215 3373 -8692
1251 -8692 7959 3114 -10005 4815 4511 -10299 1728 5727 -10368 937 8202 -7926 545
1264 545 10274 -7183 -1073 11075 -5557 -4431 9811 -4772 -6962 8580 -4494 -6590 9064
1277 9064 -847 -7695 9056 1641 -8349 8574 3523 -9434 6405 5371 -9995 3197 5371
1290 5371 -9836 960 5735 -8797 52 8489 -7406 -1104 9675 -6134 -3387 9782 -4672
1303 -4672 -5009 9252 -3528 -7246 8802 -1509 -7624 7685 -709 -7192 7646 1604 -9121
1316i121J4512j151j3259J3284Q99j3032J0545L374j4424R109P106j5233O752
1329f39Q761j3605L139J0656j3102M97J3431j2672k070J4075j0330m255J3868
1342G754q140p680J5798o036r441J3023k617j0763J2645n17j2533J2602R46j2816
1356g775Q939N698j3741O967P947j4765M427J0969j4216J801J1838j1734j069
1369d714J2472r748l479J3212r542n335J4627o349q370J2680k966r570J1188j71
1383C935j1955J1858R86j2493R364L492j1614Q185M522j2866N627Q567j2861K549
1397b704J0422j1834j82J0335r702j380J2037p356n768J2810n979o227J1552m847
1411A177q001J1954k192j0967J1243J058j1731R871K387j2128Q394N501j3172
$$ plain form
1316 -9121 5391 4240 -9019 4265 5164 -7868 2677 6051 -8373 736 7842 -7391 -639
1329 -639 8122 -5483 -2344 8312 -4790 -4293 9138 -3534 -5604 8471 -1859 -6114 7754
1342 7754 -386 -8066 7732 1696 -7745 5278 2661 -8102 4543 4026 -8507 4095 5041 -7775
1356 -7775 1164 6862 -6879 88 8035 -6730 -2303 8666 -5550 -3749 8089 -3645 -4714
1369 -4714 7758 -1990 -5469 7743 -1799 -7134 7493 1144 -7226 5454 2488 -7082 4106 3935
1383 3935 -8020 3838 4824 -7669 1695 5187 -6427 1758 6280 -6586 -959 7608 -5253 -2704
1397 -2704 7718 -4116 -4298 6037 -3665 -5045 6992 -364 -6132 6678 699 -5528 6024 1177
1411 1177 -6824 5130 2938 -8029 3214 4272 -7459 2412 4799 -7329 1065 6566 -6606
1424f606N741Q218j1413K235P724r728R49R209j0522r78J2443q554l994J0875
1438E599p045l867J1540n383p335J1813j816r889Q735O60r493R214J340j1063
1452f990R319L961j2118M771O814j0808L722O888j1088K967R656r950j604J0525
1466F065p059k342Q609o806l519J1883n531q003J1346k905p669R095k381p530
1480f747R745J329j0968P814M905j0219M900L694q288M706N952j2651K194R714
1494F080r215r36Q769p520o14J0251r047k759J1315n011o244R466l800n044R420
1509E111m015q355J0098J048j0288O165L375p738O480K443j0226N473P289j1007
1523d147J086P749o688M57O170q665J232R565q585l699J0065k891m390P361n824
$$ plain form
1424 -6606 -865 7353 -4060 -1825 5899 -3829 -2880 6329 -4193 -5171 7272 -1282 -5276 5599
1438 5599 -1446 -5313 6227 844 -6491 5322 3506 -6383 2352 3012 -6481 2733 4073 -6990
1452 -6990 2329 6290 -5828 -1057 5757 -5051 -1329 5559 -5529 -2562 7094 -2856 -4460 6065
1466 6065 -994 -3336 5273 -1533 -5052 6831 1300 -6703 4643 1738 -5931 3164 783 -6747
1480 -6747 2998 4327 -6641 1173 6078 -4141 759 4453 -3835 871 6823 -5828 -3634 6080
1494 6080 -3135 -4071 4698 -2822 -3436 6815 -2232 -4991 6324 1313 -4931 4535 735 -4309 5111
1509 5111 1096 -7259 2839 3887 -6401 -236 3139 -4599 1881 4324 -5902 -429 6860 -4147
1523 -4147 -3061 4688 -2000 -1543 4627 -4038 -2806 6759 -1826 -5525 4540 1649 -2741 4620 -1204
1538a204l873R825l401q023Q800K649q242N458R31q244Q154J946j1126N490O234
1553E374p521K53M758o471J854O727r733k53J0409n324l008P352m226j991P420
1568E620o365n930R948p99p308N811P42n554O692j648p754Q242M116r151L136
1583b02M664p195L867J982q644K732R031r358j448P962l158k183O044p057k15
1598c178J0181n918p086Q455L20n835N324l143m207Q344k69r376O731M579o002
1613a080K076J082o130N495L611j0092K587P545o060j007M125n008J966O292p977
1628b575k450R656j468o572N432k366j403O113m905o567R689J767p654L402K344
1643B443m528M741j155p706O275N341p721o67N606l546N53K393o517K487Q283
$$ plain form
1538 -1204 -5077 4748 1347 -6676 2124 4773 -3469 1989 2920 -5324 2830 4776 -6350 -860 5374
1553 5374 -2147 -1894 2864 -3607 -1753 4974 -4759 -5012 5397 73 -2935 4417 191 -1800 5620
1568 5620 -745 -6675 3273 2474 -4834 977 1719 -3835 2857 1209 -6545 1697 5813 -3338 -202
1583 -202 4462 -2733 1134 3116 -5528 -2796 6235 -3123 -4571 3391 233 -1950 4094 -2963 -3178
1598 -3178 7003 1085 -6001 2454 2774 -3061 2263 -880 -5087 3257 2988 -6388 343 4922 -1080
1613 -1080 996 2078 -4052 1443 5054 -5038 -2451 5094 -966 -1973 2152 -2856 -890 5402 -2575
1628 -2575 -5025 4631 3163 -3409 2023 -343 -1746 4367 -538 -7105 2584 4351 -3303 99 2443
1643 2443 -2085 2656 1501 -6205 70 5411 -2310 -2977 2629 -917 -364 2029 -4488 -2001 6282
1658F282o654m237P813j370l182L774m769j450Q550l548o938O353K715m315J952
1673I76q82m396P267Q15p882L189N963n793P0J268m832M180M923p917n51Q756
1689E154l037l292K463l024J130N065n292m056Q006m93o096K955N54j891N075
1704C221k439o664Q185L145p815J102L499l886L542q05o267M144O626o439k709
1719c560N148j407j173L054n465Q15Q244m419n741N530M5k368K223j713k966P667
1735C914r21p721M319L144l175P53p35l355N840J339p895J966O811m159j716J696
1751A05l727L343N691p153j583P366j874m831K517j138J7M520l703m462P309J846
1767D243o407K053N64j173L751j650o114M980L798n996q26L574k272K931J53n793
$$ plain form
1658 6282 -372 -4609 3204 1834 -1348 2426 -2343 -3793 4757 1209 -5729 624 3339 -976 976
1673 976 94 -4302 2965 3780 -4102 -913 5050 -743 -673 595 -4237 -57 4866 -3051 -3602 5154
1689 5154 2117 -1175 1288 -1736 -606 4459 -833 -4889 3117 2624 -3472 -517 37 -1854 3221
1704 3221 782 -5882 2303 5448 -2367 -1265 2234 -1652 1890 1085 -5182 -1038 5588 -851 -3560
1719 -3560 1588 181 -992 2062 -3403 -2588 5656 1237 -4504 1026 1071 -1297 926 -787 -3753 3914
1735 3914 2993 -4728 -409 2735 -440 313 -422 -3777 2063 3402 -4493 -2527 4284 125 -1591 105
1751 105 -3622 -279 5412 -1741 -3324 4042 2168 -2663 -146 -1284 -1267 3253 -450 -4912 2397 4243
1767 4243 -2164 -111 453 -720 3031 1381 -4733 247 4045 -1951 -2777 797 -1475 1456 1609 -4184
1783d184K311P217m808l931M691q25L47Q02m691n47Q008k338n919L643J494j992
1799g22R86q65k464N996J5p493L147M268l113j88K85k119L909K370p407J31O992
1816C728k563k458J614j931J295M245m873l307P116m10m118J420k03j022N081
1831C614l799l973N444J546m731L88J890q32K255k70n021L167M087n205j245L785
1847A100j130N16Q45m404J281N755l729l577M636k66n51Q49k971j054N486o05
1863B181n041K417K762k517N35n21k947N441O64o122J740L931k112j028J569k423
1879a471K539J873m916q20M966j129j945J777k135L02L624l477k751M700J039
1894B176k719m67J230j140K942n49m369K841L393m382k33J225o13K389k88m743
$$ plain form
1783 -4184 -1873 5344 536 -3395 1296 471 818 1620 -3071 -3618 4390 2052 -3867 -224 1270 -722
1799 -722 264 -601 -3065 2931 2946 -4547 -1400 2868 -245 -433 -148 -2267 1642 4012 -3395 -3264 3728
1816 3728 1165 -1293 321 -1610 -315 3930 -943 -4250 2866 2456 -1662 -242 -445 -1467 3614
1831 3614 -185 -4158 1286 2832 -1899 -1511 379 -453 1802 1532 -3489 -322 3765 -1440 -2685 1100
1847 1100 -30 486 1331 -3073 -1792 3963 234 -3343 1293 1027 476 1325 -1646 -2700 2786 2181
1863 2181 -2860 -443 2319 -198 337 -184 -3131 2310 2974 -3148 -1408 2523 411 -617 952 -1471
1879 -1471 1068 2941 -1975 -2795 2171 1042 -903 874 -1261 -959 2665 -812 -3563 1137 2176
1894 2176 -543 -1010 220 -920 2022 1473 -2896 -55 3338 -1044 -1277 -52 -665 1724 1436 -3307
1910c307J753M576l432j294K582m63N25N2k886L33M358k018l503K891J531j911
1926b13J540j462k211M426m12m964K873K672k619P99l98k680L496J166l925N03
1942a409L433j818q46J056j319Q39K479l604j457M436r60j468N84o14j1K415j926
1959a90l150M850K35l020R51O96j202K055m15l630K365L421l857K4J322j098J127
1976D84O85l395J210M157l282j821K750n83r69J813k847l88M154j668k567K659
1992C92J069j929J044p26j925L333K89l609J576K288j776M06o9k308K585J410
2008B050l544N8L210j539j178J812j993P11J858k044r77K555j75k310J965j36
2024C23r43K059j011j807J807J555k633J0L72n90J226N34k535J798K202k994q69
$$ plain form
1910 -3307 -1554 3022 -410 -1704 878 415 940 992 -1894 -1561 2797 779 -2724 167 1698 -213
1926 -213 1327 -135 -2346 2080 1668 -3296 -423 2249 -370 429 31 -2649 847 2013 -1912 -1409
1942 -1409 2024 206 -640 416 -903 -64 2415 -1189 -2646 1790 830 -638 -54 -668 -679 1736 -190
1959 -190 -3340 1510 1745 -1275 -324 372 -830 1225 810 -2820 -455 2966 -891 -867 455 -643 484
1976 484 1169 -2226 -1016 3141 -141 -1962 788 205 -764 1049 -1798 -2186 1968 300 -2267 392
1992 392 1461 -468 576 -150 -2075 1258 1547 -2062 -486 1802 26 432 363 -1945 640 2050
2008 2050 -1494 -1436 1774 235 -943 869 -1124 -413 1445 -599 -1576 979 804 -1506 459 323
2024 323 -620 1439 428 -1379 428 1983 -650 -640 -268 -858 368 902 -1633 165 2367 -627 -1496
2041a496J886J09n68J083j819K57K240j380j857K168l43l03J081j256o13J659
2057H48K17k845J716M37j184J498l75k144K414K24k412J212R35o22M08N54j509
2074f28Q28J492k061o70J692j77q10P72j196J67J941j968r43J764N20j470J189
2091D42j58j229J993k48k283O18J253j260Q31L69j45Q24j79j858J157J584k454
2108g43n9J551n00q16J097j360O26J445j316q37J498J91l66k01q98n58K639j065
2126C28j427N20J621j070O85j11j239Q67M86j070OR37p33O4P41j613M89J695j774
2145e98Q6R11N82j279R86j006k06L14M12o92J085M23j568M60K68l64L48J14j65
2164A11qj89p42N39O53o49M4j23p43O06R24n56p32J085J69q00M25p34L42J456
$$ plain form
2041 -1496 390 499 -69 1014 -805 -548 1692 312 -1545 623 280 -23 1058 -198 -811 848
2057 848 1065 -1780 -64 373 -811 687 312 -1832 582 806 -1606 -394 541 -81 327 881 -628
2074 -628 200 1692 -369 -1039 653 476 -334 438 -758 -591 1350 -618 -1561 203 723 -747 442
2091 442 284 -945 1048 800 -1483 -865 388 -872 -41 328 183 1007 828 -1030 127 1711 -743
2108 -743 -802 749 249 -567 530 -830 -204 1241 -75 -912 586 777 411 210 -688 -1246 1393 328
2126 328 -1099 -579 1042 -28 657 546 -693 174 660 -410 -404 533 -200 -136 605 -1008 -519 1176 -598
2145 -598 -512 399 981 -298 688 -318 -524 -210 202 -490 595 1018 -550 -90 178 -186 162 276 111
2164 111 103 -86 -828 -289 364 -285 -241 -364 -1107 -501 423 -133 -865 220 389 -411 14 -720 -378 1078
2184A078o37q54K47R2m91J178o17k74Q24l83p56J170m56k75j3P9p10J304J18j205
2204e81M39P0M70j369J739r62M1R16j024J86O94o8N5j81l27p81J022j02K74m73
2224C8N10j502J069L19j669J866l49n32j22O80j072J074k45j39m3P57p90P40j29
2243D61l30n20N3M05O8jM8K07n48mK92l47k33R1P01k25p16J411k83q70Q45n34
2265b9Nmk40O18l82O85j3r60K77k67O0k57J24M95J72o41M54j5K47p76O90l21m19
2288d97N49j71q70J666o99o45M28N35m66L94L3q53O40K32m81l8l43N01K31L5m64
2309b83r0K12K6n33J435r47K67l59n63R08O13j001k30M99o7nL07k23m50O49K95
2330D60m23P80q68m17L74L47n53P61n21K5J73L24q03Q64k52l45O00n90n01O87
$$ plain form
2184 1078 441 -413 -166 -74 -565 613 -4 -278 546 163 -593 577 121 -154 -167 -88 -798 506 624 -581
2204 -581 -142 -72 398 -971 768 -194 -153 763 -261 -75 619 551 606 425 98 -683 339 237 511 38
2224 38 548 -954 115 434 -1235 631 282 -250 -372 308 -764 310 65 -74 -117 640 -150 590 461
2243 461 131 -389 -336 69 137 136 184 391 -157 -161 131 -216 -449 -358 343 118 -598 813 530 -340 505 -29
2265 -29 -24 -28 -268 350 -32 653 640 -320 -43 -310 -250 -507 -383 112 284 -357 97 82 329 -447 243 -78 -497
2288 -497 52 -119 -989 677 -22 -667 -239 296 -170 224 257 -596 44 276 -205 -243 -586 -85 146 181 -283
2309 -283 -373 -161 -135 -668 767 -180 87 -272 -835 73 686 -315 -545 -46 -113 -118 189 -34 -484 165 460
2330 460 37 817 -51 -468 -94 253 -300 461 -60 -35 138 462 -341 523 271 -74 526 -64 -565 122
2350A22m06L71l84K25p4N1R94o05n95J223r96j75Q38l81k86K19m06M3Q7j15k10
2371d60J228o35j402J697j18p92P59k98J49j63m40K66J76R39j697J079l07J94
2389A75k68J00m09k59O36O26j278P02J4rJ08M20r10R24q74j8N28M82n63R6L48
2410E71j024O43l05k45K31Q19j490J116J0o43J4R36p43p4J014j110L37j19q9J99
2430D8K94j14k37K69n56L22K51q9k81P99m81k6J50m11P74j14K00p65L6M93r33
2451c71L97M33n53J93l1k4n30O35j85k99K94l33K77K13k09n99J242j036L9N10
2471F3q30K36J89K98l74O36K34n98O57j95q76K02O39p12P79N4q44M76J459k097
2491f04L52J006j795Q92P38j207M28L34n91J13P77o47k34M78k93l55N23M32n80
$$ plain form
2350 122 -284 87 -297 -72 -146 -95 899 294 -301 922 -74 -249 589 208 -78 141 -265 -222 -135 -250 -460
2371 -460 768 133 -1269 428 310 -482 277 -21 128 -35 -475 -209 -33 906 -791 288 -19 175
2389 175 -93 7 -402 -661 -25 601 -677 25 39 30 138 558 -352 572 -302 -320 208 690 127 223 571
2410 571 -453 190 -115 -360 -129 690 -800 316 326 -317 -303 633 -110 -184 830 -280 57 -62 -151 48
2430 48 342 228 -9 260 -296 26 277 188 -93 706 225 199 349 -62 712 598 798 33 69 562 -371
2451 -371 26 459 -94 99 68 44 -486 149 -36 -335 -41 -374 -97 116 -93 -692 550 -486 -447 63
2471 63 -767 -531 -342 -44 -418 218 452 -146 511 316 -560 -358 281 -431 348 402 -442 34 1493 -604
2491 -604 -252 754 -1041 -149 589 -618 -190 144 -447 -334 443 -204 -438 40 -253 -608 -85 347 -233
2510b33O82j26l80jO5r65J232J38j047M69K46m78J21Q90j487Q46J34q21r5J358
2530E48j078L3R48m82j42M58l97k25O70k42n17L16J30N56R8q64K93o6R1m40K67
2551d5q0j037Q40P17j088J5J560p83J32K04l82n30R54j286N76K99M28p37R23p61
2571h1n25J259p32O6j82j95k55N33J81k52N50R24j313l93M95r60K55J858j664
2590d31R73O13j664j66J297q34l85J022j427Q41R08j180J88K84K18o41P36P7j093
2609f64J234j059K49J84N80j010K86O07q31R48r03j13P8Q40j463O66Q04j41p63
2628d71P89Pq83J186r91l29J461j245j54J436o17k80M71L61q93j58K41l19J075
2647F87m69m33L43k19q22L79M01k97M23P20r89J29R15j049L0N74m13j203J941
$$ plain form
2510 -233 449 323 -57 -58 7 -958 274 412 -635 -166 80 -398 -277 613 -874 -28 106 -715 -810 548
2530 548 -530 -497 451 -31 -173 285 -112 -337 333 91 -426 -110 20 576 674 -190 103 37 128 -312 -45
2551 -45 -125 -1162 -322 395 -693 -678 882 99 231 435 53 -477 477 -809 -233 66 494 -243 680 -81
2571 -81 -606 653 -79 -13 -195 -390 -645 -112 69 -183 367 1291 -22 -415 80 -880 -625 1233 -431
2590 -431 542 1155 -509 -675 622 -212 -597 425 -1002 -161 747 -433 -245 39 257 -384 352 429 -664
2609 -664 570 -489 -240 -56 524 -486 -200 407 -424 524 -379 -492 -414 426 -1037 -371 433 292 -471
2628 -471 318 325 -558 628 -363 -692 769 -476 -630 806 189 -91 380 741 -152 -310 -69 -388 687
2647 687 218 -215 128 -91 -913 -534 -133 -430 -7 713 -276 -147 768 -281 -251 323 -90 -1293 648
2666F48j021k27J292p54p48J241k05j7J251q03j313O47p11M35O90J47q39L47k53
2685a93l14j2L39k94m49K146j900K45J176r98K62K67k15j71L80J8j849J602K55
2704B95j511J883j75j382P52O22o47k26Q90j27n50P79m36q8J274j235n05J380
2722I93j965K63J029M7j392K170j350J45K95J15r02P62n3j164J852n51m75N59
2740C78l86j210J572J74j350O80R90j673J246N17k327J250J300j176n08J469j158
2757b12l52L68l45n2J123q48n79J748q55p45J828o23j718J502J69j066N78O06
2775E27q58Q64K3k091J691P20j567L58J329j465J81J057q88P69L55r26n72J264
2793G71p73m68J202r67l34J151j37o82P06l47n28J175j26j682J437J40j319J255
$$ plain form
2666 648 -373 -600 692 -62 -810 431 226 209 1460 657 -656 -9 -720 -285 405 552 -287 60 -193
2685 -193 -507 -519 -180 -474 -923 1223 -677 -432 744 -254 8 275 60 -111 269 287 -1562 40 295
2704 295 -1216 667 492 -890 -138 484 -163 -389 501 374 -176 603 167 79 1353 118 -387 993
2722 993 -972 -709 320 367 -1025 1145 -205 -60 235 350 -552 210 157 -1007 845 294 -181 378
2740 378 -8 -1218 354 528 -822 -142 848 -825 421 938 -1389 -139 1161 -15 -523 946 -212
2757 -212 -564 -196 -541 -593 530 -318 -897 851 -4 -749 1079 456 -1262 240 409 -657 -79 527
2775 527 -331 533 556 -1535 156 876 -691 -333 996 -469 -288 769 -119 650 1005 79 -493 771
2793 771 -2 -470 732 -235 -569 582 445 -237 469 122 -406 769 643 -1039 398 538 -781 474
2811D74N27o86m15J698k562M37O87j112M13J014n58o04J992j044m72P18n62p59
2829h14J064L1j645J789o46r95J480J43j540J495l42k74O87O53j253j77J100j257
2847e01K80Q80j502K22P65n38j55J118p28n7J689j289q67J750j282j91Q44o56
2865b18m24J972j729r8J019n35p94J447k23o63K58K87l27k04J223j224j86P86
2883C67j678J381R01j431j56J057k05o71J204j244j27J627q89p13Q69J84o76Q4
2901a16L82j641J306N67j461J055P53j670J048L19j260N86P72o08J8R79j551L75
2919a47n3k11L76L19p59j96J416j030k78N31m88L4Q66o34jL05Q98j533N48N44
2939E07m49M02m92o4J59K57l63k34Q62q05O3J615j521m80P08p04M52J189o38j040
$$ plain form
2811 474 1001 315 -100 1598 -964 -527 160 -952 -539 475 -83 -687 1305 261 -211 507 -55 -814
2829 -814 250 281 -1364 425 -221 -1216 264 407 -1133 362 20 -254 433 1086 -167 -344 756 -501
2847 -501 -221 659 -843 -621 144 -394 -549 569 -159 -216 1473 184 -683 1067 -215 -406 438 -218
2865 -218 -642 1330 -399 -497 522 -13 -807 640 417 -246 12 299 -28 -232 991 -233 -419 367
2883 367 -1311 70 971 -460 -616 441 236 -435 769 -475 -602 1025 136 -577 292 476 -200 -116
2901 -116 266 -1375 -69 498 -963 92 845 -825 223 542 -718 -132 640 32 50 1029 -522 -147
2919 -147 -200 -411 -35 284 -475 -671 745 -285 -563 -32 -520 -486 380 -254 -255 50 948 -585 -37 507
2939 507 58 460 -32 -96 63 320 -43 -277 585 -220 -157 1458 -63 -543 165 -539 -87 1102 464 -576
2959e76R37r7j013O66M05j249K52P01k31N95O44j735K99Q58p40R84j61j264O36
2978h9J086r51P58N62k036P97L17o59n30J256q46j92J061k01j267J215n15L8J000
2997H04m6j453J424q64l99P08N59j748K108j162m88J22M53j16K27P70j162R4J488
3016A319k181P24Q87o44r34J335o62q24J156o42J5J076q3k029J845K65r98J192
3034H17r48k35N30K41j479R49N59j569J213R38j666P99Q36j493Q80K51j139M88
3052b8M14N7j190J999j740j23P08O43k162J613k45p58Q35N26j163R05k38p85J117
3071C85j47q90O51Q62j959J032L34q36M27J321j654j50J403j272j46J480n55j391
3089a105J632j201l64K624j283p21M48K35j351J351N0n29N07P63j938J24R38q23
$$ plain form
2959 -576 361 264 -749 -83 322 -927 -675 26 -205 390 1034 -701 -402 456 -284 700 539 -725 -89
2978 -89 997 46 804 1366 -670 127 444 -215 -745 511 -335 -527 534 333 -934 281 -234 -196 804
2997 804 758 -695 729 -135 -534 174 733 -1015 1093 -69 -557 -435 18 -98 129 899 -263 -169 1319
3016 1319 -862 -138 749 105 -829 506 -156 -980 176 -466 -451 625 542 -1487 358 623 -375 817
3034 817 -131 -366 164 405 -1074 -125 434 -1135 78 1016 -650 149 985 -508 372 623 -516 -28
3052 -28 386 443 -747 1252 -488 -611 97 740 -1422 191 -54 -812 23 549 -614 291 53 -732 385
3071 385 238 -652 -1 861 -1098 -66 268 -568 -141 1180 -474 -624 779 -493 -639 841 286 -1105
3089 -1105 527 -674 -1038 1586 303 -418 30 265 -1086 265 315 -214 293 1056 -882 -758 180 -643
3107f43M55M07p39L48K03r51P59J178j329k89J445j323N96l5J77p43P84P9j262
3126h83J279J76j354J376L59j763J085M56j276R14l13r88M69L44o11P16P69j567
3144h12R89M89p56l97P05M5O2J93j54j045J108l15j080K341n99j098J404k72j464
3163f56P02K48j512J654n38J20o26J813k207J129L98r14l25J597n61p04J271j205
3181c16L20O24q73L62L13j006k5O71m19l62J772q22q37Q98P6j065Q80L85j072
3200d96J055k48j452J362O81j931J599j95n34k87R49q31j60J342j127q5J487j459
3218c30j3J049j191j42L68R8l87R14m15j106J513L14q16j26L07j261J537J29j746
3237a304P10J159j445M81P53j114L26L78n65o5J537n48j06Q10j083r0P02j58p22
$$ plain form
3107 -643 -188 219 -520 -172 31 -920 -161 1017 -312 -601 844 -479 117 82 259 -484 300 379 -883
3126 -883 396 572 -782 594 953 -810 275 731 -545 369 56 -932 -463 -119 -730 -14 755 -812
3144 -812 177 666 -90 -487 218 263 325 518 364 -681 427 112 -968 1373 774 -324 1080 808 -656
3163 -656 46 294 -1218 436 -102 18 -608 1205 -1002 127 525 -389 -714 883 322 -382 889 -316
3181 -316 4 628 -245 117 430 -576 -601 70 -349 -711 1061 239 -598 300 376 -689 191 576 -496
3200 -496 559 311 -1141 221 902 -1029 570 375 -159 -446 503 -328 -488 854 -273 -358 1129 -330
3218 -330 -343 706 -485 -627 -259 -161 -548 366 -49 -1155 358 672 -144 -270 37 -1224 313 442 -1304
3237 -1304 -594 565 -880 -399 354 -760 -434 -56 -621 -686 851 303 197 1007 -76 -166 536 378 -344
3256c44Q09k67n31R20l30m62R55J78k035J548l22q09J160P6o76K96k95M9k51Q22
3276D91n71k28J011j085l57P59n76M38M08m46l71N47j54l71J464o61j175J449
3294E72l42j133J071J37p66L85j30o83R75m22j32N34P82j343R15k12m07k46J547
3313A102j296n68L40M59o14M19O48j282J127j91p60J029m9o87L23L93o99M87J62
3332C43j020J206Q90k082P84J77j466R80N97j041M61J074q03k34J171j287JM84
3350B35n86K42O89l52j321J295L37o03L80N39j176M91J4q51J95J651q85k59M59
3369D94p98J09O30j205N18J56K24n92Q63r7L18O32r13j161J761n20o50J323q43
3388B49r54J022n86q35J290J29r73J185K4j149J162j46l96O23l58j434J76J287
$$ plain form
3256 -344 465 198 -333 587 257 -205 750 928 -1107 441 119 -690 470 546 -130 166 -129 -80 -331 491
3276 491 -80 -308 703 -382 -739 20 -556 -118 290 -156 -527 20 -134 -505 959 298 -877 572
3294 572 230 -903 168 305 -461 -76 -206 -889 86 -336 -468 66 848 -495 420 208 -199 -445 1102
3313 1102 -194 -762 -422 37 -577 -158 490 -792 335 144 -616 413 364 -323 0 393 -306 181 343
3332 343 -677 529 1419 -663 121 298 -1168 -188 409 -632 -171 903 100 -134 1037 -250 -249 235
3350 235 -351 -109 580 228 -1093 202 539 -64 316 855 -321 170 184 -667 -472 1179 294 35 494
3369 494 -304 -195 435 -770 -252 -96 128 -464 399 302 620 1252 339 -822 939 419 -231 1092 249
3388 249 -705 317 -269 -1104 186 315 -658 527 551 -598 564 418 22 645 287 -1147 -971 316
3406C16n91J96N13j083P02N23o25l46N51J74K21k02m8q94J405k45j334Q58K97
3425C88m42Q40j106o90K313o97j287O17L58n49j40O02j197J063J016j416j98J748
3443A223j248J33O40q37j31R08q20j6J245q35j038J121o26L3P51m84k60R65l28
3462C96j191J182k33l93p2N02r22Q95P36j377M51l0J79m08J292j190P6J215j398
3481b90n54J284n88p20K005j354j013J408K12m66K03q6m94L41Q41j246J070K78
3499H31j541Q35Q28j247K43O21j299J198k33l35j39O48n34j89N47J13n48R69n78
3518A90j476K466r13j389J543l14r7P82m14j624J592N49j526K78Q37p20O91j297
3536h42N91k96J062m22j95o2J51l95J029m83k91J791j460q75J197J38r43M97q79
$$ plain form
3406 316 -275 -79 434 -649 53 576 -49 -395 156 330 551 349 301 -593 812 567 -767 91 388
3425 388 -54 786 -320 -1010 1303 606 -681 -64 294 -255 -395 207 -990 73 1089 -327 -525 1223
3443 1223 -25 108 748 -89 -220 688 -132 -148 1097 262 -776 345 -281 -248 503 19 -241 724 396
3462 396 -795 387 154 -239 -311 191 -731 164 900 -477 -26 -56 123 -285 1007 -183 -107 1108 -290
3481 -290 -844 440 -148 -868 1137 -217 -1230 178 390 -76 127 41 -453 -112 729 -517 553 831
3499 831 -710 125 953 -294 -51 570 -729 469 236 -99 -238 410 -124 -313 234 347 -201 768 190
3518 190 -1286 1180 267 -1122 421 107 10 792 378 -1246 346 895 -631 -353 484 -236 455 -842
3536 -842 -251 -547 515 93 -102 -164 -13 -408 621 138 -153 1638 178 -697 500 638 -305 192 -687
3555f87J52J184j16j598J041j58K91N29m52p33J362q34m37q51R98K93r45J255
3573B94j146R05L38r26J79P28J88j065R52n61L10Q07r92q88L99Q34o61M43m11
3592b73r94J800L04j590J073L80j301l57J696m78J12L76j562l76K039q98p16J215
3610D50m41k71R59q75p96J420m45q68R20p3J36K86l94q83J300q4j551J167ol19
3630c68P53m21n41R48k52n20l16J255j186J044N5q48N63O06j029m95J317o44l66
3649d45O74p88L98M38K53j502J740N0j719J103k37n37O53N65j005MR07p34l85
3668e67L79M79M7J13j050J18J257m96p58N75k08m32J540p29q55J063l55o28O72
3687A65L60q21O46J46r58P66L42j790O20J528n24m65k93l86M35Q95p68q59J312
$$ plain form
3555 -687 -535 649 533 -1065 -24 -182 109 638 186 -547 815 -19 -456 -1307 -309 -16 -961 294
3573 294 -852 53 391 -535 -356 372 560 -505 447 -114 196 1003 11 -877 -478 356 -305 138 -273
3592 -273 -1267 533 837 -753 320 700 -601 -958 738 260 372 748 -814 -1190 849 -49 -765 450
3610 450 9 -262 697 -178 -974 446 1 -867 53 -20 116 402 8 -875 425 341 -1210 -43 -49 -368
3630 -368 385 -36 -577 371 119 -401 -717 538 -648 396 451 -397 166 772 -257 -752 565 -79 -445
3649 -445 229 -559 -161 277 530 -972 768 818 -901 202 -35 -572 81 646 -359 -355 552 -182 -567
3668 -567 -188 291 338 451 -599 -481 776 280 -478 97 -111 -543 997 268 -587 476 121 -507 165
3687 165 525 -296 350 496 -462 304 646 -1144 -524 1004 480 15 -278 -664 -229 666 -102 -961 351
3706C51j035L84K94l69o95K561j839k11J142o06j07N22q58m80J529q83m1M74R68
3725A101j290O6M92J54K44kj416J43J299r92j03L96k63K73M87q11n09J763j35
3744H97q61k44L34m41O43q85J4J167o34q38N47L81m69M93K15k38J01O46j310K5
3764d57P02q21K05P91r87O01P91j167k55R72l5o23M80J05P0N30m07j028J083l37
3784B13m08n38Q47o17J087k78j333O74L49M7p38L56RN88j66K04j099J853j538
3803d88k50N29m40K89P52p62k98J165J6r12L17k62L55J147j443m26R85K72j435
3822h89J160L22j85m13L02q03J5J255j343J11J495j573j44J215n38p94O44m27
3840e90J04N2J167j109K62k89k01J356p9j145M44P92j033Q60n26n05L00M20m45
$$ plain form
3706 351 -684 -300 -6 -375 -1070 1491 -348 -559 583 -23 -130 392 -466 -946 583 -300 -341 133 1101
3725 1101 -189 -123 369 523 767 765 -651 -508 791 -201 -304 92 -171 102 589 -222 -731 1032 897
3744 897 36 -208 126 -315 328 -557 -543 624 -10 -848 -301 80 -389 104 319 81 182 828 -482 -457
3764 -457 245 -576 -371 420 -567 34 825 -342 -597 375 340 -283 197 302 372 902 495 -533 550 213
3784 213 -195 -733 114 -503 584 306 -1027 -353 -4 43 -695 -339 -330 258 92 296 -803 1050 -488
3803 -488 -738 -209 -649 -360 392 -370 -668 497 513 -399 -82 -344 11 1158 -285 -711 274 546 -889
3822 -889 271 593 408 -5 297 -506 -491 764 -579 -468 1027 -546 -690 525 -13 -807 -163 -590
3840 -590 -486 -434 733 -376 -114 -403 -604 752 673 -472 -28 764 -269 591 65 -440 -140 280 -165
3859a65R19l46j124J107k63j39q2M09n41n2R02n91p72N97N60n54J053j573k33
3878h88J647m59k29k33O62j041P77n14m7p7J392j333n6L79j26J65M10p78P23O00
3898I74j389k25J227l19p42L38n59N13Q26o36q34J449M26j243k8J62K86K81l17
3917A90j193O84J036n08n08Q3n73P86J57j105P51m41P56o40Q38L3j077J083m36
3936h4r7P28o33r01J092N42j367J382r7j111Q03L3r79R07o51K34Q84j077j83P82
3956B07K95r52J57P55p25j15M24R3m32J112j030J46L18l63k49O81n28K6M91J79
3976D90o67M23J14m44O66n57K81j47J95j285J019O17q85J71J040j491R95j5p56
3995b36K63O71r01k21K57m07O37Q58p32m97J348q70j304J670q7q01J19O54n54
$$ plain form
3859 -165 754 408 -716 391 128 -11 -93 316 -225 -277 625 34 -738 -141 419 -135 918 -655 -888
3878 -888 759 300 71 -162 500 -541 236 -278 -325 -402 990 -343 -399 -20 -146 19 429 -349 374 974
3898 974 -415 -640 587 268 -474 -136 -695 -182 644 8 -826 623 1049 -194 -222 -60 226 507 190
3917 190 -1003 -319 717 209 -299 -216 -789 -3 154 -951 -200 -641 115 -525 313 346 -731 352 -84
3936 -84 -181 547 -86 -987 105 647 -720 662 565 -546 257 290 -689 218 -433 -199 685 -392 -575 207
3956 207 502 -450 -293 462 -263 -378 46 139 -293 819 -211 -65 253 -110 -359 322 -206 -180 311 490
3976 490 -177 246 360 -84 582 25 306 159 354 -931 88 705 -180 -9 1031 -460 535 520 -236
3995 -236 27 698 -203 -424 -167 -574 63 921 189 -308 1040 170 -1134 536 449 -352 -233 421 -133
4014a33P87j55p88O72p00j26O80J25j252N35J308r40J1J30J17m07K48q82J58J375
4034G63o33m05Q51m19m88R90k04q55R86j44j024P74m43n25M77Q2K92N30p14l93
4054e02Q03N37r89q91J451r74j08J200r82R06k41o02k50R41n74K97Q40r96q82
4073a016J042M56o85m59N98N13n91M98m21M32L02p00p0P60m68m85R15j181m84
4092a044J760r93k4Q40q00l89K79M64m06R99n24q16P07M56r35J29j95N91R75j518
4112d44M02P9K97o41l0K20l94P80j81p21N00P75j895O19J264r91J92O70r3n45
4132a37k43l2j96Q27k40K6P66p54o34J196m2q53N21J12m01L3K43n31Q52l00p50
4153e37K21J301j590N20M96j111P45N13l11l42Q87r24m3M62m63j149J703q03l89
$$ plain form
4014 -133 654 499 -289 383 -317 -443 237 362 -890 -355 953 13 24 154 271 -136 112 -770 -612 763
4034 763 130 -275 576 157 -331 659 455 -400 586 442 -582 192 -251 -776 -299 -217 75 605 -109 -502
4054 -502 301 838 -151 -1042 409 -565 -673 527 -455 451 210 -392 -642 299 -275 22 862 -134 -1016
4073 -1016 26 482 -203 -662 -64 449 -142 356 -65 367 669 -31 -101 659 191 -294 621 -560 -1044
4092 -1044 716 -277 -301 539 -261 -650 -371 93 -313 686 162 -654 53 509 -426 -297 -492 99 1074 -444
4112 -444 -42 37 334 -307 -337 -117 -511 269 88 -633 -133 642 -1253 -634 630 -361 -169 501 408 -137
4132 -137 -380 -412 -608 219 -21 5 771 17 -617 579 537 -316 205 317 -84 -51 192 -339 513 213 -537
4153 -537 -316 985 -605 -85 411 -700 45 558 247 -95 792 -132 -175 287 -176 -1325 378 -425 -814
4172h14J008R1l27K47j01l79L21M01j120L49j59M81n09O55l14J36r1L65J6N8K19
4193E33q43Q37n40k72M93o17J92J075j358p2J008j006K73J181o26n87P71k41j65
4212C6L72r3l33L45l58o8O5J07n24J36J258j679N29N57r12k90Q11l20r5O33k97
4233a20l48M29L13q06P52k91j095J158Q55j105R80p84l81j06N62m45P96m96k94
4252d26J86L99P5J18j56k51n78R10k22q17J138r38j69J278j157K9Q12j86N3O31
4272G29r52L73n90J77O9L25k05J68O6N22o06K4K69j561R29M80m16L29J95j348
4292a023N84P49m08m43R72l40J58O71m14o77R63p6r54M36Q7p68J260j18j189M70
4312f0L09n19O61J43j181L34L69o52P11q0J40j44M49j261J7Q48R4k69j5j90M83
$$ plain form
4172 -814 194 285 -42 205 104 -275 46 447 -673 -324 -483 -2 -511 144 -170 -34 -125 240 256 314 533
4193 533 -310 527 -13 -285 208 -409 -217 858 -500 -572 436 -570 -297 884 258 -329 442 201 36
4212 36 408 315 -18 327 -31 -99 -34 73 -451 -315 943 -736 -207 350 -562 -852 -41 -361 -456 177 -120
4233 -120 -468 -39 274 -532 220 -71 -1166 -8 847 -258 722 -62 -443 -549 13 -432 364 -132 -426
4252 -426 -240 159 234 352 196 -55 -633 277 55 -762 376 -562 -731 547 -610 -581 231 45 98 729
4272 729 -223 150 -440 -263 -194 131 -74 94 160 682 76 100 369 -1192 -263 217 -199 130 325 -1023
4292 -1023 -439 310 -98 -541 431 91 249 920 506 -171 792 716 -238 198 285 -483 777 659 -530 -60
4312 -60 249 -270 391 534 -647 -313 56 -596 115 35 175 31 480 -781 -764 84 178 -91 -106 -296 187
4333A87L77k73n58K24J32j005J486r00M99k17mr9M75K56j176O19On50N68J61l42
4354a34n36O42L15m82J056j146K3Q71p30K79j25r7n3Q41o66p12J162o27N31l48
4374F4J30L88p73J50K60m11N76j48J67l16o57J86M56p10L21Q41n53m52J144r02
4394b39j64L56N65j363J391p01o19J103m12l86Q74o05k18J047p30l32Q52J78q10
4413b13Q78n06k16j72L21M43j193L25J26n3P95k96n00M90J35j094M00o52R65r3
4433a10K53k44M61j95o76R25k48J10m72N55n02J84J74J97l54k24m31N3O22p55
4453f77K99L05k34M83m4j235O13J094p48m39M25P41n55j93L56o92J084n28l38
4472b83J301n77n62Q6O39o26L59l56n8K10l5J41n6j46M05j128J079j133O97N49
$$ plain form
4333 187 564 291 -267 -43 89 -916 570 -330 169 -48 -52 -151 324 580 -596 23 29 -521 47 208 -134
4354 -134 -670 -28 287 -195 861 -285 -262 609 -121 158 33 -64 -117 724 58 -654 508 -119 412 64
4374 64 194 582 -191 -41 219 -192 384 236 403 87 -570 -384 72 -638 -317 524 -29 -481 663 -239
4394 -239 -403 -47 518 -845 546 -155 -774 329 -83 -469 405 -200 -418 629 -101 -433 419 597 -213
4413 -213 665 159 -57 -229 92 535 -658 -333 -207 -260 535 239 -261 229 364 -730 -330 -982 -17 -110
4433 -110 143 -101 360 165 -511 414 166 276 -196 359 -143 41 215 412 58 -166 -597 -544 78 -677
4453 -677 -378 -73 -307 176 132 -1103 -490 604 -144 -583 -158 583 28 -165 191 -501 583 55 -283
4472 -283 1018 441 -121 -35 604 -22 337 -19 -77 133 98 239 183 37 442 -686 393 -740 -43 506
4492E06n27J86k20L77o42n0J5j67P66K7n81P46l04K05r21J048o99j25L38p48P16
4513e4O1m30O24m2j035J387l06M82j322Q57q2m11O24m89Q37j233Q98o45M05L77
4533E03o94P53m20o51P77J63o79R34k65p95Q0M02m58K66K19l49j23P56p41L05
4553a7N96r84N39O34j026l12N18r6l71P06l20m40R16n21j95J028m37l32r68Q74
4573b08Q0j06K14r3L59m64q24J238nj9j55L3l68L41J25L66q61N92m93r29J917
4594G40p30K19K49n97m37K12K63j55q5J05k73M22j34r8j31P14r06M52N74J03p06
4615a99Q91p91o2R03p08j95j5J4J18OP7J57k92K2K61o33Q65j230P09O06p67PJ28
4638a28J81m11J049j027j24L55l98L65O46k72J23o54K71n08O30m5k19L92K94p30
$$ plain form
4492 506 -21 165 -55 322 -320 -370 -355 -522 244 271 -310 436 132 337 -584 464 -235 -360 -22 -770 -54
4513 -54 7 -423 201 159 -876 511 205 687 -635 222 140 -271 353 -136 701 -532 366 -279 126 503
4533 503 -191 562 142 -509 268 431 -248 686 421 -374 -294 108 -350 -84 135 -214 -337 419 -322 -17
4553 -17 579 -405 134 768 -258 -570 -52 -148 -519 187 -133 -573 343 -178 -373 655 218 -114 -1082 -208
4573 -208 -128 -234 -20 -113 246 -218 -1042 196 191 172 17 50 -318 23 148 514 -347 245 -248 -1177 740
4594 740 10 229 478 -119 -556 -344 -81 -236 -321 -216 -489 -67 -201 -299 -430 284 -622 -170 404 507 -199
4615 -199 692 -99 -161 742 34 -161 -176 -162 -44 -38 39 196 -96 -74 187 -446 419 -811 -102 504 -263 -256 -128
4638 -128 53 -358 691 -336 -460 -105 -503 -138 508 236 359 -295 -24 -532 98 53 -166 226 520 -210
4658b10j35M70n11N20m5m31k36P17J82m60O44j89L69p85K13j37j66J37L8r4M11
4679C02j55R8O2m88M57m86J236q81n40L65N0o0K04n21O92n48K69L32q84P28r66
4700g34R65k28l14P14j137J261o97L0L94k86p5J14L4QN9q64O49j64k07M91j73
4721a60o07R22j19p69Q41M09j8p26L90m95o6M19K15r63O80j26N90L43j017j06
4741c63K37K50L72q03M82o36M5Q89m90j1M94o98%O02p74K8Q96M66l29M9M9j345
4763e90J215l13j119J637j283K81o9o4n9M30p68N87J13Q84n78n34N22m92Q7M23
4783C10r73J84N22l3j98J71j04o83M32J72L51M4Q7q70L38N83m95O06k14r58o7
4804g95O48L08n1k61K92j88L60n15m87R40m83L19k40l78N45K04j47k23j7J35j05
$$ plain form
4658 -210 -345 125 -386 134 89 -342 -578 139 321 -139 505 316 685 -100 113 -24 -190 -53 -15 -109 302
4679 302 147 245 307 -181 276 -210 1026 145 -395 -30 20 -40 164 -357 335 -213 56 388 -496 232 -734
4700 -734 231 3 -311 403 -734 527 -170 -140 254 -32 -107 7 41 49 108 -756 -107 -271 -478 13 -160
4721 -160 -767 155 36 -733 108 517 499 -227 163 -332 -398 21 236 -727 -47 -173 417 760 -257 -363
4741 -363 -126 124 496 -307 175 -461 -416 473 -17 -28 466 -232 -232 370 -404 -376 520 986 657 706 755 -590
4763 -590 625 312 -807 830 -453 -172 -241 -305 -364 66 -702 -115 -2 882 304 -230 292 -200 -113 310
4783 310 -663 -479 43 10 -188 -17 -121 -804 -372 -200 151 195 282 -588 -250 333 -162 444 230 -728 -795
4804 -795 -147 161 110 -151 141 -47 313 -202 -689 251 -232 87 -153 -531 14 218 71 -152 -169 -34 -139
4825a39M97n08L18j81J76L36l55J14j76m35j99O29m19J365j469N09j40l72P35
4844B86o37k08R2R81q40J8K41K20j93j78k1Q8O8M3m09L76o88M6J362k57k8l88
4866b6n66M97O01o53R1L58L57p16J87l55K1k00J021j010J08J119r67N23n26K37
4886A01l36j67jK93m69J03k39M87N42n38N62n12j33K99J30M6j81L08r16O66L18
4907C63k06l21J52J88j92J8J59o5k48J78j30L82j071J293l03r3k08L55J63n26
4927a12k14N99r91J199n48n5M03l12l44N52O3m74L42j96M18M40q01j55k02J031
4947F43n27l16L9l77R09n84n1J89n23K59K18k7k52j83M34L97J49q68O60J89o57
4968b79L73j05k33R02j43j247M63K64N54m80j06n44K43K98k63P63p83l25N7N49
$$ plain form
4825 -139 358 -150 168 -13 163 499 144 258 82 -353 -552 77 -342 1023 -446 63 -77 -449 286
4844 286 -351 -559 -467 514 -326 -308 -67 153 -40 -218 -239 -151 -83 -40 -449 -73 -761 -715 647 390 362 -26
4866 -26 -592 -95 506 -147 -56 302 659 -57 130 -225 -204 -404 617 -393 -285 834 -133 390 -136 101
4886 101 -235 -402 -403 -110 -579 -476 -715 -228 314 -224 338 -174 -307 -8 122 168 -13 295 -621 45 363
4907 363 157 -164 -12 176 -16 2 161 96 -152 26 -104 278 -793 500 197 104 -104 251 414 -112
4927 -112 -326 273 -718 481 -67 -122 281 -31 -375 177 240 -234 108 -88 330 770 -31 -186 -388 643
4947 643 116 -200 -161 -538 371 -213 -264 -75 -598 -339 -121 -148 -400 -583 -149 248 397 -471 189 378 -279
4968 -279 94 -11 -244 658 515 -732 -269 -5 549 69 -37 -581 -338 -40 -303 460 -323 -648 -591 -42
4988d2m77J070j127O26j73K89j01J53L01j402R60L52n36N63k41j18l84O22r09
5007e74j28Q10p14J90O25J88n30K4M14K80k46k61k78L14n36L14N83N0m07K20J66
5028E04j004j1O97j82O94j235N45M91l12j38m35M32m30j71Q51o0J67n17N92m96
5048a8J00P82q69l29L32k58n4k73M57J53l3o07P43P0r7l12J164n73K05m98q75
5069g90L99L32L18m84L51M78k86L8l91n8o4L13o30P77k74m86P91Q6r8k61l70N09
5091B00M19p17J99M11o62o19P59J6o9J57p2j57k29N36M0p7k75k08P20J8l65m18
5113c93M90l14K4o8K13r2k39O88K0k33j95k40O1O14p95J70L39n54M58L42m16K21
5135A01N6n47J124j154l5K58K78Q0j98J04m5m23O09J27l90K80J36q14l60Q85j8
$$ plain form
4988 -42 -519 551 -576 50 -123 166 65 218 519 -883 77 429 -107 456 215 97 -287 335 -574
5007 -574 -702 108 -606 -416 209 397 -133 -109 305 585 339 78 -200 114 -422 -108 475 525 118 338 504
5028 504 -500 -511 186 4 698 -537 8 499 187 49 -386 46 -384 -555 296 236 403 -114 478 -18
5048 -18 82 864 -5 -334 -2 -260 -314 -587 -130 23 -10 -617 126 196 99 -213 951 378 583 85 -790
5069 -790 -391 -59 259 -225 126 604 318 356 -35 -93 -157 156 -474 303 29 -457 334 420 322 61 -309 200
5091 200 619 -98 101 512 -150 -769 -10 6 -63 94 22 -135 -364 172 212 135 -140 -348 372 390 25 -393
5113 -393 97 -217 -193 -261 -48 -140 -379 309 329 96 -99 -339 -278 336 -459 -289 50 -504 -46 296 -120 101
5135 101 157 -390 734 -420 -455 -197 81 161 -37 67 22 -401 208 335 -55 225 361 -453 -813 72 54
5156E4J32J3m09j37N00k58K3J2l18P77q5k29Kj64j90Q08k01n13L39N19m68m75
5178b68K65O8L1j91l18j25O0K12K57J02K0o05L89O0M57l98J11L69r20J2J66K04
5200d2L75o19K69k32L97k98o6L26l85J95l42M73O35j171J508j203L07O8n86K86
5220a05n86R92J97q69K34K00m11l9J6M00p8K01m62J94o0K07l09N53n8p2J4M77
5242F36r08o32P79q6K44l2p0k50k2j34R0L55P1L20j078Q15K52o34m9O19k11l75
5264c00K18L24l28Q0J10K00k26P60n98j77Q0n84L86K30n03J93O31m01n58K52m9
5285b60M81O0n03L26j43J63j66J7O55p27M68n04N5j79J041n53k52k49j08L88J88
5306A98m45K67J89l70O68N8m83n48Q22j48p2K90m57k2j1L27l07m20l58Q21M8m43
$$ plain form
5156 54 186 199 -210 -347 153 -105 -82 -70 -388 389 304 75 77 -87 -277 531 330 -183 156 675 207 -268
5178 -268 -3 65 96 -95 -413 -538 -478 -266 -9 93 113 -492 -103 -43 414 16 127 496 -424 -412 -246 -42
5200 -42 333 -286 -17 -249 148 -150 -216 110 -275 -80 -422 51 686 -485 1023 -180 127 195 -391 -105
5220 -105 -691 301 498 -371 -137 63 -348 -387 -371 29 -49 152 -310 -116 -176 31 -278 275 217 145 159 636
5242 636 -272 -904 -125 -211 33 1 -69 -319 -341 -475 -385 -30 41 361 -717 98 350 -284 -333 286 75 -300
5264 -300 -82 242 -86 -6 104 304 78 838 240 63 143 -441 -55 175 -328 -135 496 95 -463 -211 -260
5285 -260 221 281 -222 104 -39 124 -42 -25 630 -97 371 -133 -78 -257 784 231 -21 -270 -378 10 198
5306 198 -247 20 209 -161 507 565 82 -466 356 208 136 426 -31 -53 -64 263 -44 -464 -822 -1 47 -396
5328c96R32l23j32q1M28j90j0L01j11p06O84j044J076j407J398o0j20J74j75L27
5348E65m06q09L81O46n04K02j73L85m7j79J79o3n34M02l28J39n75L47Q49l64j05
5369Hj72m22K47J86l0K59j57J51l8k35L69J13Rj87k29J9l89L78K04J30m86M52
5391A80n74J233p75J53m39K39O75r64J08K93k92N81j21j026O32P10K18m17j48
5410B66n3l64L0l11m5O03K00l80j06M26l51m96K41N52J58k44j21J11j0j80K65
5431A91p84Q18O43j154L12m0K6m14N67L95o59p8N85l94n44J09K68m26R53m16k9
5452g1j15K04K70j030Q43m9L86m52k45N28j88M4o3J5m4J95M26n35l5m97P93l2
5474C48J28k06q68R64p56L87J02o6j71L04m78K2O01m26P70n12O5m82J74j7J04
$$ plain form
5328 -396 536 213 81 0 428 238 228 529 418 -288 396 -648 428 -979 419 359 239 413 238 565
5348 565 159 -650 -269 377 -127 75 -98 287 240 61 240 177 -357 45 -283 -144 -719 -372 477 113 8
5369 8 -164 -586 -339 -153 -183 76 -81 70 32 -203 166 279 288 101 -128 -109 -498 -120 84 214 -272 180
5391 180 -394 839 64 217 -222 17 692 -272 -164 129 -163 418 297 -729 -97 613 831 414 266
5410 266 213 -151 -121 -432 -477 126 326 -54 -160 266 -85 -581 -340 212 370 126 5 116 106 -74 191
5431 191 -593 225 868 -286 26 -14 12 -402 165 560 -99 -177 408 14 -530 -421 -153 -579 374 -42 -71
5452 -71 -186 18 288 -742 101 52 438 -14 -259 269 81 125 62 77 33 228 654 119 84 -413 380 348
5474 348 476 270 -598 366 -390 -3 99 33 -138 166 -312 -290 311 -115 655 143 208 -274 -100 -117 -13
5495a3J24M7M1J72l60L55M1j84j32r34N91J82K20o83L50k23M65M64k92o20L39
5516e0L30k1K32r85J3L20J42O31j95J19j092M84N62o90M56P7n26M30m73J82K04
5537A50L76q07%M22k34j59M89n85P24m62K09K30K39r02M12k23J27O19l46Q95j091
5558H3l40M00L66l29l40m0j68M77M54r35N1J14J53L30p06O37q34J33O02L11q92
5579d73N76m66O01j63m45J92K36Q7n38O86l14l19L95J99j02m19j55O18m60J4J03
5600a47N72j49j78m82Q31m27Ql6l6M4K3m3q15O43J28L44q46N21J38m96K93L6m15
5623d89Q40j20j87N04o63L8J37M54o67q6L81o32M64l6K99k40k10L74k51N54m68
5644dJ21M17o57k00k60j5N29O77q75OO47m11j69Oj94j41M26l16K80O08m23n02
$$ plain form
5495 -13 111 158 199 371 11 366 407 223 91 -843 -252 -70 150 -533 -183 -406 59 523 231 -389 -50
5516 -50 280 259 491 -494 -481 -161 -19 612 417 536 -556 -72 490 -200 256 333 -193 237 -236 -54 150
5537 150 526 -281 -281 141 -93 -252 237 -348 376 -86 123 353 592 -310 102 -121 6 625 279 1174 83
5558 83 -257 143 509 180 -160 -200 -368 109 563 -372 -321 -207 -54 276 -430 207 -627 -494 108 419 -473
5579 -473 103 -363 238 75 -370 -178 58 145 -393 293 -21 -340 55 254 152 -267 -422 196 -264 -250 -147
5600 -147 425 276 98 -384 447 20 28 -8 -44 0 23 -20 -835 -192 -64 280 -566 -45 93 -403 -110 -74 -489
5623 -489 351 231 44 548 -115 -77 60 514 -153 -239 142 -490 -26 -62 237 -3 -213 161 -90 464 -4
5644 -4 117 534 -123 -323 -583 -598 -69 608 -267 -261 386 -25 -194 -188 -382 -523 -97 -413 -133 475 52 -450
5666d50M87Q51j243K76M99k53K64L09o85K13N5rK2j86j59l77J081o67O40j267
5686e99L94M56o64P27l46j21M86n79K89o16P66k00l77M3O24L6m15N53m07J3J18
5707A81q07O65P92q27M75N37j132l07M30k5n30L29O19p18K10M99k29K34q28L73
5727e9J48O28r93K7J088r42J53n92K98K25j15j35N39k15K05q41K06M08j18%L49
5748B64o46p71J256n68O61o66J47L75P40j122N25Q9q60J8P76l55Q7K06J7o25N94
5769A42O46n70q17J388o84M52r16J30J74K30j30p43J195q43Q93q00K57ml47L98
5789E1l8L0O50j146J376j556L85L80mk47j58L95j76P22o39p6m30M24r3M08r85
5810g27L32Q7K39J8J64J83o44R7K74L47o5P7n46O10j123K40J001j47m34k30N99
$$ plain form
5666 -450 37 888 -355 -79 420 167 431 740 55 268 323 314 336 150 -9 -386 695 28 668 -599
5686 -599 -205 251 -413 314 -32 -153 333 -246 43 -573 193 -7 -384 -341 283 319 -96 457 50 63 181
5707 181 -626 39 831 4 479 1016 -116 -423 7 -18 -548 -219 400 -318 -108 391 162 396 -432 -59
5727 -59 89 717 -276 -249 839 -103 50 -542 -244 -19 -134 -269 270 55 260 -581 -375 33 -85 -85 264
5748 264 -382 -1153 103 -465 196 -470 -323 52 792 -330 195 284 -576 -558 218 -137 -50 156 173 -452 142
5769 142 788 218 -599 789 105 557 -359 -229 -55 175 45 -698 497 -346 547 -253 4 0 -347 51
5789 51 13 43 693 -453 923 -633 -248 132 128 -119 -277 118 -58 664 25 -51 -481 -57 -150 258 -727
5810 -727 -395 -308 -69 -51 113 296 -348 -251 23 370 305 382 -164 446 -677 -437 564 417 -17 -247 352
5831C52m02k7l12L32m27K57M67k41Q2j07l26l33M95L31q44Q86L1k67K87l41J93
5852H6o21Q48k00j00k45K12M0jo01J42j07L36O93n16j31L24j41o75J597n41m63
5873f4K11M35o78J15M97r73L34P29j049J59L45o18O29n75R61M9j019O0L42L67
5893B57j27N12j15o42K05j09k15o18R22M85J97k96n25k00k86J150r7n96M30n01
5913a69M29n48l28O8P23l49K82J60R4r64N92n73L92M36q77K19K57K16J33M34j68
5934D59l65l20M72n68L80o01L68j68J185p56o02M01m19j56P86K80l73O53o73l14
5954c31J93L13M29o50J10k36K51K44o38J05m77k01J091J80q73R31n05k38N93o02
5974c11J97j03L14M06j87q5p79L30M58n66P73l13j33k04R48l63q22Q51m89n1K85
$$ plain form
5831 352 -50 -77 -389 -57 -484 -227 240 -1 81 -26 -352 -685 -190 141 -703 183 214 -53 234 -107 86
5852 86 -535 313 113 13 -232 -20 20 19 -582 -440 -547 -211 482 -34 -165 159 18 -657 940 399 -64
5873 -64 147 582 -96 19 516 -457 -123 606 -443 -284 61 -557 72 -503 458 507 -512 -452 -110 257
5893 257 130 642 527 -115 90 -19 -234 -852 70 555 752 456 -69 -269 -555 595 498 -98 332 -169
5913 -169 260 -288 -616 -548 175 -174 108 268 362 -602 -10 -583 -191 245 -632 -413 -156 60 193 627 459
5934 459 94 -226 246 -322 58 -543 -175 -343 842 86 -516 -115 -534 -690 96 376 3 656 -17 -331
5954 -331 -138 175 604 -46 64 -172 79 323 -315 -210 -687 -888 203 383 -490 441 -64 -302 291 -311
5974 -311 -114 -217 97 503 316 231 -548 -218 240 -326 447 134 1 -203 745 382 -440 411 -78 -129 156
5995A56r00N78R08j366O84l16N17l63K00L06k48m69L25N5L34k80k75J07k60P60
6015D53l29Q12j137j93Q31L2r11J87L97n83M03j96MM14q62M5J521k75j511J244
6035C46J10k51m97O43j19l54qL8J02K5j62L95n42N9P6l2j66k26J416j299L54J21
6057B9O03q54K17l16J54n1P84p60j13k61J172j020N98k84K09j82l4l4j50L93q85
6078g85J039M09n06M9j67k56N35m64J8J96l10j48Q9L78J37l35M78k62J07q39K04
6099d33n1L07N64R3l17j41r1mP0k99J51j96j99Q10r53J220k58k49j068J725j134
6120d53q0Q87n11N72j45j45j87K24J97J0n31Q05j526J491q78l04N72J75l78n36
6140g41J356k33n07K58o51J49M83l44L03m84R9N11M20m28l33Q19q73K06N03J01
$$ plain form
5995 156 -744 -166 742 -624 60 -256 261 -102 98 404 156 -313 12 67 401 121 -154 -47 -307 453
6015 453 124 936 -201 -394 437 469 -442 -255 142 -441 -38 -234 -230 184 -678 -633 888 613 -898 346
6035 346 456 205 -292 351 232 -122 -130 -92 10 35 -127 268 -274 -215 -139 -171 -337 -563 853 -446 -92 29
6057 29 632 -222 -5 -321 -167 -218 566 -194 -307 -568 604 -416 182 -102 107 -75 -109 -143 -293 100 -785
6078 -785 254 663 157 206 39 -217 318 -146 -128 68 -242 -390 -301 77 214 -121 357 95 202 -637 -433
6099 -433 -484 -177 387 480 163 22 -69 -73 -3 -302 -151 -347 -546 264 -689 531 273 24 -1044 681 -453
6120 -453 -533 354 -157 415 270 125 -62 162 359 369 -162 643 -883 608 -270 -574 -2 173 -205 -741
6140 -741 615 382 -125 133 -518 -369 114 -230 73 -411 -312 199 619 191 -142 677 -196 10 513 614
6160F14p77J215r26m06J76k56j11J30N38m77M90L64o87m1j38Q8O37J04o84k61
6180d08J60R6K7N19o87O13p29M98K0m48P35r40J99N39k69m4k73M89n54J367j318
6201d08M14Q4j85J44K10k07M71r58n62P93K53l90M5O88N1m93O89k26j185O36k4
6222a60K63o33P64k67R1J39j11pR57j333m1K11l24O36n7j35l98Q21n92K47K35
6243C06L1o0k87P02r72M30m60K70k95L62N77r06L67l60L67k03M01l72L48o74O91
6264B63l83O22l09k08L71j366J354q86N60j42P69j075M94l79j46K27J79P8J41
6283A64m89O63m23J54o30M50K5o92O23N86n69o6M74q57Q80j1q16Q69p06K55R5
6304b1M6J31m91R98p85j84N68M24j086L20Pk82J73N2j34L49K24l78N23o22m13
$$ plain form
6160 614 -163 1052 126 -280 -104 -360 -471 -341 197 -280 210 574 -113 -154 -292 -204 433 537 -147 -408
6180 -408 -248 -152 -125 394 -293 320 -409 89 109 -339 396 -544 -345 194 -75 -119 -392 97 -457 910 -408
6201 -408 6 90 -95 49 259 52 523 -435 -997 -204 49 -341 -296 392 443 -50 639 413 -772 -136 -160
6222 -160 103 -530 234 -33 58 197 86 79 1036 -297 -338 -127 -451 185 128 -7 -405 416 -176 71 306
6243 306 337 277 -10 692 -280 150 -310 -40 -335 27 604 -302 65 -295 72 -131 270 -102 246 -428 263
6264 263 -120 502 193 -15 356 -1010 344 -542 18 -124 645 -430 64 -315 -461 -234 -55 23 164
6283 164 -325 338 -85 69 -561 -111 -86 -778 -155 431 -138 -204 270 -587 293 282 -534 335 -371 -116 -21
6304 -21 25 156 -335 663 -122 -306 262 686 -400 -80 -73 -355 -182 -130 -264 85 309 -69 454 -168 -581
6325e81N80N09m83l84O58j042P13K02K2n21P3J45o65J000n30L72k74k55R07m06
6345D0K48m67R0j21M06L47o85K20J06k27j2K04Q1L32k93L67q69M91j25n17J27
6366b57N25J91K64m29j004O38K37q02O33J15m0O7P3n00j6M02J5J53J5k16k48Q54
6388F70l68m8J51n82n32M04j2N66j92m13M84m67L89J63j39R5J6m2M66r76M08k5
6410A6k27K19l44j47L02M93n75K0O22l57o59k13O55J120j647Q52m43L4k45O44
6430A20m69R72n07n06O63L64o51L35n41k62J043p10k86Q00j94n05O55n37O28j04
6450C08n88J7n43J180r4m93k71J39K95o68P50j68j39J73m8O96p34k82P07m51M10
6471A96j62j95L70j51J27m20L58%k08L30q91J11N31j55O6k71Q14m15L72j133P22
$$ plain form
6325 -581 -1 508 25 -359 299 -743 -30 172 194 -327 -254 -109 -774 226 -304 68 -206 -461 446 40
6345 40 288 -179 -89 -210 196 543 -142 78 184 -43 -55 149 230 562 269 636 -233 258 133 -384 -257
6366 -257 268 459 723 294 -710 -72 165 -637 -4 111 71 138 211 -289 -305 97 112 265 280 64 -184 670
6388 670 302 254 405 -177 -709 -305 -317 249 57 -356 128 -339 50 213 74 169 185 143 609 -367 41 16
6410 16 -211 8 -336 -483 -181 312 -263 -243 379 22 -637 -850 -195 925 -722 130 -313 -279 -524 120
6430 120 -349 623 116 -390 273 637 -14 321 -220 -482 561 -149 -435 365 171 -334 321 -216 412 308
6450 308 -280 -263 -806 374 280 -213 -484 -345 -50 -718 32 -136 -275 -102 -150 546 -188 -470 237 -214 196
6471 196 34 -161 209 58 185 -235 123 123 -85 245 -646 -535 -4 -159 -93 -364 450 35 407 -726 -4
6492dM17Q08j887J114k40p81P21n51J265k065R30P40l45l39m30J143o37N70o42
6511b13N01o03L32m3n9j45J029n07r06J228p75M82Q6m00m30oO90n05J41P85j075
6532c93J5N54j18o1J27J05m80O94p01m88J629o24J13j25l71R4M93k13L05n87J72
6553A40j66K75j10q38J115l10n93P11K25q56M08l26N31j6q23R4P33j0o48J62k92
6574e94Q01o93J043q45o52J133Q5r2l80L91m19mP9m48J545o58r9K36n10l69O35
6595A85k95r2k3Q47m43j64m15O33k71l72N56M3k64m98Q61n92k66Q8N63L57q30
6616c92k15N43m17O03N1l85m14K22Q23j302M71P57o8L60q64L96p05L81M81m40
6636a14L54o99L95J62j003J328J20j060L53K43j037J533o45l84m97J160o10P37
$$ plain form
6492 -4 413 1221 -666 448 208 -573 148 -403 862 -1203 -273 467 122 -217 -647 496 -141 429 -213
6511 -213 288 -315 17 -26 -85 -230 799 292 -614 614 -161 321 407 7 -423 -429 261 -244 -103 682 -393
6532 -393 -378 176 58 -3 124 229 -251 443 -258 -746 883 259 372 247 -124 -30 463 250 555 -32 140
6553 140 -26 249 139 -699 416 106 -487 224 449 -407 1 -325 206 190 -633 -539 194 184 -464 -302 -594
6574 -594 207 -486 557 -288 -940 193 278 186 -194 197 -222 -226 -147 -595 950 292 193 429 -81 -450 185
6595 185 -110 -202 -225 622 179 15 -400 233 -38 -410 146 189 -75 -573 288 -304 -570 -482 81 438 -392
6616 -392 -607 -64 -481 122 173 -212 -626 -404 419 -883 -412 345 277 637 -227 169 -536 -155 326 -114
6636 -114 240 -459 -64 98 -905 423 543 -517 -164 79 -958 575 -70 -454 -951 209 -401 336
6654C36p7m99l06Q9k97L68L85K55o63O33l53O85m22p1q92P25K53l14k98N22q70
6675h11L45J017j424O26M44R8m14L16J21K79k01k05o09O31p34M42k05J53n50P8
6695f03O55P8J43r50R24J49k32n88Q79p22K59j94R5o33K96P83q46l37J662r92
6715a74k62k19O08l98Q5N50n91L76m74N38L5m01P97l94j29R8N89m83L52l5j388
6736i20J805j719J009r92N18j15Q1N7J22N99p33L98o41J57j37L82J101j009l2
6755f9j77J94j05J66N01n04m80M25J18R2m95J92n40J016n46Q20p13l19Q17N0R4
6776E37j155Q14m44K05n32R29l54j97N32j14k03j89k46N16j31M61m50K57m28L79
6796A87M12r04j35M45L85m12L99l03j80M3K7K21k35L87l25L04p73M82L50J176
$$ plain form
6654 336 259 -240 -546 -457 -754 -386 -1 254 -409 224 -129 556 134 63 -829 -104 149 -165 -463 59 -811
6675 -811 -466 551 -873 -247 197 295 -119 197 318 597 396 191 -418 213 -521 -79 -284 -131 -681 -603
6695 -603 52 130 273 -677 247 396 164 -424 455 -267 -8 -202 -107 -740 -444 339 -507 -844 818 -174
6715 -174 -436 -655 -47 -445 -360 190 -401 -25 -499 39 74 -327 470 76 -53 45 634 151 503 468 -920
6736 -920 885 -834 175 -817 -299 -414 -333 -276 -154 445 -288 110 -531 -374 -511 -129 972 -37 -69
6755 -69 -246 -52 -157 9 510 6 -474 -49 69 161 -334 -142 -682 334 -212 608 -105 -424 393 443 537
6776 537 -618 196 -248 -43 -575 354 0 -197 335 221 18 -171 -417 99 -32 429 -21 236 -192 187
6796 187 599 -305 -440 5 390 -22 377 74 -106 -63 -36 185 -50 337 12 316 -457 25 375 1551
6816A551j783l47J143r92JO39p12J07M86k9k12Q75q51L17J59l39m0q1r5n3O61
6837D05n84j73O13n3o75K90J073j172O52k87p92R16J78p88L82K82k13m53N42P2
6857B15n27O58o86J8K67m59L00N27n20K62L62k71j47k98L89k83m22N58m63J51
6877c69j7K45k33N30m04L38M06m15k34r2M26m46K51k36N11j77j07n67P85p16L7
6898d84L50L3N11r1j31L87j277M11J47j03M7l51M53L37o87L16N37j07p59M26j26
6919a61j2l86O12k93O57k48j96j50j6M31k88M27k30K07o00K28M25l98j55L47n18
6940c17k69J82L79Q3k18L15j4J35L03j295M93J86m42J76L56N35l8o37j62J83K78
6961B12l81j51J379j442L29M93o03k5J93M64k98J33J97l15n91M94o58l0J110p05
$$ plain form
6816 1551 -232 -579 564 -428 -427 212 -500 -393 93 64 -148 727 -124 193 352 13 -27 -108 -203 -256 405
6837 405 -179 -352 261 208 -467 -177 896 -276 376 89 -703 213 391 -397 -15 267 54 -399 143 215
6857 215 -312 346 -340 -322 -55 -514 -214 313 -207 55 417 146 -1 -299 90 -193 -615 -57 -520 -369
6877 -369 -386 -141 -374 156 -248 90 496 81 -153 -245 181 -265 -14 -250 261 84 -23 -590 195 -521 -484
6898 -484 -134 -101 410 319 188 575 -702 -291 -144 -247 -200 -551 -98 239 -448 -132 405 298 -461 -35 -161
6919 -161 -173 -559 53 -240 417 169 -27 -177 -193 238 -50 377 147 354 -246 -18 407 9 -146 201 -317
6940 -317 -586 -404 -25 58 -160 155 141 276 579 -716 -223 -37 -479 -303 53 588 550 -87 -249 -66 212
6961 212 -169 -320 1059 -383 -54 439 -164 -189 4 468 170 303 500 185 -406 88 -570 -600 510 -195
6981a95K57L95j103Q24m5J61l52r4N10p9K88j060R52j44J88n59j48N10j146J88
7001f52P13M36l97L11m67j10J87P9j87j61N52L23ro04j2k34M93l68P79o51O15
7022F36n88j58p5M30J62m57m88J64L56k07l0Q72j159J001n0p36L12J92j26O30
7042F81n22j84m3L75K08n81j42M21l78L59l07L0n05N45q1M2j03L97m85O35kp15
7064c55m7l2K52O85k47N19q77j64L52l34L74Q91j278N0M01O9o5k6l1l72M66p59
7086e28N23p69O92L88L3j9l88l06K38L61q9J72q34M58N0m15K88j12j64Q72n41
7107i0K04N70j191M59K98m53M35r5n83M7N16r2jK79K66j327J25P32N7m89J81P7
7129g5N1M69o50L08m84J51P48m70k38J23K20J87j024Q04q7R2r5R19p85k82O19
$$ plain form
6981 -195 62 457 -646 178 133 294 -58 -152 358 279 567 -493 459 315 503 -56 -204 306 -840 -652
7001 -652 61 497 100 411 -56 -166 21 100 -87 -248 304 627 618 14 2 -232 261 -107 672 21 636
7022 636 48 -110 -185 245 407 -50 -538 -374 -18 -225 -255 617 -542 459 409 -327 -15 177 51 681
7042 681 159 -25 -68 307 515 -66 -208 213 -165 194 -113 -83 -588 -43 -124 -82 -185 212 -273 362 360 -355
7064 -355 -402 -434 -182 503 256 775 -102 -266 86 -248 126 1017 -261 -211 190 259 194 168 137 -235 231 -528
7086 -528 -5 -774 -82 306 339 320 -68 -374 -136 225 136 308 -526 -68 -18 -433 -145 -257 -421 451 -90
7107 -90 114 684 -507 -48 250 -203 232 137 -446 -399 117 25 24 303 569 -758 -633 99 156 -333 -152 -75
7129 -75 -24 445 -205 103 -381 -230 518 48 -190 -67 153 340 -684 120 33 125 30 949 164 -118 501
7150E01q35K75m62k48O4N96k39j27M90m78P07k54j12J73p01M65K07J75L04j093
7170e92Q48m5l33J40L84m97J16m82Q96r53J037k95j59q25N31M2N45p70O30k86
7190f8o70Q40K20o44P03q45O06m81K25M12jl36pl19M79M65j018J491j589M74n54
7211f17N09j224J106P2J93R20m55k98o60R68n21O0j15L8m85M52N76j008O29PO0
7232B07l06j19K29l3j32j58n61J268Jp15Q16j42L14n43r7p6k59J51K17k59M62
7253B65p60M88l98M46Qm4n7P6J90J31J45o25M91r92N89j12m2L70m40O92l15K52
7275C58q80M75J24n60K47j56L31n5j73L26k05j13j84M46K15k68K25L65L77r12
7295a7N05o16J95L3J48k4K36p26j32P24n9l44Q4J07l66j25O71R1p12M19J5l78
$$ plain form
7150 501 -334 -59 -521 -769 -705 -109 -348 -475 15 -463 244 -10 -122 51 -650 -185 22 197 501 -592
7170 -592 256 211 -122 18 402 -95 21 -461 435 -518 519 224 65 -760 -229 -187 358 -412 218 -68
7190 -68 -738 102 322 -322 381 -464 142 -339 -114 298 297 -39 -46 -365 114 579 -439 1052 -537 -63 -617
7211 -617 -108 -1332 -226 -154 39 959 504 206 -454 514 -7 53 -62 -24 -509 -57 519 -489 140 147 207
7232 207 -99 -218 11 -22 -154 -312 -873 395 396 -319 497 355 669 126 29 -47 -306 -155 62 -197 265
7253 265 -495 -7 -405 41 49 5 -52 24 214 345 490 -135 356 -636 -47 -159 -201 169 -271 421 106 358
7275 358 -522 -47 77 -483 -236 -392 -61 -116 -289 37 -168 -281 -465 -19 196 -72 153 518 895 -17
7295 -17 488 -128 67 100 248 224 460 -266 -398 326 267 -77 7 114 -252 -377 294 385 -327 92 107 -271
7317b71N26j4n77O39N10q91K25J01M02k23j91q8j58q4N30l57o77J206n78l47K71
7338d6M25j59L21p16M50j15O7j57j16l84O35o85L51J50j08M00l78L05p36K00L13
7359A7k1k21M46m97Q05l79o0k81O43n58M7L69m03j99j20R94m98P2n2o56M32J28
7381HL31m42n97K20k15K65N30l12J83Q08o17K4l03j18j35L62m67J328p26L50p30
7402b53M87l17P3j88J86P0N6p6L48m61j54M72K0m15N63j81m59N52j06N29o04K52
7424C94l65J56r5k18K11L41n71P88p14Q0n84J138n49l68Q59J47o21P7j80j58J62
7445g0Q09r53m35J441r86K7r0q4r8J64j10L24Q02p05L00K78n06J50n66N74q08
7466e42M81j69N25l77K39K2p19N27O17j399Q52j66k47M79m36K80L41m75L92q75
$$ plain form
7317 -271 255 241 -336 303 813 -78 147 248 650 427 236 148 -10 -94 436 79 -598 608 30 -317 -46
7338 -46 379 220 541 -175 275 160 227 70 -46 -430 205 -480 -129 21 -87 313 -65 240 -496 -296 17
7359 17 -4 -225 221 -276 529 150 90 -191 452 -106 -59 310 -93 -292 -412 582 84 156 104 -552 -120 8
7381 8 339 -103 -700 -480 -695 -430 100 -212 -29 779 162 186 -117 -235 -370 -8 -475 853 127 477 -253
7402 -253 234 -83 -10 -198 -12 58 114 38 386 -75 -229 243 263 -152 411 230 -229 323 217 746 142 394
7424 394 29 185 90 -128 83 424 -147 641 -73 7 -577 561 12 -356 503 650 29 106 -74 -232 -70
7445 -70 739 -214 -649 792 -194 -167 -257 -341 -439 -275 -385 -61 741 36 336 614 108 258 -308 266 -542
7466 -542 -61 -230 295 -82 157 179 -540 -13 604 -795 57 -109 -356 123 -313 -33 308 -167 225 -650
7486f50J481o53j67O66n02J64o07O90n93N43L90j165M55K42N06p03j88l4O93k34
7506C34o46J02R0m88Q58l69k9P47l51p06K07Q34j92k23n58P22l48n41O9oK65j18
7528c47L73j8k85L31J21m16N23M24l60o1o41p6O78m49q6L06L80n90Oq7ok1M48
7551A47k36m36L38N61q41O37j48K09l94J07M44j25k90j36J025j244L00j63N4P09
7571E18q13K32N63J05l53j90J29j95M97l84K4L2L63j32l68N56j657J312r29L32
7591c58k40L18M49J46p27L41M87n71J70k26o10J277n27O0L81j028R97n26k5m69
7611f81K79O59m54o27R69m89O73M10n83k35m90M85M32k65M5k8j18lJ065j015m85
7632d56J041q27P28l23m49L39j15M42p2o73L70M23J6o87l8J65m95O39M8K30n71
$$ plain form
7486 -650 831 178 11 677 175 339 -268 422 -171 372 762 -403 52 294 800 97 -91 -125 568 334
7506 334 -312 -210 -120 -608 250 -119 -148 599 248 -458 -251 583 391 168 -390 332 -16 -557 -488 -494 -229 -347
7528 -347 26 8 -277 54 175 -241 282 706 346 285 -356 -432 246 -203 -289 17 397 -193 -187 -274 -280 -301 147
7551 147 -89 -525 -187 374 -467 170 22 231 -163 -56 388 263 -27 -163 862 -382 -82 -245 -191 518
7571 518 -295 -63 500 605 252 62 191 -4 493 109 133 165 528 396 28 584 -1073 239 -690 -358
7591 -358 -598 -280 169 315 -412 -71 416 -155 15 -211 -821 456 -71 -11 370 -658 339 -187 -212 -681
7611 -681 -402 257 -197 -824 145 -344 329 739 156 -79 -569 -84 348 83 128 100 -18 -21 1044 29 -456
7632 -456 585 -242 486 163 -286 53 -62 380 308 -365 5 428 444 -243 -281 -116 -611 28 76 306 -265
7653b65P08j027N16l62R49p71j66p3L89L07m37k22O57k51Q7K65j99N32j744J960
7673H53j070K52L91k85j54k99R08o32m51K86N36q73N41O8l11N22k85K70l83N38
7693D22o60M50l63N23j67K29n45j08j34n8O52o81k90J37P56J11q98M93k16J40
7713b07n69j99Q99k86K27L69m91J71P08o72J33l71J58N40m76K6L95k46%l73k57
7734e21N18M92q63N60k0j96k88K63m18L46p4L2k30M93o6K00j272J382m13L50l22
7755d7N98o97M6q4m87J288m43p62Q27k90l41Q29m34k06N08q77O45K06k35J24m83
7776c15N9J58l91M36n88R14k31Q1N70m40N14p80q7L54p27J127k36j175J337n22
7796E8L0L37On14M87m98l88L9J200j151M92p44M95q5l0J9J190o35n21k78O80k92
$$ plain form
7653 -265 443 -584 -68 -430 519 -252 -418 -491 -102 205 -232 -454 203 -48 39 304 105 637 -1107 853
7673 853 -217 35 426 141 -13 -312 596 -36 -487 -201 335 -538 3 71 -240 282 -3 267 -116 422
7693 422 -238 212 -151 372 205 434 -111 -219 -353 -411 241 -440 -730 -593 163 274 -624 -131 -347 -207
7713 -207 -776 -975 -76 -362 -135 234 -257 -86 622 -50 83 -288 -130 410 -66 -40 355 109 109 -264 -521
7734 -521 -3 489 -374 186 166 -30 -318 -55 -473 -127 -201 -169 -399 94 28 228 -1044 338 -75 275 -47
7755 -47 551 -146 -100 -184 -671 617 174 -588 239 -51 -392 437 3 -203 305 -572 73 279 44 168 -315
7776 -315 -256 -98 -489 -53 -641 273 42 123 693 253 767 -13 -100 254 -473 654 418 -757 580 58
7796 58 88 425 431 -83 404 -94 -482 -443 757 -394 98 -646 -151 -236 -266 -247 943 308 -213 -491 189 -103
7818a03K57l43j95N78m26Q10m34l04P08q72K05k86L25N14m28r29O22K77K8L50
7838C54q29N8P14n21M43J01o87M26j36L55m17l23n4J26m48O97O37j010O00j24
7858c8j22r1R74n03L20p27k66R50m32L56p58n4k77Q13k39J53k52j54M4L75o3L06
7880C15r58P07j48N32n90j98P64l33p30Q79q60Q85L1p13O37M35p47j54L20m45
7900c71M85l0q5M2j81K11p00L97M67j65j7J9l65j00O72m76m06P20J66L00r34O56
7922C05n6r3K31m37l3M82o17K66K29l63k01O50m40M0r9m33J85O0J79Q59q66J36
7944a6J5O87r40L4J46k53L38l10O37o89P33m92K03L66k27m03l03J145m91j33K55
7965C02j70J69k61k6r5L88m20n59Q37K68k93j85Q2l71K07J45J43m07L83J05m90
$$ plain form
7818 -103 154 -189 -384 194 -232 578 144 -160 548 -324 -119 -405 -80 434 6 -923 -301 -24 4 354
7838 354 -475 -417 297 -224 219 320 -367 59 -77 278 -139 -462 -516 -390 -838 -141 496 -514 86 -38
7858 -38 -160 -251 723 220 540 -187 -453 497 65 421 -337 -391 -668 145 -94 59 -193 -347 -303 72 9 315
7880 315 -643 64 -84 448 -142 -340 424 91 -639 240 -620 265 296 -417 220 655 -92 -246 74 -371
7900 -371 114 84 -1 41 -140 71 -629 -232 235 70 53 72 -293 -393 279 -197 -603 117 283 583 -351 305
7922 305 249 156 387 -50 -83 399 -218 48 277 -86 -287 363 -77 -37 -136 -569 -384 -324 -145 714 -152 -16
7944 -16 -1 686 -254 -220 -74 -327 11 -299 338 -351 382 -110 93 459 232 -171 -474 671 180 47 302
7965 302 132 301 40 14 -81 307 -113 -672 165 433 140 -45 37 -334 -127 18 161 -246 137 242 -248
7986b48O13o52lR30q13j10M58K52r53L26KM7j21k08N2Q47k6M3k92l42N27r17R30
8009C42j33m01j52M41K76L5p30MQ35j098M19K82o1m03M83n04J43M36l03O3p78
8030h04L61j14M51O00q87M5L77m48n3O61k49q43O20J075n64P6k93M20p85J59K22
8051B7l37j50P96K2n23R40j261J174q33P19K14o53l15q0M92LJ01p25N88J81m65
8072h5K94k92k83N09K54j77m22R3n4m0k35N87j04J93K40p01J83K14m7k61l64M66
8094c2m4J37l47K54L28k50j71m28K81j20O68L43l82m9K19l92k03M68r8M02k62
8115C22J51l47L64qj012Q01N6q89P34j03k94m68J455q51M4n6K81P13j285l37J063
8136C34l29l87M78j09k36K35j35O3J71N4M81j524J256m01l5N53r08M81m64J183
$$ plain form
7986 -248 365 -287 -290 640 -173 -283 175 427 -526 -200 -198 -151 -272 -480 -428 419 393 436 144 -198 329 -588 342
8009 342 209 -192 -344 97 373 408 -322 -318 517 -581 -162 120 59 -344 139 -365 -222 214 -89 -26 -804
8030 -804 -443 -557 -106 494 -393 -348 29 -419 -472 189 -60 -903 -283 792 228 304 11 431 -354 -195 27
8051 27 -310 -460 336 358 -165 775 -486 688 -145 574 788 135 -180 -260 232 235 336 -389 199 380 -85
8072 -85 209 -83 -366 143 397 220 -202 -109 -163 -203 -438 149 45 238 478 -223 -40 174 127 -134 -498 -32
8094 -32 -76 61 -286 -32 296 46 -125 -553 -272 -392 276 619 237 188 407 15 -188 280 182 584 322
8115 322 473 126 490 482 -530 271 327 -562 172 69 -225 -693 762 -89 -45 -101 180 893 -392 -729 334
8136 334 5 -382 96 -13 -249 -14 -149 -86 85 139 620 -904 352 -49 -84 469 -439 42 -422 761
8156G61j249j91O20j7J20j5J33o78L00L93l21l57P31n18M4l8K93M62K00o74M85
8177D84j174O83k72M94p1k04o0N04N97j173l53N21O33j023
$$ plain form
8156 761 -488 -679 -59 -76 44 29 162 -516 -216 177 -144 -501 230 -288 -244 -282 11 473 673 -1 484
8177 484 -690 -7 -279 215 144 -60 -120 384 981 -192 -545 -24 609 -414
8191d14
$$ Imaginary data points
##PAGE= N=2
##DATA TABLE= (X++(I..I)), XYDATA
0@%%%%%%%%%%%%%%%%%%Oo0J16j24J24j24J25j37J97k48K55k88L45l85M44n06N73
35C13o43P09q07R00r99J116j241J375j524J689j866K064k277K503k762L044l354
52a760L697m084M511m984N528o153O875p718Q737r981J1529j3536J6246k0128
66a1221K6178l7028O2448k51699n7303M18455J5779n8094m6266r5336L0424J48670
78A45007j46656q4352J36016k8366j06757Q2482k7973m1863R1488p5993r2341
89a49308K25043Q1475j84949j0451Q4148M285P0393q5720j96875J22022J62980
100A23043j46914n7054Q6432l8269J8032M1702j16650N2130J79728r8376j01677
111e7873J12448j6507p1939J9751q7568J7384K28670l5032j94158P9821Q1747
$$ plain form
0 0 0 0 0 0 0 0 0 0 0 0 0 0 0 0 0 0 0 0 6 -54 62 -62 62 -62 63 -74 123 -125 130 -158 187 -198 246 -260 313
35 313 -330 379 -428 472 -527 589 -652 723 -801 888 -978 1086 -1191 1312 -1450 1594 -1760
52 -1760 1937 -2147 2364 -2620 2908 -3245 3630 -4088 4649 -5332 6197 -7339 8907 -11221
66 -11221 14957 -22071 40377 -211322 -268625 149830 165609 107515 61249 -34087 -3663 145007
78 145007 -1649 -86001 50015 21649 -85108 -2626 -30599 -72462 19026 -56967 -149308
89 -149308 75735 157210 -27739 -38190 45958 50243 120636 34916 -161959 -39937 123043
100 123043 -23871 -80925 5507 -32762 -14730 26972 -89678 -37548 142180 43804 -57873
111 -57873 54575 38068 -33871 -14120 -101688 -84304 144366 109334 -84824 -5003 76744
122G6744p4146l926n3882n6974J62068L0156j87216N1454J37393p2801j4276K9692
134B4286o8125P8825P7056j67343j8330J72690m3141r1382K0733n7011K8868J10924
146F8050j26116q2482J94393M0449j24736K8222K2771k809R5864o4511j33394
157h4299J13169M5993j67684l810P3229k1047P4667J6092j34326P2738J42577
168A27299j16150o7387R2810k847O276J2770j32992R396J62164q0435j18833J05319
180b610K7978m9284L9295n3725k9728J57855j978j46025O3359O5159p6117Q076
192B255j9114p2088J13065N0471j62070J6779J40285m0569k7036K3749o3971M6803
204H559P1109j42100l6300J63044j3281p8676M5114k9994j3527Q7467p5730q7181
$$ plain form
122 76744 2598 -1328 -55210 -112184 49884 80040 -107176 -55722 81671 8870 -5406 24286
134 24286 -43839 34986 112042 -55301 -73631 99059 55918 -35464 -14731 -71742 -42874 68050
146 68050 -58066 -140548 53845 94294 -30442 -2220 20551 17742 113606 49095 -84299
157 -84299 28870 74863 -92821 -96631 -23402 -44449 30218 46310 -88016 -15278 127299
168 127299 11149 -56238 36572 33725 40001 52771 -80221 -70825 91339 10904 -107929 -2610
180 -2610 25368 -23916 15379 -38346 -68074 89781 87803 -58222 5137 70296 -5821 2255
192 2255 -16859 -88947 24118 74589 -87481 -70702 69583 29014 1978 25727 -38244 8559
204 8559 79668 -62432 -98732 64312 51031 -27645 17469 -12525 -26052 61415 -14315 -101496
216a01496J39179M3133j05991J3923N817l2545Q4629k0578j18561R9352R2736
227I9598j23827k8876O4361k6021L9144K5314j09207L5918J14772r5222o4655
238f8701Q3907j3843j4506M8417p9801j7922J41092k8844j06302O9738K7465n3687
250a2987K5255m3615m8588J28759J9841j32261M5431P6742p0410k616J5498n3610
262e2561P7751O1890j24463j3301J00522m5894l0438M3194m8771K1732Q7472r8449
274b1316o5040J20582P468o9913M0366j2076k1339P8323m7457r0925J00896M3248
286F2817r8313J6533L0028m4210N4243J6240r4554N3524Q0857r2321k6533N5325
298A3636l2002K2780M5451q6441J906J05362o5768p2875P5902Q126k1809M3225
$$ plain form
216 -101496 37683 80816 -25175 -11252 -5435 -37980 46649 26071 -92490 6862 99598
227 99598 -24229 -53105 11256 -14765 24379 49693 -59514 -23596 91176 -4046 -68701
238 -68701 15206 1363 -13143 35274 -44527 -62449 78643 49799 -56503 13235 40700 -12987
250 -12987 12268 -31347 -79935 48824 68665 -63596 -18165 58577 -11833 -14449 1049 -52561
262 -52561 25190 87080 -37383 -50684 49838 3944 -26494 16700 -32071 -10339 77133 -21316
274 -21316 -86356 34226 41694 -28219 12147 71 -21268 57055 9598 -81327 19569 62817
286 62817 -35496 -18963 11065 -33145 21098 37338 -57216 -3692 77165 -15156 -41689 13636
298 13636 -18366 4414 49865 -36576 -34670 70692 4924 -67951 7951 16077 -5732 37493
310C7493n3051l6931R9794j7213r0752O3878L6777n4926L1356j2368o4867P7630
322A6820L9789j01469J9350P0742n1180k912K4567n7806M4180O9458r3884k6097
334d8442R0278l5887m1563N1775k7090o205P3204n6605o3073Q6417O731o2606
346c3066M5811J078m1784O1947j1491q5955O6873N3471p8524N576L3122m5070
358b8012L1427K6535p7118L1882P9122o8825l0163N9336l0433o198N3329n5025
370a4143k1226Q1535l6302o2402N8704M621k7890N2290k7434n5970P1366L629
382B6778q1154M6016M6088m6502K2828J1207o1354M0681L9060q0019J1011O3543
394C8183n0786q735M3752m6789O793O6798n6733l3923P2821j9717l9629M7901
$$ plain form
310 37493 -15558 -52489 47305 30092 -60660 3218 39995 -14931 16425 4057 -60810 16820
322 16820 56609 -44860 -25510 45232 -5948 -8860 15707 -42099 2081 71539 -22345 -48442
334 -48442 41836 5949 -35614 16161 -10929 -17134 56070 -535 -63608 22809 29540 -33066
346 -33066 12745 13823 -27961 33986 22495 -63460 3413 56884 -21640 -16064 17058 -28012
358 -28012 3415 29950 -47168 -15286 63836 -4989 -35152 24184 -6249 -12447 40882 -14143
370 -14143 -35369 46166 9864 -52538 6166 10787 -17103 35187 7753 -48217 23149 26778
382 26778 -54376 -8360 37728 -8774 14054 25261 -36093 4588 43648 -36371 -25360 38183
394 38183 -12603 -21338 22414 -24375 -17582 49216 -7517 -41440 31381 11664 -27965 19936
406A9936j6780k2804O5305l1486o7645O4897J4085o1612L5375J8777m7395L9294
418I947J0344o8742M2425N3916n6098Q755L7596n5340O815L8331o2826K590P3641
431D1354m0108l0208N1515k3457k0765M7539l3552k7943P0182j7927n6122N3242
443A3750Q128m3377M0328K68n4172M3271J7204o4573K8546M1244m5824J8603K4379
456B7775n8694J9536M8871o0733m913O0121l5375k0239M4711l0156o787O2624
468D6741l3704l7494N4502k1123m9571M3897o765l6905N6998L391n6174M3697
480G490J9730n2821K7742K7020m3781K8463K3303o2646J3844M4780n2885m018
492b3779M5836l9719q007M3887l9456p955O3534k5335k7240N3222j6877l1537
$$ plain form
406 19936 3156 -19648 45657 14171 -53474 11423 25508 -36104 -729 18048 -29347 9947
418 9947 20291 -48451 -6026 47890 -8208 547 38143 -17197 -10382 27949 -34877 -32287 41354
431 41354 1246 -28962 22553 -904 -21669 25870 -7682 -35625 34557 16630 -39492 13750
443 13750 21878 -21499 18829 19097 -35075 8196 25400 -39173 -10627 30617 -15207 3396 27775
456 27775 -30919 -11383 37488 -23245 -28158 31963 -3412 -23651 21060 -9096 -15883 46741
468 46741 13037 -24457 30045 8922 -40649 3248 -3517 -40422 16576 19967 -36207 7490
480 7490 27220 -25601 2141 29161 -14620 13843 37146 -25500 -11656 33124 -19761 -23779
492 -23779 22057 -17662 -25669 18218 -21238 -29193 34341 9006 -18234 34988 18111 -13426
504a3426M5302j9616m6625M5181n108n5009L9371K1645l5171L8234J4941m9591
516a9872K6351K1584n9929J5711M6439l9754Q449L9088m7343q570M0756m2990
528b0080j1655N4774k3300j8139M7878k7162k9400N0637j8064m0844M9715K283
540A6643m4117L6867Q033m0089L5064J0641m8645L3206K4912n1313J7425K8393
552B7020n1582L941L1771m6903M076N5400k5041j060M8298l0517k1091L3846l6204
565h046k5896N3285j2736l3738M4734r384m6372L4296K442l6714M3368J9612l7036
578a2185L2926J8985m5651J7219J9035n2133P590K9660m5701L568M2439l3362
590a7610m409M3169k8579o521M7598k4448j9250M7852k2134l7700L5008j5930
$$ plain form
504 -13426 31876 12260 -34365 10816 5708 -49301 -9930 11715 -23456 14778 29719 -19872
516 -19872 6479 28063 -31866 -16155 30284 -9470 -1021 38067 -9276 -17846 22910 -20080
528 -20080 -31735 23039 -261 -18400 29478 2316 -27084 23553 5489 -35355 14360 16643
540 16643 -27474 9393 17426 -22663 12401 23042 -25603 7603 32515 -18798 -1373 27020
552 27020 -24562 -20621 11150 -35753 -31677 23723 -1318 -2378 45920 15403 -5688 28158 -8046
565 -8046 -33942 19343 6607 -27131 17603 8219 -38153 -3857 -1415 -38129 5239 24851 -12185
578 -12185 20741 39726 -5925 11294 30329 -21804 -14214 15446 -30255 -26687 15752 -17610
590 -17610 -22019 21150 -7429 -13950 33648 9200 -10050 37802 15668 -22032 12976 -2954
602b954l6229M2797L097l3058M1013P227m5398K6367J2823m3227K8846K8679m2719
615a2736J5449K9205m7319P45L1790l8149J106M0322l0128m676M3973k6579j7724
628a4721M2190k4677k9395L9615j3532l2540M1443O67l1416L7990M902l8854K9824
641A1496J0319m1819K5676J8582m6865J2783K4949m1865J1449L5821l2745M010
653h209L6270l5041o251M0475k7537j2134M1188k4456k6058L7711j7312l0650
665c2004L8530m440l0310L6833L610l3780L4934J0795l8053K7782J4436m4988
677a6655J3278J9688m4238J0371L1503l3331Q264L5694l2008r66L6359l0109j0874
690a3024L8626k6331k0123L9462j5030k6046L6934r529l0333L2883l752l0541
$$ plain form
602 -2954 -39183 3614 6711 -26347 14666 21893 -23505 2862 15685 -27542 1304 29983 -12736
615 -12736 2713 31918 -15401 -14656 17134 -21015 -19909 20413 -9715 -14391 29582 3003 -14721
628 -14721 27469 2792 -26603 13012 -520 -33060 8383 9050 -22366 15624 20526 -18328 11496
641 11496 21815 -20004 5672 24254 -22611 -9828 15121 -26744 -15295 20526 -12219 -8209
653 -8209 28061 -6980 -13231 27244 -293 -12427 28761 4305 -21753 15958 -1354 -32004
665 -32004 6526 2086 -28224 8609 12219 -21561 13373 24168 -13885 13897 28333 -16655
677 -16655 -3377 16311 -27927 -17556 13947 -19384 -11120 24574 -7434 -8400 27959 -2150 -13024
690 -13024 25602 -729 -20852 18610 3580 -22466 14468 4939 -25394 7489 3737 -26804
702b6804L5158R262l3349K9866J1609m2005J7363J7478m1792J3199K9180l3192
714a4027L783K9491l3044R33L3745k7769m023L8584k6316j9171L6775j9665k3169
727b3873L8041j0446k6522L5381k334k9564L1347K596l5859K6296R008l7378K4404
740A097J8476l6586J6956K4045l7646N752K4666l3486N809L3491k8691l354L5491
753B6020k8464j6046L3985k0549j6298L7663j3328k3631L5307o030k9589L1922
765A0962J035l0827K9044N457l7348K3458J5845l6503J6429K0020l4005J1779
777d654K4305l3115O751K9438l2274k682L2700k7174r840L5071k0711j3945L5018
790A8888j4689k3787L1966q460k4728L2419l057k7058L1106J861l7184K5124J3767
$$ plain form
702 -26804 8354 17616 -15733 14133 25742 -16263 1100 18578 -23214 -10015 19165 -14027
714 -14027 -10244 19247 -13797 -12864 20881 -6888 -10911 27673 1357 -17814 18961 -704 -23873
727 -23873 14168 3722 -22800 12581 10247 -19317 12030 14626 -21233 5063 14071 -23307 1097
740 1097 19573 -17013 -57 23988 -13658 -7906 16760 -16726 -10917 22574 -6117 -9471 26020
753 26020 -2444 -18490 15495 -5054 -21352 16311 2983 -20648 14659 8629 -20960 10962
765 10962 11997 -18830 10214 15671 -21677 1781 17626 -18877 -2448 17572 -16433 -4654
777 -4654 19651 -13464 -6713 22725 -9549 -12231 20469 -6705 -16545 18526 -2185 -16130 18888
790 18888 4199 -19588 12378 3918 -20810 11609 8552 -18506 12600 14461 -22723 2401 16168
803A6168l4269J7816J7386l3482J3152K2535l3117P600K6844l0044j36K7851k7736
816i432m113L3990k4777j3652L6176j5770k0323L1632j0488k0981L1392n514k6802
829a8662K9293J098l2322K5103R594l1313K0391J3237l3894J4968J9463l1586
841a4630P599K4818k7937K639K6342k7979j796L2647k4141j2694L1746j6211j6012
854a5609K9467j3337j9092L1900p690k5993K8787N93k7702K5456N860k9115K2293
867E818J1671l2710J3784J7481l0155J1333J9826l0186O235K5965l0831j970L1360
880A7621k1491q837K9624j7498j3068L1117j6552j7704L1856q971k4589K8181
892I689k983k4950K7177J124l0274K3770J1956l1395J4690J5557k7588J3206J7779
$$ plain form
803 16168 -18101 -285 17101 -16381 -3229 19306 -13811 -6211 20633 -9411 -9547 18304 -9432
816 -9432 -13545 20445 -4332 -17984 18192 2422 -17901 13731 3243 -17738 13654 8140 -18662
829 -18662 10631 11729 -20593 4510 14104 -17209 3182 16419 -17475 -2507 16956 -14630
841 -14630 -7031 17787 -10150 -7511 18831 -9148 -10944 21703 -2438 -15132 16614 403 -15609
854 -15609 13858 521 -18571 13329 5639 -20354 8433 9026 -18676 6780 12640 -16475 5818
867 5818 17489 -15221 -1437 16044 -14111 -2778 17048 -13138 -6903 19062 -11769 -13739 17621
880 17621 -3870 -12707 16917 -581 -13649 17468 916 -16788 15068 6097 -18492 9689
892 9689 6706 -18244 8933 10057 -20217 3553 15509 -15886 -1196 14361 -13227 -21 17758
905A7758l0447P956K4498k9348j06K6385k2445n648K6674k1268j0090L0983j4592
918C10j6019K9341q501j9492K6634o832k2447K7111J157k9287K2699Q861k8360
931a4825J5918J0277k7734J6005J5998l0122R446K3392k6054J459K3616k4124
943f748j657K5245k4331q240K9512j4505j4233K7021j1154j5699K9535q831k2935
956a7020K8885Jk8041K0303N536k5520J8934P438k7139J6260J5191k8138R523
969c787J9322k4074N907K1358k5838n6K6168k3664r246K5519j5696j0393K5393
982A0913j4242j2328K9142q868j9870K7445r72k2232J9369Q94k4351J9387O184
995A0471k8424J5232J4314k4773J0132J5687k3829Q100K1041k6881K73K5604k0456
$$ plain form
905 17758 -12689 -4733 19765 -9583 -9689 16696 -5749 -11397 15277 -5991 -16081 14902 310
918 310 -15709 13632 5131 -14361 12273 5441 -17006 10105 11262 -18025 4674 13535 -14825
931 -14825 1093 11370 -16364 -359 15639 -14483 -5037 18355 -7699 -6240 17376 -6748
943 -6748 -8405 16840 -7491 -15731 13781 -724 -14957 12064 910 -14789 14746 5915 -17020
956 -17020 11865 11866 -16175 4128 9664 -15856 3078 10516 -16623 -363 14828 -13310 -3787
969 -3787 15535 -8539 -2632 18726 -7112 -7168 19000 -4664 -13910 11609 -4087 -14480 10913
982 10913 -3329 -15657 13485 4617 -15253 12192 11220 -11012 8357 9251 -15100 4287 10471
995 10471 -17953 -2721 11593 -13180 -3048 12639 -11190 -3090 17951 -8930 -8657 16947 -3509
1008c509n604K3646j7208q077K4474j6700j3090K7267q257j7505K5016l530k0269
1021a3346K2369j752k4714K2424N861k5860J6404J0719k4274J3030J3825k5899
1033a1213R788J8999k5886P49K0860k1132k230K0193j9130l706K5795j3767j1012
1046a1692K6470q954j4474K2320p977j7922K1371k634k2961J8418M369k2690J4624
1059a732P396k1675J6160J3585k2215J0485J8000k2880K858J6519k2436j460J9164
1072A1769k1102n664K3026j3721q438K3658j0366r486K4507q209j6005K3641l040
1085A0570k0995J6986M76k1139J5519M855k3211J5698J1010k2498J0185J5518
1097A2974k1083O919J6643k1542J972J9947k0594m251J9826j4995p585K3139j3767
$$ plain form
1008 -3509 -9113 14533 -2675 -10752 13722 -2978 -16068 11199 2942 -14563 10453 6923 -13346
1021 -13346 9023 7271 -17443 4981 10842 -15018 1386 12105 -12169 861 14686 -11213
1033 -11213 -1425 17574 -8312 -7563 13297 -7835 -10065 10128 -9002 -12708 13087 -680 -11692
1046 -11692 14778 5824 -8650 13670 5693 -12229 9142 6508 -16453 1965 6334 -16356 -1732
1059 -1732 5664 -16011 149 13734 -8481 2004 20004 -2876 -18 16501 -5935 -7395 11769
1072 11769 -9333 -14997 8029 -5692 -14130 9528 -838 -10324 14183 5974 -10031 13610 10570
1085 10570 -10425 6561 7037 -14102 1417 6272 -16939 -1241 9769 -12729 -2544 12974
1097 12974 -8109 -1190 15453 -6089 -4117 15830 -4764 -9015 10811 -4184 -11769 11370 -2397
1110b397j0004K4464q899j5639K2286m386j7994J8577o95j8739J7853L808k1363
1123a3128J5124R614k0818J0509J1979k2199O956J4693k2302L114J7829j8859
1135g488j477J9082j6532k390K2439j4969p718K2073q818j3499J9687n843j6270
1148a1723J8385m410j8695J8475K478j8696J6262O823j9679J3314J0968k1187
1160g685Q530J4453k1892L528J3644j8384p57J7179j6744j704K0294j4208n794
1173i540K1985r810r977J9126o607j4255J8831n342j6589J5994O56j7763J4141
1186H50M310j8193J4805Q820j9628R797J2153j8982M257J3032j7464J443J4674
1199I874j6831j347J7585j3030m415J8465j1860q181K0232p873j2410J9360n362
$$ plain form
1110 -2397 -12401 12063 3164 -12475 9811 5425 -12569 6008 5313 -13426 4427 8235 -13128
1123 -13128 1996 11610 -9208 1301 13280 -8919 -1963 12730 -9572 -6458 11371 -7488
1135 -7488 -8965 10117 -6415 -8805 13634 -1335 -9053 13020 4202 -9297 10390 4547 -11723
1148 -11723 6662 2252 -16443 2032 4510 -14186 2076 8899 -10780 2534 13502 -7685
1160 -7685 845 15298 -6594 -3066 10578 -7806 -8563 8616 -8128 -9832 10462 -3746 -9540
1173 -9540 12445 2635 -7342 11784 5177 -9078 9753 4411 -12178 3816 4472 -13291 850
1186 850 5160 -13033 1772 10592 -9036 761 12914 -6068 -1811 11221 -6243 -4800 9874
1199 9874 -6957 -8304 9281 -3749 -8164 10301 -1559 -9740 10492 2619 -9791 9569 4207
1212D207j5870J7262k49j6636J5524K183j7766J3793O479j8505J0445R582j8545
1225h096O564J1527j8051L818J4116j6150k92J7005j3929k885J7196j1973p088
1238h238J8311q863j0847J6721n036j3295J6658k791j4147J5630J864j6133J3696
1251C530N411j7038J0150P657j7604O248J0807j6681M137J2438j6049J913J4049
1264H968j4044j540J6888j2156m725J7191r083r614J5971n449j1869J5200l022
1277B716j2888J4535n80j3792J3311L363j5106J0896O768j6315O790R168j5581
1290f715M501J1261j5650K795J2756j4190j376J6412j2950l321J5766j0311o490
1303g512J6046o749r695J4870m083j1837J3756j046j3823J3922K278j5608J1225
$$ plain form
1212 4207 -11663 5599 5350 -11286 4238 6421 -11345 2448 8927 -9578 867 10449 -8096
1225 -8096 -1532 9995 -8056 -4238 9878 -6272 -6564 10441 -3488 -6373 10823 -1150 -8238
1238 -8238 10073 1210 -9637 7084 2048 -11247 5411 2620 -11527 4103 5967 -10166 3530
1251 3530 8941 -8097 2053 9710 -7894 -1646 9161 -7520 -3383 9055 -6994 -5081 8968
1264 8968 -5076 -6616 10272 -1884 -6609 10582 1499 -8115 7856 2407 -9462 5738 2716
1277 2716 -10172 4363 3783 -10009 3302 6665 -8441 2455 9223 -7092 -302 8866 -6715
1290 -6715 -2214 9047 -6603 -3808 8948 -5242 -6618 9794 -3156 -6477 9289 -1022 -7512
1303 -7512 8534 1785 -7910 6960 2877 -8960 4796 3750 -10073 3849 6127 -9481 1744
1316A744N876j6247Q625Q154j5117N433J0302j3969K139J1898j3409p34J3627
1329H322j1998k079J4290r426o139J4571o959q461J4847m820j0373J3730k193
1342C312j2112J3258Q69j4004J0415M726j4481Q434O415j4146O961P979j4025
1355f399L790J0692j3228J593J1696j2586o63J3231j0351l901J3420p579p030
1368g315J3180m519q377J2543l440j0195J2383K50j2579J1175K827j3600Q945
1381A278N226j3456O606P916j3735L092R951j1962K696R452j1377q9J2770j0739
1395b371l918J4075p866n512J1329n310p774J2592l825r510J1715P79j0945J0044
1409C503J582j2342R769L190j2269P108O180j1615L612P517j1845L980Q840j1979
$$ plain form
1316 1744 7620 -8627 -2 8152 -6965 -1532 8770 -5199 -3060 8838 -4571 -5305 8322
1329 8322 -3676 -5755 8535 -891 -7030 7541 582 -7879 6968 2148 -8225 5505 3312
1342 3312 -8800 4458 5327 -8677 1738 6464 -8017 417 6832 -7314 -353 7626 -6399
1355 -6399 -2609 8083 -5145 -3552 8144 -4442 -5105 8126 -2225 -6126 7294 -285 -7315
1368 -7315 5865 1346 -7031 5512 2072 -8123 4260 4510 -8069 3106 5933 -7667 1278
1381 1278 6504 -6952 -346 7570 -6165 -3073 6878 -5084 -2388 7064 -4313 -4402 8368 -2371
1395 -2371 -6289 7786 -80 -5592 5737 427 -7347 5245 1420 -8090 3625 4404 -6541 3503
1409 3503 5085 -7257 2512 5702 -6567 541 6721 -4894 -1282 6235 -5610 -1630 7210 -4769
1423d769M33J1788r471l466J2206p093m219J1767p410o536J3504m915r553J1738
1437D004j664q824R546r6j0039R082L318j1564O366N630j1221N566N444j0888
1451e340M172Q141j1240Q83R919q222k378J0429q036k969J1010o640n678J0792
1465D843l716p195J0277k989p031J0734k116j0453R687L825j0643N587L128q705
1479d767M905M891j1631N033Q185j0045k98Q526p623R26Q526r343j325J1586o356
1494A190o603R424m012m661R449m473p497J0808K11r922P145L073q873P578P11
1509C548r291P165N202j1515L204O523r116K245N755q024K140R600q610l500R839
1524E165m522l912P181m980l172J0306m782q787R649P79p687O877Q06p479P479
$$ plain form
1423 -4769 -4336 7452 -2019 -5485 6721 -372 -4591 7176 -234 -6770 6734 1819 -7734 4004
1437 4004 2340 -6484 3062 2966 -7073 2009 5327 -6237 129 5759 -5462 104 5548 -5340
1451 -5340 -1168 6973 -4267 -3384 6535 -1687 -4065 6364 -1672 -4641 6369 -271 -5949 4843
1465 4843 1127 -6068 4209 1220 -5811 4923 2807 -7646 2041 5866 -4777 810 3938 -4767
1479 -4767 138 5029 -6602 -1569 6616 -3429 -3727 4799 -2824 -1898 6628 -2715 -4040 7546 1190
1494 1190 -5413 4011 -1 -4662 4787 314 -7183 3625 3836 -6086 1059 4132 -4741 2837 3548
1509 3548 -5743 1422 6624 -4891 -1687 4836 -4280 -2035 3720 -4304 -2164 7436 -1174 -4674 5165
1524 5165 643 -3269 3912 -1068 -4240 6066 1284 -7503 2146 2925 -4762 2115 2921 -4558 2921
1539B921J408j0818N566O664j0001K916N445q439N054N302j0566P28J1010p923
1553g33l381P265m373m66P419p391l795J0396l372q079O743J123n076P301j046
1568B535p938R175J666j0379M034M448o336M373Q38q531M905O901j0098p14R267
1583D146m533o43N646p524R42R018p179n717Q330o10n724O112k934l229Q841k508
1599B434r210P803L181o195K914J717o049O097J480j0743L625P625p110J64M659
1614B392l755K335M804q836j299R424m738m542O021j744k037N781n291n243J0889
1629D161j044p361M380K353m051N130j712p205O995L176r466R37P362l983J781
$$ plain form
1539 2921 4329 -6489 -923 5741 -4260 -1344 4101 -4338 716 6018 -4548 -3820 7190 -733
1553 -733 -4114 3151 -1222 -1688 5731 -1660 -5455 4941 1569 -6510 233 1356 -3720 3581 2535
1568 2535 -5403 3772 5438 -4941 -907 3541 -2795 1578 2416 -6115 -1210 5691 -4407 -5121 4146
1583 4146 -387 -1030 4616 -2908 -1966 7052 -127 -5844 2486 1876 -3848 2264 -670 -3899 4942 2434
1599 2434 -6776 1027 4208 -1987 927 2644 -3405 2692 4172 -6571 -2946 4679 -2431 -2267 2392
1614 2392 -1363 972 5776 -3060 -4359 5065 327 -4215 1806 62 -1975 3806 -1485 -6728 4161
1629 4161 3117 -4244 136 2489 -1562 3568 1856 -5349 1646 4822 -4644 -3707 3655 -328 1453
$$ [...]
8191a73
##END NTUPLES=NMR FID
##END=
