##TITLE=1H_T-3922
 C6D6+DMSO, 108 sc, 
 17.1.2019
##JCAMPDX= 6.0         $$ Bruker NMR JCAMP-DX V2.0
##DATA TYPE= NMR FID
##DATA CLASS= NTUPLES
##ORIGIN= UXNMR, Bruker Analytische Messtechnik GmbH
##OWNER= root
$$ XWIN-NMR		Version 3.5
$$ Thu Jan 17 16:21:59 2019 Russian Standard Time (UT+4h)  she@DPX200
##.OBSERVE FREQUENCY= 200.1313
##.OBSERVE NUCLEUS= ^1H
##.DELAY= (6, 6)
##.ACQUISITION MODE= SIMULTANEOUS
##.ACQUISITION SCHEME= undefined
##.AVERAGES= 108
##.DIGITISER RES= 18
##SPECTROMETER/DATA SYSTEM= spect
##.PULSE SEQUENCE= zg30
##.SOLVENT NAME= C6D6
##.SHIFT REFERENCE= (INTERNAL, C6D6, 0, 15.7039)
##AUDIT TRAIL= $$ (NUMBER, WHEN, WHO, WHERE, WHAT)
$$ ##TITLE= Audit trail, XWIN-NMR		Version 3.5
$$ ##JCAMPDX= 5.01
$$ ##ORIGIN= Bruker BioSpin GmbH
$$ ##OWNER= she
$$ F:/spectra/data/she/nmr/H-F/1/audita.txt
$$ ##AUDIT TRAIL=  $$ (NUMBER, WHEN, WHO, WHERE, WHAT)
(   1,<2019-01-17 16:17:52.92 +0400>,<she>,<DPX200>,
      <continue with go, POWCHK disabled, PULCHK disabled
       configuration hash MD5:
       00 E9 B6 7A A2 85 ED C7 34 08 36 98 17 FE 4E 26
       data hash MD5: 16K
       1E 0F CF B3 2D 88 BE 55 B0 D9 20 A2 3C 71 28 F7>)
$$ ##END=
$$ 
$$ hash MD5
$$ D5 33 DE 93 AA 2C B1 82 B6 1E 70 62 0C 10 68 A0
##$RELAX= 
##$RELAX= 
##$RELAX= 
##$RELAX= 
##$RELAX= 
##$RELAX= 
$$ Bruker specific parameters
$$ --------------------------
##$DU= <F:/spectra>
##$EXPNO= 1
##$NAME= <H-F>
##$PROCNO= 1
##$TYPE= <nmr>
##$USER= <she>
##$AMP= (0..31)
100 100 100 100 100 100 100 100 100 100 100 100 100 100 100 100 100 100 
100 100 100 100 100 100 100 100 100 100 100 100 100 100 
##$AQSEQ= 0
##$AQ_mod= 1
##$AUNM= <au_zg>
##$AUTOPOS= <>
##$BF1= 200.13
##$BF2= 200.13
##$BF3= 200.13
##$BF4= 200.13
##$BF5= 200.13
##$BF6= 200.13
##$BF7= 200.13
##$BF8= 200.13
##$BYTORDA= 1
##$CFDGTYP= 0
##$CFRGTYP= 5
##$CHEMSTR= <none>
##$CNST= (0..31)
1 1 145 1 1 1 1 1 1 1 1 1 1 1 1 1 1 1 1 1 1 1 1 1 1 1 1 1 1 1 1 1 
##$CPDPRG= <>
##$CPDPRG1= <>
##$CPDPRG2= <>
##$CPDPRG3= <>
##$CPDPRG4= <mlev>
##$CPDPRG5= <mlev>
##$CPDPRG6= <mlev>
##$CPDPRG7= <mlev>
##$CPDPRG8= <mlev>
##$CPDPRGB= <>
##$CPDPRGT= <>
##$D= (0..31)
0 1.2 0 0 0 0 0 0 0 0 0 0.03 0 0 0 0 0 0 0 0 0 0 0 0 0 0 0 0 0 0 0 0 
##$DATE= 1547726976
##$DBL= (0..7)
120 120 120 120 120 120 120 120 
##$DBP= (0..7)
150 150 150 150 150 150 150 150 
##$DBP07= 0
##$DBPNAM0= <>
##$DBPNAM1= <>
##$DBPNAM2= <>
##$DBPNAM3= <>
##$DBPNAM4= <>
##$DBPNAM5= <>
##$DBPNAM6= <>
##$DBPNAM7= <>
##$DBPOAL= (0..7)
0.5 0.5 0.5 0.5 0.5 0.5 0.5 0.5 
##$DBPOFFS= (0..7)
0 0 0 0 0 0 0 0 
##$DE= 6
##$DECBNUC= <off>
##$DECIM= 32
##$DECNUC= <off>
##$DECSTAT= 4
##$DIGMOD= 1
##$DIGTYP= 9
##$DL= (0..7)
0 120 120 120 120 120 120 120 
##$DP= (0..7)
150 150 150 150 150 150 150 150 
##$DP07= 0
##$DPNAME0= <>
##$DPNAME1= <>
##$DPNAME2= <>
##$DPNAME3= <>
##$DPNAME4= <>
##$DPNAME5= <>
##$DPNAME6= <>
##$DPNAME7= <>
##$DPOAL= (0..7)
0.5 0.5 0.5 0.5 0.5 0.5 0.5 0.5 
##$DPOFFS= (0..7)
0 0 0 0 0 0 0 0 
##$DQDMODE= 0
##$DR= 18
##$DS= 0
##$DSLIST= <SSSSSSSSSSSSSSS>
$$ [...]
##$SUBNAM2= <"">
##$SUBNAM3= <"">
##$SUBNAM4= <"">
##$SUBNAM5= <"">
##$SUBNAM6= <"">
##$SUBNAM7= <"">
##$SUBNAM8= <"">
##$SUBNAM9= <"">
##$SW= 20.0189088683792
##$SWIBOX= (0..15)
0 0 2 0 0 0 0 0 0 0 0 0 0 0 0 0 
##$SW_h= 4006.41025641026
##$TD= 16384
##$TD0= 1
##$TE= 0
##$TE2= 300
##$TE3= 300
##$TEG= 300
##$TL= (0..7)
0 120 120 120 120 120 120 120 
##$TP= (0..7)
150 150 150 150 150 150 150 150 
##$TP07= 0
##$TPNAME0= <>
##$TPNAME1= <>
##$TPNAME2= <>
##$TPNAME3= <>
##$TPNAME4= <>
##$TPNAME5= <>
##$TPNAME6= <>
##$TPNAME7= <>
##$TPOAL= (0..7)
0.5 0.5 0.5 0.5 0.5 0.5 0.5 0.5 
##$TPOFFS= (0..7)
0 0 0 0 0 0 0 0 
##$TUNHIN= 0
##$TUNHOUT= 0
##$TUNXOUT= 0
##$USERA1= <user>
##$USERA2= <user>
##$USERA3= <user>
##$USERA4= <user>
##$USERA5= <user>
##$V9= 5
##$VALIST= <valist>
##$VCLIST= <CCCCCCCCCCCCCCC>
##$VD= 0
##$VDLIST= <DDDDDDDDDDDDDDD>
##$VPLIST= <PPPPPPPPPPPPPPP>
##$VTLIST= <TTTTTTTTTTTTTTT>
##$WBST= 1024
##$WBSW= 4
##$XGAIN= (0..3)
0 0 0 0 
##$XL= 0
##$YL= 0
##$YMAX_a= 595712
##$YMIN_a= -812419
##$ZGOPTNS= <>
##$ZL1= 120
##$ZL2= 120
##$ZL3= 120
##$ZL4= 120
##$ABSF1= 10
##$ABSF2= 0
##$ABSG= 5
##$ABSL= 3
##$ALPHA= 0
##$AQORDER= 0
##$ASSFAC= 0
##$ASSFACI= 0
##$ASSFACX= 0
##$ASSWID= 0
##$AUNMP= <proc_1d>
##$AZFE= 0.1
##$AZFW= 0.1
##$BCFW= 1
##$BC_mod= 2
##$BYTORDP= 1
##$COROFFS= 0
##$CY= 11.3945322036743
##$DATMOD= 1
##$DC= 2
##$DFILT= <>
##$DTYPP= 0
##$F1P= 18.9103706918063
##$F2P= -1.10871071338519
##$FCOR= 0.5
##$FTSIZE= 0
##$FT_mod= 4
##$GAMMA= 1
##$GB= 0.15
##$INTBC= 1
##$INTSCL= 1
##$ISEN= 128
##$LB= 0.24
##$LEV0= 0
##$LPBIN= 0
##$MAXI= 10000
##$MC2= 0
##$MEAN= 0
##$ME_mod= 0
##$MI= 1.114404
##$NCOEF= 0
##$NC_proc= 0
##$NLEV= 6
##$NOISF1= 3.799351
##$NOISF2= 2.8
##$NSP= 1
##$NTH_PI= 0
##$NZP= 0
##$OFFSET= 15.70392
##$PC= 1
##$PHC0= -9050.438
##$PHC1= 10.40004
##$PH_mod= 1
##$PKNL= yes
##$PPARMOD= 0
##$PSCAL= 0
##$PSIGN= 0
##$REVERSE= no
##$SF= 200.130013532006
##$SI= 16384
##$SIGF1= 3
##$SIGF2= 2
##$SINO= 400
##$SIOLD= 16384
##$SREGLST= <1H.CDCl3>
##$SSB= 0
##$STSI= 0
##$STSR= 0
##$SW_p= 3612.71676300578
##$SYMM= 0
##$S_DEV= 0
##$TDeff= 0
##$TDoff= 0
##$TI= <>
##$TILT= no
##$TM1= 0
##$TM2= 0
##$TOPLEV= 0
##$USERP1= <user>
##$USERP2= <user>
##$USERP3= <user>
##$USERP4= <user>
##$USERP5= <user>
##$WDW= 1
##$XDIM= 8192
##$YMAX_p= 0
##$YMIN_p= 0
$$ End of Bruker specific parameters
$$ ---------------------------------
##NTUPLES= NMR FID
##VAR_NAME=  TIME,          FID/REAL,        FID/IMAG
##SYMBOL=    X,             R,               I
##VAR_TYPE=  INDEPENDENT,   DEPENDENT,       DEPENDENT
##VAR_FORM=  AFFN,          ASDF,            ASDF
##VAR_DIM=   8192,          8192,            8192
##UNITS=     SECONDS,       ARBITRARY UNITS, ARBITRARY UNITS
##FACTOR=    0.0002496,     1,               1
##FIRST=     0,             0,               0
##LAST=      2.0444736,     0,               0
##MIN=       0,             -812419,         0
##MAX=       2.0444736,     595712,          0
$$ Real data points
##PAGE= N=1
##DATA TABLE= (X++(R..R)), XYDATA
0@%%%%%%%%%%%%%%%%%J05k13K16k16K16k17L19m26M33m95O02o56P65q96J006j181
33f38J332j478J671j887K120k382K662k962L304l666M056m494M974n496O061o678
49c501P360q106Q927r840J0852j1987J3256j4685J6328j8221K0426k3048K6226
62A3987l0165L5205m1926N1389o5775R0800j47048N43679j9965k30962L07446
73E06665l41612J79362K15893l09101j40116J28577m46869q0994L13801k31147
83b05541k50084K09129k58405j62957M48726N7469j98438L81495J00714k37766
93a15658K41956J43698j95192K66844J18461l62121J35515K49714l47068o7341
103F8808J59856l19331j01651J99181k75157j22242K84275j58596j45110L34970
$$ y = [0, 0, 0, 0, 0, 0, 0, 0, 0, 0, 0, 0, 0, 0, 0, 0, 0, 0, 105, -108, 108, -108, 108, -109, 210, -216, 217, -278, 324, -332, 433, -463, 543, -638, 694, -784, 887, -1000, 1120, -1262, 1400, -1562, 1742, -1924, 2132, -2362, 2612, -2884, 3177, -3501, 3859, -4247, 4680, -5160, 5692, -6295, 6961, -7724, 8604, -9617, 10809, -12239, 13987, -16178, 19027, -22899, 28490, -37285, 53515, -93533, 450146, 430181, 199219, 506665, 165053, 344415, 560308, 251207, 111091, 239668, -207201, -288195, 25606, -205541, -455625, -246496, -504901, -667858, -219132, -161663, -360101, 21394, 122108, -115658, 126298, 269996, 74804, 341648, 460109, 97988, 233503, 483217, 136149, 68808, 228664, -90667, -192318, 6863, -268294, -390536, -106261, -264857, -409967, -74997]
113g4997k9950j35352L08817m0770k42004L47730J75135k32188J92724J53165
123D22310k51903Q0270P0734l32343M8167J48568l52972l7937K68435k12463j10672
134b59806J95626k32298j36378L13426n9964j28034L31220M3245j48659K56192
144A74570L3452j92805K45147O2908k99542J56269J89213k51815R439Q6232k96819
155h3751j1811J48538k74829n2647K35517j94019j20649K48256p2321p3046K82231
166C1469n5807j59193K89916P8945j62640J95780N9825j85084J67503O1581k71072
177E1223R1528J05152l21606m8139J48828j97219j9403J56889k21178o6060K40172
188g9813j18399r7983K56865k1143p9433K64672J3387j19943K47839K4404k44319
$$ y = [-74997, -104947, -240299, 68518, 27748, -214256, 133474, 308609, 76421, 269145, 422310, 170407, 250677, 321411, -10932, 37235, 185803, -167169, -205106, 63329, -149134, -259806, -64180, -296478, -432856, -119430, -179394, -307428, 23792, 67037, -81622, 174570, 208022, 15217, 260364, 323272, 23730, 179999, 369212, 117397, 126836, 213068, -83751, -95562, 52976, -221853, -274500, -38983, -233002, -353651, -105395, -177716, -250762, 31469, -24338, -183531, 106385, 185330, 22690, 218470, 278295, 93211, 260714, 322295, 51223, 142751, 247903, -73703, -121842, 26986, -170233, -189636, -32747, -253925, -319985, -79813, -198212, -296195, -39330, -60473, -139906, 124766, 138153, 18210, 266049, 290453, 46134]
199D6134J36469R3884j91585R0539N1422k70326K9227J00056k71453l1078J68412
210d8299j84935n6638J91398j06171k2452K41605r0397j04104K56842K5973r5117
221G705K11561J3380j61428J64554K2941k21534J09616P1313k48323M347P3607
232D7739j99223K0422J07048k16400k2556J97054j16837l8301K08535o1945n2218
243a26682K11287l3459p1304K37061N109j68774J36733K7416j60241J07611J3769
254A78526k24212O2623P0817k22905O918J07885j75713j6658J29213j29890J8052
265a95344K13348j02876o5999K06519j9689n7206J92034j8566j07194J69843n968
276B08902j73531J18372L0217j97435M0168K9647j79193N8867Q1228k03100n014
$$ y = [46134, 182603, 276487, 84902, 175441, 226863, -43463, -14236, 85820, -185633, -216711, -48299, -233234, -289872, -98474, -204645, -227097, 14508, -75889, -179993, 76849, 102822, 7705, 219266, 232646, 71218, 235772, 258713, 37179, 146795, 218108, -30215, -25868, 47739, -151484, -131062, -24014, -240414, -262970, -65916, -182753, -221054, -12519, -74464, -126682, 84605, 51146, -20158, 216903, 222012, 53238, 189971, 217387, 57146, 164757, 178526, -45686, 16937, 87754, -135151, -128233, -20348, -196061, -212719, -83506, -213396, -195344, 18004, -84872, -150871, 55648, 35959, -21247, 170787, 152221, 45027, 214870, 208902, 35371, 153743, 183960, -13475, 26693, 56340, -122853, -63986, 17242, -185858, -190872]
287a90872J35074j24561l797J62983q4087r286J81542o6115m6813K04942j6273
298A42737j10031J33242p078j12902J24587p874j83560O9828L0145j81508L7225
309f5189O4904j57848J8732Q5324j41511K6961J64499r6218k6265J61430m6297
320a1478j8435J70783m3975p1960J53710k5942j22654J20396M996j48516O2810
331F9735n300j60898O8680M8894j71560K0028Q7911j24118K5262J21490r5772
342a15648J1290J46538q0091j9757J74582l1264o2056J25881l5921q0336J26038
353A59256k6454j42114Q1674L748j48736N5323L3044j37127L8350N0403j38067
364a70700L9144J21671r3922L620J21342o5504O311J45047n6517l9747J35058
$$ y = [-190872, -55798, -180359, -184156, -21173, -105260, -114546, 66996, 881, -45932, 159010, 142737, 32706, 165948, 158870, 45968, 170555, 162681, -20879, 48949, 79094, -102414, -65189, -285, -158133, -139401, -54077, -195588, -168627, -4128, -100346, -126611, 34819, -11478, -29913, 140870, 96895, 24935, 178645, 152703, 30049, 150445, 155441, 6925, 69735, 64435, -96463, -27783, 21111, -150449, -130421, -42510, -166628, -141366, -19876, -115648, -104358, 42180, -37911, -57668, 116914, 85650, 23594, 149475, 113554, 33218, 159256, 132802, -9312, 72362, 76110, -72626, -17303, 15741, -121386, -83036, -32633, -170700, -131556, -9885, -103807, -100187, 21155, -44349, -38038, 107009, 50492, 10745, 145803]
375A45803l9692q3652J11493j8745j03342P3727k8896j32434P6587K5780j41571
386a14942L3765M5940j14783M0973Q6429r3592L2610J17439q1813Q18J34568m6668
398D0744k4088J13197n3442n1982J23730l3900j03926P6765k5265j18556O2340
409E617N730j14370N9054K8342j24967M4497P8238r1612K5763R1269p3233K4990
421d0682J23158n9753j6042J11017n5062n0842J01651l3743o9053Q2674l9764
432E3559j06974P2763M76j09201M9310K1056r9809N1910N5279q8394M1939Q1349
444B3263q0920J8728J07696n1883j663R4063o4488l3218J00890m0341o4799P8887
456H6215l5915q7547O4356j9428r5231O2463Q536j04358N3551N0632p9788L7169
$$ y = [145803, 106111, 22459, 133952, 115207, 11865, 85592, 56696, -75738, 849, 26629, -114942, -81177, -35237, -150020, -109047, -22618, -116210, -83600, 33839, -47974, -47156, 87412, 40744, 16656, 129853, 76411, 24429, 148159, 114259, 10333, 87098, 61833, -56723, 5617, 11347, -103023, -43969, -15627, -140594, -96097, -17859, -109471, -83708, 7561, -65672, -40682, 82476, 22723, 6681, 117698, 62636, 11794, 113445, 79702, 10649, 93323, 53559, -53415, 19348, 19824, -89377, -40067, -19011, -118820, -66910, -11631, -100025, -58086, 23263, -57657, -38929, 68767, 16884, 15221, 109284, 44796, 11578, 112468, 72127, 7328, 86215, 50300, -37247, 27109, 7681, -87550, -25087, -16551, -120909, -67358, -16726, -96514, -59345]
468e9345N7144p8893L3729R6422o0368J2479R8053n6622k5704Q5911m5603m2125
480A5078Q3558m2643p5562P2858j7180q6822N0130r831r0252N5505L1910q0955
492i4206N0021N3383q1212K4128P1558n6811K1547Q4357n7729p972Q6434m6234
504D7264l8172P0012m5821n8031O8111k4040o9889O2423j1037q6474M7233J9820
516a8601o9140N0308M2008o9845L8852O6457o0158K3584P4681n6827l527P3535
528I1327n0175k4087O8431n3013n5691O4946k9475o4185N6751k1822p6917N2998
540d0912R488o6164N9211M0701o2874M1457N1339n7150K9825O3152n9372Q054
552A6755P4926m7874j4708O0967n6566m7793N3874m2283n2674O3092j5595o4057
$$ y = [-59345, -2201, -81094, -47365, 49057, -11311, 1168, 99221, 42599, 16895, 102806, 57203, 15078, 98636, 55993, -19569, 53289, 36109, -50713, -583, -10414, -100666, -45161, -13251, -94206, -44185, 9198, -72014, -47886, 23672, -33139, -11592, 72765, 15036, 7064, 93498, 47264, 9092, 79104, 33283, -24748, 43363, 19323, -50566, 11857, 820, -85654, -38421, -18601, -87741, -37433, 4575, -65270, -26418, 40039, -20119, 3465, 78146, 21319, 17792, 91327, 41152, 17065, 85496, 32483, -23208, 41738, 12263, -51922, 4829, -16993, -93910, -40912, -31424, -97588, -38377, 2324, -60550, -19093, 32246, -24904, 4921, 68073, 8701, 16755, 91681, 43807, 29099, 90066, 33500, -14293, 39581, -2702, -55376, 7716, -7879, -71936]
564g1936N2312K20o2511N0662J9876o2876M8266N1878n1336L7593N4554n7206
576I496P153N3974n3528m579O2317n0016l2632N4804l8034m1935N2583k7617n6084
589f4098N1729m326n7285N5206J7399n6644M6274L1833n3768L5824M4045n8655
601a2466J3318N2655m8071N522N8476m9689k2639N2703m6181l8232N5077k6022
613e549m5920N5083p397m7672N2592J295n9575M0583K2246n0208M2865M3372m9306
626g591K1724M3118n5656L976M8119m8138j1820N0781l7746k3091N1468l4250
638H94m4643M4786j9162m5648N2787M200m6716M4959J5154m5845M0574L0524m9244
651a7380K4943L8963m7288J5712M6566m7138n180M5656m6006k3278M6463l5433
$$ y = [-71936, -19624, -19404, -81915, -31253, -11377, -74253, -25987, 25891, -25445, 12148, 66702, 9496, 16649, 70623, 17095, 12516, 74833, 24817, -7815, 46989, 8955, -32980, 19603, -8014, -64098, -12369, -16695, -73980, -18774, -1375, -58019, -11745, 20088, -33680, 2144, 46189, -12466, 852, 53507, 5436, 10958, 69434, 19745, -2894, 49809, 3628, -34604, 20473, -5549, -51469, 3614, -3783, -51455, 1137, 2432, -57143, -16560, 5686, -44522, -1657, 41715, -7591, 14133, 57251, 1595, 5571, 53690, 5552, -6268, 44513, 6767, -16324, 35144, 894, -43749, 1037, -18125, -63773, -10986, -6786, -53502, -8543, 6611, -39234, 1340, 31864, -17380, 7563, 46526, -762, 14950, 61516, 14378, 9198, 54854, 8848, -14430, 32033, -3400]
663c400l6659M3980k2540l6074N1950n680m5008M4761P237m7565M2170K7342m2957
676b2443L3459L7699m7156J6796M0047n1526l287L8885m5498j0571M9414l6991
688a172k7264M4761k9220l8288M6399r092l6987M6426O258l8555M3888J8908m5489
701a9427L0009K5519m6374K1709L6453m4767L403L7387m5118r318L9332l7744
713h936j9599M1302k8017k7287M7163j2668l3345M5048j249l7937M1773J2783
725A9031m0133L1638K1014m3102K5257K9316m5137Q479L0714m6350m522L9943
737B6148l7411j2590M2151l0568k2620M3299j7727k9135M2390o108l2024M5178
749A0983P893l7937L4901J3863m3015K5505K3291m2059J5226K7807m3405K800
$$ y = [-3400, -40059, 3921, -18619, -54693, -2743, -8423, -53431, -8670, -1433, -48998, -6828, 20514, -22443, 11016, 48715, 1559, 18355, 58402, 6876, 3589, 42474, -3024, -13595, 35819, -1172, -28436, 16325, -12895, -51183, -4784, -13876, -50863, -4437, 1821, -36734, 7154, 26062, -19427, 10582, 36101, -10273, 11436, 47889, 3122, 6525, 43912, -1206, -10524, 28808, -8936, -28535, 12767, -15250, -42537, 4626, -8042, -41387, 3661, 2412, -35525, 6248, 19031, -21102, 10536, 31550, -11552, 13705, 43021, -2116, 6363, 37077, -9273, -13795, 26148, -11263, -23853, 18298, -12270, -34890, 8409, -9318, -38453, 3937, -2171, -34195, 10983, 18876, -19061, 15840, 29703, -13312, 12193, 35484, -6575, 8651, 36458, -6947, -4147]
761d147L2900l9459r241L6180l3445j7488M3137j9550k4723M2101j0230k9016
773c2981L9831K002l1796L5725J0867l8003K8464J9478m0157J8091K3979m1917
785f417O142K9395l7649m248L2866l3753j2572L7089k2967j9223L9288j5372k6185
798c3606M1003k187k9961L7088N608l4976K9614J5332l8118K0412K0950m0560
810i401J0904K6654l8540N38L1309l4915r232L5850k5698j4096L7317j7408k1917
823b8635L9185p853k6340L7991J433l4245L1400J0358l4739K2176J6878l8676
835a1067J2619K3999l7750M441K7708l3946m135L1381k6201j0679L5444j8498
847f684j9072L6915q903k4836L7640k969k9170L1623O329l3335K4436J3444l6938
$$ y = [-4147, 28753, -10706, -19947, 16233, -17212, -34700, 8437, -11113, -35836, 6265, -3965, -32981, 6850, 8852, -22944, 12781, 23648, -14355, 14109, 33587, -6570, 11521, 35500, -6417, -275, 29120, -8529, -12777, 20089, -13664, -26236, 10853, -12114, -31337, 7951, -7421, -33606, 7397, 5210, -24751, 12337, 17945, -17031, 12583, 27915, -10203, 10209, 31159, -9401, 1503, 28157, -10383, -9845, 21464, -13451, -22683, 13167, -12531, -26627, 10690, -6718, -28635, 10550, 2697, -23643, 14348, 15781, -18464, 12936, 23294, -11445, 10731, 27609, -11067, 1552, 25551, -12199, -7758, 19950, -13996, -18131, 13250, -12951, -23630, 11814, -6684, -25756, 11159, 2256, -22580, 15060, 12091, -17079, 14544, 20873, -12462, 11974, 25418, -11520]
860a1520J5442J8912l4656O405K4958l4408j475K9851k7442p622L4004k1716j5103
873b4370L5383j1804k0232L4066l467k6514L0953L047l0883K7086Q481l4556J9663
886F853J5666l5398J1160K1053l3447K591K6582k8771m287L1244k2150j0779L2863
899A3180j5443j7145L3495p842k3345L1620j813k6411K6489M230l0679J9288J2716
912A8340l3076J3995J7934l0851M486K3623k9022K86K8510k4286p428L1220j6635
925b904j4066L2687j2118k0485L1944n229k4690K7624K096k8618K1634Q325l0712
938a4512J5862J7164l3007R611K0032k9401J925K6175k4726m470K8744j9116j1499
951a7218L0982j3546j7444L0219o607k1442K7641R54k6666K2613O305l0247J8116
$$ y = [-11520, 3922, 22834, -11822, -5417, 19541, -14867, -16342, 13509, -13933, -21555, 12449, -9267, -24370, 11013, -791, -21023, 13043, 9576, -16938, 14015, 17062, -13821, 13265, 21746, -12810, 6853, 22519, -12879, -1719, 19334, -14113, -11522, 15060, -13711, -17998, 13246, -8904, -19683, 13180, -2263, -19408, 14087, 6245, -17100, 14520, 12707, -13704, 12785, 17015, -13664, 5624, 18340, -14736, -741, 17193, -13658, -9172, 14451, -14571, -14285, 14225, -10061, -17489, 13731, -2904, -16970, 15717, 3599, -16886, 15058, 9829, -14861, 12763, 14859, -13759, 7875, 16200, -14512, 1350, 18514, -14493, -4882, 15150, -14251, -12326, 13849, -10877, -15347, 13397, -5719, -17218, 13764, 218, -17226, 12993, 6386, -15056, 12585, 13539, -13127, 9486, 15791, -14456, 3660]
964C660J3650l0643J1645J7786k9181N107K1822k5713k051K7200k1241p975K8065
977A2131j3768j2286K8728j0892j8707K7695k257k3810K3664L675k6275J8765
989F663P952k8447J3240J4569k7831P145K0335k5923J508K2990k1299l564K7175
1002A4513j6812j0108K6396j0884j6555K7388n980k1258K4787n12k4079J9081
1014E977N340k6894J5366J0965k6322R488J8293k4875M514K1244k1767k334K6147
1027A5142j7381o871K6379j3933j3384K5040q158j9870K3494k077k1364J8842
1039E859M171k4643J5193Q853k5000J0516J5637k3552O968J8712k1633J255K3258
1052A5594j9602n449K3186j3239j0937K3613j0722j4149K3085n031j9892K0169
$$ y = [3660, 17310, -13333, -1688, 16098, -13083, -7976, 13846, -11867, -13918, 13282, -7959, -15934, 12131, -1637, -13923, 14805, 3913, -14794, 12901, 10644, -13166, 10498, 14173, -12102, 6663, 14615, -13832, -592, 13977, -13854, -6709, 13626, -12297, -10789, 12201, -9098, -12662, 14513, -2299, -12407, 13989, 3105, -13450, 13938, 7958, -13300, 11487, 10975, -13104, 5977, 11317, -15577, -211, 10754, -15568, -6080, 12213, -12662, -8148, 13096, -8671, -11005, 15142, -2239, -9110, 17269, 3336, -10048, 14992, 6834, -13036, 10458, 8381, -12983, 5859, 10030, -14613, 580, 9433, -15567, -5051, 10586, -12966, -5998, 12714, -8919, -7664, 15594, -4008, -9457, 13729, 490, -10447, 13166, 2444, -11705, 11380, 6349, -13543, 6626]
1064F626K044k3552J7529Q015k4374J3313J2385k2842Q771J5960k1644K150J8835
1077A3216j9101k193K1038j6799q133K4066j1683j3580K3093o718j6606K1868
1089H468j465j9436J7275N921k1482J2693R154k2222J0334J3807k2774N000J7808
1102A3081j9513k820K0426j6586n168K1757j2596j0707K2215o855j4645K0780
1114I369l095j7082J7537K104j9927J3911P219k0991J0447J1494k1165O309J4008
1127A0138j8626L89J9523j5688m429K0679j3198q102K1003r305j1553J9128n389
1140D570j5048J8292J19j9628J5153M910k0421J1225J0157k0509P093J4088j9050
1153i049L442J6953j6239n18J6214j2827n090J9692j1588j0159K1121q090j3359
$$ y = [6626, 8670, -14882, 2647, 10662, -13712, -399, 11986, -10856, -2085, 13875, -7769, -5619, 13216, -5885, -8078, 12960, -3839, -11972, 12094, 411, -13169, 9924, 3206, -13400, 8468, 7003, -12433, 4842, 10763, -10719, 1974, 11128, -11094, -760, 13047, -9727, -4727, 13081, -6432, -9252, 11174, -5412, -10580, 11177, -1419, -12126, 10089, 3234, -11411, 9369, 6274, -10808, 6729, 8833, -11094, 2817, 10036, -10955, -508, 10986, -10179, -3870, 10138, -8488, -8099, 11424, -4264, -8693, 11986, -1212, -9314, 11689, 2384, -9169, 9959, 4570, -10478, 7814, 7933, -11695, 3458, 8368, -12053, -828, 9329, -11180, -4087, 10001, -9049, -5607, 11346, -4893, -5411, 10803, -2024, -7114, 12578, 990, -9169, 11952, 3862, -9497]
1166i497J6469k034j6828J5248K555j7777J2086P039j8196R869J0094j8231N018
1179d185J4751j6432O63J6452j2817m782J7188j0999q200J8218q184j2263J7673
1192G083m035j4317J6351J035j6990J4188M777j7035Q900Q789j6518N723J2574
1205A0525j6337L181J3460j4753k748J5979j2760o163J7363q060r681J6685m928
1218A763j2755J7508n79j6607J3848L619j5499J0948O862j7215P638J0377j5920
1231f012K456J2732j4014j079J5451j2451m635J5611q847p586J5653n428j0675
1244h824J5749l301j3491J4909P37j4229J1259M492j4949P549P429j5235N574
1257b331J0114j2671L70J2401j1992j531J3796q966o380J4845o661q704J3825
$$ y = [-9497, 6972, 4938, -11890, 3358, 5913, -11864, 222, 7261, -10935, -1066, 9028, -9203, -4185, 10566, -5866, -5203, 11249, -1568, -6350, 10838, -161, -8361, 9857, 1673, -10590, 7083, 3048, -11269, 5082, 6117, -10873, 3315, 8092, -8943, -43, 8746, -7772, -2049, 10525, -5812, -2631, 10829, -3924, -6672, 9307, -3453, -9616, 7747, -313, -9994, 6691, 1763, -10992, 6516, 5937, -10670, 3178, 6797, -8702, 2246, 9108, -8107, -469, 9908, -6012, -3556, 9176, -4838, -5917, 9534, -2917, -7552, 8059, -788, -8374, 7279, 1851, -8824, 6925, 3624, -9867, 5042, 5779, -8450, 2809, 7301, -7648, -99, 7330, -7905, -2331, 7783, -4888, -4518, 7883, -4109, -5640, 8156, -810, -7190, 7655, 994, -7710, 6115]
1270F115l318j1619J4002l06j3240J1200L130j4621Q247O819j4173N705J0494
1283H435j4556L021J1901j3552p28J4013j0633l681J4442q374p236J3741n297
1296A496r638J3185p55j1986J1508L66j1800R204M457j3239O392Q262j3384L928
1310b004R624j2182O76J1870j1682j020J1941q283m921J2558n341q411J1773k672
1324A926r627J1865m27j1141Q827L674j1693O912O649j2748M868R043j2293J315
1338b850J0557j0185k336J1980r142l762J2622o577o998J2351m135r871J3112
1351D766r56j2152J1198J220j1218Q839M006j2044N554P587j2469L855R644j1668
1365c838M03J0689r933k809J1822o594n834J1384l247p656R094j368r024R152
$$ y = [6115, 2797, -8822, 5180, 4874, -8366, 2834, 5964, -8657, -410, 6409, -7764, -2059, 8435, -6121, -3100, 8801, -4751, -5479, 8534, -2099, -5780, 8662, 288, -6948, 6793, 1496, -8142, 5043, 4288, -7698, 3810, 4176, -7624, 1580, 6037, -7202, -810, 7452, -5932, -2004, 7620, -4562, -3886, 7984, -3698, -4718, 7223, -1060, -5981, 6577, 1236, -7175, 4598, 1926, -7701, 4164, 3737, -7404, 1423, 5097, -6596, 316, 6965, -5783, -915, 8128, -4165, -2850, 7707, -2478, -4814, 7166, -1976, -5738, 6884, 307, -6691, 5660, 1525, -8346, 4766, 3810, -8342, 2856, 4076, -7142, 1697, 5703, -6341, -787, 6800, -5669, -1814, 7830, -3838, -3435, 7254, -2679, -5488, 6334, -260, -6094, 5290, 2043, -5613, 3481, 2113, -6911, 2241]
1379B241J527r342O986L081j0388N762N869j0359L197P888r922M34R220r258p17
1394c781R313p338l087R870l751o759J0786l631q323R647R59j0325Q143K874j0389
1409e792P124L821j1188N199P323r549K39R128r093n90R862q833j923Q982n355
1424f45m907J0097l379p583R565q15q676Q742O86q365O308M259j0320N373M403
1439D743q743J784Q093r447Q24Q658q008j968Q871n691l531P688l086n794R047
1454C440j662o670Q443j61r028O105L806q541N742M484r638K892O727j0070J152
1469b979R557q867k420J0325p393j983P887m416n289Q952j368p299Q184l29q383
1484e821P963J575q937O777L152q710L659O155q543J797N687p189p54P890o202
$$ y = [2241, 3768, -5574, 1412, 4493, -5895, -133, 5736, -4623, -1426, 6462, -3460, -3026, 6194, -3064, -3781, 5532, -1806, -4893, 4977, 1226, -5533, 5253, 1622, -6701, 2946, 3905, -6420, 1723, 4597, -5792, 1332, 5153, -6035, -836, 6487, -3062, -2823, 6305, -2788, -3378, 6484, -2349, -4272, 4710, -645, -5552, 4545, 1166, -6417, 3148, 2333, -6343, 2399, 3085, -5280, 1028, 5287, -5033, 340, 4743, -4000, -2216, 5877, -3570, -2746, 5912, -2096, -4064, 4807, -884, -4415, 3273, 187, -5607, 3440, 1778, -4892, 3551, 3390, -5638, 467, 4273, -4268, 1474, 5958, -3680, -788, 5939, -4131, -2979, 6578, -2289, -4709, 5616, -1777, -3760, 4127, -289, -5578, 3374, 2006, -5293, 2891, 2562, -5821, 2142, 3717, -5220, 1557, 4709, -4001, -342, 5813, -2730, -933, 4754, -2435, -3189, 4701, -1501]
1499a501k302Q007m351l865P639l260o261R137j310o563P501J619q363N182K735
1514D044p773M045M063q436L376O612q083n09P397o442j284P494n601l104Q555
1529D354l875m079P350k030n880N936R21q042P007K202q969M791M248p468K236
1544a298N971q049K437O025o716j81O926n858k770Q140m029m543P349k762n707
1559e065O676P8p732P688J062p909M881L176p285L946M739p312J520O432o611
1574a716n53P268o586j218P966n555l743Q000k784m988P007j447n791P282j064
1589B078o805N217K449o649M058L971p255J808N421p741J281O422n793j223N403
1604B642l657k296O343k078m923O599k328m989O975k67n447O635M19p321M436
$$ y = [-1501, -3803, 4204, -147, -4012, 3627, 367, -5894, 3243, 1933, -4630, 2871, 4490, -3873, 1309, 4044, -3729, 316, 4379, -4057, -681, 5931, -2152, -2661, 4736, -1706, -2990, 4504, -1097, -4201, 4354, 479, -3600, 3750, 1720, -4160, 1776, 2697, -5345, 1662, 3864, -5105, -314, 3934, -3534, -1298, 4673, -3376, -939, 5086, -1630, -1811, 5115, -743, -3513, 4627, 598, -3945, 3404, 642, -5065, 1611, 1689, -6043, 1645, 2707, -5202, -321, 2855, -4430, -484, 4255, -3057, -1537, 4895, -1716, -2269, 4999, -1587, -2805, 5161, -394, -4137, 3863, 1079, -3909, 3098, 1651, -4140, 3142, 2078, -4727, 490, 2939, -3710, 348, 4319, -2936, -1128, 4293, -3448, -2167, 4255, -1538, -2761, 2642, -1015, -3311, 3032, 954, -3969, 2630, 302, -4687, 2288, 2021, -3426, 3209, 3628, -3693, 743]
1619G43K878o176O35N761o732K88O638o258l04N537m859k343O343l348j799N969
1635B973l315l135P017n25o801N701N77n715M125K061o236L374L465p740K775
1650a399M209n295n19N434m252j179O955l415l440N658k096m085N604k87n485
1665c592O890r14n282M082J494n643K688L208o549K040L980m502K01N796o137
1680b240o73O488m444k763P113l358l402O202k018m326N634J79n621M542J495
1695B808o355M075L738p672K941M395p052J242N763o018k13O221m782k158N974
1710B907k781l150N615k447l742M913K99l971L718K009n667K977K657n830K159
1725c34L477n648J348M552n921O00N462n790M8M532l651k369O185j773l385M558
$$ y = [743, 3621, -2555, -1920, 3841, -2891, -2603, 4035, -2223, -2527, 3010, -1849, -4192, 2151, -1197, -2996, 2973, -342, -3477, 3540, 3015, -3786, 1915, 2492, -3223, 902, 2963, -3273, 101, 3566, -4174, -1399, 2810, -2485, -3004, 2430, -1822, -3001, 3954, 539, -2901, 2757, 661, -3424, 2180, 1893, -3592, 3298, 2384, -2898, 1184, 2678, -2965, -277, 2931, -3618, -1578, 2402, -2100, -1899, 3897, -2240, -2913, 3575, -869, -3632, 3481, 123, -3279, 2923, 905, -3421, 2213, 2392, -3229, 1313, 2808, -3547, 528, 4266, -3406, -465, 3930, -3122, -1880, 3883, -2135, -2348, 3873, -909, -3067, 2907, 126, -3024, 2591, 144, -3598, 1315, 1614, -2357, 1361, 3370, -2297, 680, 3337, -2493, -334, 3143, -2505, -1157, 3395, -2526, -1926, 3536, -2254, -2206, 2326, -1325, -3694, 2491, 718, -2667, 1891]
1741A891q84m261N520n61n040L636J946n733K873L430m712J484L369m518j19M319
1757B640l984o01N080l509k679N618k547k286M592k038l949M936J362m528L507
1772A614O52n611L908J735n850K718L005m740R35L889l399l62L760l519j124O160
1788C771l514k043N311l174l039M542n16l523L194J554o526M163J426l726J776
1803c24L057n212J112M250m739P29M293m746m55M946l872j075N573k854l435M945
1819B193r83l617L948K18m637M069J333n607L363K134m759K393J668l815R92M473
1835C366m157j231N205m268r77N291l192k592N185j638k653L486o2m605L239J120
1851A517m520K877K154l748J467L358n254R72L707l549j221M780l174j185M663
$$ y = [1891, 1007, -3254, 2266, 1705, -3335, 301, 2247, -3486, -613, 2817, -1895, -411, 2958, -1560, -1679, 2640, -1344, -1945, 3135, -374, -3053, 2565, 18, -2268, 2324, 286, -3663, 1273, 2635, -1893, 1614, 2266, -3345, 563, 2298, -3552, -834, 2171, -2569, -1634, 2255, -1144, -1506, 2254, -1265, -2389, 3771, 257, -1786, 3525, 351, -2688, 1854, 1338, -2185, 1009, 2563, -3963, 200, 1626, -2100, -324, 2733, -2479, -1367, 2883, -1856, -1127, 3166, -1580, -2035, 2911, -961, -2036, 3537, 683, -2752, 2193, 1210, -2407, 1541, 1759, -2878, 1191, 2524, -3083, 280, 2414, -2345, 48, 1716, -2099, -1107, 3366, -791, -2022, 3183, -1085, -2062, 3229, 37, -2555, 2630, 992, -1661, 1825, 1763, -2842, 397, 1517, -3003, -126, 2028, -1720, -253, 3105, -2149, -1177, 2530, -1019, -2240, 2540, -634, -1819, 2844]
1866B844l257j743M233j275k788L375n54l366L222N82l895L021J867l899P86L466
1882B619m610Q86M455m889k59M400k586j172L326k069j881M478k252k926M634
1897B154r76l760L859K95l691L643o49l384K445K912m778J278K607l501L62L356
1913B172l346p78N085k993j806L716j612k442M878k690l252M374l5l269K418J103
1929A523m031K287K763m316J407K715l993J017K706l559N10L030k679n85L439
1944B234k306j511L653j992j483K913n30l162K865J098m176L026L71l391K004
1959c87J733l771J427L370l383q80M712l973l96L564k083j611M607k205k893L776
1975A607l38l404L005J74l167K793Q06l848K394J846l084O88L035l780J441K949
$$ y = [2844, -413, -2156, 2077, 802, -1986, 1389, 835, -2531, 691, 1273, -2622, 399, 2266, -1633, -847, 2619, -1991, -1105, 3350, -1539, -1798, 2602, 16, -1156, 2170, 101, -1780, 2698, 446, -2480, 2154, 1178, -2582, 1277, 1572, -2119, 1524, 875, -2509, -64, 2848, -1930, -652, 1955, -1546, -1184, 2172, -1174, -1952, 3133, 140, -1666, 2050, 438, -2004, 2874, 184, -3068, 1306, 1271, -1998, 420, 1523, -2508, -221, 2542, -1774, -367, 2348, -1645, -628, 2078, -1481, -971, 2059, -620, -1205, 2234, -72, -1583, 2070, 78, -1405, 1508, 978, -2184, 681, 1779, -2397, 629, 1000, -2391, -387, 1346, -2425, -998, 2372, -1011, -1891, 2821, -1152, -1548, 2016, -67, -1678, 2929, 724, -2169, 1607, 1269, -2135, 870, 1044, -2123, 670, 1476, -2372, 22, 1868, -1216, -528, 2507, -1273, 168, 3117]
1991C117l376j725M948l806j560M019j759j325L178k304q66L094j019k800K325
2006A41J703l707J153R77k138J915K025l835Q75L308l464N23K451j856k84J903
2022A690j723k042L819j487j573K782o92k145K443J056m186J319K558l337J483
2037c5Q12k552K567O06k126o85L456l714K17L940k556n07K279j584j962L949j268
2054H37k671K142J12l013L598p6l133J718K743l549R62K144k538l23L391l121
2070g77j17L220k675j255L658q97j735J902l68k707L241p77l386L062J652l369
2086a328R53Q21j886K224J066l318R44J840k283O27K382k082j109K966k533j442
2102b158L605j482j643K280j419j855L422r67j924K854K7k745J854N40j854J549
$$ y = [3117, -259, -1984, 2964, -842, -2402, 1617, -142, -1467, 1711, -593, -1459, 1635, 616, -2184, 141, 1844, -1863, -710, 267, -1871, 44, 2069, -1766, -891, 2417, -1047, -524, 1927, 71, -213, 1690, -33, -2075, 1744, 257, -1316, 1466, 774, -1371, 1072, 2128, -2058, -739, 1819, -1518, -35, 777, -1775, 792, 1398, -728, -1413, 2043, -1671, -1454, 2486, -70, -577, 1702, 118, -1844, 2105, 837, -1834, 308, 420, -2593, 1005, 929, -2204, -486, 2257, -1292, -330, 1814, -724, -1047, 2344, -777, -894, 2326, -349, -1604, 2054, 1157, -578, 1324, 956, -1751, 1490, 713, -2673, 389, 2041, -1328, -375, 446, -1440, 784, 1850, -1468, -524, 1316, -967, -340, 2042, -40, -1149, 1817, -716, -2158, 1447, -35, -1678, 602, -817, -2672, 750, -217, -2141, 713, 740, -2005, -151, 389, -1465, 84]
2118H4J463k785O95J873j220j623L824l057k78K528j999o88K732j261k128J851
2134A1J29j749K353L34j761M85J797k374J170R96l221J452J518j683p01K774k527
2151i97o35L261k139p68K553j442k412M464k032j157K410n3l272K993L78l549
2167b397L436j328r70Q16K331l622J460J980k895l40L527k724r62L506k607n41
2183a330K583j120j600J942M35j868J993M61l118K411Q82l035K020O61k131J63
2199f51J604j128j085K937m94j575J326j868n75K302j126j360K446l75j921K116
2215E73m89k360K847Q45l766K663J508l161K171O12k610P39K408k987j26K415
2231A282j351k58J735j112j065J567j122j047K253j486j306K541J68j644J690
$$ y = [84, 1547, -1238, -543, 1330, 110, -1513, 2311, -746, -1024, 1504, -495, -1183, 1549, 288, -1840, 11, 140, -1609, 744, 1078, -683, -198, 1599, -775, 395, 1391, -1830, -378, 1140, -543, -1244, 1530, -997, -1632, 1629, -510, -1278, 1275, -167, -2579, 1885, -147, -1304, 1106, 1053, -2219, 774, 1152, -2397, 1039, -289, -1259, -443, 1888, -1734, -274, 1706, -1189, -1529, 1998, -726, -1688, 1818, -789, -1330, 1253, 133, -1467, 475, 910, -958, 1035, 1496, -1622, 789, 1671, -1364, 656, 1317, -814, -651, 953, -175, -1260, 1677, 1183, -392, 934, -934, -1509, 793, -333, -1693, 753, 378, -1543, 573, 84, -2276, 571, 1416, -2350, 313, 1821, -1340, 831, 1443, -1167, -428, 1980, -1007, -1133, 1282, -69, -327, 1408, 296, -769, 798, -324, -1371, 882, -604, -1910, 631, 799, -845, 845]
2246H45M7k141J631J736k942P72J180j076k97J793j448r13K284j672o39K032j390
2263a98j124J335L91j553J989N00m030L001R35k995K684J44k141J255J236j966
2279e37R6J578k005l47K591j062q71J808j649q23K440j214j092K033J69j704J284
2296F95l15j216J481l95j249R43J164k490K96K753k925J237K044k874l51J900
2312F98j257k75J758j247j127K850p35k839K573k71j233J521J018k504J442J130
2328A502k711N80J857k177M84J919j797j473K880k42k492K109L31k466K490j88
2344F06p77K14R84k515J945R84j963J24J055k371J332J791k124P62K46q25m42
2361i74K745j619M13L35j041m95J479J66j530J406j025L2R03L18k140J375n77
$$ y = [845, 892, -1249, 382, 2118, -824, -52, 1128, 52, -245, 1548, 100, -813, 1471, -201, -840, 1192, -198, -1322, 13, 404, -1149, 840, 1340, -2690, 311, 1246, -1749, 935, 1079, -1062, 193, 1429, -537, -441, 1137, -868, -1215, 1376, 314, -557, 1251, -398, -1221, 1219, 5, -1087, 946, 1115, -589, 695, 380, -836, 645, 250, -999, -56, 1108, -1382, -1086, 1667, -1258, -21, 2023, -851, -1202, 698, -559, -834, 924, -323, -1450, 1400, 665, -2174, 399, 128, -1105, 416, 1434, -1070, 372, 1502, -1209, -629, 1228, -949, -465, 1454, -343, -1816, 1064, 822, -1670, 439, 770, -1696, 794, 606, -171, 43, 1027, -1488, 457, 1441, -522, -398, 657, -1714, -382, 1409, -715, 47, 293, -532, -974, 1771, 152, 565, 900, -141, -636, 843, 1009, -521, 885, -140, -108, 795, 1113, -1027, 348, -229]
2378b29j291J157J091j512n8J785j703L58K017k195k35J301r49r97K123j037o25
2395i99K262j679j305J317M77l34R12q46j192Q51P90o95O19J568k611J015J241
2412A391j286o46K046j527p92J691m79j106J106J95j761K091j045o21J550j223
2428d16o2J239m80j235J433P37k607J186J202k339P32J280j098j02J055o03j46
2445b24J018n11q96J559m82k606L607j390q28J414l20m74N44L60j959Q82J410
2462A104j434J050P33k591K93J400j275J17N75l35j96K153j992p0P69p24k64R02
2480B15m53J14R09P3j871M80J240j680J103Q49j633K6J902k311Q82L64p16q4L72
2499b19j45n6J322p64j136J145k14r80J701o04o04J486r31j444K257l8j386N89
$$ y = [-229, -1520, -363, 728, -784, -842, 943, -760, -402, 1615, -580, -815, 486, -463, -1460, 663, -374, -999, 1263, -416, -1721, -404, 73, -261, 651, -195, -1387, -536, 254, -441, 178, 1746, -865, 150, 1391, 105, -541, 1505, -22, -814, 877, 398, -708, 398, 593, -1168, 923, -122, -743, 807, -416, -478, 761, 281, -954, 479, 1216, -1391, -205, 997, -1342, -610, 670, -428, -530, 525, -78, -224, 794, 283, -613, 946, 464, -2142, 1465, 75, -753, 661, 341, -133, 411, 771, -1188, -306, 1104, -330, 720, 1453, -1138, -845, 555, -720, -603, -28, -363, -559, 1594, -398, -468, 301, -423, -687, 215, -238, -124, 785, 858, -1013, -533, 707, -973, 130, 979, -654, -628, 1274, -1037, -155, 209, -507, -591, -219, -364, -420, 902, 138, -998, 147, -67, -1047, 654, 50, -554, 932, 1, -1443, 814, 776, -610, -21]
2517b1J409j418j117J353l26n55J279l79m96O25j165K02K86Q75j102J640n98j845
2535a353J368P34j753J612M1j135N43N71j525J97J817j766k05K117q50o78M95
2552B30p47J30J175o77r24J087m58o35P51J185j780R14K78m96j07M95q34N60j53
2571fK5j217K692j974j022K111n50n78J154l81r62J806n81j571O53L20j196J538
2589B61j99j065J060M19p46J00P80p77m12K154k798j6K439j472m28K002j113k37
2607d8M92m03j56N50l63j044K719j518j329R17J013q88J56K42j355J020J492j466
2625C1n8J599r53q77O77l34l59O56l0n7L2K0j455J317P04r68l05J061j607P48
2645a58Q85j431M09N70o57M37N70q97N69R14j104q33J398m27K57J71j017M86k63
$$ y = [-21, 1388, -30, -1147, 206, -120, -675, 604, 225, -271, 354, -811, -609, -323, 552, -550, 1090, 492, -1353, 15, 749, -1004, 608, 649, -486, 57, 628, -897, -700, 1117, -649, -854, 1263, 413, -265, 230, -517, -387, 788, 111, -813, 274, -184, -819, -68, 1117, -663, 251, 529, 33, -74, 421, -413, 147, -6, 19, -1198, 1494, -480, -1502, 609, 59, -519, 635, 254, -708, 1098, 517, -1054, -401, -81, -1277, 261, 62, -1003, 57, 476, -270, -170, 610, -167, -579, 1575, -1223, -1239, 1200, -272, -700, 1302, 189, -48, 444, 41, -115, 435, 72, -972, 1747, 229, -1100, -183, 830, -58, 98, 340, -1015, 5, 1497, 31, -27, 1572, 619, -258, 419, 85, -274, 382, 352, 295, 327, 347, -1108, 209, 913, -55, -360, 701, -906, -158, 727, -704, -295, 275, -382, 55, 625, -272, 297, 1211, 107, -726, 672, 245, 502, 673, -344, 142, -121]
2664a21j75m97J260K94q59P00n32q28L13J53L78K24l2n72o09J356j412L87J328
2683G56p54K41l53R2o01M79Lr35P35K28j42Q82o03k04J090o19N00j003M63n49
2703b94M4L52k57k88J394j360M55j18q84J396p58O74j021R04n18p91Q47Q01j360
2722g82R56m62j047O95O2L53L82O69j477R04Ln4l83Q86l36r21K6M15L30o98R99
2743E20n13k06j52n84J149J38l77L95r11R9J67O27n32n89J316r22J71J40j0R39
2763H65l49j075o4O97j187N44J19J33q04J470L70o11l64N39k081K435k27p24m82
2782g96R82k12P83q79p3K90J02j233j60J550m98q46R71N98p93M24J91j78k85O42
2802E80j258K66J74J57J6N80q74J516n50n46k1L2N03K9o08m91N35O9l01j86M64
$$ y = [-121, -296, -793, 467, 761, -98, 602, 70, -758, -445, -292, 86, 310, 278, -294, -903, 453, -959, -572, 756, 2, 243, -110, -18, -619, -140, -137, -1072, -337, -109, -251, 631, 28, -176, 914, 295, 795, -208, 255, -294, -250, 102, -155, -443, 951, -409, 46, -72, -956, 440, -318, 356, -665, 239, -279, -1070, -223, 578, -782, 174, -288, -1335, -640, -578, -225, 157, 826, -651, 253, 256, 202, -181, 705, 369, -552, -526, -111, 219, -479, 520, 7, -199, -351, -935, 214, 352, -25, 370, -541, -442, -275, 352, -180, -769, 547, -375, -204, -64, -74, 865, 516, -559, -623, 74, -1113, -569, -450, -317, -1121, 349, 719, 108, -256, 283, -1798, 637, 410, -314, -796, 186, -26, 757, -122, -195, 95, 197, -1036, -1196, 354, -144, -990, -19, 579, -214, 210, 401, 223, -62, 580, -678, -412, -238, -81, -65, 515, -359, 1157, 607, 61, 40, 72, 575, 604, -4, -495, 40, 109, -192, -378, 86]
2823H6o44J89J41l43p33J149j28m60J933r09r64K08P52l56K98J186j317J13j69
2842C2m0L56N44r12m67J247m47l87N24j521J105K60n00K74q7k65K18l32M63o34
2862e69M13P33m0k18L88k14o39O1k74J015o60n55J492q67O2m8n22O95o51M76O33
2883G11k23l28m73m43J234r79M22L64J057j385m35K05Q52m15M38j484J288J689
2901B095r37j743O50r01N00J005r26M82L90m3o11K8n79O49Q51p45n93O50P59j004
2921b3q92N59j92P14N1m3J16N1p32P71L9q02M19NK95o05k63J516j071Q1k0q29
2943h55K0J420q53N17K27q53P30jol85J018k20q12K32k67J24R96j380j2n65J062
2964A37o50J095k73j0o59M84j00L63j38K92p19k1j12P83j10l84j407K333k46j206
$$ y = [86, -558, -369, -228, -571, -1304, -155, -283, -743, 1190, 281, -683, -475, 277, -79, 219, 1405, 88, 201, 32, -8, 348, 892, -20, -487, 760, 313, -74, 450, -1071, 34, 294, -206, 68, -19, -284, -66, -398, 65, -569, -156, 577, 537, 319, 707, 493, -146, -85, -359, 656, -4, -559, 933, 66, 128, 80, -442, 253, -398, 78, 711, 488, 160, -313, -756, 478, -501, -79, 285, 1342, -43, -478, -273, 579, 164, 602, -882, 406, 2095, 1158, -585, 65, -836, -336, 669, -257, 225, 615, 572, -39, -11, -590, 59, 910, 165, -428, 222, 981, -23, -915, -356, -548, 166, 217, 174, 290, 341, -391, 380, 419, -383, 36, 41, 336, -269, -532, 984, -87, -6, -26, -855, -835, 585, -268, 249, 476, -377, 353, 352, 346, -39, 979, 759, -53, 179, -88, 36, 1032, -348, -360, -925, 137, -513, 582, 309, 299, -360, 124, 24, 387, 249, 541, -178, -199, -311, 472, 362, -22, -1429, 904, 658, -548]
2984e48J918k125Q47K15r5r00P91n0J42n27j17J10N9k21M55P2J19L90l90j066
3004i21O51m5J036j002M28o13k91J689r55l11K25L30n76k16R22j62L78j365J404
3023F06p47K22N59j099L19k21N57m19P02m37M06j47o94M64R38j258Q48m1o21p
3043g0K30J02o13J279m20l20L60j062R86j484J193J38m37L92l55l80J568j532
3061d25J051j84p53K32n93m16J337m59L19k72J141j689L07j16M67Q1M36o20k51
3080d07M28N9j60K5N01n80m5J237p53k51p65K59K66J3J95o19J153j35K84k86j26
3101B93J93J13q91l61P65o37K70m88q4M96L48N08o10L13R63j172j53M29l32P09
3121F72m82j54M44k08J27p73P92q45n05J513r0p53k7L66K50m60N22j185P56m3
$$ y = [-548, 1370, -755, 92, 307, 212, -688, 103, 53, 195, -332, -449, -339, -280, -501, -46, 26, 145, 535, 145, -921, -270, -315, 721, -281, 147, -466, -757, 932, -23, -334, -109, 221, -355, -571, 351, 189, 567, -798, 606, -141, 81, 640, -459, -140, -361, 196, -223, 479, 42, 448, 301, -393, 71, 1009, -249, 599, 558, -63, -70, 160, 262, -351, 928, 508, 188, 548, -514, 472, -1012, 181, 319, -118, 274, -81, -461, 1107, -425, 626, 442, -311, -79, -672, -1088, 249, -210, 109, -163, 978, -711, -404, -520, -53, 28, 464, -156, -407, 21, 80, -80, -55, 446, -134, -179, 1058, 305, 54, -711, -452, -186, -173, 22, -597, 556, 421, 705, 419, 293, 486, 599, -292, -653, 112, -525, -255, -743, -827, -331, 17, 525, -85, 228, 1191, 19, -134, 295, -37, 672, 190, 36, 480, 272, 399, -374, 418, -427, -932, 581, 491, -262, -289, 77, 327, -133, 389, -796, -40, -83]
3141h3J44J70l41J90l22P42o96q53J570r60L56n62q9N71P5N37o17R08j149j25
3161e34J51O45L47n13k18M68r12N17M08P09j027r36J122Q85k204J629P96k386
3179a053K09J008l97N57M40r03P92p69M51q95L00k53K14M59K29m79O61q00Q55
3198F26l12j0j423R38R0N1j26n82R43k3l54M70p85P90n48L80n8L13L31l56Nj016
3220f56P94r66K24J117o82J034q96m10L80M98L68r28q77M37M86k66M8L55j49J51
3240F2J86q72J219n22j75j36OO07q93J080p27m23J629p69J31n35l96J209K20p73
3260A28o83J054r21k14J532k243J189P21m89L05r6M22r62l02K59k10M7N84l49
3279b28j08K69J38j06Q09r91Q53o26j5l01l3L98j59l00p0K36Q33J77j346J632
$$ y = [-83, 61, 231, -110, 80, -242, 500, -196, -1049, 521, -439, -83, -645, -734, -163, -88, 449, -168, 740, -409, -534, -383, 262, 609, 96, -122, 346, -566, -49, 359, 1068, 41, -895, 227, 1112, -1092, 537, 1333, -1053, -844, 164, -233, 324, 764, -139, 653, -116, 335, -560, -260, -513, -299, 160, 389, -90, 571, -229, 626, 314, 304, -1119, -181, -91, -40, -166, -748, 195, 172, -182, 288, -497, 293, -255, 125, 67, 380, 711, 355, 360, -656, 138, -828, -604, 513, -169, 865, -31, -441, -61, 437, 805, -123, -1000, -563, -77, -343, -295, 60, -89, 62, 248, -624, 595, 73, -102, -238, -232, 375, -518, 562, -165, -588, 1041, 272, 403, -132, -528, 681, 901, 128, -555, 499, -422, -636, 896, -1347, -158, 563, 74, 379, 283, 705, -257, -559, -300, -510, -463, 121, -228, -336, -67, 71, -35, 774, -217, 636, 10, -5, -306, -339, 59, -100, -400, -470, -234, 599, 776, -570, 1062]
3299A062r54m18j70L35l62N01n4m17K37M91K07m73L90l0J266j213j030K2j60J23
3319f47N66jl29O97R1k51r2K50L00p39J059j106J570j531R77o63k27o73R12j06
3339E7n86K69r60K284r55m63M38Q3k50M94N16j653J268j172J22J37K41n08N02
3358a36O36q08P59o91K36J73L31k95M87m64j80j44O30j026K79J77j24O31O18j372
3378b83l24M70J25L56p39J97j79N50l6j35m88O76l04R45p72m38R68jK02j423J009
3399C76k95N44j137K83k0Q09p2o14j84J35L68J74k88k22j46J207j363N16k16K37
3419I2j078J214j482J028P37p87L78l58N25n83N67o06q5n45N09P81No82q7L08
3439a49P22j846J033J027j120l03N46l31Q0j2m81J173J07j086O76N66j624L58
$$ y = [1062, 108, -310, -480, -145, -507, -6, -60, -477, -240, 251, 458, -15, 375, 345, 1611, 398, -632, -610, -770, -647, -81, -82, -411, 286, 377, 126, 34, 284, 584, -155, 904, -202, 1368, -163, 814, 151, -76, -749, 163, 57, -529, -260, -1220, 1064, 109, -354, 84, 167, -83, 411, 927, -726, 542, -630, -508, -371, -130, -638, -136, 500, -308, 451, -240, -4, 169, 500, 205, 692, 228, 48, -96, 534, -492, -213, -36, -160, 471, 1089, -283, -607, -137, -12, 344, -395, -198, -377, 173, 137, 2, -486, 190, -114, 831, 59, -379, 589, 588, 790, -633, 376, 81, 625, -512, -229, -249, 560, 488, -126, -310, -175, 193, 367, 79, -143, -289, 918, -445, 71, -145, 92, -986, 228, -1254, -226, 511, -276, 102, -256, 269, -314, 253, -353, -438, -983, -474, 307, 312, -370, -457, -149, 573, -1273, -240, 787, -333, -636, -90, -421, -341, -353, -834, 339, 446, -640, 36, 602, -1022, -664]
3457f64O58J69q45P5O45m91M13N37L59q30O02l90n8K11j170L36n1J218n33m3R8
3478B46q66J140p64k62J461n85j006Q09j18p55R09q96m52J364J49o74L18M28l2
3497D14j159L30Q23j147K261j155r6k91L4l90L51L10j038J322p06k81J079j072
3515d11j70J230J75j060O1J7M52l92k38q09J073R91j717P10K91q18J147p2j080
3534f20J46N64q00J36J008m12o37J062J76l36q96J217j215P55L40k79k14K57o8
3553A84r55J654q37r88J542L5j413R22j57l63M76m8K29K23j175P04L38r10J70
3572c69L64j16l86L17J016j458R41M43j366Q38O69n21q79J113l68m27K11O17j886
3591a247J016p6L01m9R52p32j12R60j605P87M65n27l39Q8P7k62k00P58o71J557
$$ y = [-664, -6, 163, -682, -607, 38, -453, -40, 497, 856, 26, 628, 238, 180, 391, -779, -443, -494, 724, 191, 148, 246, -620, 520, -244, -506, 955, 370, -636, 173, 55, -700, 209, -687, -1139, 225, 374, -300, 18, 446, 414, -745, -415, 408, -739, 1522, 367, 271, -20, 14, -376, -25, 285, -753, 569, -137, -418, 661, -411, -581, 649, 824, -236, -175, -158, 294, -98, -336, -1145, -72, 919, -798, -88, 203, -615, 532, 460, -620, -474, 90, -710, -574, 434, 22, -615, 447, 623, 287, -609, 608, -607, 148, 488, 209, -5, 252, 184, -771, 883, 46, -942, 600, 635, -778, 144, -13, -376, 100, 52, 281, 504, -671, 33, 371, -539, -369, -5, -121, -507, -190, 826, -632, 309, 752, -614, 224, 893, 372, -507, 606, 238, -189, 22, 639, -1247, -231, -307, -6, -55, 897, 165, 53, 1013, -592, 195, 660, 133, -206, -118, -41, -303, -503, 255, -416, 1141]
3611A141j459M87M9K43j569J121J38o56L40J15j5q6J256j288P27J03q85N18J119
3630A399n77j268J515j170n63J439j111P5J119q18o20P05K99m43K25l27N06k64
3648A21M7j34O17K12j869K041n32j9L16m29n44k94R78p78L64L55n53l38M48n04
3668d95o1J441m83p90M8K80k29j10N9l94P71O43q05N45Q0p16M91P12j073m2l6
3689a64k84o57J036K73l76K07Q22j330L57p9j106J214K33q24L92R63p74l7N61
3708D27j005p9J029o24l57J334j328K71J082r29j50P94n43o91J630n76k40K07
3726B52n83K13J64L85r37Q75N42j116K60O62p14n24J303j050q31J590K00p33k39
3745b81J122j118K81l72q6R93r26J472o62l93k77R31p15K65R3M46j273l23J763
$$ y = [1141, -318, 169, 218, 461, -1108, 13, 151, -505, -165, -50, -65, -151, 1105, -183, 544, 647, -238, 280, 1399, 822, -446, 1069, -101, -664, 775, -336, -261, 858, 40, -580, 125, 424, -19, 206, -121, 385, 121, 168, 34, 651, 863, -1006, 1035, 503, 484, 800, 371, -173, -467, 511, -267, 97, 452, -101, -439, 9, -495, -556, 885, 402, -388, -340, -60, -289, -399, -340, -734, 37, 680, -125, 420, 500, -216, 275, 987, -86, -128, -164, -448, -1105, -69, 204, -172, 35, 857, -473, -116, -195, -1301, -87, 146, -678, -286, 677, -97, -134, 427, -578, -657, 372, -252, -609, 725, -603, -332, 750, -179, -329, 465, -78, -769, 861, 285, 45, 252, -331, -118, 46, 431, -506, 369, 911, -205, 55, 717, 3, -521, 782, -268, -1099, 491, 691, -42, -281, 841, -277, 4, -368, -454, 539, -387, 1085, 423, 30, -247, 684, -31, 234, 327, 773, -500, -823, 940]
3764I40j384M59L59p36k31J268o46o84J464q62m32K73m78l5N89O56r92K27N35
3783B90p81L66p1M50m35K03j30L29M85j298j37K29R45o57k28M97o65Q71l87P84
3803F60L10o11o17O3L86l80l1M88m44j1N13n76O03o3mr48O78l02N02l09n66J76
3825d83Q26j206M81K86L98l88O04k1j173m74J342j264J384j72L50j053J057j410
3843i16Q17L71p44J51j56J5N00N55j281m2M31J103l97r43m1Q08K89k89r2j27K57
3864B69q81K77J171q05k22R15o6o02L37m95j01L2P27o84M30o3O33p57m46O73K76
3885F18k66p81P41o58m36O05J148j238l16P91j42pk65j114J268M18k55j55J75
3904A31k05J55O38k07n31O95q39m39J013L24j080K30P63q43R12l42o94Q67q22
$$ y = [940, -444, 15, 374, -362, -593, 675, 29, -655, 809, -53, -485, -212, -690, -725, -136, 520, -472, -245, 290, -491, -125, -196, 254, -181, 22, -108, 221, 706, -592, -729, -500, 445, -212, -440, 57, -608, 263, -124, 660, 970, 359, -258, -195, 191, -189, -220, 268, -176, -187, 326, -250, 353, 290, 286, -662, 16, -286, 216, -93, -659, -483, 343, -863, -382, -96, 302, -86, 518, 497, -676, -1150, 192, -1072, 312, 140, 490, -563, 494, -916, -99, 272, -472, -321, -477, -462, 38, 593, -688, -730, -299, 804, 407, -536, -577, 231, 520, 231, 139, 12, 269, -612, -335, 836, 31, -191, 724, 658, 56, 393, -102, -203, -171, 556, -128, 302, 239, 872, 115, -331, 342, 618, 352, -429, 312, -346, -782, -177, 971, -267, -583, 208, 66, 59, -206, -1320, -52, 366, 111, -44, 131, -74, 81, 719, 512, -19, 676, -163, -602, 411, 735, -345, -115, 648, -195, 717, 375, -319, 548, -274]
3923b74k80J11Q7l86K32Q68p76N90L74j39l82R31j599R7R61m01K67o85J057K79
3943I32L21j47j141m55O52k84k81J600j717m90J084O35j315J994j874l09J063
3960B68K34j067Q7R97n88N81L28j063J72p1j01L94M69j021J26n0k20N39M50o15
3980a51j00M97K53j155L38M46m56M96o47k16L78M67J17k64Q78o60o66J259m83
3999C31j46l1j45o52J520n19o87J586l71p99N14p8j079J233r39o42J275r53Q67
4018B85q4k58R6k39R84j983J351r5m98J134j65j043P11J06l91J17j39l07M48J276
4038A306j374q56J689o48m85N63l04k20O04J20L18o24M64j035k27J377m96m98
4056c26Q82r51J87O64l84L11l26k27q4Q57m79k92J44j60p37L89K34J3J4J69n88
$$ y = [-274, -554, -443, -356, -742, -510, 358, -418, 172, 546, 407, 25, 956, -643, -546, 415, 14, 281, -404, 653, 932, 1253, 1106, -35, -490, 162, -122, -403, 1197, -520, -1010, 74, 709, -606, 1388, -486, -795, 268, 502, -565, -478, 519, -69, 512, 840, -223, -51, -122, -223, 171, 640, -381, -255, -305, -525, 14, 464, -151, -251, 246, 499, -656, -318, 128, -328, 168, -479, -695, -317, 150, 267, 3, 881, 221, -445, 814, 331, 185, 154, 9, -643, 877, 358, -329, 1257, 886, 87, 601, 523, -556, 677, -262, -904, 371, -582, 285, 201, -57, 39, -200, 784, -1199, 152, 57, -441, 693, 528, -515, 196, 302, -89, 28, -111, -418, 30, 1306, -68, -924, 765, 117, -368, 195, -109, -329, 275, 395, 713, 89, 553, -482, -709, 668, 172, -326, 556, -395, -208, 456, 72, 383, 57, -170, -254, 603, 124, -168, -24, -184, -921, -532, -298, -285, -271, -102, -690]
4077f90J839m61j094j34O64p90j25J822j344Q97k55k9p89N79J012j106L90Jo62
4096b75j3K23k89K38q3n83M31J177j362l79K321j079L2J10j033L60N77m85k02
4115c14M87N3l66R06j072J01O97Q0q77L68m8k12K01M15q48L85l26O80p68Q57l22
4136G7k09O07p35N09L60n88l53N59r21M23N82M57r65l88Q25r65J006n58L97J87
4156C07k81J5m99K51l30J118k95Np82O37p97Q48L08j35j157J515o29j35J09J54
4176B27J05p51L61O38K61L5k70p65j98p42R49N23O10j449K55l28k96Q51n2k01
4196b37K23N8k17O16o92r28J544L92j609J96Q70k64o88J303q32k47J036k08Q8
4215D04k50l20P00n05k083J320J441q39Q8L32Q4l43K34M70j476J249j148Q38m71
$$ y = [-690, 1149, 688, -406, -540, 124, -666, -791, 1031, -313, 584, 329, 300, -489, 90, 1102, -4, 386, 387, -275, -288, -65, -354, -116, -199, -782, -351, 826, -536, -915, 1406, 327, 359, 469, -564, -204, 373, -112, -314, 173, 226, -140, 766, -306, -205, 492, 572, -305, 63, 15, -197, 4, 419, -429, -44, -370, 310, -458, 399, 77, -132, 475, -260, 249, 609, 21, -332, 227, -694, -271, 311, 768, -197, -585, 240, -725, 281, -277, 120, 307, 26, 41, -458, -207, -537, 581, 286, 291, -491, 146, -651, 197, 505, 370, -787, 728, 99, -36, 73, 227, 332, -419, -58, 580, 841, 876, 606, -159, -357, -1099, -150, 373, 983, -466, -211, -539, -835, 16, -36, -237, -14, 44, -173, 443, -249, -1177, 367, 759, -850, -654, 216, -48, -736, 567, -265, -512, 524, 316, 404, 154, -166, 534, 29, -2054, -734, 707, -132, -44, 288, 372, 29, 263, 733, -743, 506, -642, 196, -275]
4234b75L98j281J147Q32q59K97O49j661N25L30q32N68Q61n48m30M05l15M1K64
4253A16kj28j90N26n32L0J76o45J047m96K79n4j17j29k51Q07J80r31J648j251
4273H3o0J19p25j41K343o66j297R22J35j46l50j09m46Q7R13j249J100n37m12Q05
4293C69N7n03l99J820j015k25L18j451J231L77o32K66o21J053j135L50Q49J51
4311H60j824J594j113M85q69O28K34n40N98r8m3P43q18J99J78n1K15o82K21p72
4331h55J185P08r68L93p44m86P41k23O56N67n24m30N32m77q06J101J2l41O36q00
4351a23l87J077l06j584J906l67j52j1k19o37J688m80j229O96L47o99P3M17L11
4370C21k91l9n74j0J407j155J065q14p25J016K2j44J13N44j108m57O18Q32j352
$$ y = [-275, 123, -1158, -11, 821, -38, 259, 908, -753, -228, 102, -730, -162, 699, 151, -279, 126, -189, -148, 116, 114, -14, -204, 322, -210, -180, -4, -649, 398, -98, 181, 127, 10, -119, -370, 437, 617, -314, 1334, 83, 23, 142, -583, -724, 1619, 953, -344, 578, 713, 567, 217, 108, -338, -251, 662, -587, 513, -24, -436, 369, 426, -77, -476, 1344, 329, 104, 422, -1029, 202, 579, -53, 213, -408, 645, -490, -140, 709, 860, -964, 630, -483, 2, -867, -239, -5, -545, 53, -45, -88, 655, -163, 36, 214, 163, 378, -304, -83, -855, 330, 1038, 70, 463, -281, -767, -26, -249, 407, 974, 450, 20, 552, 75, -731, 370, 382, 41, 677, -123, -510, 567, 261, -1323, 583, 216, 64, 53, -166, -803, 885, 405, -824, -128, 219, -480, -407, 10, 321, 30, -9, -583, -593, 814, -341, 724, -90, -815, 201, 223, 79, 192, 736, -372, -829, -211, 621, -731]
4389g31R25L2N0O6l46P0P36j36j084oK21p30J245m71L95N35j066L60q43J622j006
4410a62J03j05J78N84p90R66k289J391L24p90J072p93l3K96K07N0m7M05k10o32
4430b75m3J48j85K83Jk37K93J39j42j26j06K52m63O31j322J153J228j439n54R47
4450A83j668J447P3p03N98k62k67J095j432Q29QQ93k89o00P45j280K09K00M60
4469B39o62P29l83J37k3Q3K2m60J393j517l44Q41o0m8j63J136j261%K98m13N65
4490A09l27K37O53l84r49J225L93j100J052r32l26Q99j011K85p0N90j61j60k4
4509aK09n01M31p05j84R54q47L59K63o2m33L09P60q67L89Q9m97Q40m64N56l21
4530B77P27j272l09J468r01j087J771n79l67K67J59p15P69K08m76j24l8N09M32
$$ y = [-731, 194, 226, 276, 342, -4, 66, 802, 666, -418, -424, -203, -933, 312, -159, 236, 771, -295, 65, -778, 844, -162, -59, -164, 14, 598, -192, 774, -1515, -124, 200, -590, 482, -311, -344, -48, 159, 209, 162, 567, 357, -275, -318, -170, -355, -72, -71, -308, -15, 124, -18, -144, -250, 2, -461, 170, -1152, 1, 1229, -210, -764, 183, -1485, -38, 35, -668, -70, -332, -599, 496, -936, -107, -99, 794, 505, -95, 650, -630, -421, -221, 239, -423, 306, -77, 60, 37, 120, 142, -318, 1075, -442, -786, 55, -5, -53, -216, 920, -341, -341, -43, -456, 109, -218, 19, 672, 288, -661, 564, 957, -143, 909, -23, -349, 550, -461, -176, -246, 344, 183, 23, -1, 208, -293, 138, -567, -751, 203, -644, -285, -22, -84, -517, -208, 552, -315, 74, 163, -334, 506, 42, 598, 277, 1004, -268, -577, 891, -10, -1097, 674, 95, -272, -5, 154, -561, 208, 416, -60, -184, -222, 287, 719]
4549G19n07K02j058J466n43j166J230j157P97J16j79K97M07q06p95N33P50l27
4567b1k98j38P42M7J31q37m66R29m28J01L44n36LJ92M42q5O62j047L44N64k96
4588C49l83J69j3J9K37q62l7Q57k88k4n34O19j135J215r8m63N52m09P72m91O33
4609F85m66o73O28j010O42P24q25k01N53l88k98J568q37J32q02R23o15Q39n88
4628ik86L44L81p20k57N83k94n09R37P02o44p81L83j54j26P73m30k82M45J74k0
4649B10m63m41J207o42O60l15L29j658M56M01K14O59R8p10O67N9r00K07R33j419
4669d48J38O16p24k59M68k31n88J297O35j032R6R55m08L62k62j482P64N64p53
4688b92K61Q03j754J245l93k09J552j087q50J41l5J289j382J770r48m71J352p89
$$ y = [719, 212, 414, -644, 822, 279, -887, 343, -814, -17, 99, -80, 217, 624, -182, -977, -444, 306, -21, -319, -457, 285, 332, 463, -374, -840, 89, -339, -238, 106, -430, -427, -235, 207, 122, 784, -263, 81, 645, 349, -34, 135, 122, 141, 378, -484, -521, 336, 48, 24, -510, 109, -1026, 189, 91, -372, 180, -229, 543, 52, 685, 219, -454, 174, -836, -194, 530, -295, -496, 57, -331, -629, 939, 102, 234, -568, 355, -260, 579, -9, -295, 49, 430, -290, -547, 36, -258, -767, 170, 872, 228, -553, -170, -324, -450, 323, -107, -389, 56, 230, 210, -253, -694, 513, -129, 531, 216, 545, -1113, -657, -256, -42, 617, 715, 5, 672, 731, -169, 38, 971, -448, -310, 306, -418, -677, -209, -440, -1028, 269, 904, -128, -32, 923, 515, 877, 615, -867, -103, 461, -292, -31, 772, -982, 263, -130, -339, 1213, 126, -724, -583, -618, 671, -711, 1059, 111, -360, 992, 203]
4706B03o88R14p92k57J096j179j86N60M21o47N65k60J89o35L50P59l10K76m78
4725i9p84J128J96j162J210q72L20l8o17O49L48l77o54L56j05O9m95M40o9O68
4745A12o07J025o7J18K4q14k81N28n09K38J244j946J461o05r3l70N4M4k46J103
4765D13p81R43j48p12k05P10k08m67P52k51N1M9M65j020P41n49M20k85K29m82
4785c35P19p26m38M25l80J331p05N07L64j100O17j01l60j2Q8r87J101K46m93N04
4805B65o09J11N47n92O14o35R44j249M78K11R89l20j49J64j96m99j86O30j34l83
4825Am16N84j47J66j49J20m45N39j39n92r3J45L07O58l87L06p83J300j254Q22
4845E43p89l38N00k60J21o88J657o2o43Q78n53j07p68K15P22R19j105J65L7p23
$$ y = [203, -485, 429, -363, -620, 476, -703, -889, -329, 92, -555, 10, -250, -61, -696, -346, 413, 103, 379, -99, -883, 245, 441, -721, 489, -383, -63, -101, -718, -69, 279, -98, -752, -396, -501, -432, -927, -487, -556, 112, -495, 530, 463, 581, 605, -209, -490, 38, -471, -233, 1011, -935, 526, -79, -172, -542, -488, -444, -690, 413, -368, 575, 427, -285, -490, 220, 12, -455, 297, 46, 97, 146, 611, -409, 332, -217, 203, -82, 147, -335, 384, -342, -780, -355, -735, 596, -109, 398, 762, -338, 279, 178, -182, -194, -106, -1093, 8, 254, -239, 265, -344, -233, 314, -278, 336, -299, 645, -604, -126, 85, 1074, 754, 605, 769, 573, 74, -112, 518, 384, 1, -415, 169, 22, 188, 39, 159, -286, 253, 114, -478, -571, -426, -119, 539, 152, 458, -325, 975, -279, 543, -246, -584, -84, -344, -223, -911, 746, 684, 41, 919, 366, 259, -509, -294, 428, 1347, 242, 407, 444, -279]
4865b79J220m08j78p69P56N92j012R1K47o9L42n76k61J2p9O68K27o94k05J19l47
4886f03l2R01l85O81r99Q30K14q03N78n64K03J12m19Q2l4O05k91n85P75p60M13
4907h1J64n8m81O35J46l90N10j100M40q0K75o1k80N84j565J411p12M66K33R86
4927A042o49q48Q01k70K03n57j10l1J151p81k11J36j39L65M33l51j204Q12P02
4946D94k96m14M24m21L31J12K80o09K68m01L11M39K65r99L89n07O37J95q81J08
4966b75J057n17m29n86R70k24n3p3j05j8Q61n40p78Q85R7o74k16J309j150k3j13
4987e95K80O31N56j180L57O23k56L16p72J86K01n42L38k03O75j566J958k239Q13
5006d19L99K38m91r7K55M13k23l39n14Q87n31J45M88k63Q89j081J229q22o01J352
$$ y = [-279, 941, 533, 355, -414, 342, 934, -78, 13, 260, 191, 533, -43, -304, -292, -371, 297, 524, -170, -375, -256, -603, -635, 266, -119, 562, -437, 393, 607, -196, 382, -182, 21, 133, -286, -204, -238, 367, 76, -509, 266, -494, -81, 83, 25, -456, 179, 325, -65, 445, -655, -215, -295, -20, -81, -361, 223, -1342, 69, -643, -177, 56, 1042, 393, -455, 346, 76, 279, -278, -388, -419, 732, -49, -260, -124, -263, 102, 535, 184, -1020, -208, 494, 198, -216, 208, -213, 118, 230, 510, -99, 169, -232, 79, 518, 783, -216, 173, -334, 303, 498, -383, -275, 782, 265, -164, -750, 220, -4, -57, -130, -235, -253, 608, 68, -710, 175, 272, -402, -618, 691, -459, -482, -595, -315, 316, 872, -308, 49, 672, 416, 732, -40, 146, 347, -195, 143, -60, 615, -951, 1007, -1232, -419, -20, 218, -273, -370, -115, 298, 75, -264, -778, 109, -422, -277, 211, -52, 837, -244, 985, 163, -438, 914]
5026I14q10J67K0k74J3n24R08q19K88N43n02n8J50k43n50J169p23jP69k13L97
5047F21o02m9O8J31N41j872P64J050j068R00N3r64M37k34l91Q54K21J49l25QM37
5068G29o6q63Q82j219M26k25J015l42L65q62J78N46j007P24Q89o78q31K94L78
5087C33J7p40o6n35P06Oj16O67j013r8Q27R8L09N7l52o06k11O86l52m88J401p55
5109b25L19m66P67r60nJ47N14j70M53p17R47p98K90j03j128J525p14Q04o58N35
5129C57N43j153m88N76k45R92p83L08L78j66l32J00m85N71n39K97rr31Q41o26
5149g94K86J60O61k25O78j017L39L27k18m74r1M64q78J118j36K24r09Q51N5Q20
5169A241j184K64r52J017j83K7m1l04O7o59N50p8O26Q91j080K22n72O06n44l00
$$ y = [914, 104, 271, 291, 17, 30, -494, 414, -405, -117, 426, -76, -134, 16, -227, -777, 392, -331, -332, 437, 224, 621, 19, -30, 38, 169, 710, -1162, -398, 652, -416, 484, 537, -427, 10, -224, -615, 239, 460, 609, 284, 292, 729, 663, -200, 682, -537, -111, -336, 679, 337, 702, -160, 18, 564, -443, 281, 1170, 492, -339, -45, 333, 350, -390, -456, -991, -285, -279, -395, 272, -741, -839, -12, 86, 395, 452, 100, -506, -717, -31, -383, -871, 530, -225, 94, -372, 395, -565, -570, -423, 91, -79, 374, -343, 604, -194, 96, -7, -1135, 390, -324, 480, -178, 357, 900, -253, -741, -165, -410, 582, -201, 107, 485, 319, -13, 87, -398, 173, -366, -69, -78, -1009, -168, -794, -508, -348, 313, 88, 766, -251, 88, 415, 197, -277, -368, 96, -782, 336, 200, 424, -485, 366, 421, 1241, 57, 321, -631, 386, 203, 230, 189, -115, -48, -707, -157, -235, 391, 1282, 202, 424, -148, 458, -86, -386]
5189c86O29l82j28P69o21M43O5q23J123j009l48L85M26l6P52l27n23o75N65q27
5209i28R76P42j7L25j199o0K98P51j053K44n56O40l51K9K41N09n48M83p00J723
5229A549j844n7R62r66L26L81r60J81R02o36l74N49r8J13o10N80L45q56O76n05
5249c42P23R6k94L47o21Q26q19o47R83k59l79L96L28K4j012K74R57m40l29l4N63
5270C41n28l8j4j7J28N22k48n53Q13m76k31R57j444R59j41P3J08l44O56m27L02
5291C98K29m28o53M84K53O25r43j26k09o91N59j70M89O01q55N33P12j509O83M87
5311D69q46O87o54Q82m69l59J179q67P42j147J066n34n13m10R70l6k78P02p06
5330a22o7J50M07n25K43J59j57r7Q37j086P25O9p35K23n20J013q13J5l14o1J001
$$ y = [-386, 243, -139, -267, 502, -119, 324, 389, -434, 689, -320, -668, -283, 143, 107, 859, 532, 9, -666, -101, -928, 48, 790, 773, 1098, -101, -161, 137, 888, -165, 79, -477, 163, -188, -159, 82, 591, 43, 526, -174, 1549, -295, -352, 610, -356, -30, 351, -609, -428, 474, -162, -536, 13, -85, 28, -582, -2, 343, -513, 163, -342, 381, 477, 183, 530, -91, 735, -84, -731, 252, -7, -386, 10, 338, 362, -650, -376, 581, 141, -188, -222, 341, -187, -225, -239, -256, -128, 394, 146, -407, 406, -70, -301, 656, -788, 171, 30, 103, 211, -133, 523, 96, 398, 627, 199, -454, 30, 283, 908, -35, -161, -370, -1061, -502, -672, -183, 418, -437, 96, 808, -701, -18, 469, -377, 310, -344, 538, 69, -290, 889, 22, 764, -383, 683, 149, -364, -774, 196, 160, -118, 584, -122, -189, -39, 368, -157, 86, 245, 88, -9, 828, -258, 467, 536, -199, 24, -496, 517, -296, -281, -595, -656, 345]
5351C45l91k90J97j43q1j29P18K12j470L05P03l61K89L79p67R89l2j14N13j55
5371G17p48Q42p94j207J382p71P2J303j482L89O47J15n78K88P33n44p6r4l77j05
5391b88N68M7O99o44k36P55j154j14J94R1m11K35L52N13o49k49L70j84k90N57
5411A62r9O88j47q94M95o78Q67K51j461Q50q06M03R30p10j96R33j050J38L33q20
5431h11L95L44k04k86N73Q8k43J02k83J26R46p48N02o90k01k30J015j356K071
5450A110o24o38n5o19P14L25k8n61K71L70j7n21O77j12j032P22K89j021Q40k50
5470a60K26K11r70J058J16m21N0N44n58q81J870j292K92j363J125P67J15r27L66
5489A68J3j55P59n33P70p00n47K3K76q29Q66p01M68M96l47N18J26j551O4J114
$$ y = [345, -46, -336, -139, -282, -363, -492, 226, 438, -1032, -727, -24, -385, -96, 283, -484, 505, 473, 359, 872, 717, -31, 811, 17, -1190, 192, -579, -507, 796, -686, -297, 350, 465, -113, 175, 908, 364, 288, 194, -183, -288, 280, 327, 1026, 382, 146, 901, -253, -367, -173, -82, -493, -258, 94, 607, -42, -291, 79, -105, -395, 162, 63, 751, 604, -290, 205, -473, 394, 645, -816, 34, -772, -369, 561, -149, -345, 588, -462, -324, 9, -811, -416, -72, -276, -562, 11, 99, -144, -42, -325, -199, 747, -1, 501, -189, -390, -620, 395, -961, 1110, 486, -152, -207, -826, -112, 213, 185, -376, -105, 265, 248, -273, 404, 292, -740, -18, 271, -750, 90, -160, 66, 277, -693, 365, 481, 60, 110, 654, 96, -785, 1085, -207, 85, -1278, -153, 614, 729, -198, 168, 181, 26, 785, 252, 1022, 322, -225, -202, 74, -755, 111, -590, -122, 374, 27, 545, 671, -880, -816, 298]
5509B98j52r72O22r8N22K84o21K4J63j55J34R00j147O61k32q17J051P0j331P76
5529b0O45l96j30o68l56P73nK06R9K67r55J331r55l4j75R04n9L9m9m27p03P71
5551A03j26M69j069m12Q86M31p00M8N92p98n0J89J126j438R33j95J19M86o51K09
5571A52O5j80q94J256o72M81j76m61M7M95Q20K17j370N36k44l77p3Q12k81N28
5591F81j193L15m42J011j081L65P19j018Q1l55J028O23p13l18M90j41m55J244
5609H41j122j69L81k22l98l3L26N38r27L39J124j042R72q17m10N61l31K46m54
5628e97J029r00J60n96R81k28l7k49N75o4p99J84Q25j71p05K46J50N08m66O02
5648D48j394Q83Q9L52N57j028K70p90Q52n90K44j64L71p54P49L87r5o16p42J701
$$ y = [298, 146, -826, -204, -302, 220, 504, -117, -93, 70, -85, 49, 949, -198, 463, 231, -586, 465, 535, -796, -20, 625, 229, 99, -569, -925, -152, -157, 49, 148, 415, -540, 791, -164, -198, -373, 531, 472, 511, 462, 35, -668, 103, -23, 446, -623, -1035, -149, 282, -418, -370, 222, -576, -626, -437, 689, -749, 184, -11, 108, 594, -57, 152, 217, 37, -857, 399, -273, 208, 32, -429, -382, 113, 933, 1150, -220, 316, 72, -305, -378, 434, 153, 681, -512, -197, -639, 372, -709, -344, 375, -643, -562, -917, 111, 734, 21, -297, 193, 52, -403, 841, -281, -450, -69, -291, -689, -722, -396, 142, -785, -446, 678, -364, 608, -209, -619, -58, -389, -143, -597, 432, -468, -308, -904, 77, -151, -188, -437, 138, 74, -725, -541, 284, 113, -592, -346, -196, 312, -154, 448, -946, -63, 26, 378, 935, -93, 177, -613, 239, -351, -107, -271, 100, -654, 95, 482, 387, -229, -971, 730]
5668G30l23o70J52K67k03J028j026Q1L69K04j043n7Q79n05M30p76O84k83J080
5687A018j017K06j23m15K75m04O20m03M99m82m21M98Q88j280L28J89P2n79J112
5706E81p30J158p71M83o42M08n24l91J040l19K95n95O83o12Q13p4j185l25M47
5725b60P68l15k07n2M02K48R0o53K3j48o09J184o15p29J444n35k2O60j684J687
5745F77p84M69M6m28m94N3o5N37J11n57J087r37J37j18R78j37k04k64k66k51Q0
5766c30N3J09M68r59P00J133n84o61J60l66J063n0m33j93K45p6m61l1P70o02O04
5787E59p1r51J275r90K24K53J80l9K13o13r0J40K44n16L91n66J128k09p32p85
5807i55Q28k2n79Q33Q47l51m97K90q52N83J17O6j833J227J84Q91j098j05K4O34
$$ y = [730, 407, -263, -111, 156, -47, 981, -45, 36, 405, 609, -434, -491, 388, -117, 313, -463, 221, -62, 1018, 1, 207, 84, -331, -56, -460, 160, -243, 256, -226, -647, -149, 739, -541, -213, -24, 48, -531, 581, -149, 1009, 238, 721, 79, 487, -37, -428, 612, 293, 588, -7, 676, 64, 877, 803, -382, -707, -260, 508, 193, -14, -66, 336, 584, 674, 21, 44, -104, -713, 471, -144, -873, 571, 36, 14, 674, -1010, 677, -107, 362, 408, -20, -514, -461, -526, 11, 122, -435, 652, -285, -148, -266, 712, 575, 371, 107, -159, -410, -330, -277, -168, 300, -659, 41, 1174, 590, -71, 89, -277, 786, 736, 303, 110, 355, 279, -182, -213, 557, -45, 559, 488, -463, 812, -178, 46, 299, 479, 440, 653, 40, -50, 90, 334, -182, 209, -357, 771, 562, -170, -955, -127, -149, -728, 105, 952, 601, 104, 394, -458, 125, 242, 308, -1525, -298, -114, 777, -321, -426, -402, 232]
5827B32k80P56n67O03r10o3R63o13L08n10J72J82k87J05N42n16l29l76Q88M99
5847G99p99M10p95J6M41n95P81l69J3r9l8j72J84M72M13n61j129J957j21p01k68
5868a61N76l52M52o14L28r47P92l15J46k91P22p10K06O03o10M40q4q83L37P94
5888D29K57L97k30j226J350n64j94k91P70q38k2N54q87J35J8K13Q08o30n81k97
5908h29P86J7m99Q94p60K99L42o5m38O86m83j13R62j669J09J063o83M55J65P66
5928A005j795P70Np08J487q05o4l80M75p4L33n44k10K58l40N46L00m70L7K71q95
5949g98J771j306R0ON70k25o63Q07P39q66q8M86K06q67J10K80M29l92j36o91N22
5970a6o39J067J275j800k65l49P94m06o7O31o71J432j011o74O16M02l85j33J150
$$ y = [232, -48, 708, 141, 744, -166, -229, 734, 121, 429, -81, 91, 273, -14, 91, 633, 117, -212, -588, 300, 799, 0, 410, -385, -369, 72, -523, 258, -111, -98, -197, -235, -407, -223, 249, 662, 101, -1028, 929, 808, 107, -161, 415, 63, 515, -99, 229, -718, 74, -241, -95, -386, 336, -374, -168, 435, -175, 265, 181, -702, -365, 429, 686, 1083, 853, -373, 977, 413, 219, -72, 698, -140, -162, 392, -495, -360, -342, -129, 679, 49, -532, -829, -43, -26, -525, 369, -391, -92, 250, 185, -253, 433, -50, -163, 799, -870, -761, 302, -381, 74, 239, 1005, -790, -20, -15, -723, 764, -41, -105, -485, -10, -84, 249, -295, -505, -247, -587, -41, 259, -211, -174, 97, -798, 973, -333, -243, -237, 333, 108, -555, 252, 991, 125, 37, 523, 729, -138, -28, 252, 681, 289, 153, -538, -16, -655, 412, 1687, -113, -378, -727, 67, -339, -406, 225, -446, 986, -25, -699, -83, 319, -66, -199, 951]
5989I51m08n38M46o08K34L47R9r15M33J09q38R0N13l72R93q68Q84j504J290J19
6009D57j418K23M88M99k16L04r93J289m98m85P58K99p41j24l17O59n44O46l98
6028a12P5j9K24K6M36n27J27M73K20q34K00l25o6O51J48o52J1K23l75K8M05q70
6050e33J8R66p09R05j550J073q96O02L36K44n23O5M27k21n82m49Q71M00q91L55
6070i2r3J97P95j167M32K35L22m22o96K87k28j85O04Jj091J722j080m12J30R06
6090A65J04p11J139k54m26M90l29k19L27k92j118J116J86k36O77j264o7J17Q19
6109B24q00J079n84k63O7l20J66J538j013j77r0L41q37L14J141o83r9k16M30n4
6129A64M82j097N51j078O16N20M64r87J80J95M89J93p80n57L52L21ql54M8J254
$$ y = [951, 543, 5, 451, -157, 77, 424, 523, -392, 41, 150, -688, -598, -85, -457, 536, -332, 552, -952, 338, 457, -961, -738, -250, 249, 33, 337, -656, 633, 135, -350, 408, 707, -34, -158, -475, 184, -360, 286, -112, -37, -56, 168, 194, 630, 103, 230, 703, 923, 89, 289, -36, -102, 549, 697, 45, 56, 279, -96, -68, 337, -533, -515, 451, -258, 647, -903, 170, -726, -124, 212, 456, -67, -2, 425, 204, -378, -827, 44, 444, -447, -92, -185, 12, 807, -360, 72, 307, 629, 207, -489, -202, -430, -615, -11, -10, -1101, 621, -459, -871, -741, 165, 269, -442, 697, 443, 17, 507, 178, -41, 286, -6, -1124, -8, 178, -58, 619, -645, -712, -595, 224, -576, 503, -81, -344, -277, -597, -431, 1107, 94, -83, -173, 168, -669, -355, 786, 103, 4, -212, 218, 164, 646, -451, 100, -978, -362, 158, 622, -365, -185, 10, 499, 692, -88, -645, -293, 28, 20, -334, -286, 968]
6149I68j295j13l38J147o03k29R52j053R41q15O35j18J73n09K2N54j169P71Q58
6168G79o41J072j105m49p04Q08O04j02q5j099R11K24K52k91P0j58n91O34p61J049
6188D17J60l75K32o2m23l16O27j68j55o55J435j90k58M28m44o63K2N06l38Q42
6208F22q29R0n46P30M78k76m00n81L70n3j73P45k52r7m85P70M1n97N0J2J142j269
6230e08K10k41L16K81O50o70J53Q29q42m27R60J41p09K65m09J18M25J87p09K00
6250B20N00o48M96k84J18p50K96K58r37O85k17j08L49P98j92jj51l19l0n31J59
6271b89K41M78m43OR50l38j037N01M31q72Q15q94O71o51K84K80o82J192q26J054
6291H71j440L68%j48L08m33J095p41J153j131M02o46L04N66q04L11l91o5m86K171
$$ y = [968, -327, -440, -778, 369, -234, -463, 489, -564, 377, -438, 197, 79, 252, -257, -235, 319, -850, -79, 779, 138, 1210, 105, -344, -1048, -240, 364, 262, 177, -922, -11, 213, 465, 174, 244, 86, -505, 129, -632, 417, 577, 202, 434, 372, -51, -367, 260, 92, -63, -718, 717, 527, 269, 697, 253, -410, -388, 118, -220, 622, -207, -117, -663, 67, 545, 269, -131, -712, -342, -395, -568, 177, -75, -172, -657, 113, 154, -443, -393, -381, 761, -508, -298, -539, -223, 58, 708, 38, 191, 1020, 178, -249, 711, 852, 143, 408, -1, 117, 542, 729, 20, 220, 720, 72, 568, 284, 402, -348, -52, 206, -731, -46, -263, -371, -22, 776, 584, 583, 432, 113, 83, -448, -289, -48, 430, -13, -7, 943, 605, -432, 69, 500, -372, 443, -451, 220, -431, -147, 133, -549, 643, -183, 871, -569, -201, -201, -349, -41, -474, 621, -120, 1033, -98, 304, -342, -38, 528, -276, 35, -356, -421, -907, 1264]
6311A264r36m20q8J88J52n48K11p2L8K07k94J069j005N61J18p85L47J09J26k63
6331b1R57K42j620M73j39L73j71M44j161M45n40J414J2p09O06r34J107k14m26
6350A38J31k07P58j083O07p11O50l86M69n32j96L81k01j31M02q5o26N31m81Q84
6370C12n99J25r61N50L45K85j65J95J17p77J169n00j0J019n07lo16K14p9M00L
6391E17n41j74l82O16J62K59m15r6l06K42l15K15P04J2j288Q3P98n69O33K54P57
6412A166j231J02J58P5j247j67R53m82N63R65m88j082K90j31J128j240N54o8n70
6431g52J243J46q89J132j443j62O93L32r33J022j53l88O60m29J18m67nK15J8L01
6451B59j095J614o07J78k50M25p86M69L01r70P54j22K48o97N69j45l7l7N13p02
$$ y = [1264, 328, -92, -180, 8, 160, -388, -177, -249, -211, -4, -298, 771, -234, 327, 445, -340, 7, 116, 242, -21, 936, 1178, -442, 31, -108, 265, 94, 538, -623, -178, -718, 696, 708, -1, 605, -329, 778, 564, 138, 269, 62, 820, -263, 344, -367, 283, -103, 366, -166, -362, 19, -182, -313, 89, 4, -622, -91, -572, 312, -287, -162, -1123, -573, -228, 57, -108, 87, 204, -573, 596, 96, 86, 1105, 598, 595, -21, 193, 114, 514, 517, -24, -198, -580, 36, 198, 457, 42, -54, -360, -118, -433, -218, 486, 498, -790, -707, 91, -478, 155, 409, 1166, -65, 37, 195, 270, -977, -1144, -191, -673, -110, 855, 367, -715, -425, -556, 572, -668, -114, -182, -752, 491, 637, -252, 880, -563, -725, -32, 300, -633, 389, 236, -152, 508, 79, 197, -270, -275, -60, -42, 259, -836, 778, 171, 349, 99, 524, -262, 207, 508, -462, 292, 170, 418, -279, 290, 145, 108, 71, 584, -118]
6471a18J19N73q65O5K52n52n83Q46K62M9R98j469N19j13P74p00k43M62l23M08
6491C61m42O63j198M81n42J617j279O14l73J74m08J11K22r08R53M39l13N46j504
6510g86J288j255R31r62K92K02Q91n06L90Q54j892j48R37k29l27L11L34l56M30
6529C99O19j433l88q7P28ML62o7M39j89j46n41k29J073q80o9q10J823n91PQ76
6550I00r00m69R74J69o35n34l20R61p34R86j063J98Q88k11J78o03o05N70Q43l00
6570B93J45K7k06k43j08L42N18r82J61P64j470O99J63J73m05L44j264J013M42
6589D06n35l89J367j420q7P02n23L79J64j40J83l88J558r33M06j308N12j65k99
6608e10N91N64j093K87J84M20r65M71M83j061P59j51R89l30o80N05p95J140r14
$$ y = [-118, 1, 574, -291, -226, 26, -526, -1109, -263, -1, 48, 1046, -423, 96, -17, 757, 57, -186, 276, -47, 361, -81, 582, -616, -135, -677, 940, -339, 275, -98, 76, -332, -221, 1, -907, 46, 485, 172, 718, -786, 502, -753, 178, -784, -492, -290, 601, 95, 485, 1339, -553, -701, 236, 7, -320, -9, 325, -31, 399, 1018, -415, -803, -890, -162, -158, 204, 137, 576, 387, 241, -300, -529, 544, -336, -405, -1215, 608, 17, 24, 900, 0, -469, 505, 674, 39, -495, -815, 146, -588, 398, -665, -467, 421, 210, 388, -215, -820, -250, 593, 293, 438, 465, 259, 16, -92, 250, 768, -214, -53, 711, -759, -60, 103, 276, -129, 215, -1049, -36, 406, -129, -518, 849, -571, -658, 44, -479, -100, 64, -76, 107, -281, 1277, 344, 750, -558, -46, -211, -510, 81, 645, -448, -161, 23, 443, -522, -51, 432, -629, 130, -21, 968, 638, -42, 463, -332, 808, -106]
6627a06n5q19L37P79O7J47j043J769j067l5m71J126o74Q61j306O57M87k61p6J02
6647D19j72l80n29Q11K73n02J86j40K49J29J63J33k21m12J59k69Q74o61Ml45L31
6668A00l6M93j166O64m9q60N41M92K34j097l9R14j23L33q25J253p29m29N09j78
6688BJ45L52Q04q89o93L72J44o62R55O6q05m40N77j01k78J366j484J48L67P19
6708F65k45o71P23r51J361m57l94o9O99j42N0k08m34m2P88m74O41r53M21J93r53
6729d52P83j573J235m65N94M0q02J07O7L41N35m43l65J101p13k09J36k62N64k58
6749c9k68J087j499N37q5p25P46M69j082J163l16k15J06r5n86N31J187l45J93
6768G64n59m62J107k86q40N40K79m47p49O58Oo58P52j56J288j426l18K62P9O83
$$ y = [-106, -161, -980, -643, 136, 203, 350, -693, 1076, 9, -26, -497, 629, -45, 816, -490, 167, 654, 393, 317, 419, 247, -133, -662, 149, 422, -80, 106, -34, 215, 344, 507, 640, 419, 7, 166, -103, 771, 110, 114, -231, 100, 64, 557, -609, 55, 6, -854, -313, 179, 413, -684, -723, 191, 68, 401, -424, 829, 100, -329, 180, 2, 147, 499, 1303, 414, -279, 93, 237, -425, 530, 596, -209, -649, -72, -173, -451, 915, -569, -421, -54, 665, 420, -251, 472, -479, 882, 425, 31, -38, 661, 519, 569, 361, -73, -115, 673, 199, 840, -113, 308, 501, -452, 331, -1242, -7, -472, 122, 162, -640, -533, -466, -125, 410, -33, -398, 703, -10, -219, -83, -345, 219, -39, -307, 780, -719, -182, -267, -992, -246, 223, -859, 304, -12, -227, -121, -216, -802, -271, 916, 571, 764, 205, -257, 850, 564, -276, 264, 543, 96, -653, 5, 11, -647, 105, -51, 1237, -189, -507, -245, -166, 517]
6788E17J05n14l3O44j333Q08j037J361m83k0N53p95O07n02O08Lp47K97m29J185
6808G95n64m98O47K35k11j076q1J111j197L73Q31l16j91K94M05k63o06O32O74
6827I94r48o85J242p36K54R4p60O78P50m11n34L35o9j014J652j303L27L31j255
6846a058q0J093K95Q2P76j452J057j371L17K63l83P78n50J332p37n13N31o4o12
6865b96P63r51R96l39N70l64K00n56J18n85M3P9R3R82j516J09J273J1p93J69n85
6886e79Q48j58m2P95j040m52j25Q60m13M09M4N15j093N47L55m55o71J322m91k99
6906a23N57n59P57o20m74J349m10n24l46J345p77p46O57k8K22L0m64k92l7M75
6926hK33l43M21q15K70N07L3j160P98m2J37j0p9M33j240Q60p8M77l18O39j118
$$ y = [517, 622, 108, 75, 719, -614, 194, -843, 518, 35, 15, 568, -227, 380, -122, 486, 489, -258, 39, -390, 795, 231, -267, 380, 615, 404, -672, -753, 358, -839, -466, 365, 49, -142, 152, 557, 294, -312, 320, 994, 46, -639, 603, -133, 121, 215, -545, 133, 883, 472, -62, 273, 204, -810, 842, -461, -134, 197, -1058, -1138, -45, 250, 332, 1108, -344, 713, -658, -341, -78, -461, 317, -233, 1099, 362, -151, 380, 316, -296, 467, -484, 512, 173, 743, 379, 579, 23, 141, -444, -401, -322, -229, 753, -763, -654, 619, 630, -163, 6, -579, 269, 111, 69, 864, -176, -628, -753, 107, -306, 103, 147, 662, -431, 116, 471, 16, -655, 667, 176, -123, 434, -125, 632, 12, -462, 887, 477, -47, -393, 952, 175, -571, 86, 58, 280, 310, -154, -446, -483, -8, 225, -118, 303, -512, -242, 265, 298, -862, -64, -106, 31, 21, -58, 375, -865, -5, -83, 394, 76, 715, -403]
6947d03r44J740r39P75m96k40M39L68p80M23M37p4j22L91o15M44l63k58M56pr82
6968g50N52n9K53L00p28J070j126K03K42l14R75o0m80O7lK83n05k70n52P85J78
6989F1r6l75O35l55k00K4j34M24P11j097n35R36P0L74r11Q55J08k07o16k01l96
7010i25Q87Q59q10O7N82r51m99J046M13j150J15N76l27R5n01N42P43l64r11M51
7030f2P29j670J60Q29o85J07J882j346m96J188r60r3L75N55r75k5l63R23m79J076
7050F70j243P13j05K83lk40J4o4K5K96n79n38N9l97J466K7j26o41R32k44k62p2
7072b9j68L83p26M95j75m47O9Q07n6L47p23N83m1K29k77p74L07o89O17q6M69J47
7094B62p81P54l7r0j32p5J89j351J528l74R9R3J73J70p24K94p61N0O55rL93q99
$$ y = [-403, -1347, 393, -546, 229, -267, -507, -68, 300, -480, -57, 380, 306, 184, 575, -40, 404, 41, -217, 239, 232, -750, -198, -257, -4, 296, -432, 638, -488, -285, -43, -357, 618, 558, 78, 145, 142, 425, -80, -350, -902, -117, 61, -35, -410, 225, -130, -330, -306, -440, -16, 695, -402, -937, -1, 69, 443, -468, 387, 495, 288, -328, -529, -925, -38, 821, 11, 78, 660, -291, -790, 256, 669, -481, -366, 210, -117, -22, -523, 19, 762, 398, -513, -62, 667, -1003, -843, -14, -699, -592, 1290, -56, -552, 636, -324, -417, -42, 513, -462, -487, -850, 73, -406, 670, -573, 140, 35, 318, 315, 75, 89, 25, 50, 346, -233, -771, -712, -1109, 357, 384, 258, -383, 549, 305, 43, -29, -197, 186, -540, -45, -220, -667, -598, 209, 153, 500, -223, 360, 319, 548, 271, -503, -196, -885, -268, -354, 115, 262, -519, 235, 198, 108, -24, -99, 90, -1261, 267, -107, -8, 85, 258, 428, -296, -2, -763, -713, -58, -67, 326, -573]
7116e73J618q10O51j234L99q23J252r98Q93k95J23Kl42R91q34k14k44N57q19K47
7136d53O70m83j8M40j551J975p56M1j02NM10q22j49L21j26J313n69k84N5M01R9
7157D17l34q58J137k13np23Q22O29q35p1N94o95O35p61L16L11q37J173q24M64
7177C42K38r24J371O2j226l09N2l8n28R54N71j58k10q99M05O14o5o63N69n7k33
7198a32j00O93p30K37J71L18j746J681r94Q78m27P9n31K79k27P09k42N89K57j161
7218c99L74L59K32o71j53M58j297J103N79j799O84R05J87j778J518j56r32j21
7236i07N37M68q13N25j43j79M92k87J109j011j49L92r2k2p81J127n07n11J046
7255B94k47M10j085P65l26K99m86j33Q90l43N0K08M02p23J13l17n44J016m54l82
$$ y = [-573, 1045, 235, 886, -348, 51, -772, 480, -518, 375, 80, 203, 205, -137, 854, 20, -194, -438, 119, -700, -453, 217, -266, -284, 156, -1395, 580, -176, -135, -237, -232, 178, -644, -793, -472, -598, 715, 146, -138, -83, 318, 417, 83, -775, 362, 149, 144, -579, 243, 872, 37, -34, 560, -135, 500, -261, 55, 366, -471, 702, -122, 342, 580, -344, 1027, 1089, -137, -446, -394, -432, -960, -6, 565, 407, 197, -702, -297, 317, 252, -411, 158, 101, -132, -232, 461, -269, -32, 139, 457, -1289, 392, -602, 276, -151, -72, -603, -324, -551, 158, -84, 505, 762, -399, -25, 334, 566, -105, -258, 200, -1097, 6, 585, -1214, -530, 375, 562, -1216, 302, 146, -786, -907, -370, 98, -715, -190, -333, -512, -20, -307, 802, -209, -358, 34, -58, -80, -861, 266, -241, -752, 294, 47, 457, -628, 137, -189, 110, -376, -509, 381, 38, 88, 296, 698, -25, 88, -229, -773, 243, -211, -593]
7275e93k43Q82n6o70J069l65O44j377O36M18l09j87K85k65K95m01j09J056p64
7294e4J96o9L45r69L81P88j81M8r63J01P53m4O0K22R5n11r75N2J81J30J139l73
7316C52l02m55R82q17j92M39q50R46j073J475o47L17m47Q19m41r03P18P32q22
7335a69M74M90j216M21M45m38m82R50q26O99j43o51N11J74j041P15M85q22Q09
7354C85p83M25k29p7R85j552J425j352N10L04Q2j1M12k78p02N26N2m09M9P01K79
7375G42o33M04j009Q18K0k04j84J3M38J00r22M78n58J87M73L3m14k28J44L53M26
7396D77j47k1R1k45p09J483n01j8o1k06J16j24O96q22r7j14N54m60R56n63J12
7417C97j150R49j001M13O42j32O43k22o26L33n78J4R25j494K48k4J38O88j99L56
$$ y = [-593, -836, 46, -10, -680, 389, 24, 668, -709, -73, 345, 36, -151, 134, -131, 164, -237, -346, 710, -54, 142, 73, 418, -551, -170, 618, 437, 485, -478, -377, 376, 332, 392, 614, 709, 198, -777, -725, -544, -414, 725, 352, 50, -405, 577, -240, -432, 7, -843, 103, -970, 505, -142, 175, -272, 547, 106, -797, -79, 653, -169, 305, 795, -421, 0, 445, 7, -475, 475, -351, 348, 205, -446, 65, 239, -802, -87, 398, -424, 385, -398, 27, -202, -279, 706, -846, 579, -773, -263, 41, 123, 112, 524, 246, -456, 70, 122, -287, -238, 463, 742, 109, 513, -496, 322, 342, 138, -46, -33, 405, 505, -417, 61, -497, -310, 163, 196, -218, -446, -302, 51, 477, 330, 309, 400, 155, -554, 929, 428, 410, 349, 143, 259, 135, 831, 9, -88, -202, 352, -108, 848, 285, 397, -753, 196, -805, -392, 250, 118, 761, 539, -87, 246, -332, -318, 607, -887, -639, -663, -525, 163, -36, 320]
7437C20m62K11K81q94L66M88q36PP99n98N96L23j381R30j99k44K82k35J101o37
7457B18o08P85j88l51k73K94j1J87j93K82Q03k11J0j502M96K02j3L05l70R83q25
7478B0J65k43J020j788L64K52N11n39M76j53m49K62J37K46o13Q97l02Q38n62n57
7498a8P8o95N15k29l40J131j233O01L69k84P53m8n87n36R08j73q62o9L18K68K96
7519A63m9Om9j2j4j30o44M4L10K36N25n91M42l41K19K44o24P08p24l38J99O40
7541B20n20L02M45o62m0J204o51J07j73q68N28N0J088q6n14j348J893j294J261
7560I42j2j080k42P1K13O62p27k81K71R40j508l28L24M02N98j85M87j106j72P83
7580E2j16J43K2q45L89J39J039r39O02p54L42J382j204j055R60j80M34j001P41
$$ y = [320, -142, 69, 350, -544, -178, 310, -526, -519, 280, -318, 278, 601, -780, 150, -49, -293, -11, -246, 855, 218, -390, 395, 207, -144, -417, -123, -134, 53, -140, 142, 945, 734, 744, -758, -262, -60, -73, 232, -138, 845, 20, 185, -58, 962, -826, -462, -210, 301, -238, 238, 85, -364, -102, 35, 281, -332, 565, 263, 1101, 539, -18, 60, -635, -120, -349, -689, 442, -791, -190, 179, -105, 648, 600, 13, -523, 385, 212, -650, -719, -401, -133, 163, 114, 120, 71, 59, 45, -85, -729, -685, -375, -139, 386, -205, 237, -104, 115, 359, -265, 443, -281, -619, -420, 220, -300, 2, 447, -215, -255, 949, 298, 405, 232, -636, -108, -58, 1030, 944, 430, -918, 975, -319, 942, 930, -150, -392, -321, -108, 554, -173, -454, -183, 757, -751, -1079, -755, -353, 245, 60, 547, -559, -731, 52, -64, 79, 101, -744, -355, -216, 823, -116, 486, -268, 74, 1456, 252, -803, 157, -23, 411, -590, 151]
7599A51l25m37P66K5j26l51p26J298p78J012o06J50q8j041J192r32k56J272J00
7618C00l13O4j69N37M11o30p42J031o46J63R20n79k90K58n08K97om11m7L82r38
7639i16J025q52J029l69L57l36l24R61q35l27K43l65Q68o59j22M03J72j5J154
7658A092j283j3r14J207j95l64P17n04P26j08k8k91m92N33p7o2N17l41n52O03
7678A71r3J346j594L37L29q08m6O20n13J5J29j16M66J01n81K77M56k57M95q3j366
7699g15l20O81l04J016p17J66K84k89M70j95l41o31Q72JQ74j221L1Q30j60l91
7719e9n7K98l18K60J95k10m8N32o36l99j1J85M06l27M95K51Q3p22K30P49q53O1
7741A05M82l09m94O35j99m66O8J287j422l76J032n56P60r54K34q20Q06j69J332
$$ y = [151, -174, -611, 155, 180, 54, -297, -1023, 275, -503, 509, -97, 53, -35, -1076, 116, -816, -1072, 200, 300, -13, 51, -118, 419, 830, 200, -542, 489, -157, 6, 926, 347, 57, 315, -193, 104, 98, -313, -360, 22, -916, 109, -743, 286, -83, 274, -62, -386, 575, -260, -587, -344, -709, 159, -500, -622, -219, -47, -62, 1092, -191, -204, -1118, 89, -106, -470, 247, -257, 469, 361, 333, 42, -450, 83, 6, -56, 461, 120, -432, 171, 78, 1424, -170, 167, 496, -312, -358, 262, -251, -236, -107, -223, 243, 344, -237, 40, 496, 239, 734, 651, -715, -1035, -354, -658, 358, -359, -193, 91, -198, 272, 77, -264, -895, -23, -22, 852, -369, -338, 492, 332, -59, -116, 182, -136, 124, 319, 109, 61, 593, -43, -442, -453, -268, 138, -189, 306, 557, 640, -82, 148, 897, 44, 105, 587, 278, -216, 419, 220, -246, -178, 1109, -313, -689, 343, -213, 547, -407, -173, -993, -187, -356, 976]
7760I76j179K04q3M16n24J44l12m89L74R74m93K30q68R80j00J46k54m40K16J96
7780A14L9m21Q50l79m56N10l27J222j513N4k6l36J003N0o86P9P7L67L64j082R05
7801D08m14j26N96m90J80K2n24M20K3K50o62L31O79o08M27K33p72q2m82J152r12
7822c51K0M36j70j7p13R91l96M90k12n26J619j359l25O95K54o38P6L25p25L2J21
7843c73J35J07K63j99P72q2j278O82l14l26M99o23M31p50J244l06N56l64K77o15
7863b64p9%p22Q86J01K56k84K20P56n0j222Q43L85o58o79L71J24N38r04Q30k41
7884B07N52n72l22J11k54J27N4L09j12r8L05j02p42J070n95O59qm33k61Q8P82
7905G65K05j100K47M62j093j9K93P69k28qM96j360O74m63K25N16l50m58J190j407
$$ y = [976, -203, 1, -82, 334, -190, -46, -358, -847, -473, 501, 8, 238, -630, 350, 250, 396, 142, -298, -82, 114, 153, -268, 582, 203, -253, 257, -70, 1152, -361, -307, -333, -669, 334, 384, -302, -223, -146, 221, 585, -497, 408, -6, -132, 464, -26, 154, 176, -348, 72, 95, 345, -317, 14, 693, 85, 512, 745, -27, -109, -591, 561, -351, -331, 105, -65, -82, -795, 196, -200, 290, 78, -448, 1171, -188, -513, 182, 436, -202, -126, 199, -526, -494, -373, -238, -131, 132, -67, 705, 623, -655, 27, -287, -613, -114, -737, -306, -1056, 188, -118, 438, 74, 351, -264, -343, -343, -1065, -179, -78, 178, -106, 114, 870, 820, -402, 441, 826, 168, -511, -140, -16, 522, -382, 448, 207, 759, 187, -135, -24, -278, -151, -97, 212, 100, 2, 307, 205, -537, 533, -62, 597, 589, 156, -105, -17, 765, 970, -130, 117, 579, -514, -533, -240, 529, 301, 293, 789, -571, 103, -360, -135, 381, 31, -427, 763, -644]
7925f44O72O55p43L65J76n84j62J3m5q7R08j71j072M30L67k63J137k015J062L65
7945C64j84k73N42j18m67J67m43M33K95n90p46J063K95l15J27P72j145Rj09O94
7965C71r54O20N61l34j78j30K50j72O46q64m8q99J607M23j438m64M11J036l58
7984H6M64L52j324N52J93K10L84n92n25M74L26j596J598n73L8p76R82r13R23j17
8004A66N46K62j198j25j97Q75o79P90l91O47p26j60l97R33n04L29k32K40L93j349
8024g77P95j92n75P22K6o88Q62l27Q25p67J420p25q11P74k13QJ27m87m83P19j19
8045A14l16J73N0R51j311J34k96M44r9J97M41l89L60K2q02q0j87P92O8j139M15
8066d58L61L85N69j253J315j109Q09j139j57J922q69K9L26q32M98r60K61M3J193
$$ y = [-644, 28, 683, -60, 305, 481, -103, -265, -252, -297, -384, 524, 353, -719, -289, 78, -185, 952, -1063, -1, 364, 180, -93, 449, 331, -136, 31, -412, 21, 316, -274, -1020, 43, 338, 23, 150, 922, -223, -214, -323, 371, -583, 37, 598, 264, 86, -44, 206, 34, 680, -184, -232, -1131, 476, 899, -539, -1003, -592, 444, 86, 550, 902, -422, 130, 323, 533, 917, 325, -200, 274, 600, -996, 602, 29, 67, -709, 273, -640, 283, 166, 712, 974, -224, -349, -546, 329, -350, 440, 49, 696, -30, -190, -587, 346, -158, 171, -61, 179, 572, -777, 18, -174, -749, -27, -1, -689, 173, -154, 671, -96, 1324, 599, -212, 562, 349, 357, 484, -3, -486, 233, 114, -202, -29, 21, 972, -339, -205, -501, -57, -156, 41, 482, 93, 453, 475, -327, -407, -594, 198, 266, -873, -458, -97, 288, 857, -396, 919, -190, 619, -520, -677, 1245, 376, 405, 731, -101, 397, -563, -302, -259, 934]
8085I34j032n27R91l49m1k77l45J205k82j009R36M4k56N73k09n76P28j07j63o35
8105c97L17j80O25p41J58J8L77J2j180o04J751j15K91q02K25r31J632o57O92l86
8125A05j017J213k15R4p12N90o3J75N36l02n34n23J001j40N8M79p59N88o00m67
8145d93O34o15N05j444J992j187P92m09n85O94K32J46n58J332o54M56l14p12J88
8164@k43R1O1o12OJ264n93j008O44o7K41J185j184O0K59j95J49n37N08K8j17L66
8186C06o9K68k52m21J068
$$ y = [934, -98, -625, 366, 17, -24, -301, -646, 559, 277, -732, 204, 248, -8, 565, 356, -220, 508, 401, 238, -397, -80, -260, 365, -376, -218, -200, 177, 189, -991, -1595, 156, 41, 332, -470, -245, -1176, 456, -201, 491, 105, -912, 301, 86, 180, -532, 58, -5, 170, 706, 404, -130, -653, 348, 208, 266, 745, -14, 574, -26, -493, 141, -474, 31, -1413, 579, -608, 184, -225, -810, -116, 116, 262, -296, 1036, 382, 838, 524, -188, 0, -243, -152, -91, -703, -697, 567, -26, -1034, -390, -457, -216, 969, -215, -155, 104, -91, 58, -479, 29, 57, -60, 306, 237, 505, 253, -168, 900]
8191I00
$$ Imaginary data points
##PAGE= N=2
##DATA TABLE= (X++(I..I)), XYDATA
0@%%%%%%%%%%%%%%%%%j05K13k16K16k16K16k75L83m32M40n48O50p47Q57r71J096
33E61j213J406j604J798k006K234k483K766l076L412l786M192m630N109n637O213
49C256o840P534q304R152j0092J1150j2336J3688j5231J7013j9123K1633k4699
62a3199K8550l3526M0242m9885O4929r1958J55440o07484l05528Q60951Q904J62695
74B20131L08069k05365k08880L18838j63128p6878M02925o7092l51259J83674
84C61035j67743m03283J64159k2532m25104J93352J79087l29256O4497K20739
94a65049k06343J62381K76209k55170O3271L96823j76499n2736L85304q7219j60179
105A80793K29449j69098k40144K49179j01954l51213J58502j6328k82763K10286
$$ y = [0, 0, 0, 0, 0, 0, 0, 0, 0, 0, 0, 0, 0, 0, 0, 0, 0, 0, -105, 108, -108, 108, -108, 108, -167, 216, -216, 224, -324, 326, -421, 436, -535, 561, -652, 754, -850, 948, -1058, 1176, -1307, 1459, -1617, 1795, -1991, 2201, -2429, 2680, -2957, 3256, -3584, 3950, -4354, 4798, -5294, 5856, -6480, 7208, -8023, 8990, -10133, 11500, -13199, 15351, -18175, 22067, -27818, 37111, -54847, 100593, -506891, -812419, 48532, 57436, 220131, 528200, 322835, 113955, 432793, 269665, 192787, 595712, 528620, 177361, 361035, 193292, -209991, -45832, -68364, -493468, -300116, -121029, -450285, -385788, -165049, -371392, -209011, 67198, -187972, -124701, 272122, 95623, 42887, 428191, 340972, 180793, 410242, 241144, 1000, 250179, 148225, -202988, -44486, -60814, -343577, -133291]
115a33291P3603l28444J53173J75298l14159R1249L35298j21672O8781K64258
125B64094j60049M1285K95790k35401j60560K76476j31272j96257K55708p6445
135A73369k60466J62837j04455l50445J70840R1388k50775J39441J27333k05712
145c06645J81448K09198k54120P4650K89670j72897l60K94421j00915m3183K07602
156C78869k04032j59822K51544j12824k58029J56216o9014k43260J69088K515
166h8749k57861J62421J05065k43221J15020J95708j40879J10647J86093j81219
176c6975R8399K98399j66214p5727K14669j47235j36243J80151j24171j56929
186e1876J86030j13955k64017J49309J46k25647J26719L7792j92282J97639J72605
$$ y = [-133291, -59688, -388132, -234959, -59661, -373820, -282571, 52727, -68945, -164, 264094, 104045, 145330, 441120, 205719, 45159, 321635, 190363, -5894, 249814, 173369, -87097, 75740, -28715, -379160, -208320, -116932, -367707, -228266, -100933, -306645, -125197, 84001, -170119, -95469, 194201, 21304, 20944, 315365, 214450, 171267, 378869, 174837, 15015, 266559, 153735, -104294, 51922, -17092, -260352, -91264, -88749, -346610, -184189, -79124, -322345, -207325, -11617, -152496, -41849, 144244, -36975, 61424, 359823, 193609, 117882, 332551, 185316, 49073, 229224, 105053, -51876, 134154, 20199, -243818, -94509, -94363, -320010, -193291, -155499, -347781, -150142, 22463]
197B2463j89040J07465K01287j62415M6764K14892j22960L4889K11861j93242
207A71964j08648K07119j28101j83657J28002j11038j80742J65356m6209k06944
217b92898J57129L1490k08646J34950J30281j25317J48549J45334j76095R4517
227C9294K19126j41693m049J74282j41333n8748J52848j51765j15664J61615j34913
238a000j95752J42392k8039j55226J31160j7224j72239J69693R8666j51906J33445
249d6030J45468j35118Q1381J48446j31896N8554J68721j74509n3843J69354j17193
260A13335j01875J09711j40867j31407J46985p8451j57948J56966j213j67962
270b52726J23795N7355j13928J57165R7780j53974J09502J63432j24430L9453
$$ y = [22463, -166577, -59112, 142175, -20240, 26524, 241416, 118456, 153345, 365206, 171964, 63316, 270435, 142334, -41323, 86679, -24359, -205101, -39745, -85954, -292898, -135769, -104279, -312925, -177975, -47694, -173011, -24462, 120872, -55223, 39294, 258420, 116727, 112678, 286960, 145627, 86879, 239727, 87962, -27702, 133913, -1000, -196752, -54360, -82399, -237625, -106465, -123689, -295928, -126235, -27569, -179475, -46030, 99438, -35680, 45701, 194147, 62251, 120805, 289526, 115017, 61174, 230528, 113335, 11460, 121171, -19696, -151103, -4118, -82569, -240517, -83551, -84764, -252726, -128931, -71576, -185504, -28339, 69441, -84533, 24969, 188401, 63971, 103424]
280A03424J29204j42850o081J33399j47413o1435J44364j29802j41672J10809
290h053p0556j08505J33223m8975j42692J53164M7463j26338J26810Q6351j15613
301g3721J03093J05244j17549Q4103J31808j49317j3447J21254j15770l9400J03640
312A39938j41249r2026J23620r3022j16356J26133l3432j20096J16635Q822r3576
323a74609J50222N7813j29407J08579J06363j00501P2514R9640j27012K6082J03938
334A93622j39820k5373J16990j26081q6279R3494r1485p3537J22588o8631j14186
345a98698J29426L918r8542J26149M4005r2348J10335O4860j06383R7115R8301
356A78138j27376J7125R0329j09345K013Q9321j33499n3027R8685j02059p8259
$$ y = [103424, 232628, 89778, 83697, 217096, 69683, 8248, 152612, 22810, -118862, -8053, -78609, -187114, -53891, -102866, -245558, -92394, -44931, -171269, -44459, 41892, -73721, 29372, 134616, 17067, 101170, 232978, 83661, 70214, 191468, 75698, 36298, 139938, -1311, -93337, 30283, -62739, -179095, -52962, -86394, -206490, -89855, -81033, -174609, -24387, 33426, -95981, 12598, 118961, 18460, 90974, 190614, 63602, 89684, 193622, 53802, 28429, 145419, 19338, -66941, 26553, -64932, -138469, -15881, -84512, -198698, -69272, -65354, -163896, -37747, 6258, -86090, 24245, 89105, -17278, 79837, 178138, 50762, 67887, 158216, 48871, 50884, 140205, 6706, -46321, 52364, -49695, -127954]
367a27954J07382n6228q2466J05088k5899p5910J37215K7112j00289J00930O2896
378G1877q2538Q8987O5423j10564M8167P7916j22580K844R0723j11871m6056P1024
390D3352j06554m5988J06842p3977p8537J09157k2851p0167J14991N270p5369
401i3831J10521L6984q5916J00710P3489j01804L9051N4650j08235K5930P2783
412A24332j17497k0352P9846j02542m6761Q5746p3658n8391R4841m4565n5360
423a34361J22875L881p5065R4829K2404p1362R4315M4241r0364O1001N2467j06769
435A8092K2224O4055j01473r164N6374j00378j8935Q5430p7540n0913Q9864m3888
447f6252m5797J04450j0016n5044R8788N464p2373R2971M1072p5917N9158L3505
$$ y = [-127954, -20572, -76800, -159266, -54178, -80077, -155987, -18772, 8340, -91949, 8981, 71877, -10661, 78326, 143749, 33185, 81352, 159268, 36688, 39532, 130255, 18384, -27672, 43352, -63202, -109190, -2348, -76325, -154862, -45705, -68556, -138723, -23732, -18462, -93831, 16690, 53674, -32242, 68468, 141957, 40153, 79204, 133854, 25619, 51549, 124332, 6835, -13517, 66329, -36213, -82974, 2772, -70886, -129277, -34436, -79001, -134361, -11486, -7605, -82670, 12159, 34563, -36799, 57516, 101757, 11393, 72394, 124861, 18092, 40316, 104371, 2898, -6266, 50108, -50270, -69205, 16225, -61315, -112228, -22364, -66252, -112049, -7599, -17615, -72659, 26129, 31593, -40780, 52191, 93263, 17346, 76504, 110009]
459A10009r2767M0500M9840j08649P54N9904r4166j7679P1741p7187l2209P2981
471a6928o4913m3178J05197j5279m8208R2038j685n7764R1105J9892p2655P1521
483E9143L8329q1436M3473M4771q7770J1749L8335r8181k616P2454p4465k6437
495f2651O8479o1390l5677Q1229l4315l8489R1963q620n0269Q6573J4572o1526
507a0121O4121J4778p7027N3372M0492q1365J9419L6347q8014q01N0038p5464
519e4225r778O4703o4011k4422Q1711k9876l0448Q2628j6621m0011Q7241M818
531E1709n4590O7847J2776p1446N0746K5242p6484K7744K3172r3362N043M6344
543A4741p4825l515N7615n7515j1413P0595m1938k3594P9032k2364l3400Q6820
$$ y = [110009, 17242, 57742, 107582, -1067, -313, 59591, -34575, -52254, 19487, -57700, -89909, -16928, -81841, -125019, -19822, -35101, -83309, 8729, 7044, -50720, 40385, 60277, -12378, 59143, 97472, 16036, 59509, 104280, 16510, 28259, 66594, -31587, -34203, 38251, -36214, -62651, 5828, -55562, -91239, -10010, -44325, -82814, 9149, 529, -49740, 36833, 51405, -10121, 54000, 68778, -8249, 45123, 85615, 4250, 23669, 60016, -27998, -28799, 21239, -54225, -64003, 700, -63311, -87733, -6022, -35898, -66346, 16282, -339, -40350, 46891, 51709, -2881, 64966, 77742, 6296, 57042, 82284, 5800, 33544, 56716, -36646, -31603, 14741, -60084, -63599, -5984, -63499, -74912, -4317, -46255, -69849, 9183, -13181, -46581, 40239]
555D0239O099l9868O7451j362p0549M8963J4196p1362L2966K6857p5733J4612
567g491L3792p5286K96M5650o4800q495O9941l4705j1412P2628l0498k8763P4029
580C4886j0310l9907O6988j92n3090N2459R439o2233L6764J6011p7558J9476L2554
593B5287o7778J1198M2069o0253l21N9415m4931j0019O4386l7244k7143O6286
605B0952j4764k7400P0584q229m8551N2872m5n9752L8132J2192o3634L0459L0557
618C3373n9357J6157L2825o5560k388M6144m6544K24O3577l3115j6682O2763k3182
631H235l0294N8776j2449m0257N5081K692m5725M5757N443o4106K6568J4138o0227
644c6368J9637L0113n7215Q144M1383m7112M63N2313l8916j2373N7972k4505j7528
$$ y = [40239, 46338, 6470, 73921, 72559, 2010, 50973, 65169, -6193, 26773, 53630, -22103, -7491, 26301, -48985, -48689, -3039, -67839, -76334, -6393, -41098, -52510, 20118, -10380, -39143, 34886, 24576, -15331, 51657, 51465, -1625, 50834, 60273, -1960, 34804, 50815, -26743, -7267, 25287, -42491, -31293, 10776, -49477, -49798, 9617, -35314, -45333, 19053, -18191, -45334, 20952, 6188, -21212, 49372, 41143, -7408, 45464, 45419, -14333, 23799, 35991, -27643, 2816, 33373, -25984, -9827, 22998, -42562, -44950, 1194, -45350, -45126, 18451, -14664, -31346, 31417, 8235, -22059, 36717, 24268, -15989, 39092, 41784, -3941, 41816, 47259, -16847, 9721, 23859, -36368, -16731, 13382, -43833, -35689, 5694, -41418, -40955, 11358, -27558, -39931, 18041, -6464, -23992]
657b3992O3082j2153l4522N5190l495m4535M2192j457n6075L0315J0629n5390
669c0211K7317K4963n9519Q685L2105n1478N113M7484l8930k727N8960k5353j1368
682a4959N4942k1714l0364M9988j2181l5514M9233o46m8994L2519L370n5786K4294
695e812J6542n3387J7263L1885m4988J1499M1700m0869j775M7255l0276r344N5316
708C5009k0494k2889M7521j5187l1814M3293q161m4564L3718J886m9048L0066
720f64J4711m9386K0328K4414m5515J2919L6911m0319L908M2535l2283k240N0688
733C6007k7192j7385M4873k1885k8122M3786j0347l7759L8261k071m5162L0411
745C415Q134m7498K3627J8510m4447K0152L3711l8811O936L8209l5136j160M3849
$$ y = [-23992, 39090, 26937, -7585, 47605, 44110, -425, 41767, 40310, -15765, 14550, 25179, -30211, -2894, 22069, -37450, -28765, 3340, -48138, -43025, 4459, -34471, -37198, 21762, -3591, -14959, 39983, 18269, -12095, 37893, 25712, -9802, 39431, 38785, -10209, 22310, 25680, -30106, -5812, 10730, -42657, -25394, 6491, -38497, -26998, 14702, -26167, -27942, 19313, -10963, -20307, 35009, 14515, -8374, 39147, 23960, -7854, 35439, 27278, -17286, 16432, 18318, -30730, -664, 14047, -35339, -15011, 9403, -36112, -23193, 13718, -26601, -22693, 19842, -12441, -14681, 36007, 8815, -8570, 36303, 14418, -13704, 30082, 19735, -18024, 20237, 18166, -26996, 3415, 11549, -35949, -12322, 6188, -38259, -18107, 15604, -23207, -16271, 21938, -13198, -14358, 29491]
758B9491k7001j1976M4406k0363k2463M2372j4524l4768L6036o866m0289L3085
770G140N111m2541K3220J3386m2223J9929K6521l9482J0368L4740l4185L567M1214
783B6765k9639o409M0643k1147j8692M0823j5713k7183L5803j0377l5635L3577
795A2816N79m0842K6340Q549m0165K0728K1621l7405J4778K8682l4930O191L6066
808B3008k9431k548L7868k5255j3764M1463j8896k4256L5824j3289l0822L3337
820A3239k445l6833K9017N153l8192K4102J6268l7328J7264K4821l5301R072L3693
833B2530l0586J82L4899k6266r770L7028k1278j7829L4494j4722k8089L2056m250
846H399l1921K8567R01l4482K5068J3092l5841J9763K0306l3603J1952K9127l0508
$$ y = [29491, 2490, -9486, 34920, 14557, -7906, 34466, 19942, -14826, 21210, 14344, -25945, 7140, 12251, -30290, -7070, 6316, -35907, -15978, 10543, -28939, -18571, 16169, -18016, -14449, 26765, -2874, -9283, 31360, 10213, -8479, 32344, 16631, -10552, 25251, 14874, -20761, 12816, 13395, -27447, -1107, 7442, -32723, -11995, 9626, -27779, -13001, 15681, -19249, -13058, 23008, -6423, -8971, 28897, 3642, -10122, 31341, 12445, -11811, 24013, 10724, -20098, 13239, 10794, -26039, 2978, 8131, -30061, -5959, 10309, -27019, -9755, 15066, -20235, -11163, 22530, -8056, -7874, 27025, 759, -9011, 28017, 6739, -11090, 23404, 8682, -19407, 12649, 8399, -23522, 5045, 5946, -28536, -3468, 9624, -26217, -6454, 13852, -19751, -7799, 21328, -9180]
859i180L713L1497k7794m189L3488k2210j6049L3792j6534k3553L3097r725k8662
872b2309K9447j929l3006K6260R103l3648K2070J5699l2706J5197K3724l1059
884a3157Q238K9277k9120k067L1926k3072j0301L2416k0096j8977L1015j1608
896D474k4470K9533m204k8695K6642M297l0767K2150J2199l0767J6129K1137k9829
909a2171R784K4455k9244J604K8369k4772n770K9232k0424j4821K9415j3399k0414
922a8156K9092p209k5550K6641P45k8129K3732Q699l0383J9200J6863l0161J2278
935b338K1998k9358M941K5637k5336j710K8511k2816j0637K8614j5828j8520K9565
948A2723r187k2903K7003k424k6210K4569M597k8855J9037J3867k8413J3899J9480
$$ y = [-9180, -5467, 26030, -1764, -5953, 27535, 5325, -10724, 23068, 6534, -17019, 16078, 6353, -22309, 7138, 5209, -27797, -1537, 7566, -26082, -4012, 11687, -21019, -5822, 17902, -13157, -4919, 24358, -4762, -6829, 25097, 2025, -8276, 24140, 4044, -14933, 16082, 4474, -19996, 9537, 5333, -23362, 3280, 7577, -23190, -1040, 11159, -19608, -3479, 17658, -12171, -2387, 22068, -7176, -5572, 22797, -1975, -7745, 21487, 1063, -13758, 15657, 2258, -18156, 10936, 3727, -21823, 4818, 5563, -22566, 1166, 9865, -20518, -1318, 15545, -14616, -2338, 19660, -9698, -4757, 20880, -4456, -6166, 22345, -471, -11108, 17506, 1678, -16842, 12723, 3536, -19367, 7636, 5212, -20998, 3571, 8168, -20687, -1650, 12217, -16196, -2297, 17183]
961A7183k7894P199K3746k6775J64K5791k1524o538K7376j7661j3914K7796j2283
974B666k1265K6997m206k3792K4421J628k6164K0893Q049k6482J6470J6665k6320
987a0440Q049K0671k4737K710K3870k2874n332K5531j8215j0830K5155j3103j6789
1000a6334K5205o957k1068K4781k61k2953K0668O812k5682J7500J2984k6245J1927
1013C77J8545k6285M503K1919k4279l111K3798k0015q694K6479j5294j4596K5354
1026H701q376j8594K5313k766k0893K2118N145k3465J6954R805k4181J2768J4440
1039A6969k5002P106J7796k2723j14K0427k0888n157K3765j6117j0029K4435j1076
1052f08j5109K3979m189j8909K0471K260k1822J8607O655k3183J4063J0906k4039
$$ y = [17183, -10711, -3512, 20234, -6541, -6377, 19414, -2110, -8648, 18728, 1067, -12847, 14949, 2666, -18599, 8398, 4192, -19600, 4821, 6449, -19715, 1178, 9227, -17255, -785, 15880, -10440, -2391, 18280, -6457, -3747, 20123, -2751, -8083, 17448, -767, -11597, 13558, 455, -16334, 8871, 1914, -19154, 5627, 5366, -17587, 3081, 9893, -15789, 1711, 14695, -11550, 377, 18922, -7363, -2860, 19059, -5220, -8331, 15467, -4548, -13242, 13237, -2057, -16653, 8701, 325, -18269, 7044, 4278, -16615, 5503, 10648, -12817, 4137, 13942, -10239, 2529, 16969, -8033, -927, 16869, -5854, -5968, 14459, -6429, -11586, 12179, -3938, -13967, 10468, -608, -15717, 8262, 4073, -14836, 5635, 7895, -13927, 4680, 11335, -11848, 2215, 13121, -10918]
1065a0918Q248J6790k2656L312J8757k1473j331K3286j6862q288K3594j2109j2575
1078a2225K3184p604j7017K2595k167j9844J7407M920k3077J4421J0940k4043
1090a2510J0596J3875k1215M306J7930j9549Q90J9703j8843m660K3011j4193j0202
1103a0861K2153q543j4891J9394m829j7094J9621J143j9975J6778O147k0770J2059
1116C32J0529k0350P606J4980j8905J388J8214j7357k705J9004j4057q300K0490
1129A0869j1275j2391K0403n394j5389J8853R41j8838J6243N482k0747J3522Q549
1142A0828j9998Q474J3232j9533M832J5385j9583m74J7783j5539o073K0029j1960
1155b597r089J9994o895j3700K0410m581j4632J6093L466j8346J4749M941j8047
$$ y = [-10918, -2670, 14120, -8536, -5224, 13533, -7940, -9271, 14015, -2847, -11135, 12459, 350, -12225, 10959, 3355, -13662, 8933, 6766, -13078, 4329, 9249, -13828, 593, 11533, -12510, -1914, 11961, -9254, -4948, 12982, -6567, -5677, 14026, -4817, -9477, 13534, -659, -10861, 11292, 2749, -12142, 7252, 2423, -14671, 4950, 6093, -13882, 2896, 9043, -11727, 332, 10861, -9489, -1883, 13097, -5808, -4420, 13794, -3563, -6268, 12736, -1321, -9621, 10869, -406, -12797, 7606, 2212, -13177, 5676, 6617, -12221, 4022, 9504, -11243, 2279, 10828, -9170, -696, 12536, -6997, -2165, 13220, -6363, -6837, 10946, -4593, -10666, 9363, -2597, -11686, 8308, 1413, -12287, 8123, 3542, -11090, 5003, 8469, -9877, 4872, 9813, -8234]
1168h234R433R733j8084N192J1980j7632J099J7326j5900l750J8390j2380p420
1181a0247J8105p578j0957J7845m674j3239J7170R54j7442J4251M488j8615J1041
1194A102Q027j7710O580J1513j6456K418J5210j5130j746J5970j2777n233J7985
1207I753r596q838J8301o644j1923J6255k085j5714J4812J535j5935J0936O385
1220G242j6244O711J0290j6233M311J3878j5880N34J5610j2138m251J6551j0425
1233d4q378J7325p513j0569J6187l282j2621J2669K338j5993J1580N350j5976
1246h927R094Q588j5813N335J0789j4274J802J3141j4199j057J3165r408n611
1259g375J4356o964p713J3432l739j1313J4388j040j2564J2331K284j3781Q681
$$ y = [-8234, 1199, 10932, -7152, -1960, 10020, -7612, -6513, 10813, -5087, -8837, 9553, -2827, -10247, 7858, 280, -10677, 7168, 2494, -10745, 6425, 7379, -10063, 4188, 8676, -9939, 1102, 9129, -8581, -2001, 9512, -6944, -4526, 10684, -4446, -6192, 9778, -2999, -8232, 9753, 157, -8681, 9620, 2976, -8947, 7308, 5223, -10491, 4321, 5856, -10079, 857, 7242, -9002, -2291, 7999, -8234, -3923, 9955, -5925, -5391, 10219, -1919, -6170, 10381, -44, -8422, 8903, 1390, -9179, 7008, 3726, -8895, 3774, 6112, -9881, 1699, 7049, -8927, 167, 8755, -7058, -1723, 9066, -5208, -3406, 9735, -4464, -5521, 7644, -1764, -7375, 6981, 17, -7696, 5736, 1997, -9316, 5072, 4032, -8532, 3799, 6083, -7698, 983]
1272I83O495j3972N651R143j4055K705J1873j2665p95J3387j1752l447J4865q126
1286B90q667J4858m926j0050J3780j643j1714J1579K140j4023J0431L937j3613
1299g621P123P369j2928M312R861j3076J706J2118j1167l259J3258q573n107J2795
1313F811o577o980J2512k747j0928J2564j637j1626J1494K041j2176Q435O012
1326G198j3465M988Q902j2957J661J1923j1063j151J1707r034m998J3349o190
1339H70p147J2916m864q824J1197n64j0687J1021Q29j1748Q505L897j1660N179
1353a080P349j1676L644R296j2025N02J1483r576m058J2224o874n230J2815o003
1367G91q189J1638j343r339R428K361j0990P385M423j2006O756N325j1436M390
$$ y = [983, 7478, -6494, -843, 8300, -5755, -3050, 8823, -3842, -4637, 8750, -3002, -6449, 8416, 290, -8377, 6481, 1555, -8495, 5285, 3642, -8072, 3507, 5647, -8376, 2055, 5992, -7621, -498, 6871, -6057, -1745, 8116, -4960, -3254, 8864, -2303, -5562, 7696, -877, -5984, 6811, 234, -6746, 5766, 3019, -7909, 4655, 3018, -8608, 2886, 4927, -7249, 1186, 7198, -6267, -1279, 7623, -5334, -3673, 8250, -2813, -3964, 7743, -1291, -6289, 7060, 870, -6277, 6639, 1775, -7049, 4148, 3584, -7103, 3918, 4747, -7001, 1504, 5401, -6259, -1080, 6269, -5407, -1763, 7533, -4492, -3990, 7493, -2083, -6141, 6083, -791, -6021, 6794, 791, -7398, 4240, 2897, -6442, 2986, 5347, -5643, 1742, 6165, -5841, 915, 6240, -5196, -806]
1381h06P543j0672Q01J0657j1044j411J2236r235k812R438m153o218J0379l250
1395A453q298J0396K69j0739R202K239j1038P626M827j1101M875O344r979J675
1409b249Q535r144J49R256q932k714J0157o120m193J0599m714p081J0279j463
1423B365q830R557L39q949O239M509r870M200N573r967L792P066j0003J005R127
1438F153p759k061Q756o198m196J0200m274o361R423j735p526R978j770p581P415
1453B464J279r437O012M039r626M636N535r342K403O875o604j292Q266p195k211
$$ y = [-806, 6737, -3935, -3134, 7523, -3521, -4932, 7304, -1931, -4743, 4695, 542, -5676, 4703, 1453, -6845, 3551, 3820, -6919, 2283, 4522, -6516, 1110, 5937, -5164, -289, 6055, -3924, -2249, 6286, -2858, -2709, 6547, -2385, -5099, 5058, -1062, -5255, 5344, 630, -6451, 3828, 2365, -6465, 3092, 3431, -5518, 721, 5230, -4640, -440, 5133, -4834, -1042, 6024, -3979, -2974, 6153, -1606, -3667, 5089, -1109, -5305, 4895, 621, -5740, 3683, 1948, -5578, 4400, 2630, -4951, 2464, 3743, -5694, 318, 4357, -5269, -633, 4902, -4440, -2037, 4838, -1766, -3058, 5208, -1987, -4198]
$$ [...]
8191C08
##END NTUPLES=NMR FID
##END=
