##TITLE=1H_T-3921
 aceton-d6, 8 sc, 
 9.1.2019
##JCAMPDX= 6.0         $$ Bruker NMR JCAMP-DX V2.0
##DATA TYPE= NMR FID
##DATA CLASS= NTUPLES
##ORIGIN= UXNMR, Bruker Analytische Messtechnik GmbH
##OWNER= root
$$ XWIN-NMR		Version 3.5
$$ Wed Jan  9 14:29:45 2019 Russian Standard Time (UT+4h)  she@DPX200
##.OBSERVE FREQUENCY= 200.1313
##.OBSERVE NUCLEUS= ^1H
##.DELAY= (6, 6)
##.ACQUISITION MODE= SIMULTANEOUS
##.ACQUISITION SCHEME= undefined
##.AVERAGES= 8
##.DIGITISER RES= 18
##SPECTROMETER/DATA SYSTEM= spect
##.PULSE SEQUENCE= zg30
##.SOLVENT NAME= Acetone
##.SHIFT REFERENCE= (INTERNAL, Acetone, 0, 15.7039)
##AUDIT TRAIL= $$ (NUMBER, WHEN, WHO, WHERE, WHAT)
$$ ##TITLE= Audit trail, XWIN-NMR		Version 3.5
$$ ##JCAMPDX= 5.01
$$ ##ORIGIN= Bruker BioSpin GmbH
$$ ##OWNER= she
$$ F:/spectra/data/she/nmr/H-F/1/audita.txt
$$ ##AUDIT TRAIL=  $$ (NUMBER, WHEN, WHO, WHERE, WHAT)
(   1,<2019-01-09 14:25:02.34 +0400>,<she>,<DPX200>,
      <created by zg, POWCHK disabled, PULCHK disabled
       configuration hash MD5:
       00 E9 B6 7A A2 85 ED C7 34 08 36 98 17 FE 4E 26
       data hash MD5: 16K
       E9 AA 8B E2 9A D2 2F 9B 0E AF 24 53 CE 9C 2B AE>)
$$ ##END=
$$ 
$$ hash MD5
$$ A3 A0 99 DC 60 EF F3 C8 98 22 C0 0B 82 1E B3 7D
##$RELAX= 
##$RELAX= 
##$RELAX= 
##$RELAX= 
##$RELAX= 
##$RELAX= 
$$ Bruker specific parameters
$$ --------------------------
##$DU= <F:/spectra>
##$EXPNO= 1
##$NAME= <H-F>
##$PROCNO= 1
##$TYPE= <nmr>
##$USER= <she>
##$AMP= (0..31)
100 100 100 100 100 100 100 100 100 100 100 100 100 100 100 100 100 100 
100 100 100 100 100 100 100 100 100 100 100 100 100 100 
##$AQSEQ= 0
##$AQ_mod= 1
##$AUNM= <au_zg>
##$AUTOPOS= <>
##$BF1= 200.13
##$BF2= 200.13
##$BF3= 200.13
##$BF4= 200.13
##$BF5= 200.13
##$BF6= 200.13
##$BF7= 200.13
##$BF8= 200.13
##$BYTORDA= 1
##$CFDGTYP= 0
##$CFRGTYP= 5
##$CHEMSTR= <none>
##$CNST= (0..31)
1 1 145 1 1 1 1 1 1 1 1 1 1 1 1 1 1 1 1 1 1 1 1 1 1 1 1 1 1 1 1 1 
##$CPDPRG= <>
##$CPDPRG1= <>
##$CPDPRG2= <>
##$CPDPRG3= <>
##$CPDPRG4= <mlev>
##$CPDPRG5= <mlev>
##$CPDPRG6= <mlev>
##$CPDPRG7= <mlev>
##$CPDPRG8= <mlev>
##$CPDPRGB= <>
##$CPDPRGT= <>
##$D= (0..31)
0 55 0 0 0 0 0 0 0 0 0 0.03 0 0 0 0 0 0 0 0 0 0 0 0 0 0 0 0 0 0 0 0 
##$DATE= 1547029501
##$DBL= (0..7)
120 120 120 120 120 120 120 120 
##$DBP= (0..7)
150 150 150 150 150 150 150 150 
##$DBP07= 0
##$DBPNAM0= <>
##$DBPNAM1= <>
##$DBPNAM2= <>
##$DBPNAM3= <>
##$DBPNAM4= <>
##$DBPNAM5= <>
##$DBPNAM6= <>
##$DBPNAM7= <>
##$DBPOAL= (0..7)
0.5 0.5 0.5 0.5 0.5 0.5 0.5 0.5 
##$DBPOFFS= (0..7)
0 0 0 0 0 0 0 0 
##$DE= 6
##$DECBNUC= <off>
##$DECIM= 24
##$DECNUC= <off>
##$DECSTAT= 4
##$DIGMOD= 1
##$DIGTYP= 9
##$DL= (0..7)
0 120 120 120 120 120 120 120 
##$DP= (0..7)
150 150 150 150 150 150 150 150 
##$DP07= 0
##$DPNAME0= <>
##$DPNAME1= <>
##$DPNAME2= <>
##$DPNAME3= <>
##$DPNAME4= <>
##$DPNAME5= <>
##$DPNAME6= <>
##$DPNAME7= <>
##$DPOAL= (0..7)
0.5 0.5 0.5 0.5 0.5 0.5 0.5 0.5 
##$DPOFFS= (0..7)
0 0 0 0 0 0 0 0 
##$DQDMODE= 0
##$DR= 18
##$DS= 0
##$DSLIST= <SSSSSSSSSSSSSSS>
##$DSPFIRM= 0
$$ [...]
##$SUBNAM2= <"">
##$SUBNAM3= <"">
##$SUBNAM4= <"">
##$SUBNAM5= <"">
##$SUBNAM6= <"">
##$SUBNAM7= <"">
##$SUBNAM8= <"">
##$SUBNAM9= <"">
##$SW= 24.933730806125
##$SWIBOX= (0..15)
0 0 2 0 0 0 0 0 0 0 0 0 0 0 0 0 
##$SW_h= 4990.01996007984
##$TD= 16384
##$TD0= 1
##$TE= 0
##$TE2= 300
##$TE3= 300
##$TEG= 300
##$TL= (0..7)
0 120 120 120 120 120 120 120 
##$TP= (0..7)
150 150 150 150 150 150 150 150 
##$TP07= 0
##$TPNAME0= <>
##$TPNAME1= <>
##$TPNAME2= <>
##$TPNAME3= <>
##$TPNAME4= <>
##$TPNAME5= <>
##$TPNAME6= <>
##$TPNAME7= <>
##$TPOAL= (0..7)
0.5 0.5 0.5 0.5 0.5 0.5 0.5 0.5 
##$TPOFFS= (0..7)
0 0 0 0 0 0 0 0 
##$TUNHIN= 0
##$TUNHOUT= 0
##$TUNXOUT= 0
##$USERA1= <user>
##$USERA2= <user>
##$USERA3= <user>
##$USERA4= <user>
##$USERA5= <user>
##$V9= 5
##$VALIST= <valist>
##$VCLIST= <CCCCCCCCCCCCCCC>
##$VD= 0
##$VDLIST= <DDDDDDDDDDDDDDD>
##$VPLIST= <PPPPPPPPPPPPPPP>
##$VTLIST= <TTTTTTTTTTTTTTT>
##$WBST= 1024
##$WBSW= 4
##$XGAIN= (0..3)
0 0 0 0 
##$XL= 0
##$YL= 0
##$YMAX_a= 105660
##$YMIN_a= -114336
##$ZGOPTNS= <>
##$ZL1= 120
##$ZL2= 120
##$ZL3= 120
##$ZL4= 120
##$ABSF1= 10
##$ABSF2= 0
##$ABSG= 5
##$ABSL= 3
##$ALPHA= 0
##$AQORDER= 0
##$ASSFAC= 0
##$ASSFACI= 0
##$ASSFACX= 0
##$ASSWID= 0
##$AUNMP= <proc_1d>
##$AZFE= 0.1
##$AZFW= 0.1
##$BCFW= 1
##$BC_mod= 2
##$BYTORDP= 1
##$COROFFS= 0
##$CY= 11.3945322036743
##$DATMOD= 1
##$DC= 2
##$DFILT= <>
##$DTYPP= 0
##$F1P= 18.9103706918063
##$F2P= -1.10871071338519
##$FCOR= 0.5
##$FTSIZE= 0
##$FT_mod= 4
##$GAMMA= 1
##$GB= 0.15
##$INTBC= 1
##$INTSCL= 1
##$ISEN= 128
##$LB= 0.24
##$LEV0= 0
##$LPBIN= 0
##$MAXI= 10000
##$MC2= 0
##$MEAN= 0
##$ME_mod= 0
##$MI= 1.114404
##$NCOEF= 0
##$NC_proc= 0
##$NLEV= 6
##$NOISF1= 3.799351
##$NOISF2= 2.8
##$NSP= 1
##$NTH_PI= 0
##$NZP= 0
##$OFFSET= 15.70392
##$PC= 1
##$PHC0= -8861.159
##$PHC1= 21.40007
##$PH_mod= 1
##$PKNL= yes
##$PPARMOD= 0
##$PSCAL= 0
##$PSIGN= 0
##$REVERSE= no
##$SF= 200.130013532006
##$SI= 16384
##$SIGF1= 3
##$SIGF2= 2
##$SINO= 400
##$SIOLD= 16384
##$SREGLST= <1H.CDCl3>
##$SSB= 0
##$STSI= 0
##$STSR= 0
##$SW_p= 3612.71676300578
##$SYMM= 0
##$S_DEV= 0
##$TDeff= 0
##$TDoff= 0
##$TI= <>
##$TILT= no
##$TM1= 0
##$TM2= 0
##$TOPLEV= 0
##$USERP1= <user>
##$USERP2= <user>
##$USERP3= <user>
##$USERP4= <user>
##$USERP5= <user>
##$WDW= 1
##$XDIM= 8192
##$YMAX_p= 0
##$YMIN_p= 0
$$ End of Bruker specific parameters
$$ ---------------------------------
##NTUPLES= NMR FID
##VAR_NAME=  TIME,          FID/REAL,        FID/IMAG
##SYMBOL=    X,             R,               I
##VAR_TYPE=  INDEPENDENT,   DEPENDENT,       DEPENDENT
##VAR_FORM=  AFFN,          ASDF,            ASDF
##VAR_DIM=   8192,          8192,            8192
##UNITS=     SECONDS,       ARBITRARY UNITS, ARBITRARY UNITS
##FACTOR=    0.0002004,     1,               1
##FIRST=     0,             0,               0
##LAST=      1.6414764,     0,               0
##MIN=       0,             -114336,         0
##MAX=       1.6414764,     105660,          0
$$ Real data points
##PAGE= N=1
##DATA TABLE= (X++(R..R)), XYDATA
$$ [...]
2376a941J656K631n76l386n97K813J063j393M8kk429n8L604K145k926l260J088
2393a520K300K30k31K14j144k571J248L393K12k736j195K000P06j251K21J058
2409I34j626q42K279J613k546k512J970K743r31j587K56l9r10J164K067m88l201
2426a656o46K843J015j321p92R47m13r79J352J628k264j715J922K193j197k658
2442a741K13J876j3j4R99j138k837M63M114J218k869k177P30J017m8J289R35k260
2460b43k363J331L349o86k466L42J260p55o27J692j50j826j96K725N99k700j298
2477b012J916J579j033n36P70j240j621J731K802j201l051j7K310M03j066N05
2493B39N54j296r66K378Q70k467r04K005J718j723j283P07K88n01R33J455j827
$$ y = [-1941, -285, 2346, 1770, -1616, -2213, 600, 1663, 270, 318, 316, -2113, -2171, 1433, 3578, 652, -2608, -1520, 780, 1010, 779, 993, -151, -2722, -1474, 1919, 2131, -605, -1800, 200, 906, -345, -124, 934, -692, -1534, 745, 2358, -188, -2700, -730, 2013, 1082, -505, -249, -288, -1198, -34, 2033, 1545, -1656, -2302, 541, 1556, 235, -557, 390, -23, -1002, 350, 1978, -286, -2001, -79, 2114, 917, -1741, -1528, 348, 335, 321, 1320, 182, -2655, -2192, 1922, 3140, 271, -1906, -1176, -159, -207, 1082, 2017, -243, -2606, -1275, 2074, 1388, -1078, -736, 524, -231, -858, 834, 684, -1142, -1338, 1387, 1986, -714, -2012, -96, 1483, 450, -86, 684, -556, -2177, -446, 2356, 1155, -1896, -1913, 397, 800, -266, 239, 793, -503, -1469, 909, 1779, -688, -1592, 413, 2131, 408, -875, -168, 120, -381, 552, 2007, 180]
2510A80l212Q56L650K61k090p16L94j65J04K377R30k665k271K132K085j045j761
2527i56J244N5j346M15J539o46k279N92K611m3k818j29K153N87r89J044L98j945
2545e13j489K286K090j441k574J98J652m35l7Q59J13k066n2K504K1k084o96K575
2563I11O77j530l82J109q10o49K047R08k446k668J101K784K11j362J90j80j354
2580a443L50K654P74l045j565K143J163q68l78R46m24j508J050J504j091k056
2596a794J089K215n71j750K81J511j003l02J547J2l007n68K335J591j708j170
2612a292J295M45q62P31J324n55k701Q05K177l46k069L62J925n96j126M59K10
2629A86j440p43K494Q21k189j626J658J886k83l4J017j184k046Q51K645k77k681
$$ y = [180, -3032, -2176, 1474, 1735, -355, -1071, -677, -842, -738, 1639, 2569, -96, -2367, -235, 1850, 805, -956, 288, 343, -1003, -588, 951, 305, -1974, -1382, 1229, 1186, -1632, -1761, 392, 979, -10, 1034, 1432, -513, -2002, 284, 2374, 933, -1641, -1443, 209, -226, -263, 596, 709, -1357, -1409, 1095, 1116, -968, -1664, 911, 1588, 58, -324, 785, -25, -674, 1373, 2281, -165, -2833, -1732, 1052, 1263, -99, 91, -89, -1443, -1093, 1561, 2335, -710, -2275, -132, 1031, 163, -215, 731, 307, -1201, -151, 1353, 262, -1794, -705, 1510, 939, -811, -530, 981, -22, -324, 1223, 1235, -1772, -2340, -5, 1586, -122, -1292, 3, 448, -414, 317, 1641, 1086, -1615, -810, 1367, 1021, -1048, -686, 1239, 643, -483, -24, 186, -1254, -1997, 497, 1318, -871, -2497, -839, 1047, 764, 730, 1747, 563, -1483, -632, 2013, 1736, -945]
2646i45n75J486J70p33O46J085j754j364J552J191j456j271K013J492j206r40
2662f09J166K12q25J62J641q07k395m40K394O66j633R3Q60q24j204J261J526j734
2680d90q95J068J268m71j295R39J274q54r32J418k08k204J61K267M68k333l60
2697a179J269M09m64J017M70j961j822J135K271m14j769L58J505j320k37J842
2713A110N94k128r72J794O37j961j47J784O55j661j66J246o04j131O21J942j215
2730C98k471O82K128l91n77K91P91j456o97K016Q84j762q80J259P79j317k22J286
2748G41r8j325K59J217j253j346R28K332m72j861J70R18l57m73J590K40k135r72
2766a897J772J272o48j008J103l20j114J23J881k7k049l70J704l99j414J038J392
$$ y = [-945, -1520, -34, 136, -597, 49, 1134, -620, -1984, -432, 759, -697, -1968, 45, 1537, 331, -609, 557, 769, -56, 106, 1747, 940, -1455, -1895, 499, 1165, -468, -375, 485, -339, -1543, -282, 1244, -490, -1385, -317, 951, 480, -815, 124, 1398, 544, -388, 1030, 822, -1382, -1221, 1046, 1514, -819, -1179, 90, 499, 35, 1052, 1522, -439, -2261, -1126, 1145, 731, -1038, -680, 825, -495, -732, 1110, 1704, -424, -1396, 398, 1035, -926, -1073, 711, 1366, -295, -461, 785, 181, -950, -329, 1613, 398, -2073, -1391, 737, 346, -231, 60, 851, -605, -1302, 714, 1598, -164, -1044, 215, 994, -323, -545, 741, 643, -682, -423, 794, -459, -1805, -877, 1455, 983, -878, -708, 210, -147, -620, 970, 1210, -925, -1897, -125, 1147, 499, -509, 594, 274, -840, -717, 1164, 1137, -912, -1282, 422, 23, -1391, -353, 1039]
2783A039l75j587Q21P99q32j111J765J031j703j685J187J544r55kJ153l04j640
2800h55m44J964L02j566j0J332k41j398O08J662j002j212O49J194j492j176J297
2817c88J809j193j061R76J64q23l40K182N24k517l88J421L04r07J85J049p73j656
2835a432O09J791o87j293P25J084j035r59J034J500r32j132J383K76j374m88J663
2852G33O97j963o10J319J38j335O85J535j076j654M58J896j07j416O34J222q92
2869B64j252J510N94j001o81R69J77j448m78J355Q24r91k99O30M91j585K93J913
2887A285k93j836M9J574m43j139Q85J133j560j135J365J067r00r27J443P6j536
2904h92j7J644M34j124m77J148j18j762N15J822j79j760Q9Q11l87p07R65J261
$$ y = [1039, 664, -923, -102, 697, -135, -1246, 519, 1550, -153, -1838, -651, 893, -62, -64, 1089, 785, -855, -1299, 665, 967, -599, -609, 723, 482, -916, -308, 1354, 352, -860, -211, 983, -509, -1685, -388, 1421, 228, -833, 143, 307, -516, -856, 1326, 1850, -667, -1055, 366, 670, -237, -52, 997, 224, -1432, -823, 968, 281, -1012, -287, 797, -238, -1197, -163, 1337, 405, -727, 656, 932, -442, -930, 733, 1430, -533, -1143, 176, 314, -1021, -336, 1199, 123, -1531, -1073, 823, 716, -700, -66, 1156, 264, -988, 522, 1116, 115, -566, 403, 580, -868, -1346, 9, 833, -158, -457, 173, 664, -921, -628, 1285, 992, -844, -795, 779, 336, -803, 82, 1215, -345, -1480, -115, 952, 52, -875, 568, 644, -892, -909, 735, 1169, 45, -432, 716, 598, -1164, -649, 1173, 994, -766, -677, 134, -253, -960, 5, 1266]
2922A266j306r88R52Q98r48n82J475L46j457m73J294M03j347k51J415l20j503
2939a126M68J318O9j009N27O43q60j097R29J546j074j444N86J095o80p74J444
2956E61P02j633o43J252L90r47j66J505m21j734M09J577L37j309J60Q40r00j044
2974a064O37J539j035j206R57P81j160l27J429O31j096r24J447J05r75l45J447
2991H41k7j830N7J267J37j168L96R08l49j699O73J636n67o17P36Q86j507o23J311
3010D61N61r61q94J133r3r79q5J652K62j870r0J296k32j162R53J287j037j418
3028a216J037J528j208n81P71O52j037j025R23J277j549l62J281j76j256j38J710
3045F31j0j496L86J286l34j396R20J226n07j693J053Q17j074q45J516O24j147
$$ y = [1266, -40, -1028, -76, 822, -126, -708, 767, 1113, -344, -817, 477, 880, -467, -718, 697, 377, -1126, -658, 660, 729, -280, 247, 890, 30, -1067, -138, 1408, 334, -1110, -524, 571, -109, -883, 561, 1263, -370, -1013, 239, 629, -318, -484, 1021, 600, -1134, -725, 852, 1189, -120, 40, 880, -20, -1064, -427, 1112, 77, -1129, -172, 609, -551, -878, 551, 1182, 86, -838, 609, 714, -261, -606, 841, 814, -1016, -959, 308, 445, -723, -327, 581, 232, -1467, -794, 842, 275, -342, 394, 1280, -227, -850, 461, 1022, 61, -833, 300, 207, -772, -857, 795, 1057, -813, -903, 393, 161, -1001, -48, 1239, 202, -1216, -179, 1349, 141, -440, 331, 983, -54, -1079, -156, 1121, -428, -790, 491, 315, -941, -1079, 631, 621, -875, -489, 797, 463, -933, -13, 1213, 706, -987, 66, 883, -191, -1036, 480, 1104, -43]
3062d3j100Q63J062r57m71J180L0j458k94J671L56j266m9J478n24j507J079J297
3080A347o62j115J80O26o84n33J186O70j126j073J041O45j054j63J449r7j413
3097g76L3J519k37p66J63R04j91j385M51J235m77j036L95R08r23j307J629P10
3115H49q77j157J275L07o88m50J605J65j290m06J385J3j404L15J345n96j560P92
3133c77R70l95o83L92P60r07j050J438P34r85l01Q15K89j113k33J741J91j787
3151e01k52J393k83j261O84J055l64j458J5J638l95r49Q56Q00j202q87J115Q51
3169H55r98m51Q51M59j360m27J782k92j070J71R43m26q45M31J538m51j555M68
3187c77P49m40n68N95R49q06j005Q70P69q98k06J030K09j313q51J527N88j289
$$ y = [-43, -1143, -280, 782, -175, -646, 534, 564, -894, -1188, 483, 839, -427, -476, 1002, 478, -1029, 50, 1347, 685, -430, -250, 376, -308, -841, 345, 1015, -111, -1184, -143, 502, -552, -715, 734, 637, -776, -743, 776, 539, -227, -64, 840, 649, -736, -285, 950, 473, -563, -168, 740, -183, -1490, 139, 849, -28, -1185, 90, 397, -291, -741, 864, 1029, -261, -667, 718, 731, -673, -358, 987, 391, -1169, -377, 593, 198, -485, -93, 667, -240, -1290, 148, 882, -103, -404, 411, 700, -413, -646, 1095, 1286, -501, -753, 640, 357, -904, -220, 835, 471, -987, -972, 666, 271, -678, 178, 978, -224, -1111, 4, 855, -143, -594, 257, 716, -644, -1071, 711, 419, -651, -480, 463, 37, -808, -377, 1161, 710, -845, -377, 372, -68, -636, -41, 908, 102, -903, -33, 736, -162, -368, 662, 871, -442, -1293, 234, 822, -467]
3205d67K74R91k40j585L89J021Q1j091M22Q71n99p06O73J117j200m53L30N52r28
3224e48K01R45J79j442k48J100K44o05j63P65j45j138K67J424n12p55R1Q01j87
3243B74j166P22J232j092n08M87L97p87l38R83N36j041l08R46N8q92J19J171k33
3262E60r90M4R38N4q62R5Q40p80r30O13R28p09n48N44O23p84j65J200J44o83q99
3283g67R69K74r88L1J623n50j428K86J144l28j044P69P99r99r72J097P00m91l99
3302b74O00L96p73r2O47pn85k50P71k42m70l82J100J4r42l21J005j5r58O53P07
3323E82m66r95P02J024q97k42N71P80j430m68R41L43n84k80P94J2r24K18J147
3342H28o74o94K73M88l01o95P72N08l82p86M79P13o61k86P17O26j181m56P22M57
$$ y = [-467, -193, 798, 558, -1027, -638, 383, 464, -627, -205, 666, 67, -639, 34, 1151, -49, -502, -172, 380, -548, -347, 598, 777, -665, -913, 187, 431, -174, -337, 428, 283, -855, -588, 836, 324, -431, -340, 461, 274, -892, -170, 1062, -30, -538, -51, 346, -441, -779, 204, 740, -301, -609, 337, 395, -497, -378, 793, 560, -430, -386, 552, 606, -256, -161, 679, -101, -1031, -418, 510, -199, -747, -203, 420, -364, -529, 671, 815, 132, -767, 202, 476, -512, -481, 1142, 592, -836, -550, 594, 266, -778, -9, 790, -209, -1181, -84, 616, 125, -274, 326, 722, -51, -143, 504, 497, -88, -338, 433, 191, -279, -661, 439, 453, -489, -810, 195, 180, -778, -125, 582, 116, -879, -177, 847, -50, -292, 279, 1059, -371, -839, 102, 445, -139, -419, 375, 387, -537, -319, 828, 154, -540, -267, 221, -80, -775, -3, 505, 123, -663, -184, 529, -132, -418, 299, 925, -256, -712, 10, 467]
3362D67n89j60Q24k68r00J83R06J06j175J27R28m34p49N71J157o19p63L60M68
3381D40n27q20R65Q26j130m95R91q8n18RO76o3j189L83Q12%p02J74P71J8j133
3402f00M61J000n90n68M10O04r53k26N63N68o07l80L14n9p33M77O65P7q26j06
3422e09J096k50p67K47R26q9j208K61R30m91n54O48K39o00m05O84M55p34m50R49
3442C78k68n88k98J143P20j363mO84m6r95O38R13k67j220K39Q06n43o78N61J001
3462H13r67q42J101J22m12k27R84j03r46L2Q70K19p31n03R70j33j151L82J072
3481E50k05j365O74Q03o71l40P60N28n97o56O13L19n98l34R30M65j241p9O61J38
3501C55m58O7O77n84q51L86J258l84q23M88K71o08l53P36J99n25l86O37M78p87
$$ y = [467, -122, -282, 542, 274, -626, -443, 463, 569, -606, -479, 449, 15, -734, -163, 994, 375, -388, -28, 440, -87, -907, 58, 884, -246, -741, 250, 162, -356, -347, 329, 266, -923, -540, 272, 272, -430, -256, 515, 533, -600, -139, 861, 271, -297, 113, 717, -236, -462, 101, 669, 62, -318, -4, -63, -796, -319, 346, 423, -403, -509, 587, 337, -430, -183, 743, 654, -554, -293, 637, 146, -408, 240, 479, -121, -526, 158, 613, -121, -571, 378, 110, -478, -776, 367, 1087, -276, -280, 404, 358, -637, 1, 914, 647, -573, -334, 472, -71, -749, -188, 813, -154, -996, 105, 227, -185, -412, 572, 469, -477, -445, 425, 644, -87, -590, 380, 247, -904, -522, 550, 345, -1020, -346, 457, -214, -554, 206, 734, 137, -519, 94, 413, -185, -519, 411, 876, -365, -444, 217, 355, -103, -36, 641, 57, -794, -408, 850, 466, -357, 131, 402, -206, -559, 177, 376, -149, -535, 102, 580, -207]
3521b07K4L69L34q65l7P72L3p16j25P30j63p42J85Q07j17q62N64N57p25n71Q60
3542A05N19m65n29N88J28m17m74J163R6j003k64R38l64l63KR41n05o49N92L30
3562C69K6p79J03J224j001p72J080O44n30m67K15K70p24k01R91k30m64m27O87
3581A4K2n63K82P45Q4q67J96P14o30n42N35P06p30m95K70P56q50K06M57k5o19
3602c34n11J002M18p53j00P77l91l83k43J486l00r53k6P47k81p03O89L71k26p78
3622d92M00N29n99l60N62N19j110j37N54RQ5J25M23j79m19k64R23j10q69P1O64
3643C25r3p89O36O66n73o73N90J33k80l79L08L87k32o02O35K45l83j81R65o12
3663I3n28M46O99o2j086K75Q52n41n53K51O75q21j29K78J96l96k46P75K68n09
$$ y = [-207, -183, 186, 520, -345, -382, 390, 423, -293, -418, 312, 149, -593, -408, 399, 282, -580, -16, 541, -184, -755, 105, 624, 159, -370, 218, 346, -71, -545, 618, 714, -289, -553, 385, 21, -342, -340, 601, 96, -553, 39, 369, 395, -384, -281, 943, -58, -830, 250, 894, 364, -103, 112, 382, -342, -543, 448, 218, -246, -673, 14, 36, -527, -245, 500, 584, -283, -87, 627, -3, -545, -10, 696, -34, -529, -259, 497, -353, -147, 310, 285, -334, -845, 157, 575, -178, -278, 499, 108, -275, -518, 968, 668, -285, -311, 436, 155, -548, 141, 512, 286, -492, -92, 437, -162, -522, 40, 559, -551, -688, -134, -125, -40, 85, 508, 329, -90, -354, 569, 459, -410, -339, 325, 232, -557, 79, 745, 172, -501, 89, 222, -58, -437, -129, 258, 26, -576, 59, 304, -79, -260, 705, 93, -435, 11, 710, 648, -438, -163, 689, 148, -405, -154, 521, -300, -429, -151, 45, -351, -597, 178, 446, -63]
3683f3k32O54J82n33l71P98L32j013J58N52l10m98M40K45l23q44P22N15l14n81
3703d84M68K56m32j39M51L59n90j51M69L50j161P61L74k94n23K32L44Q5p37K13
3723a49P53m57q63O90L97m48j24J62Q30j165J80L01L58n26K8R7M0n23%N41J83
3744C05l29o5L21n55l59N08P13k09r38L47Q74q17n1L38L33n66n34O72N15j23k72
3765A08K47R2q22J86N95j51p06K97M14n06k59N18M09l18m88N65J54m37l94P07
3785B11J46k76m10M98j07m3k71P64j14j004K89L65j35j00L2M34j61m94K86L86
3805B96nm41LM97m91n4M72K02o52n9K71M5k97k77P05j05l11p1M68J01n66j10Q57
3828D78m34m84L12N72j51n46J14L49k36r6J20K81j70o93P54J7k22j98J45M94m90
$$ y = [-63, -295, 359, 541, 8, -363, 435, 767, -246, -88, 464, 154, -344, 96, 341, 18, -826, -104, 411, 97, -484, -16, 240, -192, -331, 120, 479, -111, -262, 207, 557, -604, 157, 531, 237, -286, -54, 290, 375, -362, -149, 604, 147, -716, -26, 371, -77, -201, -39, 791, -374, -194, 107, 465, -61, -33, 64, 104, -419, -419, 122, 305, -24, -89, 232, -323, -682, -174, 539, 330, -608, -261, 613, -204, -255, 83, 416, -150, -684, -12, 503, 380, 108, 355, 447, -375, -189, 406, 255, -451, -154, 260, -246, -505, 13, 422, 104, -384, 181, 335, -102, -496, 211, 357, 81, -329, 169, 62, 19, -252, 512, 398, -606, -317, 48, -87, -187, -155, 279, 118, -376, -90, 296, 291, -150, -147, 350, -141, -195, 277, 479, -173, -232, 39, 84, -213, -490, 215, 110, -201, -272, 196, 297, -269, -379, 478, 44, -440, -128, 444, 293, -253, -139, 210, -26, -122, -2, 279, 109, -584, 170, 187, -35, -233, -88, 406, -84]
3849h4j86K25L02o92M25N86j70r21K38M66l40m5Q9L87l84k97L85M71p58J90J09
3870dN31p67p5M93K53n32l67J070m00k50l22R97k50p69K06N94l63o37O78K55j10
3891B31o82L22K45k07J06J88N6n41j06M32K32l97Q1L55J59r00L00N53k85k48J
3912a05L51j87k41K04N42p04n4L69L46n63J25j42O60o24l80O52J55q03N5Q78l47
3933A87l29k70N75l2m97M06L84k57p26N83N64l60o74M33L26m98j68P43O2m94l68
3954d10O38j57k77j20N11j02l49J95K55J22p21O34L7n51j73L15P08k25o26K90
3974fL55n91L7N79K30n58l62N77m13N8j77P44k08o27j21O97k28o44N60M94q5m79
3996a68J41M26k88l38L10K50o81J86K21K63m65j35L32j28n69L96K64K16m40O4
$$ y = [-84, -270, -45, 257, -435, -10, 576, 406, -515, -277, 189, -151, -196, -107, 280, -104, -401, -16, 455, -303, -113, -4, 527, -240, -315, 178, 431, -101, -468, 602, 202, -48, -370, 627, 377, -392, -186, 408, 45, -592, 86, 341, 231, -451, -129, 116, -91, 15, 203, 259, -282, -388, 44, 276, -121, -40, 315, 474, -426, -126, 427, 142, -106, -105, 246, 59, -182, 22, 564, -140, -194, 175, 521, -42, 83, -59, 601, -23, -403, 249, 404, -399, -344, 534, 187, -142, -412, 163, 131, -366, 40, 424, 167, -559, 24, 588, 228, -446, -13, 313, -185, -353, 390, 452, -42, -410, 228, 71, -206, -326, 185, 83, -266, -71, 184, 306, -415, 219, 256, -295, -468, -153, 555, 330, -296, -6, 349, -242, -205, 374, 604, 46, -316, 261, -152, -94, -271, 473, 265, -362, -483, 214, -14, -658, -98, 396, 311, -168, -27, 399, 111, -227, 83, 333, -348, -162, 59, 322, -143, -278, 54, -74, -643, -247, 17, 233, -207, -143]
4016a43L66k41q8m4N37m2p15K17N92k53q65O87L38o00m10O10M8k87J45L60J8n19
4038b89J54J71K52n70J96L16n5n04P71j13J2q39N87J46l32q9J75N75m15l04L28
4059A73q9j93k37N53K86q03JO80k18p78M64Q16n58l82L56M34j91m06j8J48J00
4080A38k00K48K04k17q87N62L49n44N6M24J22m83k01Q27k86l29K97K81j40m76
4100b55J40M74j81k97N26J69k91o57M67M36p68m18P40L39p85L84R2K59l58j60
4120a44R2P5k09j58M51N8n19P0M53j40R4jL56m23m54L68J82j79l16O51k25l10
4142b28J0L49K01k35k40k2L88m23J66L88n41l38L12O07l65k08K05L89n94k56M58
4163B3K23k58k35M30O2q35J94N78K50m13q7M22J06m83j03K37j05m49N28K76m31
$$ y = [-143, 223, -18, -106, -150, 387, 345, -370, -153, 439, 186, -679, 8, 346, -254, -664, -54, -6, -293, -148, 212, 230, -289, -135, 36, 288, -282, -86, 230, 175, -329, 442, 329, 341, -498, 89, 235, -97, -186, -11, 564, 149, -155, 173, 84, -109, -346, 207, 493, -310, -309, 371, 153, -625, -161, 655, 97, -285, 71, 505, 314, -92, -110, 38, 138, -62, 186, 390, 173, -714, -152, 197, -347, -291, 133, 255, -228, -429, 398, 112, -217, 80, 361, 221, -255, -115, 359, 178, -119, 407, 576, 285, -372, 95, 531, -237, -655, 85, 424, -361, 23, 115, 374, 16, -144, -52, 23, -186, -344, 107, 165, -354, -284, 169, 29, 123, 122, 478, 55, -399, -31, 151, -28, -344, 307, 82, -228, -218, 131, 332, 97, -143, -165, 223, -200, -34, 354, -187, -525, -213, 394, 29, -179, 26, 415, -179, -435, 23, 246, -12, -247, 183, 245, -590, -396, 182, 432, 19, -68, 354, 460, -23, -126, 111, 6, -443, 85, 361, -70]
4184g0n92N16Q3K38k68j03L89o51L4N21J33p46J17M62L56m17m7J18k49k94L02
4205a68M66L3n74J65L99l67n53L67M72r8n47M14k96L07J12k2J61o96r5P01L1j62
4227E0o1K83l21n34K61L60q3j67K62K17qm21M69p7j78l31O16K97q69rN80N7m81
4250h8j45N16p3n65L24K82O0n25L2J86Q6J85n52M68k44k33N09J3l90q3M61n5Q7
4273B56q14N55K35m91K8L06j80j70M23K55j16n77j17N40L3j04k66K04K03n45M75
4294A33K43l9l92J66k51R3n1m4L2k19r1P52j10l96p4M36J08m83l0M16j42k20J34
4317b9M71k79o43K35M45j06j25j64L11l46j02N36j12J44l10L96K5n98q5L59o8
4338d5p7%M93l77j13o0N00m86j59J00L22m98j58P79J2l22k90K37L13k08j96M85
$$ y = [-70, -662, -146, -63, 175, -93, -196, 193, -458, -424, 97, 230, -516, -399, 63, 419, 2, -45, 73, -176, -470, -168, 298, 331, -243, -78, 321, -46, -599, -232, 240, 142, -405, 9, -287, 20, 132, 110, 271, -425, -520, 181, 212, 50, -11, 272, -49, -583, -322, 38, -45, -212, 50, 267, 259, -162, 307, 230, 52, -279, 337, 634, -235, -244, 336, 393, -88, -233, 283, 210, -355, -31, 251, 311, -214, -182, 4, 90, 275, -277, 191, -53, -286, 223, 236, -154, -237, 224, 169, 256, -558, -3, 232, -259, -231, 75, -105, -275, 148, 403, 287, -290, -407, 133, 166, 62, -204, 0, 203, -342, 133, 376, 337, -55, 111, -140, -47, -98, -142, -110, -329, -420, 332, 222, -174, -248, 188, 296, -187, -217, 199, 57, -163, -29, 442, 163, -480, -245, 200, 94, -31, -195, 116, -230, -332, 204, 92, 236, -74, 322, 347, -251, -336, 23, -45, -122, -122, 371, -6, -119, -179, 321, -165, -324, -224, 98, -400, -558, 221, 233, -89, -379, -142, 171, -37, -233, 252]
4360B52J25p38K25K13J67m66L2M47n8j45k20K8R9k23O8M09n71K72K80K88k66l38
4382a20j16L71k16P1O9K7l93m5N37j10n09J73K68J16j09N5J68l82k1L40L65p00
4404a61j05K48N36m73j90N59k67n29L21M31q8l34OL41l00J05k16K15k8m06K15
4425a20J82l15K8J30K50k5k78L72j79j70j06N19o2o83M06J39M17l29m95J95p5
4446a99j25L36Kk41j35J54L31J85j54m0K55l26p1R6J77l92m4O03l7l83l07J71
4468a44K40n05N10M0j8l82R5N52l13k54j22L93k44j45M34m6k09r5N08k55N6r1
4490EK53k2k2n83L33K09m51J31N73k58j30k76J10J74j18q4K8j61K01K25L12n62
4512a13k92N22m9m20J14J45J65L3l07K89L11o51J73N11j57k96l34K99PK22j04
$$ y = [252, 377, -361, -136, 77, 244, -222, -190, 257, 199, 54, -166, -138, -39, -262, -194, 215, -356, -84, 196, 484, 218, -120, -236, 135, -81, -10, 59, 86, -307, -352, 185, 75, -434, -261, 7, 123, 14, 69, 237, -145, -166, 174, 539, -161, -266, -18, 518, 45, -145, 414, 147, -382, -61, 370, 282, -52, -46, 295, -5, 100, -116, 99, 71, -335, -120, 62, -253, -225, -95, 155, 130, -148, 224, 45, -125, -231, 288, 226, -457, -51, 88, 505, 176, -319, -124, -199, -324, 12, 14, -227, -362, -208, 123, 308, 154, 114, 369, 43, -28, 68, 245, -147, -191, 412, 375, -8, -315, -144, 96, -409, 101, 141, 123, -259, -164, 388, 75, -179, -301, 92, -152, -297, 137, 91, -118, -213, 295, 40, 96, 5, 258, 236, 214, -369, -36, 173, -278, -147, 426, 168, 38, -238, -128, 46, -72, -156, -128, -289, -88, 137, 449, -113, -405, 117, 68, -352, -238, -93, 72, 105, -202, 87, 398, -253, -80, 431, 274, -22, -356, -57, -50, 172, 68]
4533F8%nj12p2L48j88J48k72J45j21J8j81P97m41j29KL47n40j35L82j80K0J05
4556Dj9k51M4N65j58j91k87J30L35J33l57k79O12k52O9P8K99k99l87K11K0J20
4578A40L9j60l59L83l5K94p6o29K84N51m65J45o8j59M2j27L32M9k40j69K87J9
4600G8j04k45K84j83J35j75M42j61m05J28L88n1J00k07j62Q8l5K10j06P8o57O29
4622F9l9J00j03j98K6L11l69L53k45k51L89L5M7j09l0K68j37l26L69Q4l48j22
4644b26L12Q3k72l96N63J36p5j15k76M38m83P0M26o4j28j60M79j81k53K68l2M5
4666A59j64k63M37m5l37J0L76n5j41o2L34m03mL15k30l1j88J34M00J69l23J68
4688B56j66k02p5R8o6k7J89L81j29l83j03M53k99r6L58k6k49oJ38J26j70j92M5
$$ y = [68, 68, 63, -49, -121, 227, 39, 187, -85, 60, -61, -43, -224, 573, 132, 3, 5, 352, -188, -323, 59, -121, -101, 4, -15, -266, -222, 343, 185, -6, -293, -163, 172, 305, -52, -331, 281, 29, 98, 176, 475, 176, -211, 0, 20, 140, 179, 19, -340, 43, 8, 302, 226, -403, -119, 432, -33, 112, 44, -115, -73, -200, 132, 181, -59, -228, 59, 78, -26, -271, 13, -170, -35, -210, 232, 71, -334, -206, 182, 131, 231, 24, -138, -50, -85, 125, 19, 97, -560, 69, 30, 130, 27, -171, -145, 166, -203, 150, -95, -346, 43, 78, 125, 16, -14, 254, 117, -209, 160, 244, -104, -226, 86, 169, -103, -499, 64, 200, 125, 10, -266, 172, -311, -241, 185, 121, -7, -167, 312, 131, -122, 146, 114, 159, -5, -268, 169, 124, -213, -203, 173, 118, -23, -85, 249, -154, -158, 157, -73, -104, -292, -158, 242, 411, 88, 256, 90, -112, -187, -89, -155, -182, 7, 388, 259, -124, -227, 226, -73, -169, 189, 163, -86, -92, 46, 172, 2, -190, -145]
4711a45L59k39J30K0L3l66O2L48N5m02K3J1M8k8J21K2M5l72M38P2j37r6j03J00
4735an2m8L22j54n2m96R20j71j67L1J02j11j94r8R0P3k64K98k1P5k83N8K73j56
4759b6Q2P9j18m65K09O9L65k57j52K32q3n3J9j32K06j00J1L48k58j66L35P6R0
4782C11o05J85L97l33k42J17J28R0l22L22J31l31J39j06K08l36J86K70j43P8j59
4803a5J48l71Q6K27L5j76J24k56N88m14m04L21K24n2n11L36K27o8J72p5J03m57
4825b08J83J8O5K3p5M9J50k68J85j04J36K4N6J85n19k32M50J83j8p8k93m2q5M6
4849a69K21K57l95N8K85j11m8M6J94j46k95J15P4K5k53L67q3N1l55L03J60l07
4871fm1K61j80L05n03O3R4J08k18M91n88m3M10J2j82q9Q3J48Jl61M34K4kl51L69
$$ y = [-145, 214, -25, 105, 125, 158, -208, -146, 202, 257, -145, -122, -111, -63, -91, 30, 52, 97, -275, 163, 235, 98, 2, -101, -1, -53, -101, 221, 67, 15, -481, 439, 268, 101, 132, 234, 123, -71, -169, -79, -6, -270, 28, 7, 82, -201, -143, 130, -26, 56, 135, 17, -448, -239, -170, 195, -62, -214, 18, -65, -118, -99, -231, -25, -125, -114, 234, -24, -190, 145, 221, 311, -294, -109, 288, -45, -287, -170, -42, 48, -274, 48, 179, -152, -13, -119, 89, -247, -61, 209, 66, 144, -15, 133, -238, -152, 75, 110, -66, 58, -198, 390, -24, -428, -107, 117, 65, -446, -110, 117, 49, 221, 146, 249, -208, -25, -7, 58, 81, 6, 55, 205, -63, 122, 18, 154, 178, 234, 419, -100, -332, 118, 301, 283, 205, -88, -130, -215, -169, 52, 309, -86, -28, 257, 146, 98, 144, 338, 192, -103, 12, 86, 111, -142, 225, 142, 193, -162, 141, 301, -6, -47, 214, 34, 339, -164, -101, -7, 101, -117, 374, -214, -257, 153, 165, -17, -106, -23, 125, 126, -235, 199, 223, 221, -130, 239]
4896B39j07J53k75L26j39k3j50j16L28k28O4M7m1k55K62O9J08l09N8j19P6r6O0
4919f8K47l33OK58O0K7k50%K60j16rJ1j9P3j8q7R8m1n6k74O65n70J02P6M3J48
4945B33j22Kn24K53L14j36J02j20J16m2k52k1K92m9j43J98J32j56m09K14J88J25
4967A95J2l16J53J48l87K53K2R6k70K11j85K57m3k28K20j1k10J07J40n9n8m28
4989c81M56k13L62l31J79n4j96L15j75l45K41N1K74m17J63K79j17j53n7L24l70
5010a65J05N5n8O6N6k7K13k01J61j68N3k48K66m9K3m07J07M13k60J71o2J14k18
5033f0J01J69j03k50p2M67m05j69L43J11p8k04k3K57j48l6k2j3N8M7K31j55p3
5056b7q5l1L2L31m84J73j3j00M91r6k69N5j12mJ62K12l16L68k8l30j41P54n96
$$ y = [239, 132, 285, 10, 336, 197, 174, 24, -92, 236, 8, 72, 119, 78, -177, 85, 154, 262, -47, 11, -108, -32, -128, -68, 179, -154, -148, 110, 170, 197, -53, -53, 207, 91, 82, 93, 74, 147, 129, 42, 140, 99, 43, -231, 434, -136, -34, 42, 85, 233, 111, 113, -411, -158, 156, 20, 122, 2, 118, 76, -176, -197, 95, 46, -97, 101, 233, 77, -332, -118, 70, 195, 207, -109, 44, 192, -195, 58, 80, 176, -94, 117, -68, 189, 146, -82, 138, 127, -83, 24, 164, 105, 47, -381, 75, -138, 224, -107, 72, 18, -178, 137, -38, -383, -142, -91, 183, -234, -71, 208, 91, -62, -119, 205, -165, -60, -5, -63, 3, 59, 32, 245, 44, 205, 37, 90, -158, 108, 59, 82, -325, -218, 195, -65, 106, 44, 158, -60, 41, 210, 107, -143, -215, 252, -153, -322, 21, 132, 54, -150, -173, 84, -64, -100, -122, -135, -77, -30, 201, 46, -27, -112, -143, -111, 220, -264, -91, -104, -204, 287, 191, -78, -23, -135, -139, 23, 235, -81, 287, 259, -71, -212, 542, -54]
5079e4l9J59J05k67j73M42l6J62k47l93O47o5l50J8m2L22l58J17l1m1n6Q9J82
5102I1j42l4J08n9J00m5o0N2J7j2J40j74j33K80J66l30nJ66j81P0J10l30K82n3
5126B4j36L13j17j09k80L33l7K57l04L75j19m67K70j33J71l1M1Q7j40n0R2l26
5148b86M09k40J80J95k61K60j19l35J00J9n9K10k8k52j08J81r9K48Q1l60N33n70
5170c01N96R1m04r8N09j18k03k4k60K98l85J08p2L86k06J79k75K00m9m8K15l29
5192a90J49K16l04K2N9J72j76P3K09j55K09j60j28j32K29J5J9J56j88k93L74j47
5214B9n0j00j38L09Nm1j07J39PQ4m85K52K64k05m3K8n11P45q7MJ54j82J72m9l30
5239a36J77K7k31P7R6O7R1j96k41K65n1K04Lj34j36l0J93j39n2K59L5%k60QQ4
$$ y = [-54, -93, 66, 171, -96, -269, 173, 137, 299, 52, -341, 306, 241, -109, -91, -133, 189, -169, -52, -83, -124, -180, -91, 91, -51, -85, 23, -36, 64, 19, -41, 11, 28, 16, 156, -18, -151, 129, 295, -35, -40, 126, -55, 15, 125, -205, 77, 24, -112, 201, 84, -25, -305, 28, -9, 248, -56, 319, 200, -267, 3, -130, 41, 10, 51, 138, -2, -52, 40, -286, 123, -117, 63, 258, -3, 257, 138, -197, -97, -78, -137, 73, 45, -207, -315, -134, -233, 15, 96, -264, 269, -301, 295, 386, -18, -116, 393, 275, 72, 48, -212, 86, -299, -191, -263, 123, -83, 96, -179, 21, -28, -76, 139, -190, -41, 175, -129, -107, -48, 124, -52, 21, 230, 75, 284, 124, -4, -136, 93, 108, 127, 283, 95, -198, 176, 29, -21, -121, -259, 50, 55, 14, -93, 46, 53, 137, -348, -96, 168, -37, -80, -52, -563, 182, 95, 99, 253, 71, 243, 194, -136, 41, 68, -163, -86, 10, 77, 168, -28, -269, -4, -55, 149, 152, 18, -118, -148, 45, -94, -146, 113, 148, 148, -112, -104, -20]
5264b0J41m21K80K40l04k58P70m66K04j72J00j42j73O4K67J87m40N6K86q5q3Q7
5286A18j72M7n0k83L96m63J84L44j14j04j81L77M0k04j07J28l20L52j62L97o54
5307d31K62K80j51q5j06K95p0oJ08k60M74l94j5J97J01m11M3K40j15M07m51K76
5329A88Q7l85o3J70M7n2J54l94L4L03k04M09l46l13L32j4j28P0j02Q5M9j08L97
5352B16q6k64K18J10l6l72L26k08L14j70J86j5m02j77J56N34o24J49J00K1j60
5373a84k1L5M47n01j53M70L25o48J23J54K9l07p4L23k82J43K59J98j97j04l99
5394c64K94J57j56M35l06j6k69J73J74j45j94L90O1o3l46J93L1M7j51Q0Oj33j85
5417b87N72m10j5J53P9M06n80Q2k8J26j48K06j45j37J26r0j96J79J5J87m6k19
$$ y = [-20, 121, -300, -20, 220, -84, -342, 428, -38, 166, -6, 94, -48, -221, -157, 110, 297, -143, -87, 199, 114, 31, 118, -54, -7, -57, -340, 56, -407, -223, 121, 7, -97, -278, 99, 139, -65, -172, -44, -364, -12, -174, 223, -431, -169, 111, -40, -125, -231, 64, -6, -12, 96, -164, 310, -84, -99, 98, 199, -212, -169, 71, -44, 363, -88, 188, 275, -110, -173, -3, 44, -8, 146, -248, -214, 89, -115, 294, -52, -365, -33, -47, -175, -105, -207, -122, -73, -181, 216, 130, -134, 84, 194, 158, -214, 112, -96, 218, 48, 234, 219, -183, -360, -204, 330, -294, -145, -45, -24, -184, -205, -170, 277, -224, -377, 93, 418, -230, -107, 47, 76, -231, -305, 18, -264, -121, 138, 336, 139, 35, -364, -70, 87, -69, 366, 60, 44, -225, -52, 122, -23, -217, 173, 234, 171, -175, 18, 49, 96, -55, 25, 31, -102, -287, 285, -125, -140, 13, 92, 498, -82, 0, -28, 98, -50, 156, 11, -126, 0, -90, -286, -107, -92, 95, 49, -170]
5439a70M6M2K81k41j08J91M3n47O22q4J01l91p0L52r2L17n33K83j31K30k51P3
5461c7l83N94J47p6m68J51M13n49J3JJ29kM62p36O67n56L43lJ00k55l2Q4j8K09
5485A98l90J44K11m48K42R3k93K95l6J29J04m2j22mk23J15j14L50l25J4J21J77
5507A96j11j1Nk43K62m8J13j53k29J72K02m6k17L8q8K85R6j93%J54j63k29O7K57
5531A16m64L89K53n9j25M1J0Lm3k22J32j65N45k61J85m97R4M04l94K80m28K48
5553D2J29l52J5J88r6j47K27N6o7J78j02Q8l43J7J68R0j25J10m9j98K48l66M28
5576A39K56l98k6k09N5l8L96L5R2p27M84l7N7J51o6j04j48j21K20J02j3j32l6
5599f8N85l34l92M1P4J40n4J6q0j55N39l01m5k54L06o2k06J43L11j13J0n51O34
$$ y = [-170, -124, -82, 199, -42, -150, 41, 84, -463, 159, 75, 176, -215, -285, 67, -25, 292, -241, 42, -89, 141, -110, -37, -420, 174, 321, 245, -223, -72, 341, -208, -195, -194, -65, -67, 395, -341, 326, -230, 113, 110, 210, -45, -77, 7, -11, 198, -192, -48, 163, -285, -43, 50, -243, 52, 16, 145, 249, 207, 85, 81, -142, -27, -141, 209, -116, -102, 19, 196, 85, 74, 79, -164, 98, 50, 163, 10, -219, -47, 155, 109, -108, -70, -158, 127, 223, 30, 30, 184, 21, -208, -141, 116, -348, 41, 294, 235, 110, 151, 161, 164, 121, -101, 31, -134, 411, 150, 335, -162, -68, 336, -58, 222, -206, 42, 171, -181, -166, 22, -74, -221, 6, 62, -5, 173, 71, 159, -184, -167, 1, 91, -34, 76, 27, -171, 77, -289, 139, 395, -3, -29, -238, -183, -221, 175, 210, 302, -425, 59, 22, 79, 230, 164, 60, -88, -209, 11, 113, 100, -32, -68, 517, 183, -209, -168, -94, 46, -8, 8, -72, -227, 312, 11, -34, -288, 18, -44, -250, -107, 204, 91, 101, -450, 184]
5622A84k19P5N5K66j81l53L67o1J38j72l18N91k97m30K91K31j54j21J50J64j88
5643A8m78M24K53j08n3nk40r0J89Q6j46k15L96L4K38k57m80O15j10l9m15M48M6
5666A11m84M48j0j13q3j4K6L96k72J97j41k3l18K25N51m49j08R6j03j01M72j36
5688A67q6j09l87N51l36M4k7M7R2k10K68K76l63J62N1n0L7k53O5M64m87k46K64
5711f6j84k18M59R6j3J12m39L13J89k93l3M59j98k79J89J28j46k0k84J3O1J35
5733a9jq1K9j82J31K4K26j18J46k15j31K15K33o00O1P0j35L81n8R6L61n39L62
5756B56J7j81p7K10l16L65m05pJ52q0l61N91n4j08j96L63j4m54K03l3J56q9o6
5779a28J84L76p13K30N0L73l07mkL3k48l8K03J17l82K99K18k33j27p0K33o7P8
$$ y = [184, -35, 40, 95, 361, 180, -173, 194, 133, 271, 99, -219, 372, 75, -355, -64, 167, 13, -108, 42, 206, 18, -460, -36, 217, 109, 56, 51, -189, -279, -90, -4, -150, -365, 31, 65, 303, 46, -434, 181, 71, 32, -383, 65, 111, -373, 75, 65, -48, -131, -145, -119, 277, 5, 202, 61, 38, -280, -55, 496, 47, -61, 35, -68, -169, 303, 167, 81, -28, -415, 136, -200, -156, -183, -136, -44, -254, 14, 290, -73, 89, 140, 90, 127, -126, -61, 403, -84, -330, -66, -250, -468, -9, 87, 74, 186, -253, 60, 249, -44, -77, 382, 184, -95, 94, 222, 76, 56, -228, -215, -154, -19, -20, -101, -72, -254, -123, -99, 127, 9, 155, -60, -191, 24, 257, -343, -282, -212, -347, 34, -24, 72, 433, -106, 256, 273, 92, 15, 225, -91, 274, -131, -138, 14, -66, -427, 164, 110, 2, -194, 169, 155, -299, -96, -129, 27, -62, -128, 56, 432, -281, -51, -1, 372, 65, 61, 59, 92, -156, -194, 9, 126, -256, 43, 261, 28, -99, -169, 64, -3, 75]
5802G5Q1p3p3k5l4M12j63m31J1J97Q2Q3l2j34n2N3lk30K3n6O2p0J86j44L92k02
5828f5k76K36J99j60O6k81K64J54K1j81J14k37K01J02l27J48P8K1M6j71K0R4j52
5851h6J78j13R1J58l13j09K09o2q8M11j18Mm19L04K34%l22J54j0k15K72l0Qm01
5875b63k9M21k17Q3l2K09P3m60N02j08oo63K32M55J6l68K11O7k17k00M67j35P3
5898A11k68K96J35j50l85P2K12j58J24J05R8o78L55K03nqK0K81n30m9L56K9N2
5921B18n29L20J18J01j12r6j32J31J86p4o7j01N4K78j12l37m2M61J37l43k13n8
5943b12K13k02J4j52K22k96N59L2k12l8J61k2j94q0K33J23j68m6K43Q0q2o8m1
5966F7J51l82J05jJ04P5l15J38n7j98K61L61l77K76j22K39l45p6K19j15q1l6j94
$$ y = [75, 156, 83, 10, -15, -49, 363, 200, -231, -220, -23, 59, 142, 110, -24, -76, -23, -26, -256, -233, -289, -227, -297, -111, -255, 137, -65, -341, -105, 94, -66, 0, -281, -17, 137, 158, -23, 91, -146, 55, 157, -170, -22, 56, 77, 123, -48, -28, 66, -86, 92, -21, 70, 228, -85, -194, 15, -47, -135, 276, 158, 162, -257, 47, 281, 281, -41, 113, 103, -112, 160, 130, 138, -263, -292, 129, -88, -5, -37, 172, 245, -215, 287, 179, 173, -490, -258, 197, 213, -155, 56, 123, -94, -294, 173, 38, 111, -157, 139, 274, 124, -261, -189, 23, -135, -11, 94, 192, -486, -131, 72, 67, 59, 79, 360, -170, -219, 137, 166, 218, -311, 9, 127, 228, 116, 20, -112, 19, 205, 131, 64, -37, 17, 295, 183, -154, -196, 265, 402, 59, -154, -212, 1, -201, -187, -339, -117, -413, 146, 178, -34, -72, 89, 67, -127, -207, 26, 149, -19, -65, 178, 258, 176, 108, 67, 218, -164, -59, -60, 44, 119, -196, -58, -115, -313, -52, 309, -68, 208, 86, 325, -20, -96, 123, 8, -73, -109, -303]
5989c03K22q5O3J74J33l56N2K58n38K88J90l0j53rK14q0M9k84J80Rm42K56J39
6012e3K12k70L11n8m75J73R2K21j02k08J80K50m01O9J15N88m64k75K86p6n9Q3
6034A39lj18k98J58O3J27m02L29O9J08P4m52K67j44p5PL79m23p8J90L09l33N6
6057e1K50m62M44j46J61j86m6n9K66N2n18M06j94P3l21M43J15j1m24K33K74k01
6079I8o2j77N05m42j68L04l6m58L79J59l4J56k49J96l06j05L84J93j80l03k08
6100c54M49k28k17N64j34J21l96J89L49l26j91K17M08l78n7L5q2J05k20L47k65
6121f4j13J44j6j6n4m8L68l62j37L36K71n08m0r1K95O1k43K52J26j92j45L02j42
6144a6J79k79N4J51k32Q2Q5j6j31J01J14j7lj24J10L4l13K98K52n49J36J86j24
$$ y = [-303, -81, -166, -103, 71, 204, -152, -100, 158, -380, -92, 98, 68, -85, -94, 120, 40, 89, -195, -15, -6, -448, -192, -53, 159, -111, 200, 142, -333, -160, -68, 153, 51, -157, 23, 273, -128, -59, 56, 644, 180, -95, 191, 115, 56, 139, 136, 18, -280, -122, -59, 68, -334, -5, 64, 172, 246, -206, 61, -83, -158, -151, 228, -195, -273, -83, 226, -107, -51, 199, -263, 181, 35, 196, 10, -36, -95, 171, 223, -295, 111, -83, -10, -331, 112, 227, 216, -208, 25, 299, 98, 36, -141, 364, -78, -246, 58, 22, -436, -57, 102, 68, 224, -25, 171, -135, -240, 144, 337, 157, -146, -354, 95, -133, -350, 214, 80, 201, -195, -6, 343, 17, -174, 43, 451, 73, 16, 51, -31, 74, -146, 201, -64, -177, -33, -49, -65, -119, -167, 201, -161, -298, 38, 309, -199, -239, -330, -35, 26, -217, 35, 161, -31, -176, 126, -16, 163, -116, -62, 89, -143, -61, 24, 8, -123, -22, 92, 75, 72, -52, 58, 92, -221, 77, 329, -220, -84, 102, -22]
6167b2k0N4n2J33o3k66M85j12j27j64L92l1l1J6n6j4k57K54o8L2k40M13n8k29
6191c1l13N14M0n86K04N3K48J6K6r9O9l50R2J69M7q8k50M74p18M17L33rk44j77
6215a63L80j84r4j6k23L56j51l57M17l57K53l7L13q8m7k45K30L19m66K59l25J34
6237i2j42J40K21k8m16M37r2p4l5l18N12l36J26J05k90K7K36M21l29k08J67l1
6259Aj08K12r5K30k61m81J56P63l19m34M01M0J05m48K34L07k78J45j93P3k25j2
6281a87K12Q1j70k82N38K9m27L82R3l84j76J58J33k31J65q9J53Q5m02M17k36J00
6303c8L3N1K26o06K64N02k85l07n4J22n2j50J38M60n3n77L72Jm9j96L77r4j61
6326g6K21J67k25j46j47K41J36m69J58K33K36m63J01J99l19J7L46j18J51l44J0
$$ y = [-22, -42, 12, -40, 93, 30, -236, 249, 137, 10, -154, 238, 207, 176, 192, 136, 122, -135, 119, 51, 83, -157, 256, 198, -31, -344, 170, 210, -376, -172, -119, 129, 145, 171, 72, 141, -209, -117, 52, 99, 11, -239, 235, -483, -66, 267, 258, 14, -163, 217, 33, -61, -77, -300, 56, -95, -452, -35, -392, -139, -176, 137, 49, 2, -243, -13, 306, -160, 99, -226, -92, -234, -94, 127, 99, -317, 120, 28, -46, -81, -399, 113, -223, -97, 8, -282, -255, -19, 402, 73, -135, 32, 1, -107, 105, 10, 240, -21, -502, -346, 417, 98, -336, 65, 105, 210, -238, -4, 303, 25, 170, -23, 50, -175, -187, 25, 106, -64, -346, 192, 221, -206, 176, 269, -115, -291, -133, 0, -231, -66, -155, -2, 83, -319, 98, -138, -38, -5, 46, 272, -334, -70, 432, 147, -160, -214, -92, -144, -294, -156, 304, 251, -326, 46, 47, -2, -198, 179, 85, -76, 145, 312, 87, -59, -206, 35, 171, -298, -140, 93, 329, -134, -33, 166, -153, -136, 210, 92, 243, -101, -91]
6347i1J85l85L94m2j22j77J90K41k82K06l22L94j33j99K54J2q8j90Q9J96k43o1
6369a74J00L45j96O3J71k55m00J41K98lj96M5K74m72K24j91N38M2n81N5K21N9
6391A08j19L8j95L60l42Q5N2M1k78N23k41l64K29L80k80Q3j90n8K31j86O8J76
6413A21j1q9m4N3J49l42pK39oj09R8J13k52l01jM02J64k83J45M00l56m13N20J46
6437C36k09l35J57K32l47l4M57k45j29R0l50N15j52j87M89o1r0j57K55k29j19
6458a13K32j45j94L3J15L02l15q2K16K27k15j2L9J00m77M52o5j54l39L62J74J
6480A42j07k22O2J27l81N72K6k32k00N27r3m54J92J36j02l70K31L45p6q7r7jJ8
6503d4l02J71K28n2k48K27J54O5j87j19N44n75KK05J49O7k98j57N34k32j36J58
$$ y = [-91, 94, -291, 103, 61, -61, -238, -48, 193, -89, 117, -205, 189, 56, -143, 111, 123, 35, -155, -66, 130, -113, -174, -74, 271, 75, 138, 309, 54, -346, -205, 93, 90, -106, -61, 213, -259, -35, -226, 312, 354, -227, -172, 49, 108, -11, 27, -168, 192, -150, -65, -13, 28, -250, 273, 32, -332, -103, 277, -3, 80, -110, -168, 63, -123, -55, 121, 110, 21, -23, 30, 179, -163, -170, 69, 63, -46, 52, 165, -87, -388, -389, 13, 177, -106, 39, 439, 83, -330, 190, 336, 127, -208, -51, 181, -166, -200, 257, 12, -117, -27, -377, 138, -14, -201, 288, 227, 137, -20, 235, 6, -113, 119, -26, -220, -187, -72, 230, -85, -167, 49, 276, 61, 49, 88, 188, -289, 163, 98, -56, -395, -33, 141, 142, 35, -187, -125, 2, -379, 193, 219, -13, -213, 314, 221, -233, -41, 95, -7, -377, -146, 199, 123, 36, -61, -62, -44, -346, -175, 53, 1, -247, -20, 134, 199, 12, -107, 437, -138, -136, 69, 218, 285, -13, -170, 364, 132, -4, 154]
6525A54n07K07j29k0M77l87K88K1l21L0M40n4k26p9j0K9J83q2L9pn8p0K41Q9l35
6550h7J83J13L20n67j53L91j94n4o1j4O5j07L83l6l19L27j20P0K27l78%L47n97
6573b61J66L07l99J53J09j72K44j20O7k8p0k73L02M02l88p6nJ31J7m32L2J007
6595G13q67J78j83L08j52k95J74M42l46q2L37k15k92K47M95o42q7N8N14k02j75
6616g2N16m27JK32l17K04l6l30K78J89k44r6K35j66m03M08K16l28N8oL81j39l13
6639a59L3K61q7j0L4k75J55k73K22N25n22O5j55K22M1l01M96m52K32J42R5m25
6661a36J90l14K62N1q8K55j79j83qj29N11j86k61K24L4l6J41K49n04k24M70N5
6683A94k03j02j08P16n47K9n6L4J40p1K2L06m11j96N09l15J14o6PJ00Q5k58J82
$$ y = [154, -353, -146, -275, -295, 182, -205, 83, 104, -217, -187, 253, 199, -27, -106, -116, -87, 96, 14, 53, 46, -12, -82, 159, 248, -87, 96, 209, 529, -38, -191, 200, 6, -48, -109, -123, -58, -165, 218, 182, -137, 190, 70, 140, 367, -11, -11, 336, -261, -95, 212, -187, -34, 75, -97, 147, 27, 94, 66, -4, -277, 25, 427, 39, -37, -42, 89, 106, -326, -294, 713, -154, 24, -159, 149, -3, -298, -124, 318, -28, -110, 227, 12, -280, -33, 462, -180, -267, -209, 305, 103, -72, 444, 17, 18, 250, -67, 137, 101, -229, 49, 238, -6, -102, 133, -33, -436, -28, 188, -140, -82, -88, 293, 154, -159, -126, 135, 48, 38, 72, -203, -48, -321, -99, 426, -96, -31, -186, 36, 77, -224, 272, -180, 52, 194, 289, -136, 54, -260, 2, 53, -35, 220, 41, -142, -150, -279, 232, 46, -215, 9, 43, 7, 148, 397, -107, -331, 139, 194, -9, -111, -219, 497, -50, -21, -77, -43, 97, 26, 48, 354, -57, -253, 256, -59, 55, -11, -4, 96, 181, -77, 105]
6706A05J00m20M37k43L91n17k67N78j66k89L92J53l89k6J00M3J69k95J64Nn1j2
6728c8j6J29l21K56j33M75n55M03l20k9J35k1J4j82j44M25R0Pm78K49J97k1k21
6751i9J39J2j74j9M7K41j95%J67J0N4j59K8P3l36p6N88l08j56Q9M5J76k36J55
6775F6K18k93J15J04j17j68l47L92K69m5o4N5J16l37j19N55m76n8L0J95K65n28
6797a72Q8K30l3j34R0j40K69k88L52j15r2p4L4m7K3k69M31K83q55M23P8nJ15k32
6821d0K84r6lk57K48m21L86j96K00Jj42K93n9j96m3K77k92j92K19L29j94j12J38
6844A32k20J0J67n3J21j72p6J91K86k50k41j01J14L43J47l61j1J10l17J06J53
6865G8j4k10j72M33j39n8j68N4J64j5K46L2j3m60N70l11j17J63m11N11j4j01n3
$$ y = [105, 205, -215, 222, -21, 370, -147, -414, 164, -2, -291, 101, 254, -135, -161, -61, -18, 151, -144, 20, 25, -26, -38, -54, 75, -246, 10, -123, 352, -203, 200, -120, -149, -14, -35, -21, -203, -347, 78, 168, 175, -303, -54, 143, 122, -99, 40, 52, -122, -141, -94, 147, -48, -48, 119, 129, 183, 24, 52, 125, -211, -287, 301, -7, -163, -74, -29, 147, -89, 66, 284, -9, 106, 210, 93, -75, -422, -30, 239, 194, 130, 185, 301, -36, -155, 400, -76, -134, -104, 91, 356, -172, -84, 146, 113, -21, 69, -71, 198, -90, 262, 147, 55, -19, 15, -32, -9, -278, 153, 436, -419, 4, 82, 77, 192, -40, 244, 148, 145, -112, 136, -285, 101, -95, 105, 106, -36, 257, 198, 2, -41, 236, -56, -248, -29, 300, 106, -6, 132, -88, -78, 89, 36, 157, -15, -91, 100, 386, 136, -105, -206, -92, 251, 398, 37, 26, 136, -181, -75, 78, 64, -146, -318, 115, -24, -82, -250, -196, -32, -47, 199, 231, 218, -242, 328, 17, -100, 63, -348, 163, 149, 48, -5]
6888eo2j68L43K90n97K18l2rj56j50M88m2k13l60P99j69j65m8m2L61k40j67K82
6911A56k90n8j33L40l0j38K21ll23K22L0Nl42k5M72j74J47k14J4L70k12m33K93
6934a05J45m16L61P1K46m68K04j61o3J12J21P4k94J78K22j78k89J88K82k52J3
6955ij4j16P5j64L85P9m60J83j80L32J8n0L2k09Q6m04P08j8l20m03K39K97j34
6978d7k00K89K10m96L89J47k16n19L46K85j98j34J76K8l54L53J04J56m86L31l72
6999b08J56K78l37L19o8l61J35l5K09m24M82K23l50j70k7M17k17k7k25K41R4l78
7021b73M70j17m2l91N22r5J65k84k1K1n1j43M18o4j74k00L40O7k58K43j49j91
7043b07k62N30J60l28K07j3K26j68n86M95q4mL9K12j36l31L1M54k48J02k52K41
$$ y = [-5, -67, -235, 108, 398, -199, 19, -13, -22, -178, -328, 160, 118, -95, -455, 344, 175, 10, -38, -80, 281, 41, -126, 156, -134, -192, -325, 15, -15, -153, 68, 65, -258, -36, -6, -1, -343, -368, 104, -70, 77, -137, -123, 247, 35, -398, -105, 40, -376, -15, 56, 302, -166, 38, -123, -186, -74, 47, 121, -173, 5, 227, 49, -240, -52, 230, -22, -9, -23, -139, -64, -228, 157, 236, -224, -41, -221, 111, 129, 79, 111, -98, -12, -416, 292, 274, -46, -449, -210, 87, -47, -247, 42, 252, -244, 145, 292, 76, -443, -97, 188, -10, -144, 32, 60, -294, 59, 163, 319, -167, 164, -208, -52, 226, -111, 208, 140, -221, -86, -121, 88, -336, 146, 369, 19, -151, -178, 239, 22, -5, -230, 11, 105, -273, 197, 80, 38, -353, 169, 74, 239, -45, -66, -45, -96, -239, 179, 115, -59, -259, 81, 148, -110, 133, -16, -207, -469, 61, 221, -107, 100, 87, 313, 145, -441, 54, -30, -34, 5, 217, 81, -250, -219, 235, -13, 89, -163, 78]
7065G8j37J8J03K82n54K28N2L26m43j10o1L56k72K43j48L32o98K58L46j13j67
7086h1j03K54j25J43J45K4k05k38M8J92j00j7r6J53K70l94J54J06j2k66K40Q2
7108A74j99O3R8J45l41K33m7Rq1l27M27m3k53j26M98j20j60J16M05o31PK24k13
7131a42pKM09k98j23J61k1K08l47L17k0n3j45j16L38j44j08k21K86r9j1M8N6l09
7155c39K39J50J3r0k6J38j13j0j43R9J68n05M47l7R5l55J98k1j17J36Q5j28J66
7178E0j00r4N14m91j54M79j34l66K00j07K90k94J75K26m02%K37m1N48o00n8K82
7200A60j48k31K65O6Op4k62J38J32j38J30J46l41j49O23q3k23k76L77P4k80J63
7222G5J3m32J04J29K81k55j08K12L29J8m91K17j94O4m0R0j21N4k99L63r3O7j00
$$ y = [78, -59, -41, 62, 344, -210, 18, 70, 396, -47, -157, -218, 138, -134, 109, -39, 293, -405, -147, 199, 86, -81, -184, 70, -55, 88, 233, 257, 52, -186, -138, 54, -46, -63, -159, -6, 264, -130, 24, 130, 118, -148, 92, 174, -25, 38, 136, 281, -60, 173, 126, 135, 54, -273, 154, 111, -142, -268, 230, 110, -50, 66, 471, -160, -153, 71, -142, -149, -147, 262, -36, -159, 2, -19, 189, -158, 159, 139, 86, -59, -175, 163, 19, -89, -310, -24, -123, -134, -86, -30, -339, -100, 50, 63, -27, -53, 85, -28, -38, -181, -82, 86, -419, 28, -9, 86, -269, -71, -92, -209, -73, 12, -116, 50, -50, -144, 370, -121, -275, 204, 70, -296, -96, -203, 87, -207, -32, 194, -208, -208, 29, -12, 536, -64, -122, 160, 12, -219, 46, 112, 118, 44, -218, -80, 52, -86, 44, 190, -151, -300, 323, 240, 17, -259, 118, 192, -88, 75, 88, -344, -240, -111, 170, -85, -193, 19, 348, 366, -125, 92, -102, -38, -78, 12, -109, -55, -354, 9, -84, -17, -117]
7245a17K64O2j76k01L45j85m1J99r0K16m12j93N20l14N6n6L19m43L82Om4j0k18
7268a31J80J74l38k23L24j59n0L37K7jj12q7K83j54J11j54K04k13l21K10L42m53
7290b04K48m3L45m60%J57r3L27k43J4J63j12m39Q25m51m59M39L66q9n07K78j23
7312f1N3K0q4K02k00j76L95N2j16j7K4N5O6k73J19J40j54n4r9L86l33Q1P5j94
7336i3n80P97M9k30N7j85J21j76L05J55k17q6r9jOk36M85k56J31k2j72K58p7m2
7360a08k76K92K69o5n74O42l74j61M03K33k89k00K98r6j38J50O3j3n81L16K92
7381H3K56p03K29J52k02J01K16M0k5k30jJ63K63q29N44O7j70p9K86J34k95PP7
7404H4o3j25n4L96k88R2k39M03J1n06N45k50m6Q9K84k32j90J40j05K01j91L2M2
$$ y = [-117, 147, 209, 33, -168, 177, -8, -49, 150, 60, 276, -136, -329, 191, -123, -67, -123, 196, -247, 135, 141, 97, 87, -131, 49, 223, -115, -338, -14, -173, -223, 114, 141, 140, 28, -59, 224, 70, 181, 27, 231, 18, -303, -93, 249, -204, 44, 1, 346, -114, -114, 43, -50, 277, 34, 48, 211, 99, -340, 485, 34, -425, 14, 380, 291, -216, 62, -61, -8, 12, -72, 130, -70, -246, 149, 201, 85, 68, 92, 147, 213, -60, 59, 199, 45, -9, -108, 278, -55, 26, 101, -93, -673, 124, 173, -57, 0, -185, -64, -240, 65, 220, 3, -83, -182, -183, -177, -413, 72, -184, -53, -75, -247, 11, -66, -108, -384, -92, 177, 112, -462, 180, -194, -355, 48, 281, -8, -208, 90, -6, -144, 6, 69, 56, -525, -209, 83, 339, -364, -135, 17, -185, -84, 132, 172, 147, -83, -84, 79, 342, -487, 57, 124, -46, -125, 161, 295, 0, 7, 84, 21, -104, -158, 238, -50, 42, -197, 206, 217, -289, 256, 6, -40, 49, 333, 101, -89, 51, -54, 147, -44, -12, 30]
7427C0m6k69OM51k96mQ2J16J00l88O1N04j21m59K96p7K33l03KQ2J29l42J28q0
7451a65N30l83p6M70o86M02P5l25j06K96M25k77p8Q4m3j23l01R9L84k73k09L05
7473B5J79p7l0o6j48K63j19kL52o15K26R3k20MK21K84l19P2l0j17M6l5J61j03
7497D5k42J07j39K98k22K56o0J33k11k37M45p4j14k29K59j04R4L9J70j18k30j34
7519b68L48l1Nn0J44k27j43J37L93l28k68M15j24m8K41n1j19k8QL34J10m98k55
7542c03M93j29j41n8L42j92o4o5m6K67Kk30L26j11k35K28m6nj25L31k32R9k15
7565a09L34j3m58kN99m96j5j0L04L4n19K91J85J49m06J59j07M7k52N05r1k14O0
7588b5J44J89l92K39k25J16p2L3j92P9J20J42J46j28m73K97M28l64o2j14J77l74
$$ y = [30, -16, -285, -279, 172, -124, -128, -46, 70, 170, -218, -157, 347, 226, -233, 63, -14, 219, -84, -82, 0, 129, -213, -85, -165, 365, -18, -94, 376, -310, 92, 167, -158, -264, 32, 457, 180, 102, 186, 143, 20, -281, -182, 202, -71, -280, 25, 204, 127, 97, 31, -117, 146, 27, 25, 377, -238, -12, 81, -139, -135, 86, 370, 51, 123, 93, -24, 22, -13, 148, 45, -197, -90, -229, 69, -153, 103, 43, 176, -35, -272, 173, 99, -15, -244, 15, -89, 5, 44, 214, 96, -134, -268, 80, 49, 54, 4, 148, -79, -222, -85, 308, -20, -288, 127, 3, -45, 196, 145, 26, -2, 6, 340, 450, -48, -303, 190, 61, -80, -138, 204, 12, -52, -117, -163, 104, 106, -124, 202, 91, -144, 84, 38, 33, -92, 239, 7, 106, -109, 225, 212, -246, -248, 351, -145, -160, -170, 134, 168, -351, -60, 125, 274, -132, 27, -80, -33, -285, 220, 129, -85, -25, 119, 308, -84, 155, -70, 46, -26, 7, -185, -106, 14, 156, 302, 174, -299, -2, 426, 62, 0, -114, 63, -311]
7610c11J19M3N09n19j65L37K62m99q1O22j90l91n4M41n1l16R1L40j75O7k07J44
7632A6j0J06j16L48m50l75N54k00R6l77N37K11l0n78K57j13o9K98k13kl9j90M27
7655H8j18Jo6M5l2k73K22K08P2m10K92j6j38K46P1M7l80j63J12L4m8J56J30m09
7679c29M26Q6q9j04k83J5N02j21l84K76j87R9k2K89l50p7K46N13j57m68k18P42
7701D05o19j06L22M03M0k22k43K67k34J8m9K90K1m15k03L41r7r8J26K59j81r5
7723g0k57N86l03j5N3Q7l49K38N32m29j63K3j51K19o2L2L18k14k63O80n69K33
7745A56l87R7J90j40j27M06l69L4J22N9j72J60j71M01j07p2MJ26r8k67J94j64
7767a25K21J05k10Q0j65l50Q40k79m17K50K74k64j99k8L83P5o71P67k87j29L63
$$ y = [-311, -192, -149, 360, -159, -324, 13, 275, -224, -305, 317, 127, -264, -318, 123, 72, -244, -153, 187, 12, 79, -128, 16, 6, 112, -4, 344, -106, -481, 73, -127, -31, -408, 129, 340, 310, -268, -11, -124, -193, 105, -108, -110, -149, -339, 88, -30, -29, -95, -50, -82, -355, -133, 75, 147, -263, 29, 13, -125, 121, 192, 239, -141, -304, -192, -158, -206, -50, 80, -329, 97, 183, 94, -10, -293, -278, 224, 103, -281, -5, -192, -93, -115, 174, -176, -253, -7, 506, 349, -119, -337, 405, -214, -320, 2, 405, 445, 223, -20, 247, 13, 31, -18, 272, 293, -122, -325, 16, -81, -179, -53, 206, 25, -70, -327, 259, -44, -59, -6, 81, -268, -30, 502, 73, -90, -67, -218, 1, -61, -29, 289, 75, -188, 492, -77, 156, -231, -134, 56, -84, -211, 195, -174, -140, -18, 41, -131, 29, -142, 259, 152, 80, 84, 210, 112, -155, 39, -125, 96, 201, -9, 71, -94, -444, 396, 117, -300, -50, 224, -40, -239, -267, 116, 191, -480, 287, 0, -129, 234]
7788B34l09j14J26k12M72l70J76q2K24J22m55R4K1K75m37L03K01k34j47J28l21
7809c05O01m85K73j82n1J83J9K00n43j11N03j12q9m9J81R8R5m06N5N18n15K0J93
7832I1j55j08j58M65K28k96k6J47j76O7l18N97k25m7j78J98k81J59K63p6j72l6
7854c7j09K12k67J51J47j64j6n0J28J70l92K48j23j9J07R0M1J63l83%n8l5K34
7877C8o9J67p6n46M61R2k61n9K29O1K2k75L11k78K53n20M92k34K30q5P0K48l54
7900h3N0L47l90l51L32L22r1l86N92mm04m0K20J68l21J0R8j51j8JK46l84K33p0
7924g4J05J31l67jL32k30k12N01Q2k95j09L82m01O8k08K82L45n41K90L5R3l23
7946a15J26l11M18k58J67L5j13k9R6r7jK50k57L57j53m52L98K14l45K0L03R8m56
$$ y = [234, -75, -189, -63, -275, 197, -173, 3, -79, 145, 267, -188, -94, -73, 202, -235, 68, 269, 35, -112, 16, -305, 296, -189, 84, -98, -149, 34, 53, 253, -290, -401, 102, -10, -99, -148, 33, 131, 226, -180, -125, 393, -122, -102, 91, -64, -172, -330, 135, 363, 67, 41, 188, 12, 79, -239, 358, 133, 86, -92, 106, -175, -16, 247, 171, -1, -37, -146, 66, -201, -50, 97, -67, -83, -133, -5, 165, -227, 21, -102, -121, -14, 76, 117, 280, -103, -103, -161, -196, 38, -31, 136, 60, -486, -25, 67, -194, -253, -24, 37, 59, -216, 95, -183, 70, -450, 42, -192, 38, -47, 23, 271, -83, -33, 314, -76, -427, -95, 227, 136, -250, 342, 338, -66, -106, 114, 282, -39, -29, 69, -82, -100, -99, 147, -237, -4, -74, 31, 162, -205, -206, 126, -104, -316, 185, 267, -28, -137, 245, -156, -88, -296, -14, 331, -210, 80, 115, 208, -115, 11, -300, 118, -140, 27, 62, -51, -80, 16, -81, -82, 168, -89, 268, 115, -337, 61, 275, -70, -50, 253, 351, -105]
7969a05PK28M0m26o2M30K%k58L48%m32J26L50k7j98k48L09j69k28L61j53J75m24
7993c54N38j17L1k53K24K7M5k97K07L32l32j28K21k1l08K18l58O57o61L43L6l81
8015c31J35L13j00N0m7j48j79K54L30l20J11l04N0KM6j48J01J40K52l48J90J98
8037B47k36PK6R0J3l22J12J87l78k15M83nj60j10L41R7l95J67L1O7q3J94J8p8
8061I8rj04J13j31J32o8J02k90j79L35k0R2j13J76R2j8m66L25J20k71K0K55j28
8084F3j60L38o4J41m76K02J34k05j05J03K48k55j6J63J4j05p7M23m24o6J54K4
8106E4j82M3j25L09r5k51M62k7L6j64k88L67r4KJ03rJ9k53J55J59m49K13L38j65
8130A58k35k37L30r4n6N0K41r6r1o7K96K1m12M24j1l10j15N15n6m62J33k05J41
$$ y = [-105, -98, 130, 170, -256, -318, 112, 114, 114, -144, 204, 204, -228, -102, 248, 221, 23, -225, 84, -85, -313, 48, -105, 70, -354, 184, 67, 98, -155, 69, 96, 141, -156, 51, 383, 51, -77, 144, 123, -185, 33, -325, 332, -329, 14, 50, -331, -196, 117, 17, 67, 20, -128, -307, -53, 277, -43, 68, -236, -186, -184, -138, -286, -185, -45, 207, -141, 49, 247, 11, 18, 44, 134, 147, -175, -63, 124, -254, -469, 14, 9, -151, -261, 80, 177, -218, -51, -20, 47, -36, 158, 176, 98, 89, -15, 98, -33, 99, 31, 133, -157, -336, -1, -21, 71, -42, 134, 226, 208, -258, 67, 187, -84, -64, 191, 63, -97, 241, 177, 318, -158, 44, 178, -27, -132, -29, 219, -36, -52, 111, 125, 20, -57, 366, -58, -124, 30, 54, -128, -85, -210, 99, 4, -247, 215, 188, 224, 60, -228, 139, 45, 47, 150, 141, 160, -93, 62, 221, -228, -15, 323, 158, -77, -314, 16, -78, -134, -84, 157, 61, -30, -97, 199, 220, -192, 232, 221, -89, -204, 311, 255, -207, -74, -279, -138]
8153a38l7P6L47j28k77j93L26r8K23Q1j4L0l24J87q3J26m93N19K8j97J05k63M10
8176B13j28k97q1K67K67m2k71M5o9k04L86J87k49k8j35
$$ y = [-138, -175, -99, 248, 120, -157, -350, -24, -122, 101, 182, 168, 198, -126, 61, -22, 104, -389, 130, 158, -39, 66, -197, 213, 85, -212, -293, -26, 241, 199, -72, -27, -96, -300, 86, 273, 24, -4, -139]
8191a39
$$ Imaginary data points
##PAGE= N=2
##DATA TABLE= (X++(I..I)), XYDATA
0@%%%%%%%%%%%Qj6J6j6J6k4L2l2M0m8N4o2P2q2R0j04J20j36J53j72J95k19K45
34A30k75L06l39L77m18M62n12N68o30O95p68Q55r52J059j182J326j495J696j943
53a040K253k657L207m000N256p562J3160n1349p1604R6146R8585K5265l9809k8859
67C6992k4648q113K1078K9221k2321m7373j5885J6735M016M121K0007n28m4829
80c1527k6611K9994K7454k6116k4457K5543L2930l460n299J9961J3547n651P974
93C4282J4892k0438l4747O744K8346j5145m3115j641L2321M504k5029q782Q179
106a9629K618J1792K6472k483m3170k1082L2895L4188l464j2393o597k2362j4027
119c7242M6665P1719m76p3520m6069K5876M1596Q207j7903l7133m4754n679N0175
$$ y = [0, 0, 0, 0, 0, 0, 0, 0, 0, 0, 0, 0, 8, -8, 8, -8, 8, -16, 16, -16, 24, -24, 30, -32, 40, -42, 48, -56, 64, -72, 81, -91, 104, -115, 130, -145, 161, -178, 199, -219, 243, -269, 299, -331, 364, -404, 451, -501, 558, -624, 702, -793, 903, -1040, 1213, -1444, 1763, -2237, 3019, -4543, 8617, -42732, -114336, -18190, 80395, 105660, 65851, 36992, 12344, 4231, 25309, 54530, 32209, -15164, -31049, -14314, -10298, -6177, 13830, 13302, -31527, -58138, -28144, -690, -26806, -51263, -25720, 7210, 3750, -1549, 18412, 31959, 26308, 34282, 49174, 28736, -6011, 733, 29079, 13934, -29181, -30822, 1499, 6003, -19026, -27808, -19629, -17011, -5219, 21253, 18770, -24400, -45482, -12587, 21601, 18137, 5744, -853, -23215, -37242, 9423, 81142, 80666, 7146, -38923, -13047, 28549, 36756, 18853, -18280, -63034, -68713, -18538]
132a8538M4303j2205k9221L396J3171l154N778K2277n830l9788j2877L1823K0702
145A9837j3231k596K0873M568j7196m009N433j5178k0458O849R679k1466j8802
158d5697K6067L5103m478j8314J0746K0790k110r380k489j2530j7911J2662L0890
171B3349o252m0911j2450K9775K2613q41j35n536l1014j9805L3800M9828m568
184C7853m8532k6702J2537K5561K6713J3426k4727m6624o905M2991K8388j9244
196A4735k5744l588l784p117J5356K7512l864k5641N54K4275O728j0394L495O657
210A9180j4928j7681O323Q144j2627n820J8771J0061j8703q524K2224J5102j6012
223E510j5773M681K183n777O164R234j3353j4944K2013L5199m482l2849j1096
$$ y = [-18538, 25765, 13560, -15661, -12265, 906, -2248, 3530, 25807, 19977, -19811, -32688, -865, 19837, 6606, 4010, 24883, 29451, 12255, 8246, 13679, -1499, -21957, -15108, -5429, -26895, -45697, -19630, 15473, 10995, -7319, 3427, 24217, 22107, 12727, 10238, -2292, -20203, -7541, 23349, 17097, -23814, -36264, -6489, 16124, 15283, 15148, 9612, -21402, -41207, -7407, 42421, 37853, -10679, -37381, -24844, 717, 27430, 40856, 16129, -30495, -37400, 5591, 33979, 14735, -11009, -14597, -18381, -25498, -10142, 17370, 13506, -12135, -11581, 12694, 19422, 9028, 12523, 19180, 4252, -13429, -7106, 1038, -11589, -17409, 1362, 11423, -7280, -15804, 6420, 21522, 5510, -10263, -5582, -3399, -9176, -3012, 6222, -7131, -22075, -62, 35137, 30655, -2194, -13290]
236a3290J2072N760R39P592p677l2955j3620L3152L7729j726k6053j5835n205
249a9117N759K6296K1922k1666m5385p114L5453K4013o634p474j201j0309o409
262a1866J8642J9463j2225k3381r08Q499n430k447J3531N225j6544p138J4805
275B26P774j1131j059J5087j174k0074l038J8272N372j2037k862O566k960j522
289b560J4824P387k1729j9696J6386K4393p025k1992o450M621J915J2865J9866
302B2805o070l1745j0822K5052K1822l763j2166j2004j6325k047K9889K8739j4451
315A8914l5733n390K2674J2973p84J45q073k1234o289K1230J5994j0155j1608
328g336N803K518q637M523J6863j121j9528m868J2357J000r368N643J2698o068
$$ y = [-13290, -1218, 4542, 5481, 13073, 5396, -27559, -41179, -8027, 29702, 27976, 1923, -13912, -19117, -13358, 12938, 34860, 13194, -32191, -39305, -3852, 20161, 13527, 6053, 4852, -5457, -11866, 6776, 26239, 14014, -9367, -10275, -1776, -7206, -9653, 3878, 9103, -7441, -14579, 226, 8000, -3131, -4190, 10897, 9723, -10351, -13389, 4883, 10255, -1782, -4644, 1922, -1038, -2560, 12264, 19651, -2078, -21774, -5388, 19005, 11980, -10012, -16462, -11841, -9926, 2939, 22805, 16735, -15010, -25832, -780, 21042, 17279, 5113, -6891, -23216, -25263, 4626, 33365, 18914, -16819, -22209, 465, 13438, 12654, 12799, 4726, -16508, -22797, -1567, 14427, 4272, -7336, -1533, 985, -7652, -3129, 13734, 12613, -6915, -11783, 574, 1574, -7794, -2151, 10547, 4479]
342D479j4179O789J5529k053j0068J359N19j1044j618J7900M462k2645j2831J7950
356e451J9677l155r510k975o963m547J6065K0260j0105l0109o451J9117J4279
369A0132K592K590p832k2264p130K6609K4269j4059k8971o926Q305O341R626J1563
383A4845p347k1732j859K1577J0463r995n093M623p801j1887Q290J7991l475j5009
397f409J113R685l166m650R920O060j5046j2341Q906R579o168m417Q517r36j0245
412i598N856K1243Q79k1564r703J2809Q950l899j750l302j4665n822K1812K2242
426B3488r097k3581l605J0568M302N073Q037q940k6814p292K5180K1283n821j3452
440f71l806k041j18J4948J5157j1853k5383l184J5387L745n227N535M645j1808
$$ y = [4479, -9700, -2911, 12618, 10565, 497, 1856, 2375, -8669, -10287, 7613, 12075, -10570, -23401, -5451, 14226, 11071, 1561, -1414, -8377, -12924, 3141, 23401, 13296, -16813, -23264, -4147, 10132, 12724, 15314, 7482, -14782, -21912, 4697, 28966, 14907, -14064, -20990, -12685, -6344, 3282, 14845, 7498, -14234, -16093, 5484, 15947, 5952, 859, 5482, -2319, -14206, -5916, 12075, 8600, -6409, -5296, 4389, 1223, -3427, 6493, 12553, -2493, -14834, -5928, 3651, -2517, -6934, 1583, 647, -9598, -3742, 17501, 18380, -3184, -12887, -78, 8872, 4973, 3223, -79, -14744, -20566, 1246, 23488, 14391, -9190, -12795, -2227, 2075, 7148, 15185, 6245, -20569, -27861, -2681, 18602, 12781, -671, -4477, -6518, -6636, 8312, 23469, 11616, -13767, -16951, -1564, 2181, -3046, 2489, 7134, -4674]
454d674q779J3843J5393o547j1333J798O64r240L02J3920J278j5598m250J4226
468A003O607o251J434O692p499j2913Q281J6320n638j9066k786J0933L742K588
482C447R215k591j9868o040K1781J5561j3076j9183l076J159K72J2701J6480o876
496I906k3648k615K0974J2800l474m973n679j5846o111J8254J8072j0207j8058
509a0605J174J0402k3P87J0103n79j8802r591J1310Q748n935k173O426l064q228
524a0050R414J7084k011j5841k060R499j338o622L796L391j2054q231J2660J3748
538A1385p178j1602K124L822k367N681J1086p326k2455k665K0868J2923p847p438
552i89n40m834l39J6733J5443j1617k3320m322J0307L734J308M801n710j8818
$$ y = [-4674, -13453, 390, 15783, 9236, -2097, -299, 365, -8875, -8573, 5347, 6625, -8973, -13223, 1003, 7610, 1359, 2793, 9485, 1986, -10927, -2646, 13674, 8036, -11030, -13816, -2883, 859, 3447, 12662, 10071, -9797, -15837, 5944, 21505, 8429, -10754, -13830, -12671, -12399, 302, 16782, 9906, -13742, -16357, 4617, 17417, 13943, 8970, 3291, -12555, -18666, -412, 17660, 7453, -10605, -9431, 971, 948, 1735, 11838, 11259, -7543, -17134, -5824, 2924, -3011, -5184, 1242, -1822, -10050, -636, 16448, 14437, -1404, -3464, 6035, 4697, -1925, 1871, 5262, -6792, -15023, -2363, 11385, 4207, -7395, -5271, -1449, -3816, 1865, 12951, 5625, -16830, -19495, 1373, 14296, 6449, -989, -1529, -6363, -6702, 10031, 25474, 13857, -9463, -13785, -3478, 256, 1564, 6365, 655, -18163]
566a8163k868K1859J7666p555j2136O87j599o430N763J3526l632j7743l162J2956
580h31N452j033N759M870j2094j1124Q641J1514q340j3463J916N708l217J088
594e154J1393K041j2889l530J3482N715j0347o847K782k062l408J1075J3626q211
608G666j8087R30J6726N775n290k633n862j3241j682J9157J2497j1814j5249N2
622a1055N706J981Q456J1206p335k0926l788J7565J0955n817m274k145q703n806
636a3980J2516J4725n024j3480j10O829j118kR136L89j6068r202J1200R672n566
651h3m051N442O07n713M469J0438m299j5271n67J0995Q16p543J799M906m487k288
667d830J3629R923j1494j6017J243P660j1l10L463o600j3494L153K0369J0105
$$ y = [-18163, -21031, 828, 18494, 10939, -1197, -510, -2109, -8539, -2776, 10750, 7118, -10625, -13787, -831, 4621, 3588, 9347, 14217, 2123, -9001, -360, 11154, 2814, -10649, -8733, -3025, -6242, -5154, 6239, 8280, -4609, -8139, 5343, 11058, 711, -6136, -3354, -5416, -8824, 2251, 15877, 7666, -10421, -9491, 7235, 13010, 7720, 5087, -775, -14016, -15698, 3459, 15956, 4142, -11107, -11055, -5349, -3368, 5088, 16294, 8959, -11967, -15755, 1810, 12765, 6948, 2674, 529, -8174, -13980, -1464, 13261, 8237, -5243, -5353, 1476, 358, 356, 9492, 9881, -6187, -15389, -4189, 5483, -83, -4134, 1308, 1915, -3798, 671, 11109, 6810, -8461, -9028, 1967, 2783, -4760, -2961, 1945, -2542, -4830, 8799, 18722, 7228, -8789, -7546, 114, 103, -207, 3256, -3344, -16838, -13685, 6684, 16789]
681A6789r384q950o29k831k693J1736J2625r670j9005j594J3269O488m53K272
695G970m201j4066n414J4109J2675n825r106J338P30l236N313J2709k097j5777
709d878m950J0086M260m905J012L302o311p529P566R167o401j0627L898Q870j159
724A401k497O151K015q256j705J1916M921j2803r416L116J891j163N988P544q415
739F88j4609L165J6029M213p416l629j717p320j307J5888J2848p803j3371l44
753d685O106J616L557O183p028j7447m232J4593R286m330l432K66n286n645Q203
768b275J2024m449j3555j614P206J584J10O831K566r136m927R645P398p071p197
783b860L738L212n030p8O466k922j1057j9J0226J360q595l050L061j627j20J1660
$$ y = [16789, 7405, -1545, -2174, -5005, -7698, 4038, 16663, 6993, -12012, -13606, -337, 6151, 5698, 7970, 3769, -10297, -15711, -1602, 11073, 5248, -3858, -2520, -1790, -5026, 287, 12996, 10899, -4878, -9828, 258, 4518, -387, 625, 3927, -2384, -9913, -2347, 6820, 419, -10208, -6310, 2560, 1401, -1096, 5055, 7070, -1186, -2891, 9025, 13946, 1143, -8273, -5157, -3266, -4429, 1559, 9103, 688, -13921, -10756, 5273, 9486, 2070, -1559, -3276, -10596, -11903, 3985, 16833, 9030, -4341, -4685, 1421, 3037, 6594, 12777, 5749, -11698, -15930, -1337, 7949, 3619, 187, 453, -4833, -10478, -2275, 9749, 5300, -8255, -9869, -2663, -1079, -969, 5862, 8428, -708, -5635, 4010, 11408, 4337, -2860, 878, 4090, -940, -1018, 5448, 2526, -8531, -8550, 1676, 3036, -5559, -8609, -5548, -7175, -7295, 4365]
799D365Q682r318j1354M407J1138J545k803J380m057j1519j018J4423P872r367
813D376j0677j200j267j112Q295R416o774j5145j00J3088P125p70K483J19r772
828a915n797J1402J0614n374j0354m99K207l463J685Q290j226j2321m763Q803
842b711M110n929q31M675n93m266N752Q029m581q720L187Q451j074m922J658J220
858C455o363j419J1248N617j1068j0500K723N017o97K118M113n844j2007K492
872a1115J4455N866n241l920m26n566o32J1326J0280p988j3495K01P730K090N62
887D127M432l234j3590m623J0943Q091n084m781J668j950m423O623J0692j929
901F962j1289q44P969Q45l554K489L274o817m449P368O065o854p629M104N031
$$ y = [4365, 13047, 3729, -7625, -3218, 7920, 9465, 6662, 8042, 3985, -7534, -8552, 5871, 13743, 4376, -6301, -7501, -8768, -9880, -1585, 7831, 1057, -14088, -14188, -1100, 6025, 5255, 7738, 7857, -1915, -7712, 3690, 14304, 8930, -1424, -1923, 284, -3179, -1494, 6796, 5570, -6751, -11514, -2711, 1399, -4530, -5361, -686, -1279, -5545, 207, 8236, 3655, -5065, -1878, 6573, 5499, 577, 2235, 3455, -2908, -4327, 6921, 12538, 1470, -9030, -6307, -1290, -1987, 131, 4244, -1600, -13607, -11115, 3340, 9206, 3965, 45, -381, -5947, -6579, 4747, 15027, 7039, -6456, -6255, 1475, 3565, 4127, 8559, 5325, -8265, -12888, -1945, 6146, 1062, -3719, -2051, -4001, -8424, -1801, 8891, 6962, -4327, -5171, 2798, 3643, 89, 2578, 5852, -965, -5414, 1954, 8019, 1165, -6464, -2360, 2671]
916B671l479j226M723j427r225Q27J1810L715q660n331L054J128n60P093N762
931A0875q320j1811L120J0655J606l318j23k643r073q11J3499P954p874r786R88
946e062K968m72M489P645m839j3126k202J0349N452l121K02J253o400n000P775
961h9R574m582r334L26M299j838p52O384J020q680l036R150M562p234l974M330
977A26Q14m114K194O331l945r411K806J0448R52o337q94J132m277l32R520N649
993A0662j0064r478M200O796P7M69L498m558j1144O84J2848N401o929n330J61
1008b707k214j559Q598Q261o169j0997M46P465J498j037L897j99r986m263R147
1023A81P546n004n581K128M08m159L126P894k072r824l56P884R49n652N36L888
$$ y = [2671, -808, -2034, 2689, 1262, -7963, -7136, 4674, 8389, -271, -5602, -2548, -1420, -1980, 5113, 10875, 2555, -9256, -6136, 4519, 6125, 2807, 2684, 41, -9032, -9843, 3656, 11610, 3736, -6050, -5062, -2094, -2566, 1923, 9568, 4729, -8397, -10599, -250, 5202, 2081, 2283, 3536, -2864, -7864, -89, 9485, 4903, -4431, -4105, 194, -1644, -2396, 3988, 5008, -3672, -6708, 2442, 7004, -230, -4204, 126, 940, -3174, -980, 5351, 1406, -8005, -5199, 5249, 6201, -136, -1030, 102, -4175, -4507, 5013, 10662, 598, -8880, -4680, 2116, 2193, 2662, 6160, 1602, -9542, -8858, 3990, 9391, 2462, -2868, -2707, -4921, -6480, 2118, 10379, 4210, -6787, -6341, 1124, 2622, 1585, 5482, 5283, -4703, -8966, 181, 7727, 2723, -2858, -730, -322, -4481, -1355, 6539, 4467, -5357, -5713, 2171, 3120, -2532, -1996, 1892]
1039A892l422l050O332O276o685p546M143O562j492l097K498j960p191J080J1324
1054E664L316r651o399M104K335j371M489N139o977j0863K525J1111K550m117
1068A855l3n24o142j461J0134P422p372r200J957K900j660J883O342k059j0980
1083f938j756Q991M170m161r00K692l637m522O071Q256m582q299J569O427j643
1098A738k773L505R56o580j742P755L183p465n113M264L560k634J455L998l855
1113B52q046L081J1031J472p792k767J965j688n41P283M908q501q668L149P041
1128B179kn72K447k892q896l4J0867M385o334l950J957q99k603N279P244l968
1144D208r798K57O523R66k470L031Q47p076l457P933O172n482n602L035K390k909
$$ y = [1892, -1530, -4580, 1752, 8028, 1343, -6203, -2060, 4502, 3010, -87, 2411, 451, -6740, -5660, 5664, 8980, -671, -7070, -2966, -631, -2002, 2487, 7626, 649, -10214, -7689, 3422, 5972, 1855, 1822, 1298, -4844, -6305, 3829, 11251, 3879, -5321, -3364, -464, -2124, -241, 6101, 4042, -6938, -8694, 297, 4467, 306, -594, 2098, -1539, -6061, 10, 8266, 3684, -4615, -3046, 3381, 1738, -1035, 2470, 3426, -3154, -4896, 2859, 6042, -1423, -6536, -2272, 1288, -1346, 109, 4107, 252, -7794, -4713, 6318, 7790, -2, -2769, -804, -2492, -3033, 4250, 9158, 657, -8011, -4862, 2179, 2177, 1605, 4052, 1160, -7736, -7770, 3097, 7482, 1148, -2802, -845, -1744, -4347, 932, 8176, 4208, -5590, -5333, 1190, 2156, -314, 2717, 3564, -3512, -6969, 964, 7136, 1654, -3948, -913, 1477, -1432]
1160a432L46N411j275p775K02Q241J329p107k010M281r07k090M832M133o723p482
1176h026M928Q517p41m878M32k51n072J428Q997L098q193o117L633K794j388K323
1192A484M316m878r321J215R536K378m071l51Q73m964k501P872O613m947p344
1207d090J818L807j531K41N349j032q603k204P148L408n147k174L018r99l582
1222d573L618N482l301o857K690P401j271m503J296K379l290p59O748K685q018
1237b73n657M373M494k248j249K154l600o424K582R926J218o814k318K669m10
1252a577j331O550N034o233p657K620O468Q3j736J509j361p348j822P689M608
1267E496n306m416J633K78k784L790O687k210p946K24O869J227l010J374K393
$$ y = [-1432, -1086, 4325, 3050, -4725, -4523, 3718, 5047, -2060, -4070, 211, -696, -2786, 2046, 6179, -544, -8026, -3098, 5419, 4678, -200, 232, -19, -5091, -3663, 5334, 8432, 239, -5878, -2245, 549, -839, 1484, 5800, 922, -8399, -7184, 2352, 4730, 659, 308, 1181, -3783, -6284, 1588, 8201, 3254, -4090, -2272, 1535, 4, 245, 5594, 4562, -4041, -6245, 903, 4311, -836, -3010, 8, -991, -4573, -955, 4527, 1226, -5631, -2941, 4460, 3189, -1314, -18, 2361, -929, -1688, 5060, 7745, -273, -5930, -1557, 2937, 689, -560, 1594, -2006, -8430, -5848, 4078, 5296, -1518, -3836, -1167, -1577, -2908, 3642, 8676, 2443, -5214, -2594, 3874, 3957, 2221, 3730, 2369, -4979, -6801, 888, 5496, 190, -4226, -2593, -2315, -5099, -1309, 5378, 3168, -4778, -4554, 2315, 3542, 532, 1906, 4299]
1282D299l714l376M876M199n319n793L542L914l394j792K659k74n180R50P031
1297B628J312o610k442M546K173j320K734L127n297o101L958P662o26n599n07
1312c62M20m645n23P430L492p107n835L033L645r78J939M698k934p937K17Q891
1328C444K859m045j032J382l503k944N188N575l772p696Q94M332k040j148L520
1343A014Q00n739j562O688L056m770k647M614J268l185N04M161k187n218J909
1358a294O606j087o141q58K785j655j397M831K032o238n265M786N912r67k177
1373a27J839j359n129J115Q273K593o280l596K077j22j510M179M518m862p944
1388f335J277O306N19k230J814J19n738j785O982N076m406m533K510J623k811
$$ y = [4299, 585, -2791, 2085, 6284, 965, -4828, -1286, 2628, -766, -2558, 101, -173, -5353, -4403, 2628, 3940, -2670, -5112, -566, 1607, 287, 3021, 6148, 851, -5250, -1292, 6370, 5744, 145, -362, 58, -4587, -5110, 2320, 5812, -1295, -7130, -4097, -452, -1430, 509, 5207, 2273, -5664, -5447, 3444, 6303, 2258, 1226, 2608, -895, -3839, 1349, 6924, 3152, -4544, -3650, 682, -1358, -2506, 1014, 1814, -3925, -5487, 1201, 4257, -513, -3160, 1454, 2722, -463, 41, 4202, 2015, -3203, -1294, 5312, 4225, -1916, -2774, 11, -1644, -3041, 1790, 3822, -2416, -7681, -2895, 3017, 2050, -127, 1712, 353, -4776, -3661, 4612, 7205, 925, -2671, -594, -716, -2226, 1953, 6471, 1609, -6335, -5058, 1248, 1767, -463, 1351, 1470, -4268, -6053, 929, 6005, 1599, -2934, -424, 1199, -1612]
1403a612J210M937p98p061p5O155P11n161l50L695j753l234L353L458l865m834
1419e224M006N215k158l693J972R40l627K16O390J233p054l494M345K926j709
1434B84O63K621l904n972K418P865N55m685p74J214k675j133O525L992n654o662
1450e322K037L913q27P0L678j682p046n68P434L096m295j840K652j523k959L462
1466B80N165k353o212J078M594j248l087K101J786m216j833N023K363n133k875
1481d567M868K609l104j109L251p96m758J894P158m54o591j037L315j17j758L420
1497B224K609n977n714L759O100j368k557J260j41n146M69P796K924n923l937
1512c622K653J367j472K661M632l519p058O76N778O22l217M66J259l722k739M987
$$ y = [-1612, -402, 4535, 3737, -3324, -3399, 2756, 3467, -1694, -2044, 1651, -102, -3336, 17, 3475, -390, -5224, -1218, 3997, 1839, -1854, 118, 1058, -2569, -2353, 4037, 5270, -1784, -5278, -933, 1993, 284, 947, 3568, -336, -6308, -3890, 3975, 4530, -155, -929, 285, -2390, -3523, 3002, 6994, 1340, -5322, -3285, 628, -199, -129, 3549, 1867, -5179, -5747, 1687, 4783, 488, -1352, 1300, -223, -3182, 280, 5445, 3092, -3120, -2042, 2552, 1304, -1783, 318, 2104, -2112, -3945, 1078, 3441, -1692, -4567, 301, 2910, -194, -1303, 1948, 1152, -3606, -1712, 5446, 4992, -1599, -2636, 679, 562, -1196, 2224, 4833, -1144, -6858, -3099, 3001, 1633, -924, 336, 195, -4951, -4482, 3314, 6238, 315, -3622, -969, 398, -1074, 1587, 6219, 2700, -4358, -3682, 2096, 2718, -499, -33, 1226, -2496, -5235, -248]
1528b48M235l538m189K850K217k375m43L756M69m592k21N212O30m891p01M045
1544B216l80l344J330K766l272n070L773N322j522m488R75J593k195O6N611J614
1560D995o013l783M386L590j441m18K491l186n857J653P055J021n087j597J874
1575c17k093j353N016M128m471o011K077M450k95j336L008M9n770j030N739K690
1591D481m155k283K944l13l531J852M480j924m681J124M608j601l771J627K530
1606A387j918j863L234K498m481k730M328L204k812j820K323p00l623J374N992
1621D393j81o044j725L354Q54j640K412K380m321m891K249O160l69k896Q64P3
1637F72l610o54O284K614m510l901K377J394j793J418L804j938o141K33N365P56
$$ y = [-248, 3987, 449, -3740, -890, 1327, -1048, -1491, 2265, 2734, -1858, -2079, 3133, 3763, -1128, -1829, 2216, 1836, -1508, -178, 2588, -684, -5754, -1981, 3341, 1819, -2669, -1694, -101, -2296, -2230, 3381, 4995, -1018, -4801, -415, 3175, 1734, 1316, 3807, 621, -5236, -3583, 3472, 4493, -594, -2191, -317, -2410, -3763, 1253, 5381, 910, -5101, -3024, 1426, 1131, -205, 2803, 2852, -2918, -3948, 1791, 4481, 326, -1957, 987, 674, -2857, -1005, 3475, 1551, -3130, -2006, 2602, 1001, -2770, -1143, 1387, -531, -2394, 840, 3338, -1143, -3873, 455, 3659, 847, -973, 1350, 650, -2973, -1599, 4393, 4212, -1832, -3557, -203, 651, -989, 1423, 3803, -518, -5409, -3160, 3000, 2631, -265, 599, 672, -2938, -3592, 2692, 5306, 796, -3105, -728, 666, -1127, 291, 4095, 2157, -3984, -3751, 1614, 2370]
1653B370l421O85K301k686k562L538L509l139l495K406L066k627j916K979J202
1668B210m057l7M164P79m956j055L757J162k832K85K368k163l494K845N262j777
1684B461m212j98K086j546p20M427J737m905l814L387L578j036j006K251j585
1699I05m672M43O000J491m281j606J545j056j263L178L443l108m842J100M235
1714A512m70k020K183J231l782j630M679J796l759k224K973J135k874l46L524
1729A928j028l341Q06M263j119m486Q75L278q16j769K367J734l763k619L769L800
1745C879k723k625J238Q78l047L78M685J124n239j945L085J074j673J655K397
1760C141k401n073J689N260Q5k650L29O98k843j249M391L301m169l476J402K523
$$ y = [2370, -1051, -366, 1935, -751, -3313, 225, 3734, 595, -2900, -494, 2572, -55, -1971, 1008, 2210, -1847, -1884, 2280, 3059, -1897, -2952, 805, 1967, -865, -580, 1788, -375, -3869, -1024, 4238, 2461, -1751, -1949, 137, -1409, -2129, 2298, 4035, -870, -4684, -1297, 2281, 1245, 239, 2490, 905, -3767, -3324, 2676, 4167, -114, -1720, -175, -1231, -2494, 684, 4127, 1019, -3823, -2723, 1512, 1042, -978, 1205, 2436, -1346, -2976, 1703, 3499, -260, -2484, 489, 1624, -1250, -1596, 1928, 900, -2441, -1635, 2628, 1509, -2977, -2102, 1176, 360, -1409, 958, 2692, -1071, -3690, 79, 3879, 1156, -1469, -231, 647, -2400, -2022, 2663, 3787, -1452, -3397, -312, 762, -911, 744, 3141, 740, -4333, -2644, 2616, 2701, 51, 380, 1078, -1765, -3014, 1377, 4678, 509, -2967, -1565, 958]
1776I58j701L31K898r58m614n5M783Q66l718l66L354r62k401J499K800k486k580
1793b352K351L436k985l194J958J797j575q86K595O21m113j298M400J850k662
1808e7q40K322o33l346J553M535q95m182J18J904j309j508L471K642l831l987
1824d043J928L483r79k36J569p15m268r9N468K075l643k315J674M5j273J771L144
1841C586k168m800J004M262m94k713J053J706k179j187K467J408l026j987L896
1856H28J862k745j925K066Q09k112N77L440j162m066K36L930K30k556Q33J213
1872A458j847l082K487K781j392k513J595J396k922l19M185K251l947k747K091
1887e25J429j108J379K684k363n039M74M510J380k849j074P73k354o83L978K954
$$ y = [958, -743, -412, 2486, 1528, -3086, -3141, 1642, 2508, -1210, -1576, 1778, 816, -1585, -86, 2714, 228, -2352, -1, 3435, 450, -2744, -786, 1011, -564, -1450, 1145, 1766, -2347, -3645, 755, 2605, -57, -897, 1425, 792, -2554, -1001, 3534, 2639, -1543, -1425, 479, -830, -2338, 1133, 3775, -56, -4043, -2115, 1368, 389, 153, 1722, 1007, -3261, -3360, 2108, 4183, 540, -1775, -101, -56, -1329, 442, 3586, 1418, -3382, -2378, 1884, 1390, -1323, -270, 1436, -743, -1930, 537, 1945, -1081, -3068, 828, 2690, -55, -1980, 86, 895, -1217, -640, 2800, 1638, -2428, -2192, 1738, 1968, -588, 245, 1458, -389, -3471, -984, 1797, 405, -2108, -513, 883, -2039, -2358, 1827, 4078, 131, -2616, -525, 904, -204, 1175, 3859, 1496, -3543, -3069, 1441, 2821, -28, -1102, -329, -2683, -3366, 612, 3566]
1903C566l336l340K199K918j034j322J593L23l036k0L333N2l627l40L802L00l198
1920a167nJ668j262j462K321K765k256l698K089L215j157j846J643P75l068j281
1936b726K779J846k476m01K842n75l120J13M099P13l055j264J286j284p64L513
1952A526K790l056n339J170L605O38j455P24j088k529M07M930K189l506k827K481
1968F60Q01j453N4J723j261l266J558L298j100m040J197L125o28k109N71J111
1984B41j580q03L874J675l046k308K623J733k209n62J456n14k650M6L165j61k638
2001a658J126K393r70l670P34L030L74k195N93P25k814k26N167K170l814l994
2017c029R28K350j15N00J755j879m052J369N227P43l818j477J209n50p05J087
$$ y = [3566, 230, -3110, -911, 2007, 973, -349, 1244, 1567, -1469, -1489, 1844, 1896, -1731, -2071, 1731, 2031, -1167, -1172, 496, -766, -2228, 93, 2858, 602, -3096, -1007, 2208, 1051, -795, 848, 1623, -1445, -2726, 53, 1899, -577, -978, 1864, 1289, -1831, -1718, 2381, 3094, 39, -1225, 61, -1223, -1987, 1526, 4316, 1260, -4079, -2909, 696, 1334, -121, 603, -485, -3014, -2607, 2323, 4512, 1006, -1821, 660, 1461, 8, 62, 1785, 524, -2742, -1184, 2114, 1014, -3026, -1829, 1296, 668, -1441, -870, 241, -1339, -2142, 1732, 3407, 361, -1947, 676, 2409, 200, -362, 1094, 580, -2070, -2024, 1141, 980, -1658, -532, 1861, 891, -2779, -2045, 985, 1359, -836, -243, 482, -2332, -2558, 2609, 4779, 965, -3029, -2101, 249, 134, 634, 2389, 510, -3542, -2173, 3054, 3797, -21, -1498, -289, -839, -1544, -457]
2033d57J595k641j844L416K794k509k346J664J871p52j248J695k00k684O73M110
2049C137K99m078j722K596K89j656J09J664j731j801J708L066j412j991K006K484
2065B967k116k868J442J797o82mJ831j171m116l4N066J660l915k786Q35J98K31
2082a665K861K239l710l637J996M747J68l003k82K60j371N00L002K00l711r29
2098b335L717J648k991k147J741O42j506J032J506j447k779K274M093q53l968
2113a373j39J791k77q10J608R24k565j244K864J687k477j906K535J428k134j508
2129a596J104K7r04J783K613k275m556J033M545Q57k186j001k90j141L82M411
2145B806J479m280l471J912L325l88j450R3p09k096J745L564p37l770r2L490L67
$$ y = [-457, 1138, -1503, -3347, 69, 2863, 354, -1992, -328, 1543, 791, -457, 1238, 1038, -1646, -973, 3137, 3436, -642, -2364, 232, 521, -1135, -1026, 638, -1093, -2894, -1186, 1880, 468, -1523, 483, 2967, 851, -2017, -575, 1222, 540, 536, 2367, 1196, -2920, -2954, 2112, 3772, -143, -2929, -2094, -1896, -1665, 1196, 3435, -275, -3912, -1916, 2831, 2999, -4, -286, -26, -1397, -897, 2105, 2305, -1406, -2335, 1382, 3030, 39, -2108, -367, 275, -1231, -199, 1307, -140, -2919, -645, 3448, 2595, -1373, -1512, 279, 2, -808, 800, 1724, -841, -2085, 779, 2466, -11, -1917, 618, 2046, -88, -1596, -492, -465, -1369, 414, 3027, 752, -3804, -2771, 1774, 2631, 445, -556, -846, -1987, -1605, 2806, 4285, 5, -3466, -1554, 1771, 1383, -67, 26, -683, -2779, -1034, 2530, 1793, -1977, -2069, 1421, 1788]
2162A788k476o05J270k34l42J886J165k723k602K777L345j623l059M38J064j117
2178a048M71K198k60l505k09L835P94k898p79J952L17j383m9J140j421j117L178
2195A216K669l379l760J135L373O91j189J39j556k356J205M622J386m530k975
2210c309K126K229l85L85M03k100k425K347L452j589l344R11K658n04j317M82
2226B0L44j592L16L128J86l768j945L308K137j658j094K24k63q22J588K081r37
2243A253l560Q61K966l1k301K48J294m99n10J193J52k724o18L711J822k822l048
2260b613J055J826K58O05Q37k818k650J803M645P14l893j879J326L31L66J459
2276A372N09k973k041K973K693j727k156M84J765p05l96Q13n67k121Q73L381j82
$$ y = [1788, -688, -1293, -23, -257, -599, 1287, 2452, -271, -2873, -96, 3249, 1626, -1433, -995, 69, -1048, -577, 1621, 1361, -2144, -2353, 1482, 2276, -622, -1401, 551, 868, -515, -564, 576, -845, -1962, 1216, 3885, 506, -3254, -2119, 1254, 1945, 756, 895, -661, -3017, -1812, 2810, 4196, -334, -3309, -1183, 1046, 661, 1046, 1449, -651, -3076, -729, 2723, 1134, -2210, -1299, 1359, 855, -462, 20, 364, -1228, -912, 2216, 2402, -1366, -3311, -3, 2134, 476, -618, -394, -657, -1479, 109, 2190, 1253, -2307, -1446, 1520, 1489, -812, -564, 730, 231, -279, 914, 1066, -1658, -2276, 1435, 3257, 435, -2613, -1558, 268, 526, 1131, 1968, -850, -3500, -1697, 2948, 3662, -231, -2110, -784, -453, -87, 1372, 1881, -1092, -3133, -160, 2533, 806, -1350, -866, 899, 194, -202, 611, 44, -2077, -1204, 2177, 1995]
2293A995l676r64K862J412q65oj71j389j395K301K322k064k981J808J968l96j429
2310f68N63O91j488L53K039p25l232J0L921J096k170j791R33J53l5K332J103l512
2328d27l608K187L953M65k754r88L69o62P01K729L64l803j514L341K047k053j572
2345a225J321L88q23O04J258j928j833J518L107o36l452J01J760L81m82J098k33
2362I24k882n86L296K116k275k544J698J217o87m26Q90p35j630J110K456r78l019
2379b055K58L042O91j453n04l79r17J86L239Q95l743k559J996L055r4j399J88
2396D47r96j903J335L400l74l506n23K282R74j277j48Q95p21n61J367J015k116
2413d10k169K282K780j436k334N17O89m52O46J414o52l265L93L247J034k434r30
$$ y = [1995, -1681, -2645, 217, 1629, 764, 758, 587, -802, -2197, 104, 2426, 362, -2619, -811, 1157, 761, -668, -105, 586, -902, -549, 1490, 765, -2467, -2457, 1464, 2560, 390, -1401, -468, -315, -350, 1982, 3085, -427, -4035, -1848, 2105, 2570, -184, -1172, -803, -1465, -764, 1965, 2329, -1474, -2988, 353, 2400, 347, -1225, 96, 484, -339, 265, 1523, -405, -2238, -720, 2387, 1751, -1701, -1600, 160, 541, 59, 1157, 924, -1958, -2544, 752, 2868, 593, -1951, -253, 964, 277, -149, 741, 6, -1624, -514, 1942, 964, -2055, -1797, 1245, 1936, 483, -21, -400, -1317, -1131, 2108, 3003, -740, -3299, -1303, 1752, 1658, 259, 447, -549, -2452, -1117, 2283, 1909, -1597, -2120, 162, 1136, -141, -289, 606, -115, -676, 691, 1706, -410, -2579, -297, 2483, 1047, -1287, -770, -81, -533, 113, 1527, 875, -2390, -1997, 1250, 2284, -150, -1080]
2430a080J114J73r09P89J005j703j258J961K151j717k618J237K238l65j026M44
2446D36r65j749P43L785Q41l590k037J851J612k35R9L71j931j994K311K811n13
2463A846l095LJ743R8r38P31K81j566l52K296L37k700o89K350J521j564r23L66
2481b55J31j086J669K139j685k981L32K827J96j378l24N42r70n44K168O82k677
2498a214n37K406J416j772k291J810R21n64P05P67j827k225J512L389k31k905
2514f40j395R80N59J2J851J98k735j535K565K212j087j799M42R32p82J01J663
2531A542l37k595R65K008m39k650l86J932N47j290J98O61j208m36K504J800k156
2548F60k393Q31K176p19q73Q52n1j778J82K571m1k617p23K407N56j845n04J453
$$ y = [-1080, 34, 207, -702, 87, 1092, -611, -1869, 92, 2243, 526, -2092, -855, 1383, 1018, -8, 436, -529, -2278, -1535, 2250, 3091, -499, -2536, -685, 927, 692, 791, 1162, -769, -2763, -452, 2359, 1846, -1249, -1246, 497, 595, -343, 388, 669, -897, -1249, 1047, 1384, -1316, -2005, 345, 1866, 302, -621, -255, -124, -1210, 459, 2598, 913, -2068, -1736, 1091, 1287, -91, -415, 127, -843, -1387, 781, 1463, -1214, -1751, 655, 2071, 299, -1992, -182, 739, 175, 880, 1647, -180, -2405, -893, 2496, 2265, -640, -2035, -1055, -496, -484, 1367, 1565, -1170, -2705, -140, 2072, 985, -814, -372, 560, -222, -121, 1542, 1205, -1390, -425, 1583, 1144, -1506, -1892, 40, 587, -703, -505, 156, -1052, -1488, 1016, 2816, 660, -1733, -902, 1274, 555, -318, 534, 483, -1295, -1113, 1458, 1417, -1200, -1923, 484, 1040, -805, -1309, 144]
2566A44n4k49J245P65j888k354J759L103q17k626k05Q05p04P39K345n7l256q73
2584b178K159J639j766l04J052o80j039J014J615p54j936Q93J719q39k563R28
2600a040J786n70l79J114J16j989n88L131P20k483j506J092P63j203O17J598p39
2617D40k206J366J962n10k274N28K059p15j503R80N35o64k37J677N18k715j893
2634b652J552K153q42j116N22l62p55J471K322m80k725j89J995Q7j065L31R98
2651A245j405r86J397J241j661j342J221J032j710n70J224O95o20L79J279m56
2667I63k246K20K557J91k327j52J255l47r95J204J071j602j623R81J676j435j460
2684b069J788J123j213m85J379L18j416K48J881R1k833o87J670Q16p88K82P02
$$ y = [144, 90, -159, 1086, 1851, -37, -2391, -632, 2471, 1654, -972, -1177, -372, -1076, -337, 2008, 1951, -1305, -2178, -19, 1620, -146, -450, 602, -78, -1117, -103, 1512, 758, -1178, -285, 1434, 595, -1968, -1040, 746, 176, -203, 911, 1027, -962, -1550, 1581, 2301, -182, -1688, -596, 167, -1036, -419, 1179, 440, -1766, -400, 1562, 1052, -1222, -694, 1365, 650, -853, 127, 662, -2, -239, 1438, 1956, -759, -2652, -1100, 1053, 211, -905, -383, -745, -1500, -29, 2293, 1813, -912, -1101, 894, 981, -84, 247, 1245, -160, -1146, 251, 1492, -169, -1511, -290, 742, -968, -1538, -314, 381, -239, 140, 1419, 963, -1283, -1063, 1494, 1685, -642, -794, 461, 114, -881, 323, 1394, -208, -1831, -850, 826, -609, -2069, -281, 842, -371, -856, 523, 841, -575, -327, 1554, 1645, -1188, -1875, -205, 611, -177, 105, 807]
2701H07j005j452J744K107j345k137J59J134l49p72J610L45j643RJ336O86j489
2718b55q44J635K14j765J28J699%j236O02J714j396j766J98K241n43j592Q12M01
2736B47j087l33J727R98j469j567J606R29j613m36J604K04j436N63J177o22j668
2753a176J164J739r80k240K65J601j21m83P77N02j854q94J856J200j295j107Q48
2770a98N29j104L80J785j43j750k27J292J73j872L15J692k54j754N21J495p16
2787A64r53J419O93j457j342P33J479j049m42J137j07j417L33J957K6j671n56
2804a053J868j44j660L76J971q77j383R44J029r76j551J622J157p31j958J171
2820a95M93j140K9J612L34k324k36K067O64j148m25Q62l97j425J029J564p93j373
$$ y = [807, -198, -1650, 94, 2201, 856, -1281, -1122, 12, -337, -1109, 501, 846, -797, -788, 548, 1234, -255, -1099, 536, 750, -1015, -887, 812, 812, -424, 178, 1892, 496, -1270, -1072, 1169, 626, -966, -154, 247, -840, -1173, 554, 1552, 83, -1484, 122, 1051, -562, -998, 606, 810, -626, -63, 1114, 492, -1176, -12, 1727, 747, -1493, -1228, 373, 252, -231, 546, 1048, -806, -1700, 156, 1356, 61, -1046, -198, 331, -773, -393, 1392, 1249, -501, -728, 564, 737, -1135, -820, 872, 618, -1136, -615, 880, 164, -789, 630, 1323, -134, -1476, -743, 736, -313, -755, 382, 275, -1142, -809, 1148, 1174, -497, -1053, 815, 671, -989, -613, 1358, 481, -902, 42, 1071, 95, -1456, 166, 1323, 592, -1366, -195, 298, -842, -813, 799, 1133, -1191, -1427, 640, 1304, 156, -269, 593, 196, -1229, -200, 1364, 571, -802]
2838h02L95R28q20j162J461O61o64j229J290P43j370q5J743L18j582q99J627J70
2856G23j311M57J655j214j731L91K022p19j384N03J159p70q62J115J212q56j015
2873f25J109O75j072r63J495L75j206r03J419j54j234P23J303j25k072O6J905
2890G16l2j276R58Q33j256j490J404J341j024q66R07M17j033l79J110L80j614
2907i04M3J371J05j517M56J695k14j942K97J570o18q34M97J339j413j099Q15J352
2925I99j062n87Q04M93j331m47J685K71j145k36J042R6j503j32K080o95r81q8
2943g37J171m78r51J119J394p07j830O11J159q73o76J403L17j594n93J704O28
2960A067j563l0J202j18j720L88J511j43j091K15J213n22j494J149J325r83j431
$$ y = [-802, -407, 521, -299, -1461, 0, 661, -3, -1232, 58, 801, -569, -654, 1089, 1407, -175, -1074, 553, 723, -588, -131, 1524, 310, -1421, -1030, 992, 273, -1111, -608, 551, -219, -1081, 34, 1246, 390, -625, 484, 1159, 87, -876, 619, 994, -212, -1115, 304, 150, -1084, -361, 942, 817, -1255, -1189, 716, 684, -592, 366, 1199, -57, -1547, -143, 1198, 174, -692, 215, 632, -401, -780, 330, 710, -904, -861, 510, 615, -902, -446, 1249, 1035, -907, -610, 960, 342, -492, 5, 1344, -69, -1168, -353, 999, -63, -650, 154, 647, -684, -1131, 554, 825, -320, -556, 486, 582, -921, -1053, 1027, 332, -649, -737, 434, -44, -995, 124, 1518, 811, -1019, -408, 751, -122, -798, 605, 922, -672, -1265, 439, 1067, -496, -526, 676, 558, -1162, -774, 737, 594, -497, -282, 931, 409, -1085, 64, 1389, 406, -1025]
2977a025O76P77r57m13J152Q18j724k5J005P23j366j02J218mj579O1J423K41j317
2996d18P0J197q44j455J267J024q28j037O45Q02r95m51J609Q17j401p28R79M69
3014G22j099J27J361m70j636l1J432J07j540O41J340r55j437R98J717p88j057
3031e68O83R01j351l77R46J283j884l68R84J3p44nJ413J69j972J18J114k63q69
3050g77L06J329p22j255O70J177m81r40R07R51j268j305J443J146j266m76J050
3067D89K4j371K57J064L92j672N6R50k14j097J055J244o97j404P20Q53n98m48
3085c97R27O67j685o24R30J076j311OP10J51j561J05J344L11j256JJ093k16j112
3104h41P26J555p48j292N64R95j180o10J150Q25j418o48R14M58j032m04J518J0
$$ y = [-1025, -349, 428, -529, -942, 210, 1028, -696, -721, 284, 1007, -359, -461, 757, 753, -826, -765, 658, 899, -418, -348, 849, 5, -1450, -183, 841, 13, -1024, -379, 423, -572, -1023, 586, 1403, 2, -726, 253, 722, -377, -250, 1111, 641, -995, -1026, 406, 513, -1027, -386, 954, -1, -1438, -440, 1277, 489, -568, 115, 1016, -335, -712, 234, 1517, -367, -735, 249, 262, -482, -487, 926, 1095, -877, -759, 355, 92, -777, -471, 858, 136, -1119, -449, 728, 247, -693, 214, 1165, -103, -1408, 35, 1181, -85, -561, 489, 513, -858, -601, 463, 855, -817, -761, 189, -25, -1122, -67, 1177, 480, -924, -204, 649, 51, -397, 530, 1197, -488, -1112, -182, 894, -417, -411, 299, 450, -1111, -1006, 338, 649, -607, -606, 487, 271, -841, -115, 1440, 692, -600, -36, 959, -221, -831, 319, 1144, -274, -922, -8, 450, -582, -986, 532, 542]
3122E42j420J17J322J1j064M45P25l80j112O12J403p45q75L54M98n35j016J384
3140B66Q91j181r10Q47N38j204j54J719J80j751m2J198K50j236N14J051m83j470
3158i77N7J782l89j366J005M55p39q13J066P45r13o90P07P52j497j74J415N52
3176I78j319k38P93K12j070K36J370n99r42J57J211j047k63P45P14j083j023J278
3194A10Q99j106m28N25L61q00j15J187l2p92j06O96l74q58K90J556n12j385M11
3213d73R04l84q83O41Q79r45n46O87J286j173n00J318n5j473j41J135K69o43l97
3232d94J070n12o98L37J130m56r57K70Q56n05q23Q68J056p69r75R01K10m99q61
3251h51J290L42j305m60J021J12n08j56J347p65j072J86J201L89q45K79L83m78
$$ y = [542, -878, -761, 561, 572, -492, -47, 678, 298, -814, -202, 1201, 456, -419, -65, 433, -102, -1118, 266, 1157, -24, -934, -87, 451, -753, -907, 812, 992, -759, -801, 397, 647, -589, -75, 976, 493, -977, -920, 862, 473, -893, 112, 567, -172, -985, 81, 826, -87, -777, -70, 682, -815, -989, 426, 978, -341, -579, 214, 426, -644, -408, 962, 363, -579, -422, 789, -258, -521, 224, 938, -145, -1168, 110, 1009, -97, -525, 0, 361, -439, -554, 633, 601, -191, -297, 399, 25, -833, -543, 1013, 501, -884, -473, 431, 47, -836, -195, 684, -261, -807, -120, 1166, -7, -507, 811, 756, -717, -858, 277, 546, -97, -494, 576, 64, -634, -297, 833, 377, -580, -310, 546, 41, -782, 86, 1142, 373, -602, 299, 509, 10, -851, 439, 781, -524, -984, 37, 149, -359, -515, 832, 67, -1005, -819, 382, 771, -74, 205, 588, 110]
3269A10o95P14P62n09j082O31M51p80m47J231M99j301n8N00K91p49N8R75j11r55
3289d65J9J012K44j032L41O96j006j129J181N38l42q66Q14L98j064k15J054R81
3307A159j264k25Q63q1r30jJ277l45q40j15R59m32l34N22O28q39j083O90N40J14
3327B63n20N45N58j534j22J182L63p64m10O07L65q48J1J248l20p61j53R98o41
3346F7j003R71M02j48j148N63P43n59m08N52P30j350l31Q83J009j172k11P65L9
3365C94p74J4J158l18j038R2R06m34p94L44J048k32q46K96R00r30k63J256j09
3384F70q93o77J052M01p25k31J063k22j208K28J167k56j087M05O71m48q34P03
3402b21Q99m70r18M62P51p13n59R84O06j049l6O76j11p61q0J169K29j516k88J228
$$ y = [110, -585, 129, 891, 382, -700, -69, 382, -398, -845, 386, 885, -416, -474, 26, 317, -432, -374, 601, 490, -465, -446, 566, 810, -222, 119, 815, -191, -1320, -139, 399, 57, -809, 5, 403, -661, -876, 178, 1159, -105, -330, 533, 452, -478, -479, 798, 453, -387, -502, 457, 25, -309, 213, 841, 2, -1081, -391, 149, 263, -257, 288, 846, -688, -810, 372, 735, -29, -439, 168, 533, -315, -304, 944, 624, -137, -290, 708, 67, -936, 35, 437, 289, -859, -296, 447, -112, -520, 32, 762, -588, -919, -36, 973, -199, -410, 355, 394, -380, -366, 792, 474, -564, -472, 434, 0, -794, -450, 598, 366, -480, -184, 716, -214, -477, 779, 670, -223, -900, 152, 553, -172, -403, 660, 438, -770, -542, 625, 369, -718, -313, 358, -90, -924, -221, 678, 208, -710, -248, 503, -210, -769, 215, 821, -228, -264, 412, 301, -460, -540, 629, 858, -658, -946, 282]
3422B82R3p59P0P12l93o20M08R87l61p24K73L83n84l7L72Q05p06n26L68K54j046
3443g49jR51J41j257L13P11P4o03O46M37l12r02L00R55l47m98J14N26p89n90Q12
3464f8O68q05m44R82j58q07Q4P96J19m03k38N13L2l87K39P45l86j177M11R79p99
3485a04o45Q26O94j057p20J017O97p71l51P19K22r06p8P99Q9p65K1Q35m05o96
3505e79M27O56m03n21j29J205q00l62Q67L16j033l70O85M54q65O6O39J82q49J89
3525b25N62K2p57J41J037k75q64L76N31k84p81M36N48n53q25R15P55r06l77M80
3545d4L13m72p9Q82M36j259m16J016K3o86m8O72j34p32L95M10j18m59L49K99l19
3566B9p56O47P38m17k01J84K25m82k12Q84J81j037j30M87K32o95j17P12k02m48
$$ y = [282, 375, -384, -314, 398, 5, -615, -207, 780, 419, -305, -32, 351, -233, -270, 102, 907, 201, -325, 43, 297, -749, -750, 201, 342, -915, -602, 109, 183, -420, 226, 663, 351, -551, -251, 704, 357, -141, -27, 499, -290, -880, -68, 600, -205, -649, 333, 175, -632, -548, 248, 367, -36, -274, 239, 271, -116, 123, 868, 482, -695, -284, 695, -104, -749, 77, 771, -286, -1006, 11, 708, -63, -414, 305, 527, -379, -457, 342, 431, -334, -313, 522, 117, -579, -152, 504, 101, -420, -549, 656, -144, -506, 361, 677, -356, -726, -41, 413, -452, -386, 253, 435, -414, -225, 337, 359, -398, -257, 780, 505, -359, 17, 548, 264, -517, -81, 467, -86, -911, 4, 759, -147, -524, -44, 269, -203, -282, 600, 1036, -223, -639, 377, 400, -286, -334, 338, 204, -528, -133, 277, 159, -300, 49, 348, 29, -727, -80, 658, 241, 40, 224, 449, -33, -245, 639, 820, -217, -347, 140, 372, -323, -440, 272, 70, -378]
3586c78q1J028n39n75N68M20m48o41O24O00p27J32L90L19j243K72L54N56r83k61
3606f13Q99j86o21J57P23j54l47j62P71k36p30M90P98p78n84O88N84o53k66J06
3626a14L58o64l78J018K36o54k5M21l78l58M16N94k35o65J96K90m71l57Q45P75
3646H50q28q15N43Q48m08m74P33j8o59l41N11L23n07N9O28j53r50M31O92k57n20
3667c12J26M73j98o78R43N33n86n81L79L42p16k56R66K70r13m46L78P68r50j51
3687f09J053l24n45M3L75M07n65J98L48n06m43N87Q38r34l93L66N01n69m9L42
3707A21K74n94j96M55K35m31r1O84j77n90K18L98j75m24L58L98m78n31N42M84
3727D80n11n2k2O17n55p12J229L48q71n41P06q8l67j52J114M8p19l83L72L67o06
$$ y = [-378, -459, 569, 30, -545, 23, 443, -5, -646, -22, 578, -149, -17, 373, 692, -551, -279, 75, 631, -352, -613, 286, 100, -521, -364, 359, 205, -142, -304, 467, 231, -499, -9, 789, 11, -573, 115, 699, 46, -220, -114, 244, -420, -798, 220, 456, -198, -223, 198, -180, -538, -122, 472, 237, -428, -232, 58, -413, -770, 75, 850, 22, -793, -250, 598, 190, -284, 449, 431, -228, -569, -58, 265, -242, -183, 445, 292, -658, -227, 465, 208, -312, -186, 287, 89, -589, 354, 887, 301, -280, 99, 441, -275, -531, 435, 705, -208, -654, -276, 492, -458, -609, 444, 120, -425, -382, -7, 400, -165, 33, 381, -125, -568, 19, 857, -77, -470, -104, 397, -172, -221, 121, 395, -199, -395, 60, 295, -136, -227, 457, 280, -310, -92, 306, 131, -293, 65, 463, -15, -546, -4, 480, -31, -83, -105, 512, -43, -755, 474, 822, -49, -590, 116, 28, -339, -491, 623, 671, -48, -431, -59, 308, -298]
3748b98K63N71m64n77M41L88n19k35O02J84k55n30L84J87M5m11Q27m46o08J54
3768b97O71M2m35k04P06n80k56M79K89j19n61O4L81m44k00Q41J40p30j72O93K18
3789E26n31l79Q95k47n39K86L78j4n48J11O1K42r16L37O97l2r04O09K39k61n17
3810e07P45L67l80q05M41N77m73r6K82K79q59M1M56K14m59k0K77L51o71K72K31
3831B63O0n83K28L29n32p4L65K70k08l19L18P4o61P9O22L60r23K8M06J99n66j48
3853d13Q32j97m24j10P57k04m62M73J38n21l26L03P74m17m33K66J90m01m19Q65
3873B71p8k69k11M65L3m69j06O58P5o33m8N85l00k36J12K98k60l14M64J45k41
3894e9m15N50J4p60L46M83N4j81o2M05p2n36k7R66k28p90J6O81j03p81N67K7Q3
$$ y = [-298, -35, 536, 72, -505, -64, 324, -195, -430, 172, 356, 101, -429, -45, 142, 187, -224, 603, 157, -451, -297, 374, 416, -19, -223, 483, -97, -353, 126, 415, 296, -265, -201, 180, -264, -464, 377, 517, -213, -385, 308, 526, -5, -384, 511, 264, -275, 11, 389, 375, -173, -62, -1, 241, -675, -338, 359, 327, -577, 32, 271, 10, -507, 238, 605, 225, -580, -139, 438, -35, -131, 151, 430, -429, -388, 68, 282, -177, -197, 80, 431, -240, 32, 263, 323, -260, -32, 297, -235, -309, 56, 326, 118, -201, 117, 191, -470, -391, 231, 591, -332, -304, 102, 301, -265, -413, 419, 222, -202, -312, 445, 241, -221, 252, 390, -131, -457, -154, 620, 203, -230, 36, 226, -175, -594, 271, 193, -76, -287, 178, 211, -258, -364, 294, 369, -264, -312, 273, -27, -263, -151, 147, -113, -427, 37, 182, -59, -474, 76, 90, -670, -324, 159, 213, 32, -30, 375, 303, -233, -260, 706, 478, -312, -296, 385, 282, -499, 68, 95, 178]
3917A78m45L14Q5j41j70L46L25p29j95Q50j10l82mL64J31p80M5Q55m60l84L05
3938bK22k32n23N51J97kp47N51K72m78P2O86j20o91l45Q41K53m27j46N62m78l27
3960c11O0N10R2l27k67L85k67l68M00N89l29q34N92M30o68o2R11Ro91k26M13L04
3982C45n93LO12n1l46j01K21l1m56J72M65j47o11r8Q02o2m21L72J26k40k12M68
4004B17L90m79l73P27l96n91L12Q65p29k37J98L50l24j79r0O40l41k54J65L49
4024B20k48JK06K72l18m06L10J65j77j46J77J63o27p6O53J13o85j01Q09l75n2
4045a22q3O36l74m40J69K17K76p10N04L47l47m87K70L71p2k12N89l15m81L7O59
4066D32j36m69K52J88j43l26j35Q71l56n92L39J44m8l55L41O7J24l87O00j07m34
$$ y = [178, -267, 47, 132, -9, -179, 167, 492, -237, -432, 418, 308, -74, -78, 286, 417, -363, -318, 537, 77, -307, -2, 220, -12, -535, 16, 213, 211, -536, 15, 287, -191, -119, 567, 447, -244, -589, 252, 505, 78, -68, 494, 16, -311, -251, 259, 351, 24, -243, 142, -125, -493, -93, 496, 167, -667, -75, 355, -313, -375, 536, 545, -146, -372, 41, 345, -248, -245, 367, 316, -30, -131, 90, 59, -397, -225, 240, 93, -518, -616, 186, 124, -297, 75, 201, -39, -251, 217, 607, 128, -245, 482, 86, -505, -193, 672, -57, -294, -96, 254, -70, -249, -339, 301, -40, -294, -129, 220, -28, -27, 179, 451, 133, -273, 37, 202, 25, -121, 56, 219, -408, -484, 169, 282, -403, -504, 305, -70, -122, -205, 431, 57, -383, -214, 3, 279, -431, 73, 420, 73, -414, -144, 227, 155, -57, 532, 217, -264, -227, 432, 296, -173, 79, 267, 124, -202, -337, 534, 178, -414, -75, 69, 21, -334, 7, 74, 198, -189, 411, 304, -130]
4087a30k7L17k72p2p9P9M11m40R2M71l88k82n7Q36j38l35J02L2l8l48K85L53o05
4110b33j13M87o2J16n48O06m5n10L1N60j29m55K42K47j65n89L84O77l31l21j00
4131b51P29m13l42M26L52l19l65J69J75k81j32J24J4k69L13M44m51l29%R12n40
4152c4k58J37Q23l97n84M95J81m87n82R54j6m21Q5L29l96J7k62M76J76j92n38
4173d94O68l7m26K25J36J18o63L92M19m28j09J25N49l68o01M60J68q7m64O64j84
4194F3m00K0O12r5R5m68N8L91n66K49N92m16n67M05J03j11k54j68P19m41J08l3
4216a04J35l16J22M91j40m57m5M41R2n36K41L01k35m64K94Q48p28o2J39LN6m7
4238B9J00q0j51O9J65J36l62j86N40L69n17m96O28j26k73M55J49k47o37M88k3
$$ y = [-130, -157, 160, -112, -184, -263, -184, 227, -213, -121, 350, -38, -320, -377, 459, 321, -14, 88, 120, 82, -266, 19, 372, -233, -346, 141, 79, 195, -353, 253, 208, -302, -271, 289, 160, -295, -53, 194, 29, -560, -176, 501, 170, -151, -251, 478, 65, -277, 149, 501, 182, -183, -14, 161, -120, -252, -128, -114, -383, -70, 374, -77, -406, -406, 506, -34, -292, -155, 668, 271, -313, 182, 363, -124, -706, 248, 232, -189, -104, 225, -171, -154, -416, 60, 236, 44, -494, 174, 137, -289, -64, 72, 190, -473, -81, 338, -90, -199, -74, 475, 107, -494, -34, 134, 47, -417, 247, 63, -337, -317, 295, 200, 295, -173, -115, 276, -290, -41, 551, 135, -432, -27, 76, -35, -289, -457, 262, -179, -71, -104, 31, -285, -163, 328, 188, -269, -314, 127, 219, -317, -76, 225, -10, -474, -180, 668, -60, -122, 17, 20, 76, 29, 129, 49, -102, -33, 132, 268, -94, -280, 260, 629, 112, -384, 244, 118, -155, 300, 449, 202, -435, 53, 30]
4259C0K63l67P0j84J94j38jL43k72j33L34k99O2k53L61K96o22J34J50L17m21k17
4281c53P86Ro49k71N27NQ8k28J15j32l53M17K82j07l60Q7O28k51k63j2M98m05
4303E8m57R84m60m00o0M60p7j76k22L99n9j59J86K17j96j24o8M64k35j63M55n09
4325a42N4J8J09k6rj45K66j62j85Q3L02%o76N88J83k57j92K1P12j02o65J22J21
4348A8o3n7J02l1k80O8L15K39k69l79K74L03n13K83J40k48k37K20K16j70J07j16
4370g8M68k61j53J06n8n80L64K69j9r6m11N46k9k62M97l27j97K54l21M23K04m14
4392g5n2L84j88k03J39r1K97m68N94J26n80k03M54M32l84j95rJ34l80J64O84J38
4414G18q66k83O04K38p30K78J85q2k36J90K95m73J71k21O35o69j18L09N0J11Q1
$$ y = [30, 293, -74, -4, -188, 6, -132, -133, 210, -62, -195, 139, -160, -98, -351, 10, 306, -316, -182, -32, 285, -136, -353, 433, 442, -207, -478, 49, 54, 142, -86, 29, -103, -456, -39, 243, 136, -224, -137, 491, 240, -23, -35, 463, 58, -399, 585, 125, -275, -335, 125, 48, -128, -350, 49, -10, -169, 17, 234, 38, -86, -154, 310, 75, -88, 367, -142, -88, -70, 39, 13, 4, -141, 125, -37, -222, -139, 163, 163, -513, 75, 258, 1, -191, -170, 542, 440, -225, -103, 18, -45, -102, 0, -31, -311, -243, 72, 311, 42, -337, -63, 240, -273, 10, 150, -98, -335, -115, 101, -69, 38, -78, 390, 129, -24, 82, 24, -556, -192, 77, 58, -38, -449, 97, 68, -194, 303, -24, -221, 33, -288, 135, 339, -75, -127, 257, 69, -134, 5, -86, 211, -257, 337, 463, -117, -320, 134, 566, 182, -13, -22, 112, -268, -104, 580, 718, -148, -431, 173, 411, -319, -41, 144, 62, -174, 16, 311, -162, 9, -212, 423, -246, -364, -55, -5, 106, 187]
4435A87R9kn51J01M97N5m27j63L74P1l52L70l9l44m77M64N33l71j98L1L61l27
4457a08j7J9J32J29j66J14J83j57k29N8K9K8j5j28Q4k48J46O14k52j68m32N30
4479A46j51j11J87J28k93l03K33N13m88l63M96L90m25p6O5K4J2K21k6j00k33m6
4501b00M47j46L8l16J04K36k51K05J37j11n12L62K36j33l62M00p5J14m52M93Q9
4522C03k71p5L01o0k85l58K63J36L6L10j56j11n24M77M87k47n37K31l9J02pK33
4544B09j96k20K55L89k99j81k79M42J24k72j70J16L08o35N37k8q0l12L7M58J33
4565C36n33J17J58l27K65Q8L41o07O3m3M05m3k46J99L7n21L86J43m73p6M48p2
4587D5J84n13P0L65j77j33Q65m65m68P3J55P09p61J09N2p1J16j61K76m4o74L50
$$ y = [187, 286, 284, -267, -166, 331, 386, -41, -204, 170, 241, -111, 259, 220, -124, -601, -137, 396, 25, -173, -142, 219, -108, -125, -106, 26, 155, -11, 103, 286, 129, -100, -42, -13, 15, 0, -128, -44, -292, -146, 468, 216, 48, -384, 146, -5, -116, 71, 199, -94, -397, -164, 349, -139, -502, -6, 384, -41, -117, -52, -28, -16, 205, 179, 79, -154, -200, 247, 101, 139, -177, -73, 163, -88, 117, 254, 143, -369, -7, 229, 96, -266, 134, 59, 173, -279, 214, 303, 32, -43, 258, 198, -87, -445, -182, -46, -10, 300, 144, 33, -491, -14, 473, 226, -311, -80, -119, -17, -24, 209, 13, -207, 48, 437, 138, -43, -322, 120, 244, -28, -198, -82, 226, -409, 128, 100, 20, -292, -255, 203, 336, -197, -80, 78, -249, 16, 104, 445, -162, -99, -142, 263, 220, -26, 173, 210, -311, 75, 218, -255, -331, 117, 45, 229, -284, -214, 151, -26, -159, 706, 241, -227, -154, 1, 710, -51, 58, 110, 39, 155, -6, 270, 226, -448, -98]
4609i8QJ54k61J46o4K77k04j5n1L7j84L42J38l63j75J36M47l36M6K19m01JK85
4632H4L07m24j36k48M70j5P8j07j20M4P9J22J34r6m16K10L24k53k46L47k38k02
4654c02K53lR9j24j95L90j24Q6j44J91j40j34J31K95k61l54R0K86M3nj19j98P
4677b32m9N70j45j74l93N45j43n9J11K81k63m4l80P37k53k63J27M56m28j65K70
4698A06O3m8k44K33j03j60K28k86K38j2k16K24J15k41k48K94L14o82L63L01l29
4719i0j73O9K86k23L1Q2K86m74J21N6K28j51p0k34M20k97L32l38N75o47m9J34
4741a26P5R6k11J60P2Q7n7q8K04k30k48N36P3p27L45P7J89k53j04N0j30J50M73
4764D13k42l78K29k86M88j38j42rQ8n64N24K6j39N2j87M79l66J76O9k8m5p1K3
$$ y = [-98, -90, 64, -197, -51, -115, 162, -42, -57, -108, -71, -255, 87, 225, -138, -313, -177, 270, -66, -20, 199, -202, -201, 84, 391, -33, -169, -417, 53, 38, 116, 9, -111, -67, 12, 134, 268, 172, -244, -34, 290, 37, -209, 138, -100, -302, -49, -52, 47, -77, -272, 118, -6, 80, -64, 127, -13, -147, -16, 279, 18, -336, -246, 40, 83, 78, -41, -239, -232, -281, 289, 144, -30, -423, 122, -21, -80, 31, 312, 49, 5, -375, 362, 109, -154, -27, 429, 1, -164, 106, 169, 121, -123, 110, 7, -153, 75, -211, 27, 15, -201, 23, 138, -103, -351, -57, 257, -425, -62, 239, -90, -263, -194, 92, -131, -100, -18, 268, -206, -85, -29, 199, 48, -22, -256, 164, -133, 199, -139, 436, -211, -260, -126, -51, 45, -166, -6, 66, 153, 96, 8, 212, -18, -266, 270, 343, -384, -39, 38, 227, -26, -130, -80, -210, -60, 413, 171, -207, 22, -264, 224, 86, -56, -65, 23, -541, -17, 9, -130, -78, -265, 214, -152, 24, 93, 65, 20, -51, -28]
4787b8J34j25J28j7J4j13n6j03J11j08L56o3j93l25N54J95k26j85J72p8j45O7
4809c4j09L2K72k18M1L85m99k44K00L33k32J54j05P1l24O07m4k91l9j31K37M5
4831A07k43r0l8N34l47J31L41q17K63L06L3j39l20lO53p25K31L76j97k03J47J82
4853A82K0k21K6L8j72Q1N1l3n6k0r8L11Rj52l2M07K96r39K63j81m4J60O0L78m91
4878a57l2L89K03k57k66m0L10k63P8J88j10K64j59l3j47K04k55L00o2l88M04p0
4900A01m03J54j4K06O5P4j22M7j58j02K28J60m25M2J00j07N0L55p2m29N1J34J33
4923F8p9J7j33J0L2J52J83j91K33l81J96k70J5J83J19P8j30l0J83l17p2L83l4
4946B15p2q9j84J34K15j49p3kQ5o7J44n57L18r7M78J9m08o2P2n1N9j89N38O7n16
$$ y = [-28, 106, -19, 109, 92, 106, -7, -63, -166, -55, -163, 193, 130, -63, -388, 166, 361, 135, -50, 122, 44, -101, -34, -143, -111, 161, -57, -16, 369, -130, -374, -174, 159, -73, 81, -24, 47, -277, 330, 286, -5, -44, -175, 62, 107, -136, -226, -264, 270, -77, 54, 395, -422, -159, 147, 180, 41, -279, -282, 371, -354, -123, 253, 56, -147, 0, 182, 202, -19, 7, 45, -127, -46, 5, -28, -84, -104, -202, 109, 118, -34, -66, 341, 637, -302, -39, -220, -264, -104, -44, 334, -157, -189, 200, 403, 146, -120, -160, 150, -113, -35, 153, 43, 307, 148, 115, -32, 172, -83, 217, 155, -233, 171, 101, -302, -148, -162, 44, 109, 183, 61, 108, -50, -152, 76, 236, -189, -147, -47, -154, -104, 251, 179, -250, -199, -65, 68, -11, 6, -127, -117, -85, 67, 250, 59, 292, -89, 107, -163, -148, 35, 154, 232, 102, 72, 255, -62, -134, 249, 215, 143, 54, -130, 4, 219, 70, -3, -5, 80, 13, 157, -400, -82, -179, 299, 318, -90, -152, -80, -131, -72, -261, 277, 344, -172]
4971a72l3L91L3q9j18k32K4K4K5M35m46O8J09k25K10L0K19k72N1n1QJ10l7k04
4995a42K10l5j34P9J29m25k93N05K9J59r4j05K70l03J6K90J67l79J98k00J65j97
5017i0NL17o6l27p2J80Jp9j0P11m36j68P7L62n65K7N41m73N4l3L34j52k79n7K62
5042F4p1R4m80K75l6J54l22J71M48n18O5pM94l18K07J39l56K09k69L02m7k61k58
5065c21M15P8m78J33J39o8K2K35m20K98L30l56p1j5l6J6K00J9q1j5P6N0l5L5K25
5090C75l47R3l3Q2q0j95J8L9K59j15j43J17j61L3J69L8k36r5K73l85K74j73J09
5113h4L31O0k41Q4n3l17K90N1n72L18K84j31J43k40J7J19l39M01k40pK7j99J67
5136a31L44m80K31K37l39J92L33k32m31O82n27L01k93K68j02n2j31M27l10J32
$$ y = [-172, -205, 186, 219, 130, 12, -220, -196, -172, -147, 288, -158, -90, 19, -206, 4, 34, 253, -19, 32, -19, -11, 99, 62, -142, 68, 33, -101, -22, 107, -318, -611, -106, -77, 82, -12, -117, 153, -150, -134, 156, 323, -56, 142, -58, 107, -90, -85, 232, 166, -161, -233, -53, -52, -131, -141, 570, 134, -34, 43, 405, -160, -133, 408, -65, -11, -44, 290, 138, -141, -198, 64, -7, 87, -393, -118, -154, 0, -322, -151, 297, -221, -156, -163, 331, 13, 220, 359, 3, 212, -57, 245, 198, -63, -321, 94, 172, -306, -173, -34, -102, -80, 155, -265, 33, 363, 7, -64, -79, -115, -99, 101, 120, 39, 24, 100, 150, 115, 150, 375, 28, 121, 88, 170, 90, -105, -87, -48, 211, 96, -47, 70, -91, -58, 111, 149, -87, -182, 91, -294, -20, -193, -84, 247, 307, 66, 150, 97, -220, 70, 121, -451, -133, 151, 20, 163, -77, -60, 59, -280, 121, -119, -126, -99, -298, -131, 213, -267, -36, 201, -138, 54, 387, 155, -276, 406, -121, 180, -113, 155, 53, 1, -130, 297, -13, 119]
5156A19r4K9k31L10j73J26j22k15J67L4K12m22m6N66r4l11Q0L69k52k08K95j50
5178a1J9k27J08K03j05J25k37p1K50K8P9k98K56L6j33j15J96k08L8k51K48J81
5200A11k30J13n4J4L76l41k00L65j0k20J93j15j56J13p9j79M60j02J93n84M95
$$ y = [119, 25, 54, -177, 133, -40, 86, -36, -251, -84, -50, 162, -260, -306, 260, 166, -145, -65, 304, 52, -156, 139, -11, 8, -219, -111, 92, -13, 112, -125, -196, 54, 82, 161, -137, 119, 155, 22, -93, 103, -105, -67, -318, -70, 111, -119, -6, -60, -46, 330, -11, -211, 154, 144, -76, 117, 2, -154, -41, -120, -299, 161, 59, 252, -332, 163]
$$ [...]
8191A67
##END NTUPLES=NMR FID
##END=
