##TITLE=1H_Suc Am
 CD3OD, 8 sc, 
 2.06.2021
##JCAMPDX= 6.0         $$ Bruker NMR JCAMP-DX V2.0
##DATA TYPE= NMR FID
##DATA CLASS= NTUPLES
##ORIGIN= UXNMR, Bruker Analytische Messtechnik GmbH
##OWNER= root
$$ XWIN-NMR		Version 3.5
$$ Wed Jun  2 13:28:21 2021 Russian Standard Time (UT+4h)  she@DPX200
##.OBSERVE FREQUENCY= 200.131506
##.OBSERVE NUCLEUS= ^1H
##.DELAY= (6, 6)
##.ACQUISITION MODE= SIMULTANEOUS
##.ACQUISITION SCHEME= undefined
##.AVERAGES= 8
##.DIGITISER RES= 18
##SPECTROMETER/DATA SYSTEM= spect
##.PULSE SEQUENCE= zg30
##.SOLVENT NAME= D2O
##.SHIFT REFERENCE= (INTERNAL, D2O, 0, 15.7039)
##AUDIT TRAIL= $$ (NUMBER, WHEN, WHO, WHERE, WHAT)
$$ ##TITLE= Audit trail, XWIN-NMR		Version 3.5
$$ ##JCAMPDX= 5.01
$$ ##ORIGIN= Bruker BioSpin GmbH
$$ ##OWNER= she
$$ F:/spectra/data/she/nmr/H-F/1/audita.txt
$$ ##AUDIT TRAIL=  $$ (NUMBER, WHEN, WHO, WHERE, WHAT)
(   1,<2021-06-02 13:27:26.10 +0400>,<she>,<DPX200>,
      <created by zg, POWCHK disabled, PULCHK disabled
       configuration hash MD5:
       00 E9 B6 7A A2 85 ED C7 34 08 36 98 17 FE 4E 26
       data hash MD5: 16K
       9C 71 AE 66 EE 75 64 58 41 B9 69 39 08 61 23 52>)
$$ ##END=
$$ 
$$ hash MD5
$$ 57 11 90 E5 A6 1E 55 AE 08 73 6F CF 17 E4 E6 E0
##$RELAX= 
##$RELAX= 
##$RELAX= 
##$RELAX= 
##$RELAX= 
##$RELAX= 
$$ Bruker specific parameters
$$ --------------------------
##$DU= <F:/spectra>
##$EXPNO= 1
##$NAME= <H-F>
##$PROCNO= 1
##$TYPE= <nmr>
##$USER= <she>
##$AMP= (0..31)
100 100 100 100 100 100 100 100 100 100 100 100 100 100 100 100 100 100 
100 100 100 100 100 100 100 100 100 100 100 100 100 100 
##$AQSEQ= 0
##$AQ_mod= 1
##$AUNM= <au_zg>
##$AUTOPOS= <>
##$BF1= 200.13
##$BF2= 200.13
##$BF3= 200.13
##$BF4= 200.13
##$BF5= 200.13
##$BF6= 200.13
##$BF7= 200.13
##$BF8= 200.13
##$BYTORDA= 1
##$CFDGTYP= 0
##$CFRGTYP= 5
##$CHEMSTR= <none>
##$CNST= (0..31)
1 1 145 1 1 1 1 1 1 1 1 1 1 1 1 1 1 1 1 1 1 1 1 1 1 1 1 1 1 1 1 1 
##$CPDPRG= <>
##$CPDPRG1= <>
##$CPDPRG2= <>
##$CPDPRG3= <>
##$CPDPRG4= <mlev>
##$CPDPRG5= <mlev>
##$CPDPRG6= <mlev>
##$CPDPRG7= <mlev>
##$CPDPRG8= <mlev>
##$CPDPRGB= <>
##$CPDPRGT= <>
##$D= (0..31)
0 1.2 0 0 0 0 0 0 0 0.06 0 0.03 0 0 0 0 0.0002 0 0 0 0 0 0 0 0 0 0 0 0 
0 0 0 
##$DATE= 1622626045
##$DBL= (0..7)
120 120 120 120 120 120 120 120 
##$DBP= (0..7)
150 150 150 150 150 150 150 150 
##$DBP07= 0
##$DBPNAM0= <>
##$DBPNAM1= <>
##$DBPNAM2= <>
##$DBPNAM3= <>
##$DBPNAM4= <>
##$DBPNAM5= <>
##$DBPNAM6= <>
##$DBPNAM7= <>
##$DBPOAL= (0..7)
0.5 0.5 0.5 0.5 0.5 0.5 0.5 0.5 
##$DBPOFFS= (0..7)
0 0 0 0 0 0 0 0 
##$DE= 6
##$DECBNUC= <off>
##$DECIM= 32
##$DECNUC= <off>
##$DECSTAT= 4
##$DIGMOD= 1
##$DIGTYP= 9
##$DL= (0..7)
0 120 120 120 120 120 120 120 
##$DP= (0..7)
150 150 150 150 150 150 150 150 
##$DP07= 0
##$DPNAME0= <>
##$DPNAME1= <>
##$DPNAME2= <>
##$DPNAME3= <>
##$DPNAME4= <>
##$DPNAME5= <>
##$DPNAME6= <>
##$DPNAME7= <>
##$DPOAL= (0..7)
0.5 0.5 0.5 0.5 0.5 0.5 0.5 0.5 
##$DPOFFS= (0..7)
0 0 0 0 0 0 0 0 
##$DQDMODE= 0
##$DR= 18
##$DS= 0
##$DSLIST= <SSSSSSSSSSSSSSS>
##$DSPFIRM= 0
$$ [...]
##$SUBNAM2= <"">
##$SUBNAM3= <"">
##$SUBNAM4= <"">
##$SUBNAM5= <"">
##$SUBNAM6= <"">
##$SUBNAM7= <"">
##$SUBNAM8= <"">
##$SUBNAM9= <"">
##$SW= 16.9725357007746
##$SWIBOX= (0..15)
0 0 2 0 0 0 0 0 0 0 0 0 0 0 0 0 
##$SW_h= 3396.73913043478
##$TD= 16384
##$TD0= 1
##$TE= 0
##$TE2= 300
##$TE3= 300
##$TEG= 300
##$TL= (0..7)
0 120 120 120 120 120 120 120 
##$TP= (0..7)
150 150 150 150 150 150 150 150 
##$TP07= 0
##$TPNAME0= <>
##$TPNAME1= <>
##$TPNAME2= <>
##$TPNAME3= <>
##$TPNAME4= <>
##$TPNAME5= <>
##$TPNAME6= <>
##$TPNAME7= <>
##$TPOAL= (0..7)
0.5 0.5 0.5 0.5 0.5 0.5 0.5 0.5 
##$TPOFFS= (0..7)
0 0 0 0 0 0 0 0 
##$TUNHIN= 0
##$TUNHOUT= 0
##$TUNXOUT= 0
##$USERA1= <user>
##$USERA2= <user>
##$USERA3= <user>
##$USERA4= <user>
##$USERA5= <user>
##$V9= 5
##$VALIST= <valist>
##$VCLIST= <CCCCCCCCCCCCCCC>
##$VD= 0
##$VDLIST= <DDDDDDDDDDDDDDD>
##$VPLIST= <PPPPPPPPPPPPPPP>
##$VTLIST= <TTTTTTTTTTTTTTT>
##$WBST= 1024
##$WBSW= 4
##$XGAIN= (0..3)
0 0 0 0 
##$XL= 0
##$YL= 0
##$YMAX_a= 356241
##$YMIN_a= -263120
##$ZGOPTNS= <>
##$ZL1= 120
##$ZL2= 120
##$ZL3= 120
##$ZL4= 120
##$ABSF1= 10
##$ABSF2= 0
##$ABSG= 5
##$ABSL= 3
##$ALPHA= 0
##$AQORDER= 0
##$ASSFAC= 0
##$ASSFACI= 0
##$ASSFACX= 0
##$ASSWID= 0
##$AUNMP= <proc_1d>
##$AZFE= 0.1
##$AZFW= 0.1
##$BCFW= 1
##$BC_mod= 2
##$BYTORDP= 1
##$COROFFS= 0
##$CY= 11.3945322036743
##$DATMOD= 1
##$DC= 2
##$DFILT= <>
##$DTYPP= 0
##$F1P= 15.9154993809931
##$F2P= -4.1035820241983
##$FCOR= 0.5
##$FTSIZE= 0
##$FT_mod= 4
##$GAMMA= 1
##$GB= 0.15
##$INTBC= 1
##$INTSCL= 1
##$ISEN= 128
##$LB= 0.24
##$LEV0= 0
##$LPBIN= 0
##$MAXI= 10000
##$MC2= 0
##$MEAN= 0
##$ME_mod= 0
##$MI= 1.114404
##$NCOEF= 0
##$NC_proc= 0
##$NLEV= 6
##$NOISF1= 3.799351
##$NOISF2= 2.8
##$NSP= 1
##$NTH_PI= 0
##$NZP= 0
##$OFFSET= 15.70392
##$PC= 1
##$PHC0= -11474.81
##$PHC1= 1.40099
##$PH_mod= 1
##$PKNL= yes
##$PPARMOD= 0
##$PSCAL= 0
##$PSIGN= 0
##$REVERSE= no
##$SF= 200.130013532006
##$SI= 16384
##$SIGF1= 3
##$SIGF2= 2
##$SINO= 400
##$SIOLD= 16384
##$SREGLST= <1H.CDCl3>
##$SSB= 0
##$STSI= 0
##$STSR= 0
##$SW_p= 3612.71676300578
##$SYMM= 0
##$S_DEV= 0
##$TDeff= 0
##$TDoff= 0
##$TI= <>
##$TILT= no
##$TM1= 0
##$TM2= 0
##$TOPLEV= 0
##$USERP1= <user>
##$USERP2= <user>
##$USERP3= <user>
##$USERP4= <user>
##$USERP5= <user>
##$WDW= 1
##$XDIM= 8192
##$YMAX_p= 0
##$YMIN_p= 0
$$ End of Bruker specific parameters
$$ ---------------------------------
##NTUPLES= NMR FID
##VAR_NAME=  TIME,          FID/REAL,        FID/IMAG
##SYMBOL=    X,             R,               I
##VAR_TYPE=  INDEPENDENT,   DEPENDENT,       DEPENDENT
##VAR_FORM=  AFFN,          ASDF,            ASDF
##VAR_DIM=   8192,          8192,            8192
##UNITS=     SECONDS,       ARBITRARY UNITS, ARBITRARY UNITS
##FACTOR=    0.0002944,     1,               1
##FIRST=     0,             0,               0
##LAST=      2.4114304,     0,               0
##MIN=       0,             -263120,         0
##MAX=       2.4114304,     356241,          0
$$ Real data points
##PAGE= N=1
##DATA TABLE= (X++(R..R)), XYDATA
0@%%%%%%%%%%%Qj6J6j6K4l2L4m2N0n8P2q8J04j20J38j63J89k15K49k85L25l70
$$ 0 0 0 0 0 0 0 0 0 0 0 0 8 -8 8 -8 16 -16 18 -24 26 -32 40 -48 56 -64 74 -89 100 -115 134 -151 174 -196
33a96M18m71N29n95O69p49Q34r29J032j144J269j402J548j710J885k077K289k521
$$ -196 222 -249 280 -315 354 -395 439 -490 542 -602 667 -735 813 -897 988 -1089 1200 -1321
51a321K776l061L378l732M133m587N109n715O428p288Q339r659J1380j3721J7110
$$ -1321 1455 -1606 1772 -1960 2173 -2414 2695 -3020 3408 -3880 4459 -5200 6180 -7541 9569
66I569k2461L2181n5300K07781J84471m12063r708o844j70118J52349L51844l3258
$$ 9569 -12892 19289 -36011 171770 356241 -55822 -65530 -72374 -242492 -90143 261701 228443
78B28443j97657j29539q2692K2935J81077J60303L0075j69399k00301l0793Q3747
$$ 228443 30786 -98753 -181445 -158510 22567 182870 212945 43546 -156755 -187548 -103801
89a03801J40954J76286l7407k02506j09673l8184N5033K35249J03931j35210j05057
$$ -103801 37153 213439 176032 -26474 -136147 -174331 -119298 115951 219882 84672 -20385
100b0385j02007r9677J70083K27871k0066q8419q6964j50431j0149J82045J54437
$$ -20385 -122392 -222069 -51986 175885 155819 67400 -19564 -169995 -180144 1901 156338
111A56338P899j11520j36616o5776J6622J32931J85907k3616j80752n6708m4753
$$ 156338 164237 52717 -83899 -149675 -133053 -122 185785 162169 -18583 -75291 -120044
122a20044m2997K17869J83270j60223j25996J3321j11209j077K59636J03074j59217
$$ -120044 -163041 54828 238098 77875 -48121 -34800 -146009 -147086 112550 215624 56407
133E6407j11030k6145m0434M1813J70457J04590j20692j66918k0474K3551M5351
$$ 56407 -54623 -80768 -121202 -79389 91068 195658 74966 -91952 -112426 -88875 -43524
144d3524J51031O2899j35177j13407l4273m791J29392J39645n2560q7044n5870
$$ -43524 107507 170406 35229 -78178 -112451 -117242 12150 151795 99235 12191 -43679
155d3679j06699M0618J93754M4081o4612l4857j05060q2486J05110J41706K9671
$$ -43679 -150378 -109760 83994 128075 63463 28606 -76454 -158940 -53830 87876 117547
166A17547m6117q4756p8323k2483N9927J42812O4704j16429r5772m648m0104N1531
$$ 117547 71430 -13326 -91649 -114132 -54205 88607 153311 36882 -58890 -63538 -103642 -52111
178e2111J77293J1402j35542m5826l2995l4976J19622J25104m3044q1691n4525
$$ -52111 125182 136584 1042 -44784 -77779 -112755 6867 131971 88927 7236 -47289
189d7289n6194K1805J14650Q6696k9535j03827o4021j426K1685Q5299J00661m4190
$$ -47289 -103483 -81678 32972 119668 90133 -13694 -77715 -79141 -57456 27843 128504 84314
201H4314j27805l8264J0465K5891J03066O1685p2997q2426m2024j4612P7762J05945
$$ 84314 -43491 -81755 -71290 -45399 57667 119352 46355 -36071 -78095 -92707 -14945 91000
213I1000o13o4614n9169n4245N256R2932Q2331r098p0890o4746l1708J8562Q8516
$$ 91000 90387 25773 -33396 -87641 -82385 10547 92878 83780 12890 -51856 -83564 -65002 23514
226B3514P9060l2552q0704l9155k7792J4120J09372O7175o7920p1604k2043k7574
$$ 23514 102574 70022 -10682 -49837 -77629 -63509 45863 113038 45118 -26486 -48529 -76103
238g6103L0571J05878M2413o4217p4234l0422L655M2429Q0796L5980o8780p8671
$$ -76103 -45532 60346 102759 38542 -35692 -66114 -62459 -20030 60766 96746 27966 -50705
250e0705j2614P277M3730R3321Q263r2862m6920k031p547O5532R0132k8268q2667
$$ -50705 -63319 -56042 -12312 81009 89272 -3590 -50510 -52541 -60088 5444 95576 67308 -15359
263a5359l3037j5778J8635P9883M8094l3191o0204m8212r033M4798O8128L4704
$$ -15359 -48396 -64174 -45539 34344 82438 49247 -10957 -59169 -68202 -23404 44724 79428
275G9428l8972p1424k7526P000K8911P5240L7288p1154o6136J72j110L3678Q5823
$$ 79428 40456 -30968 -58494 -51494 -22583 52657 89945 18791 -47345 -47173 -48283 -14605 71218
288G1218N315p8610l7150r859n525O5888P0987l0190o3148k5891j7012J0486O8585
$$ 71218 76533 -2077 -39227 -49086 -54611 11277 82264 52074 -11074 -36965 -53977 -43491 25094
301B5094N3914l2491o7707k6832K114J6877N9122M7910m0743o9213j6190N328
$$ 25094 79008 46517 -21190 -48022 -45908 -29031 30091 78001 37258 -31955 -48145 -42817
313d2817K0843O7442L1067o0921n3712k113l126K8346P4587J0540p0203m1142
$$ -42817 -21974 45468 76535 15614 -38098 -40211 -43337 -14991 59596 70136 -67 -41209
325d1209J922J134L7446O4457n607o7147l2160k95O435N1608N2223k8523n8267
$$ -41209 -39287 -38153 -707 63750 58143 -9004 -41164 -41459 -35024 16584 68807 40284 -17983
338a7983j8385n815J1733O0404L9519m1805n3767j1996k95J9031N6678K7394m5790
$$ -17983 -36368 -42183 -30450 29954 69473 27668 -26099 -38095 -38390 -19359 37319 64713 18923
351A8923n0840p824N713K3441N6624J5557n8783m0089O027j994K5882O5865l164
$$ 18923 -31917 -39741 -34028 -10587 46037 61594 2811 -37278 -31251 -33245 -7363 58502 55338
364E5338o9416k2642Q406l368L8452N4457k1641n6291j7416j877J1259N0136L0756
$$ 55338 -14078 -36720 -28314 -31682 6770 61227 39586 -16705 -34121 -35998 -24739 25397 56153
377E6153l2421m1584j4563m621J9232N1805K3385m2991m4014p2K218J1799N3667
$$ 56153 23732 -17852 -32415 -37036 -17804 34001 57386 14395 -29619 -29691 -27473 -15674 37993
390C7993K1397n6961l9238J1646L28J5305N6903L591o1142k3034R696m153L1419
$$ 37993 59390 2429 -36809 -25163 -24835 -9530 47373 50964 -10178 -33212 -23516 -27669 3750
403C750N0911j8721n2862j1836J424M078M0941L3896k7466m2170j1875R34J4104
$$ 3750 54661 35940 -16922 -28758 -27334 -23256 17685 51581 24115 -18055 -29930 -28996 -14892
416a4892M1282K2259l3499l8937m872M467J2845M1517J9864m3165m0241P844Q397
$$ -14892 26390 48649 15150 -23787 -28659 -24192 -11347 30170 50034 6869 -33372 -25528 -17131
429a7131R350M2272J2418m9389l1793R930O411K0780L9423r354m5338j2543J488
$$ -17131 -7781 34491 46909 -2480 -34273 -24343 -17932 2848 42271 32917 -12421 -24964 -23476
442b3476m32L9034L6370l4188m0281N875l486l998M6945L1423m4275l9263J1966
$$ -23476 -23908 15126 51496 17308 -22973 -17098 -20584 -24582 22363 53786 9511 -29752 -17786
455a7786K188k540M2892K6124m6068l8071J4046O524K669L8812J5221m6543k9359
$$ -17786 -15598 -18138 24754 50878 4810 -33261 -19215 -12691 -10022 28790 44011 -2532 -31891
468c1891J3444M145J3529L6995n011m1977j2770K345K377L2827K6555k5451k8870
$$ -31891 -18447 -14302 -773 36222 31211 -10766 -23536 -21191 -18814 14013 40568 15117 -13753
481a3753l052p253P450L9822J5754l0355k5996k833J482J0403K9138J5920k7172
$$ -13753 -16805 -24058 -16608 23214 38968 8613 -17383 -20216 -18734 -8331 20807 36727 9555
494I555l4583J358J3547O281K5131J5096l5338k8875J1139M592R097L6439k536
$$ 9555 -25028 -23670 -10123 -3842 21289 36385 1047 -27828 -16689 -12097 -3000 33439 30903
507C0903m6569o294J4245j1992K0432M4345k3836m7446J0139J0278j3998K7829
$$ 30903 -15666 -21960 -7715 -19707 725 45070 21234 -26212 -16073 -5795 -19793 8036
519H036L6478l0932m0734J0484R691n348K6478K3242k9599l2054O085Q158O591
$$ 8036 44514 13582 -27152 -16668 -6977 -12325 14153 37395 7796 -24258 -18173 -10015 -3424
532c424K4261P299k7497k0141P41M915J8281K3527q680k6877o762j172j385K5942
$$ -3424 20837 28136 639 -19502 -18761 -13846 4435 27962 19282 -7595 -14357 -15529 -16914 9028
546I028K5320k1119k8950K948J847m946K6551K5008k5882k9686O044M338j41K3832
$$ 9028 34348 13229 -15721 -12773 -10926 -15872 10679 35687 9805 -19881 -13837 -9499 -9640 14192
560A4192J5970k3606k5694K442P946N964J9336R888k4370k3187O822Q158L419
$$ 14192 30162 6556 -19138 -16696 -8750 -2786 16550 26438 2068 -21119 -14297 -6139 -2720
573b720K3215O669l5191j5508J7814j548K327L3234m663m2097r11J7373q862J3555
$$ -2720 20495 27164 -8027 -23535 -5721 -7269 -4942 28292 23629 -18468 -19379 -2006 -10868 2687
587B687K9058j9095l1692N742N733q52K1200J2846k1591j8249N24K457R839J9163
$$ 2687 31745 12650 -19042 -13300 -7567 -8419 12781 25627 4036 -14213 -13689 -11232 -1393 17770
601A7770K283k0007j4260J151L681R367K0231M8k7411r952J0478j983P286K6290
$$ 17770 20053 46 -14214 -13063 -9382 -15 20216 20264 -7147 -17099 -6621 -8604 -1318 24972
615B4972o340l3369j508J3265n681J0252K4971j3583k9829L073R819k861J4903
$$ 24972 18632 -14737 -16245 -2980 -8661 1591 26562 12979 -16850 -13777 -3958 -6819 8084
628H084J6225j8161k2336M288O288J904J5818R237k0120j7989O521N667K628J6468
$$ 8084 24309 6148 -16188 -11900 -5612 -3708 12110 21347 1227 -16762 -10241 -4574 -1946 14522
642A4522N530k3683j4539J0821M138J561J9047J577k8721p808J4278q51M282K1082
$$ 14522 20052 -3631 -18170 -7349 -3211 -1650 17397 18974 -9747 -17555 -3277 -4128 154 21236
656B1236p585k8551J360J1340m513J2373J7077j7438k0896O448M756p88J6677
$$ 21236 13651 -14900 -13540 -2200 -6713 5660 22737 5299 -15597 -9149 -4393 -5181 11496
669A1496Q510k0281j3819N703L668L023J4547M510j9830j3422Q989N056N79J5292
$$ 11496 20006 -275 -14094 -8391 -4723 -1700 12847 17357 -2473 -15895 -6906 -1850 -1271 14021
683A4021K993k4717r204J4542j0P54K0098m929k7843J702J3547o650P875J9456
$$ 14021 17014 -7703 -16907 -2365 -2375 -1621 18477 13548 -14295 -12593 954 -5696 2179 21635
697B1635j5127k2829Q413O679m558J3464J1789j8767j5464P994M642n14J2868
$$ 21635 6508 -16321 -7908 -1229 -5787 7677 19466 699 -14765 -6771 -2129 -2643 10225
710A0225O073j7806j3376Q620N852r06J2575M298k1294r979J3290J974j250J6206
$$ 10225 16298 -1508 -14884 -6264 -412 -1318 11257 15555 -5739 -15718 -2428 -454 -1704 14502
724A4502j423k4844j165J3772m177L870J7817j1093k2015O882Q172n444J0952
$$ 14502 13079 -11765 -12930 842 -3335 535 18352 7259 -14756 -7874 298 -5146 5806
737E806J2049j6927j4935Q903L389j488J2702N483j7527j0312Q581K989l93J1960
$$ 5806 17855 928 -14007 -5104 -1715 -3203 9499 14982 -2545 -12857 -4276 -1287 -1680 10280
751A0280L334j8932q493J1718J915j888J4078R67k2960k757J4487l463o2J7622
$$ 10280 13614 -5318 -13811 -2093 -178 -2066 12012 12979 -9981 -12738 1749 -1714 -1776 15846
765A5846p105k3074N743J1020o862O800J4568j4309j7102R944N252m859J1584
$$ 15846 8741 -14333 -8590 2430 -4432 2368 16936 2627 -14475 -4531 721 -4138 7446
778G446O804j6140j0103Q060L062l77R565L485j5371q663R132L538j260R953K169
$$ 7446 14250 -1890 -11993 -3933 -871 -1248 8317 11802 -3569 -12232 -3100 438 -822 9131 11300
793A1300j8736m556J2420q12j156J4255m058k0929L897J1547p144M815J5012j2931
$$ 11300 -7436 -11992 428 -384 -1540 12715 8657 -12272 -8375 3172 -3972 843 15855 2924
807B924j6794J0182N297o362J0444Q230j5697r965R033K715k372R712L763j4437
$$ 2924 -13870 -3688 1609 -4753 5691 13921 -1776 -11741 -2708 7 -2365 7347 11110 -3327
821c327p489Q288L323j844Q921K146j6069m914J1209l2k019J2378k029j9099J987
$$ -3327 -10816 -2528 795 -1049 7872 10018 -6051 -10965 244 212 -1807 10571 8542 -10557 -8570
836h570J1905n651J489J4238q614j7642P722Q671p130O159J0735j3292j1871R064
$$ -8570 3335 -2316 -827 13411 4797 -12845 -5123 3548 -3582 2577 13312 20 -11851 -2787
850b787M283m009P999M511j2805o909P457K308l74P310Q75j2601l654P476J068
$$ -2787 1496 -2513 5486 9997 -2808 -9717 -2260 48 -326 6984 7859 -4742 -8396 -920 148
865A48n52Q735j224j5099p37J1190l108q86J2644n204j7477N747J0224p223L385
$$ 148 -404 8331 7107 -7992 -8729 2461 -647 -1533 11111 5907 -11570 -5823 4401 -2822 563
880E63J1790j1245j3074R772M430n386P779N445j3084o037Q186J106j420P318
$$ 563 12353 1108 -11966 -2194 2236 -3150 4629 10074 -3010 -9047 -861 245 -1175 6143
894F143J991j2193m831Q844J651l641Q341K325j5599l083J3538k345m851J3020
$$ 6143 8134 -4059 -8890 -46 1605 -2036 6305 8630 -6969 -10052 3486 1141 -3710 9310
908I310j680j8427L950J2268p321R05J1869r050j2204P797M338m021O664L829
$$ 9310 7630 -10797 -6847 5421 -1900 -995 10874 1824 -10380 -2583 1755 -2266 4398 8227
922H227j0835m293N823o8M82P172n17j0296k074O465O5j441P511M59j2699j768
$$ 8227 -2608 -6901 -1078 -1146 -664 6508 5991 -4305 -6379 86 151 -1290 6221 6680 -6019 -7787
938g787R976j180l381R413m20j4935J332J1220l909k164R973m208j3414M832Q728
$$ -7787 2189 1009 -2372 7041 6621 -8314 -6982 4238 329 -1835 8138 3930 -9484 -4652 4076
953D076n544J643R065q889j0329Q880M418o015N960N359j2185n044R886K69m122
$$ 4076 -1468 175 9240 351 -9978 -1098 3320 -2695 3265 8624 -3561 -8605 1281 1550 -2572
968b572P613K086j2254j896Q790n18k982O888M96j1462r61R141j391k515Q155
$$ -2572 5041 7127 -5127 -7023 1767 1249 -1733 5155 5651 -5811 -6772 2369 978 -1537 6618
983F618l242j1792N057O839n953L656P709j0582o859R914L51n857R022K861j2486
$$ 6618 3376 -8416 -3359 3480 -2473 1183 8892 -1690 -8549 1365 1716 -4141 4881 7742 -4744
998d744j686Q074j258k110O076J131q798l302O629K846m242L816M162j0852l887
$$ -4744 -6430 1644 386 -1724 4352 5483 -3315 -6617 12 2858 -1384 2432 6594 -4258 -8145
1013h145J0658M34o349Q263J146j4035K675J0056n603q84R580o768r546P496M059
$$ -8145 2513 2947 -3402 4861 6007 -8028 -5353 4703 -900 -1784 7796 1028 -8518 -1022 3037
1028C037n867M825M902r130m631P470J115l406M810K385q436l428P531N24l687
$$ 3037 -2830 1995 6897 -2233 -6864 606 1721 -1685 3125 5510 -2926 -6354 1177 1701 -1986
1043a986N394J683r798j048Q064j439k855P185j524j0030K578P180l823r60P742
$$ -1986 3408 5091 -4707 -5755 2309 870 -1985 5200 3676 -6354 -3776 3404 -419 -1379 6363
1058F363m456r736N579O294n819R72P906p076p895P870L603o216M361M740r426
$$ 6363 1907 -7829 -2250 4044 -1775 -803 7103 27 -7868 2 3605 -2611 1750 6490 -2936
1073b936l620Q029P7l294M998J121q075j410O188M97k550L607J326p681j705Q183
$$ -2936 -6556 1473 1550 -1744 3254 4375 -3700 -5110 1078 1575 -975 2632 3958 -3723 -5428 2755
1089B755j042m108O577n70j0304L205Q128o042O3Q593p195p930Q749K277o446
$$ 2755 1713 -2395 4182 3612 -6692 -3487 4641 -1401 -1338 7255 60 -7870 879 3156 -3290
1104c290N454M033r354k367P060o55k323M342M77o008j744N091J174k907K845
$$ -3290 2164 6197 -3157 -5524 1536 881 -1442 2900 3377 -2631 -4375 716 1890 -1017 1828
1119A828K684p801k496Q740j067n148P136M36j0693K526Q688n321j431P681n078
$$ 1828 4512 -3289 -5785 2955 1888 -3260 3876 4312 -6381 -3855 4833 -488 -1919 5762 684
1134F84p750O748L211n137L093M506p270l534O219J587m174L248K960o525k977
$$ 684 -7066 -318 2893 -2244 849 5355 -1915 -5449 770 2357 -1817 1431 4391 -2134 -5111
1149e111O748O63m408M268J801p338j288P342j240l431N316k39p876J698O608
$$ -5111 1637 2300 -2108 2160 3961 -3377 -4665 2677 1437 -1994 3322 3083 -4793 -3095 3513
1164C513l168k166O074k329p947M471N464n125M02O114n664n985P373K057n992
$$ 3513 345 -1821 4253 1924 -6023 -1552 3912 -1213 -811 5303 -361 -6346 1027 3084 -2908
1179b908M351L789q431j592P286j326l416M638R05o512l21N218l93k679L279R39
$$ -2908 1443 5232 -3199 -4791 2495 1169 -2247 2391 3296 -3216 -3537 1681 1288 -1391 1888 2827
1195B827o269n43O784j332l959N685k48q668L302P262o118j018Q066n629o786
$$ 2827 -3442 -3985 2799 1467 -2492 3193 2945 -5723 -2421 4841 -1277 -2295 5771 142 -6644
1210f644P646K434o341L606M242p338j982O137m54k909L549J026n367r89M879
$$ -6644 1002 3436 -2905 701 4943 -2395 -4377 1760 1306 -1603 1946 2972 -2395 -3384 1495
1225A495K08k751K511J890o054j468O891j172m154N368M06q074K634O142m375
$$ 1495 1703 -1048 1463 3353 -2701 -4169 2722 1550 -2604 2764 3170 -4904 -2270 3872 -503
1240e03j617O800l776o721N932L384n790K127M844o328l464O628Q82m610L398
$$ -503 -2120 4680 904 -5817 115 3499 -2291 -164 4680 -1648 -5112 1516 2398 -2212 1186
1255A186K831o410j503N703p2l592L396J594o248k88O109j522l441M332N02o622
$$ 1186 4017 -2393 -3896 1807 1735 -1857 1539 3133 -3115 -3403 2706 1184 -2257 2075 2577 -4045
1271d045J441O194l166k603N522j803o803M295M732n310O30N263m996m644O823
$$ -4045 -2604 3590 424 -2179 3343 1540 -5263 -968 3764 -1546 -916 4347 -649 -5293 1530
1286A530J029n216L704K741o249j129N759p33k935L047O36m909q8M531m44k614
$$ 1530 2559 -2657 1047 3788 -2461 -3590 2169 1436 -1499 1548 2184 -2725 -2813 1718 1274 -1340
1302a340K641J129n241q5N745j664l310M339j78o671L308N561n321p91O334m312
$$ -1340 1301 2430 -2811 -2896 2849 1185 -2125 2214 2036 -4635 -1327 4234 -1087 -1878 4456 144
1318A44n556O579K319o227K948L956o315j992O287m23l871L347J510n272o49N146
$$ 144 -5412 1167 3486 -2741 207 4163 -2152 -4144 2143 1720 -2151 1196 2706 -2566 -3215 1931
1334A931o55k690K439J388n047k70N404j423l387M317M38o527K491N429m523j329
$$ 1931 1276 -1414 1025 2413 -2634 -2904 2500 1077 -2310 2007 2445 -4082 -1591 3838 -685 -2014
1350b014N656k854n751N433L263n960J568M809n630k802O249r0m100L140J978
$$ -2014 3642 788 -4963 470 3733 -2227 -659 4150 -1480 -4282 1967 1877 -2223 917 2895
1365B895n183m39M400q41k109K548M05m137L51M079r55k493K943P78n176J001
$$ 2895 -2288 -2727 1673 832 -1277 1271 1676 -2461 -2110 1969 1014 -1479 1464 2242 -2934 -1933
1381a933N138l115k305M682r03o067M240M069n378k16N522m101m078O075R03m834
$$ -1933 3205 90 -2215 2467 1564 -4503 -263 3806 -1572 -1788 3734 -367 -4445 1630 2533 -2301
1397b301K547L003n163j099M935k90l429K916R74m315O4M172r81k713K687J054
$$ -2301 246 3249 -1914 -3013 1922 1632 -1797 1119 2093 -2222 -2158 2014 1033 -1680 1007 2061
1413B061m832J010M398k295k573M404m67n796L190M482m815n24N044l327m085
$$ 2061 -2771 -1761 2637 342 -2231 2173 1706 -4090 -900 3582 -1233 -1757 3287 -40 -4125
1428d125N217J689n024K381L262n334j166N332j031l178L241O85m254N36L544
$$ -4125 1092 2781 -2243 138 3400 -1934 -3100 2232 1201 -1977 1264 1949 -2305 -1769 1775
1443A775r12k424K569O48l839J54M392j373k932L312M36m938J589M796l354k296
$$ 1775 863 -1561 1008 1656 -2183 -2029 2363 990 -1942 1370 1806 -3132 -1543 3253 -101 -2397
1459b397N160j621n289M439K982n080O78M796m590k591N426j21m197L119J779
$$ -2397 2763 1142 -4147 292 3274 -1806 -1128 3668 -922 -3513 1913 1792 -2405 714 2493
1474B493m781J82M202j456k249K650P22l773M14L852j499k318K753L07m344J453
$$ 2493 -2288 -2106 2096 640 -1609 1041 1763 -2010 -1596 2256 757 -1561 1192 1499 -2845 -1392
1490a392M224k887k028M500j192m954L938K953m799O58M256l915k904N293K52
$$ -1392 2832 -55 -2083 2417 1225 -3729 209 3162 -1637 -979 3277 -638 -3542 1751 2003
1505B003m379K456K570m446n79M593j275k771K670P94l590J72L559j063j993K247
$$ 2003 -2376 80 2650 -1796 -2375 2218 943 -1828 842 1636 -1954 -1782 1777 714 -1279 968
1521I68K45l438Q41L717j694k305K871Pm267K396L807l877r34M234k446l697M698
$$ 968 1213 -2225 -1384 2333 639 -1666 1205 1212 -3055 -659 3148 -729 -1663 2571 125 -3572 1126
1538A126J439m785J819L304m516r95M870j138l277L103R63m305R73L569j810j811
$$ 1126 2565 -2220 -401 2903 -1613 -2608 2262 1124 -2153 950 1913 -2392 -1419 2150 340 -1471
1554a471K592k4k987P71L154j742j922K602L52l700J615L624l252j839M565j741
$$ -1471 1121 1097 -1890 -1119 2035 293 -1629 973 1325 -2375 -760 2864 -388 -2227 2338 597
1570E97m099L882K445m676P86L843l563j958M710p36l305K749J343l873L43L412
$$ 597 -3502 380 2825 -1851 -1065 2778 -785 -2743 1967 1231 -2074 675 2018 -1855 -1512 1900
1586A900j386j776J854M88k670M84K693r51k063K060Q18l586J096L633k632j852
$$ 1900 514 -1262 592 1080 -1590 -1106 1587 636 -1427 633 1451 -2135 -1039 2594 -38 -1890
1602a890L875r22m280L313K713m404J27M217k778l070M859K78m293K161K493l921
$$ -1890 1985 1063 -3217 96 2809 -1595 -1468 2749 -29 -3099 1760 2038 -2255 -94 2399 -1522
1618a522m17M069j564k331K580Q17l528R30L064j639j945K514K36k938N77L103
$$ -1522 -1939 2130 566 -1765 815 1632 -1896 -966 2098 459 -1486 1028 1264 -1674 -1097 2006
1634B006j897j757L080q0l678J874L195l347q35L496j896l142L972J361m303J146
$$ 2006 109 -1648 1432 1352 -2326 -452 2743 -604 -1439 2057 161 -2981 991 2352 -1951 -805
1650h05L412m022j030M444j064k983K668P96l194P42K905j734j584K315K37k916
$$ -805 2607 -1415 -2445 1999 935 -2048 620 1416 -1778 -1036 1869 135 -1449 866 1103 -1813
1666a813R03K640j528j741K549K55l247R33L669k912k048M051p69l784L208J975
$$ -1813 -910 1730 202 -1539 1010 1265 -1982 -1049 2620 -292 -2340 1711 942 -2842 366 2341
1682B341l780L93L506l340j446M224l78l775K416J809l945N43L430j333k179K198
$$ 2341 -1439 -1046 2460 -880 -2326 1898 1520 -2255 161 1970 -1975 -1432 1998 665 -1514 684
1698F84M95k589L32K548r66j940J969Q37k937O54K888k253j359L194p11l346K602
$$ 684 1179 -1410 -1078 1470 504 -1436 533 1370 -1567 -913 1975 -278 -1637 1557 846 -2500 102
1715A02K581l793j71L152k116k505M002O25l812J910J900l466m3L578j586k187
$$ 102 2683 -1110 -1281 1871 -245 -2750 1252 1877 -1935 -25 1875 -1591 -1634 1944 358 -1829
1731a829K772M16l099O34L033j751j529K086L11k514P07K369j376j382K041M0
$$ -1829 943 1359 -1740 -1106 1927 176 -1353 733 1044 -1470 -763 1606 230 -1152 889 929
1747I29k825J679K358k824o28L193j645k840L524J564m288Q09L518l267j412L896
$$ 929 -1896 -217 2141 -683 -1311 1882 237 -2603 921 2485 -1803 -994 2524 -743 -2155 1741
1763A741o20k893K289R98k973O43K721k069j016K032K46k422N58K342j397j786
$$ 1741 1121 -1772 517 1515 -1458 -815 1906 -163 -1179 853 1099 -1323 -765 1577 180 -1606
1779a606K275P98l396J080L096k467j609K999j50l385K787J938l873O12L354l014
$$ -1606 669 1467 -1929 -849 2247 -220 -1829 1170 1020 -2365 422 2360 -1513 -901 2453 -561
1795e61j686M106p44l388K780J528l675N78K887j438j851K164K22k158N91J720
$$ -561 -2247 1859 1115 -2273 507 2035 -1640 -1062 1825 387 -1464 700 922 -1236 -645 1075
1811A075j131j128J844o7k157J167K227j999j429K914j72l341K103K345k913o78
$$ 1075 -56 -1184 660 593 -1564 -397 1830 -169 -1598 1316 1144 -2197 -94 2251 -662 -1340
1827a340L162j516k302L056L82l064J618J939l146j33L401j604k142K313R79l224
$$ -1340 1822 306 -1996 1060 1442 -1622 -4 1935 -1211 -1344 2057 453 -1689 624 1603 -1621
1843a621O01K601j329j319J638M83k192M19K084j188j114J688N4k390J412K095
$$ -1621 -1020 1581 252 -1067 571 1054 -1138 -719 1365 177 -937 751 805 -1585 -173 1922
1859A922k884p93L630j446k795L067J371l740P52L009k759j081L236p20k377K309
$$ 1922 -962 -1755 1875 429 -2366 701 2072 -1668 -916 2093 -666 -1747 1489 769 -1608 701
1875G01L04k333Q31K371k028j105K201j89k114P05K227j306j583J748O56k097
$$ 701 1005 -1328 -497 1874 -154 -1259 942 753 -1361 -656 1571 265 -1318 430 1086 -1011
1891a011K73K274j582j082K398r03k212K447J186l059L35K906k358k015L649K90
$$ -1011 -738 1536 -46 -1128 1270 367 -1845 602 1788 -1271 -936 1970 -388 -2403 1246 1536
1907A536l377J536J980k493l96K482j026j544J986J2j683R68J351j821o18J930
$$ 1536 -1841 -305 1675 -818 -1214 1268 242 -1302 684 696 -987 -19 1332 -489 -1107 823
1923H23q5k129R96K078j711j457K396J20k481J146J997k256n66K550j383j916
$$ 823 738 -1391 -395 1683 -28 -1485 911 1031 -1450 -304 1693 -563 -1129 1421 38 -1878
1939a878K916K02l073K012J924l486j97L411j313k424K338Q78k282J82J854p07
$$ -1878 1038 1240 -1833 179 2103 -1383 -1580 1831 518 -1906 432 1310 -972 -790 1064 357
1955C57j194J029M16j477P01J199j054q91J847j22k394J493K211k659j035L083
$$ 357 -837 192 608 -869 -168 1031 -23 -914 933 811 -1583 -90 2121 -538 -1573 1510
1971A510r23k610K215J517k863N92K021j707j041K770j039k152K358O31k645M13
$$ 1510 587 -2023 192 1709 -1154 -562 1459 -248 -1289 1481 442 -1710 648 1279 -1366 -953
1987i53K552j709j370K035N40k207N96J841j071j235Q98P31j418L71J509j648
$$ -953 1599 -110 -1480 555 1095 -1112 -516 1325 254 -981 -83 648 -770 -399 1110 -538
2003e38n38J977n63j925J928J675l463K82L080j905k136L130J93k728J343J653
$$ -538 -1076 901 338 -1587 341 2016 -1447 -1165 1915 10 -2126 1004 1197 -1531 -188 1465
2019A465k183j11K203j712r75K064J91k545J457J653j855q38J783J97j880M06
$$ 1465 -718 -829 1374 -338 -1313 751 942 -1603 -146 1507 -348 -1186 597 794 -1086 -680
2035f80K035j042j336J428M87j834O04J732j947k72K277j432j531K708J52l257
$$ -680 1355 313 -1023 405 892 -942 -338 1394 -553 -825 1452 20 -1511 1197 1349 -1908
2051a908J449K493k784r40L347q04k389J562Q12j624K55J389r06o22J177l1j587
$$ -1908 -459 2034 -750 -1690 1657 853 -1536 26 838 -786 -531 858 -48 -670 507 476 -1111
2068a111J110R59j010j268K219o6k121R17K122j976j248K787o21k035J622R14
$$ -1111 -1 958 -52 -1320 899 833 -1288 -371 1751 -225 -1473 1314 693 -1342 280 1194
2084A194k153N97J610j907p03K683p34k214J983J270k978O70K234j203j618J523
$$ 1194 -959 -362 1248 -659 -1362 1321 587 -1627 356 1626 -1352 -682 1552 349 -1269 254
2100B54L14j188J29J160p18o13J308k76j197J055P77j579m03J775k9k405J618
$$ 254 568 -620 -491 669 -49 -662 646 370 -827 228 1005 -574 -977 798 769 -1636 -18
2117a8J743k488n03K791j143j974K146M72k062Q68J272k094L03K240j590j655
$$ -18 1725 -763 -1266 1525 382 -1592 554 1026 -1036 -168 1104 -990 -687 1553 -37 -1692
2133a692K432J99k224P02J880j387j063J433N13j447J73J164m90q09J082J38j537
$$ -1692 740 939 -1285 -583 1297 -90 -1153 280 793 -654 -481 683 193 -616 466 604 -933
2150i33J008R49j951J01K316j501j833K400R76l026R63K060j876q25K333p05j674
$$ -933 75 1024 -927 -826 1490 -11 -1844 556 1532 -1494 -531 1529 -347 -1172 1161 456 -1218
2167a218J413L30j326N67J320j578l74J618j99j700Q35J422j092j115J666P09
$$ -1218 195 525 -801 -234 1086 -492 -866 752 553 -1147 -312 1110 18 -1097 569 1278
2183A278k235M96J505j043p29J288j97j573J850K98k039Q11J816j923q60K424
$$ 1278 -957 -461 1044 1 -728 560 363 -1210 640 938 -1101 -290 1526 -397 -1257 1167
2199A167l46k376J445J485k294j10J989q10j170J532n3r39L90Q81j273j96J208
$$ 1167 821 -1555 -110 1375 -919 -1029 960 150 -1020 512 459 -480 -90 791 -482 -678 530
2216E30k75j303R09J185j504p19J962J02k097R49J482j700m00J992r62j129J666
$$ 530 255 -1048 -139 1046 -458 -1177 785 887 -1210 -261 1221 -479 -879 1113 151 -978 688
2233F88k0j953J611Q38k177j29K736j357j747K062M14j814M62J111p78o96J040
$$ 688 668 -1285 326 1164 -1013 -1142 1594 237 -1510 552 966 -848 -386 725 -53 -749 291
2250B91m9n04K39N80o27j95P79j48j248P79J375j734o06K377q91j966J916R92
$$ 291 242 -262 -23 557 -70 -265 514 366 -882 -103 1272 -462 -1068 1309 418 -1548 368 1360
2268A360k582O27J952j794l76J904o36j409J589K73j757M14J630j394o88J288
$$ 1360 -1222 -595 1357 -437 -813 1091 455 -954 635 908 -849 -435 1195 -199 -887 401
2284D01L82j632L93J540q86j065Q07N62j067L16J123r03o46J434o12j336J607
$$ 401 783 -849 -456 1084 198 -867 -60 502 -565 -249 874 -29 -675 759 147 -1189 418
2301D18P59k026L42J784j274j405K419m13j615Q43J156j316k26J518p84p94J106
$$ 418 1177 -849 -507 1277 3 -1402 1017 604 -1011 -168 988 -328 -554 964 180 -614 492
2318D92m6j439J241P83j205n61J292j24j313P84J201j085j093J297M33j255L35
$$ 492 446 -993 248 1031 -174 -735 557 433 -880 -96 1105 20 -1073 224 657 -598 -263
2335b63J161j446r3J618q92j049J660k8j916J186J415j943o12K225n58j722J691
$$ -263 898 -548 -641 977 85 -964 696 668 -1248 -62 1353 -590 -1202 1023 465 -1257 434
2352D34M89j722L35J302q07o16J054k20p23O39M41r39k59R31J36j430Q66J436
$$ 434 923 -799 -464 838 31 -585 469 249 -474 165 606 -333 -592 339 475 -955 -89 1347
2370A347j520o81J564k94j409J326P36j624J13J503j265p53J884p31j166J477
$$ 1347 -173 -854 710 416 -993 333 1069 -555 -442 1061 -204 -957 927 196 -970 507
2386E07M53j815K50J633r82r39J045J36r34L34J139n69o62N40L48q52J36Q18r49
$$ 507 960 -855 -605 1028 46 -893 152 288 -646 -312 827 258 -404 136 484 -368 -232 586 -363
2405c63m43J467k72j474J173J115k130J94J723q61j173J887r9j701P42J177j589
$$ -363 -806 661 389 -1085 88 1203 -927 -733 990 129 -1044 843 744 -957 -215 962 -627
2422f27K24J428j009r98J484j19j165P75J015j125o14R65O6j111P88P25q44p16
$$ -627 -403 1025 16 -982 502 383 -782 -7 1008 -117 -731 234 300 -811 -23 702 -142 -858
2440h58J342L3j334O60Q01j017k34J411o53j296J768K88j997P93J407j301p33
$$ -858 484 517 -817 -157 644 -373 -607 804 151 -1145 623 911 -1086 -293 1114 -187 -920
2457i20J693l56j391J203K39j040M06R13j038k90J029l37q76Q30P25j101k89J248
$$ -920 773 417 -974 229 468 -572 -166 747 -291 -581 448 111 -765 65 790 -311 -600 648
2475F48l26j099O72J177j074o60J114l49j043Q71P38j448L09J469j350n69J612
$$ 648 322 -777 -105 1072 -2 -662 452 103 -940 -69 669 -779 -470 999 -351 -920 692
2492F92k41j531J282O78j481jJ209o35p49J393k96p98L97L46n17k98R21j26o90
$$ 692 451 -1080 202 880 -601 -602 607 -28 -777 616 320 -478 -81 265 -252 -550 371 245 -445
2511d45L93N05o33n25J430l27j239Q20Q54j414o6J695r07j128J730n8j561J144
$$ -445 -52 453 -180 -705 725 398 -841 -21 833 -581 -647 1048 141 -987 743 685 -876 268
2529B68O10j326q8J659r53j108J345J85j390P24Q20r32l75Q36M7r43M22P11n55
$$ 268 878 -448 -536 1123 170 -938 407 592 -798 -74 746 -186 -561 275 322 -621 -199 512 -43
2548d3k41O58j39r22L31R01q93j75J323o22j187J369Q47j789J85J290j079l59
$$ -43 -284 374 235 -687 -356 545 -348 -523 800 178 -1009 360 1207 -582 -397 893 -186 -545
2566e45J216l33j225J173R4q19J47J104q72o31J237k92p78O98N74j021m27J054
$$ -545 671 338 -887 286 380 -439 -292 812 -60 -691 546 254 -524 174 748 -273 -700 354
2584C54p7q45M73P17p83l63J108o48o21P63N13j138K92J116j216o75J824l63j374
$$ 354 277 -568 -95 622 -161 -524 584 -64 -685 78 591 -547 -255 861 -355 -1030 794 431 -943
2603i43J284L40j487L65J097r14o31J225L5q69N08N38p35k18P06Q2q36M55L81
$$ -943 341 681 -806 -441 656 -258 -889 336 371 -498 10 548 -187 -405 301 383 -453 2 383
2622C83m73m18R15o4j019M37J008j055l10J105l97p57J010K84j330O16P94j156
$$ 383 -90 -508 407 343 -676 -239 769 -286 -596 509 112 -645 365 649 -681 -65 729 -427
2640d27k0J198p26q58R88K96j064K68R53o89l60P02K00r05M11O77r02j59P59J75
$$ -427 -447 751 25 -833 155 451 -613 -345 608 -81 -441 261 461 -444 -33 644 -258 -417 342 517
2660E17j129P02P60j105l23J432n46j030R17N84j267K61J102j086o65J523l61
$$ 517 -612 90 850 -255 -578 854 308 -722 195 779 -488 -227 875 -211 -876 647 286
2677B86j015J022M98j405L29J031r85m53Q27o6p72P26L75n35l79J018l61n66K91
$$ 286 -729 293 791 -614 -285 746 -239 -692 135 69 -703 23 398 -137 -516 502 141 -425 -134
2696a34N73l61n17J008m28r15R70N88j460R7J248j119k05J086k8j267O83Q93j199
$$ -134 439 78 -439 569 141 -774 196 784 -676 -579 669 -450 -655 431 403 -864 -181 712 -487
2715d87n0J342p46p60R64n3p64N84N53o44m18P97j59p31K73O03k18p76R79J70
$$ -487 -537 805 59 -701 263 210 -554 30 583 -61 -479 318 159 -572 -299 304 86 -690 289 459
2735D59r83M81N94q99l18J435m70j048J144J95j248P47P89j571J50J113l68q23
$$ 459 -524 -43 551 -348 -666 769 299 -749 395 590 -658 89 878 -693 -543 570 202 -621
2753f21R56L36j399N73N44o81l17J034Rj067N62L37m82o6N81j68p87N27O14o10
$$ -621 335 671 -728 -155 389 -292 -609 425 434 -633 -71 266 -216 -282 299 131 -656 -129 485 -125
2773a25j08N83K9q37N35N62j072L0J216q07n78J065l42q67P58N86j376L94J061
$$ -125 -233 350 379 -458 77 639 -433 -403 813 6 -572 493 151 -716 42 628 -748 -354 707
2792G07o24o27P70o3o77O96P5l38l49O62nm86R1O33p51j11P90m16p11J035L60
$$ 707 83 -544 226 163 -514 182 257 -81 -430 232 227 -259 -168 465 -286 -397 393 -23 -734 301 661
2813F61r64P4Q94o54r05J599j74j076M36O62r19J5R64p38m45J026k42o07K53O00
$$ 661 -303 -229 665 11 -894 705 531 -545 -109 553 -366 -351 613 -125 -570 456 214 -393 -140 460
2833D60n37q8M61j24n51J26O82n60k24O53k09o93L62Q00q54O2N88L3r84P53M92
$$ 460 -77 -165 296 172 -379 -253 429 -131 -355 298 89 -604 -242 558 -296 -234 354 387 -597 156 648
2854F48j373M71R11q02l98J073m38q40Q27L65r01M32O67n64m25Q04j34p39J23
$$ 648 -725 -254 657 -145 -543 530 92 -748 79 444 -457 -25 642 78 -347 457 323 -416 -293
2873b93P75p26J48L68j37m58K81N66o18l57O97J05r69R20L57j314K50J126o89
$$ -293 482 -244 -96 272 135 -323 -42 524 -94 -451 246 351 -618 302 659 -655 -405 721 32
2892C2p23J365m23j017Q42M59p58m2Q65p38m82Q85j0p13J71O27n49p3N70q4n57
$$ 32 -691 674 251 -766 76 535 -223 -265 600 -138 -620 265 255 -458 -287 340 -209 -282 288 204 -353
2913c53L94K97m25l33Q08j49p64M17N71n29l94R45m10o57O22M71j161M21P06r08
$$ -353 41 338 -87 -420 388 239 -525 -108 463 -66 -460 485 75 -582 40 511 -650 -229 477 -431
2933d31j31R65l26p28Q54L71j036N81M20p54O1N26n43l06M18N28m47l75M78J46
$$ -431 -562 403 77 -651 203 574 -462 119 539 -215 -154 372 -171 -477 -59 469 22 -353 125 271
2953B71p01J62N34n09J1N85m05n39J026J35j242P07N98r47k65J099l26q91Q76
$$ 271 -430 -268 266 -243 -232 353 -52 -591 435 570 -672 35 633 -314 -579 520 194 -697 179
2972A79N22r88J68O36l20n64Q04k09o41M47K69n65J95N71l22m04K77K38o32Q2
$$ 179 701 -287 -119 517 197 -367 437 228 -413 34 303 -262 -67 504 182 -222 55 293 -339 -257
2992b57M97k2o35N08L92r01K4R82o89m14Q62N0p79N46K80r34N8Q30m25l48O87
$$ -257 240 218 -417 91 483 -418 -394 588 -101 -515 347 397 -382 164 444 -490 -432 398 -27 -375 312
3013C12k16m03L86J86n09p2M02j92k73M17L78o03j51M77j33k10L51K38p33L2O60
$$ 312 96 -307 79 265 -244 -316 86 -106 -379 38 416 -187 -338 139 6 -204 147 385 -348 -316 344
3034C44j79n85O99j02p92P28M37q67j39R14k36p26N52J39o42L37M72n39j4L60
$$ 344 165 -420 279 177 -615 113 550 -317 -456 458 222 -504 48 187 -455 -118 354 -185 -199 161
3054A61J70o27K59K96n41P1M91k32m52N66J84l87k63P56O1r78Q05K01j155K33
$$ 161 331 -296 -37 259 -282 -211 280 48 -404 162 346 -41 -304 452 513 -465 340 541 -614 -381
3074c81P77l76m81R08k47p46M17N63n75p5O99m11j99O17k12o45O23J46n71j11
$$ -381 396 20 -461 447 200 -546 -129 434 -141 -216 483 72 -127 490 278 -367 256 402 -169 -280
3094b80J68K28o9l7j25r3JN39k83k84M55N7n02N8O41l60n48O06j49m24N26K18
$$ -280 -112 116 47 10 -115 -208 -207 332 49 -235 220 277 -225 -167 474 114 -434 172 23 -401 125 343
3116C43o78O0N75m30m43N04L73p05M77M62p51j42O22L6n12K07J73l0k77M58j80
$$ 343 -335 -275 300 -130 -573 -69 304 -401 76 538 -213 -355 267 303 -209 -2 171 141 -136 322 142
3137A42o64N91K80o99K41O85n05n82Q36r2q30M14Q38q76j65R63m41o35O62J89
$$ 142 -522 69 349 -350 -109 576 71 -511 325 233 -597 -183 655 -221 -386 577 136 -499 163 352
3157C52n31JN46o36mO30l61p0o5L39k45n8K48O9k86k24O08o07J35M83n2q07N82
$$ 352 -179 -178 368 -268 -272 358 -3 -73 -138 201 -44 -102 146 215 -71 -295 313 -294 -159 324 272 -535 47
3180D7K85p21l7Q99k92o69J024n07o51P12M70j073L71N04o13j26P84l21l74K95
$$ 47 332 -389 -426 473 181 -488 536 29 -622 90 560 -513 -142 362 -251 -377 407 86 -288 7
3200GK77m70kO47l50j91K5K71l77j24N91q5o79L72N61r60L54L65k76k78O12j49
$$ 7 284 -186 -188 459 109 -82 -57 214 -163 -287 304 219 -460 -88 473 -487 -133 232 -44 -322 290 141
3222A41m70L44L07n96j35Q89p41m4M71l9n14L88M58m03m84P84n17k85M19J12o8
$$ 141 -329 15 322 -274 -409 480 -261 -305 166 127 -387 1 459 56 -428 356 -161 -446 -27 85 17
3243A7k51M53m7n09J91O60p89j16O89k10n65N61J69p56N71M40o92j48P04l07n74
$$ 17 -234 219 172 -337 -146 514 -275 -391 298 88 -477 84 253 -503 68 508 -184 -332 372 65 -509
3264e09P82R3p82M13M79n10j86N16m3l85P6L89k80r9K26k21k78K13K99k85k8N36
$$ -509 273 366 -416 -3 476 -34 -220 296 253 -132 -56 333 53 -46 180 -41 -319 -106 193 -92 -120 416
3286D16l49k27K10L18o74J26O36p28j49P47m04m67Q22J41r06J47N19j45k63J86
$$ 416 67 -160 50 368 -306 -180 456 -272 -421 326 -78 -545 277 418 -488 -341 178 33 -230 -44
3306d4K76m24J19N95o79k68N94j74k48J69J96k58o1M89k7k88J02L17o12O3O40
$$ -44 232 -192 -73 522 -157 -425 169 -5 -253 -84 112 -146 -207 282 255 -33 69 386 -226 -163 477
3327D77n52j38L55J89o84J69O32o54q7M67j64n25J009m74k57J15M10m28p2K58
$$ 477 -75 -213 142 331 -353 -184 448 -206 -293 174 10 -515 494 20 -237 -122 288 -140 -212 46
3347D6M4m04J49O78n63m6K22L22n44l6L68l93k54O47k11l62M25M7n03K79O63p10
$$ 46 90 -314 -165 513 -50 -96 126 448 -96 -132 236 -157 -411 236 25 -337 88 135 -368 -89 574 -136
3369a36k32R26n99n19Q76m0p00J9R28n60k58O74j31o27M14J38j38k20L54k12l65
$$ -136 -368 558 -41 -560 316 276 -424 -405 523 -37 -295 379 248 -379 35 173 35 -185 169 -43 -408
3390d08M98K73m39k33O10j61k74K52L63o69%N69m35l71M99K68m93K04K77o98O2
$$ -408 90 363 -76 -309 301 140 -134 118 481 -188 -188 381 -54 -425 74 342 -151 53 330 -368 -306
3411c06N27l94j29O42j50m26R0M62o11J15L66k60j82L72J7l33L03K07Ko76L64
$$ -306 221 -173 -302 340 190 -236 -146 316 -295 -180 186 -74 -256 116 133 -200 103 310 312 -364 0
3432@L57n48j66O00n28n8N87J48p46L88M77r01J9P64l52k88L85J61n32J61N42
$$ 0 357 -191 -357 243 -285 -343 244 392 -354 34 511 -390 -371 393 41 -247 138 299 -233 -72 470
3453D70m55k26M36p6k31M10j12k69j01L34l90o9M58N9m74J69K67P0o12O15M1o95
$$ 470 15 -211 225 149 -82 328 216 -53 -154 180 -210 -279 179 238 -236 -67 200 270 -342 273 314 -381
3475c81K10O87n76n20Q10j21m40N10J24o93K94L48k17l70O04k16l90M43O4l19
$$ -381 -171 516 -60 -580 230 109 -331 179 303 -390 -96 252 35 -335 269 53 -337 106 170 -149
3495a49%M26k72k14L70J26j03k22K73k05k94J86J56l50j22O14l88j48N66J07p36
$$ -149 -149 277 5 -209 161 287 184 -38 235 30 -264 -78 78 -272 -394 220 -168 -316 250 357 -379
3516c79L28L88n47j2N44j24o15P43j75n63K80M43o60K71K08k46L3n0K81j21j93
$$ -379 -51 337 -210 -222 322 198 -417 326 151 -412 -132 311 -349 -78 130 -116 -83 -133 148 27 -166
3537a66L43k3l93J94L22l93o7J06k7l22M90M95q84L65M89p49M1N18m16l57O81
$$ -166 177 154 -239 -45 277 -116 -183 -77 -104 -426 64 559 -325 40 529 -220 -179 339 -77 -434 247
3558B47j61l92L95K71n20O2K12k11p5O9L08m41J38L39m8l93K93M9k52k35N01P9
$$ 247 86 -306 89 360 -160 -98 114 -97 -172 -103 205 -236 -98 241 193 -200 93 142 -110 -345 156 235
3580B35l93J59R0k73P9N30o58l1M53J64n91M07K24r20M55M41n38O0L22j69l48
$$ 235 -158 1 91 -182 -103 427 -231 -262 191 355 -236 171 395 -525 -70 371 -167 -107 215 46 -302
3601c02K51N00o48J84R7k9r8K9K93j98j94L37k99n4J98J70k41k83O09l21l55O07
$$ -302 -51 449 -199 -15 82 53 -45 -16 277 79 -115 222 -77 -131 67 237 -4 -287 322 1 -354 253
3623B53p8m10J74M08n15J8M30m93j96N60Q9p79N49K16k63j41L04J0k74K17l5q0
$$ 253 175 -235 -61 347 -168 -150 280 -213 -409 151 240 -539 10 226 -37 -178 126 136 -138 79 44 -36
3645c6j25L23j20l50K59J14l95o6N14%l40K55J37o01L98K57l57k18L93P0m88K81
$$ -36 -161 162 42 -308 -49 65 -330 -396 118 118 -222 33 170 -431 -33 224 -133 -351 42 112 -376 -95
3667i5K27l24Q9K61l07k30L89L26o17M30P3k82j60K98l3qj58M18m17k4M07j00
$$ -95 132 -192 -103 158 -149 -379 10 336 -281 149 222 -60 -220 78 45 37 -121 297 -120 -144 263 163
3689A63p8j03K03l85J94Q0M6l21L14n4l47L44N6l02j29K91M2j46L46m5k52K7J33
$$ 163 85 -18 185 -200 -6 74 120 -201 113 59 -288 56 112 -190 -319 -28 14 -132 214 169 -83 -56 77
3712G7j73r0K20M1l75N31m7k26j80K83J04k56k5N31k18j15K86m72j18N25l4p17
$$ 77 -96 -186 34 75 -300 231 184 -42 -222 61 165 -91 -116 415 197 82 368 -104 -222 303 269 -448
3734d48J74N00n70p2P77j02n60K99R9m87K79N11o66k7O43k33l58L2L51k95K97
$$ -448 -274 226 -344 -416 361 259 -301 -2 97 -390 -111 400 -266 -293 350 117 -241 -209 142 -153 144
3755A44j51R5l12N80j91j87L5K14j35j68J50L3l26J96L11m13k08P88j63n99K39
$$ 144 -7 88 -224 356 165 -22 13 227 92 -76 74 107 -219 -23 288 -125 -333 455 292 -307 -68
3776f8K98l39r9N86o20J52K72j22l58L46L6k20J41J25k40J50P4j00j41L27r5J08
$$ -68 230 -109 -208 378 -242 -90 182 60 -298 48 84 -136 5 130 -110 40 114 14 -127 200 105 213
3798B13n10M71J14m81P0K49M2m20M59J09o79J45M11k26r3L13k06l84N68J20n42
$$ 213 -297 174 288 -193 -123 126 168 -252 207 316 -363 -218 193 -33 -126 187 -19 -403 165 285 -257
3819b57j23P53n08n4L94l13j61M32o8r7l54N93J5l64P8R7l54N2L16j83N5K34M1
$$ -257 -380 373 -135 -189 205 -108 -269 163 95 -2 -356 237 252 -112 -34 63 -291 -239 77 -106 -51 183 224
3842B24n37L16L49m20k47N15q8m13L53J81m85K66J04k33J25n3N8k23K99jj34j67
$$ 224 -313 3 352 -68 -315 200 112 -301 52 233 -252 14 118 -115 10 -43 15 -208 91 90 -44 -211
3864b11K85j1j74j90N52k15l65N63q4m37M48J85o38J54N26l14k97L99j35k27J43
$$ -211 74 63 -111 -301 251 36 -329 234 150 -287 161 346 -292 -138 388 74 -223 176 41 -186 -43
3885d3J3k13K47K95k14n64M95n1k00M20m4p2R8k01J89l38P6L71m18L1K56k22R8
$$ -43 -30 -243 4 299 85 -479 16 -35 -235 185 141 69 167 -34 155 -183 -107 264 -154 -123 133 -89 9
3908Il3M59o72L7M29k04k99K51J32j35k30K76j59j87N68l00j18K19p0k51L54M64
$$ 9 -24 435 -237 -200 229 25 -274 -23 109 -26 -256 20 -139 -326 242 -58 -176 43 -27 -278 76 540
3930E40p43j00O47j57j74P2k1N3j44m6K93k82J50j04J2k33N47k70k37J63K83m69
$$ 540 -203 -303 344 187 13 85 64 117 -27 -73 220 -62 88 -16 -4 -237 310 40 -197 -34 249 -220
3952b20Q6L46l41N7L07k8n31M62Jk72J43K04j68k92K52q6m7J71J12m35K55M8j30
$$ -220 -134 212 -129 -72 235 207 -324 138 139 -133 10 214 46 -246 6 -80 -127 44 156 -279 -24 24 -106
3975a06r4J79L10k46l24M43j17J7P6j04j47J47J34m81O2N06j29r8l5L26m93J55
$$ -106 -200 -21 289 43 -281 162 45 62 138 34 -113 34 168 -313 -251 255 126 28 -7 319 -174 -19
3997a9M1J14j75M11l46j43K12K6l09K6M68l02j60K7K29k51J02J44%j83K0j0M7
$$ -19 22 136 -39 372 26 -117 95 121 -188 -162 306 4 -156 -129 100 -151 -49 95 95 -88 -68 -78 -31
4020c1l6M18k31k72K57j47l7p3M35m71QL33k97j00M75k3m59J67L49l69j10L64
$$ -31 -67 351 120 -152 105 -42 -79 -152 283 -188 -180 153 -144 -244 231 208 -251 -84 265 -104 -214 150
4042A50j54j04l1K49o5r5Q1r9L2j88M81k92j14K23n0j01K08L2l62P4L89j70l92
$$ 150 -4 -108 -139 110 45 -50 31 -68 -36 -224 257 -35 -149 74 24 -77 131 163 -199 -125 264 94 -298
4065b98M52j41l27L28j04l15K52L23j88l19N15k98k37L64J34k8j36J00j5j64Q5
$$ -298 154 13 -314 14 -90 -405 -153 170 -18 -337 178 -120 -357 7 141 113 -23 77 62 -102 -17
4086a7M8L0J14o9j46j26J42J43l32p3M54k54j39N64m8n35R6K97j70k82M87K1l46
$$ -17 31 61 175 106 -40 -166 -24 119 -213 -286 168 -86 -225 339 291 -244 -148 149 -21 -303 184 205 -141
4109a41K54k13O4k7P4N6J62O3l08J2L3J22j50n8m6J15l9o4L58l87K50l6q1m1K32
$$ -141 113 -100 -36 -63 11 67 229 292 -16 -4 29 151 1 -57 -103 12 -27 -91 267 -120 130 94 13 -28 204
4134B04l8m00L0K31j76k14N22K9l29J48J19l07Q7K29l55K2O7K02l28K65l19J00
$$ 204 166 -234 -204 27 -149 -363 159 188 -141 7 126 -181 -94 135 -220 -198 -131 71 -257 8 -311 -211
4156b11K22J14j73m9J52J03j28k39N30k69k77L18k6k57N4M02k90k31M47k53p6
$$ -211 11 125 -48 -97 55 158 30 -209 321 52 -225 93 67 -190 -136 266 -24 -255 192 -61 -137
4177a37P2L27n27K22L01k63k02J90n8J09R6P0k71J76k67J79Q4r0k7j37K32Ok00
$$ -137 -65 262 -265 -43 258 -5 -207 -17 -75 34 130 200 -71 105 -162 17 101 11 -16 -153 79 85 -115
4200a15k36M38K29n04r5M07r5o6K8J49k58J14L26k77k76O42n42j13M56j80l16
$$ -115 -351 87 316 -188 -283 124 29 -37 -9 140 -118 -4 322 45 -231 411 -131 -244 212 32 -284
4221b84L59K43n07K54J60l19j70M22j36J02k43K47j83O6l3J60j63M7J38k55j53
$$ -284 75 318 -189 65 225 -94 -264 158 22 124 -119 128 -55 11 -22 138 -25 22 160 -95 -248
4242b48L65j43j25J49K50j18k32K29j99j83L08L61m74L3J17j18PJ71j67j92K38
$$ -248 117 -26 -151 -2 248 130 -102 127 -72 -255 53 414 -60 -27 90 -28 -21 150 -17 -209 29
4263B9J59l53K46j8Q6k06nJ11L1j86J59l07K23K08Q0l46O5M44n09q8L68j44p4
$$ 29 188 -165 81 63 149 -57 -62 49 80 -106 53 -254 -31 177 257 -89 -24 420 -89 -177 191 47 -27
4286b7J09J68l39KK2J59k71L81k00j75J1N51m04l7O5k08J57K53r8j26j06N1K22
$$ -27 82 250 -89 -87 -65 94 -177 204 4 -171 -160 391 -13 -50 15 -193 -36 217 119 -7 -113 -62 160
4309A60k78R8J34j77k83M09j63N6P5J92n05K52L69l96o7J84M4l0O7k62l6Q0J63
$$ 160 -118 -20 114 -63 -346 63 -100 -44 31 223 -282 -30 339 -57 -124 60 104 74 141 -121 -157 -77 86
4332H6j58j35J64L15k33j64J09j08J79k5j83K8O4o1P8k02J80J00l29K83K05k50
$$ 86 -72 -207 -43 272 39 -125 -16 -124 55 30 -153 -125 -61 -122 -44 -246 -66 34 -295 -12 193 -57
4354e7j26J76k3k19M17k10KL38m61O6J83M3k61l9M20n1l86J71R7l51L05j6Mk4
$$ -57 -183 -7 -30 -249 168 -42 -40 298 -163 -97 86 129 -132 -171 249 198 -188 -17 80 -271 34 18 22 -2
4378bj95L42k67J73R7j21m8j61J48qj92M41m27J1J78J17k67K64J8m75M73R3j90
$$ -2 -197 145 -122 51 148 27 -21 -182 -34 -42 -234 207 -220 -209 -31 86 -181 83 101 -374 99 192 2
4401Bj51K42j95j98M13l20m5J33M73k41k93K91J29l79j06L08k20K99l61J83J05
$$ 2 -149 93 -102 -300 113 -207 -252 -119 354 113 -180 111 240 -139 -245 63 -157 142 -219 -36 69
4422F9k5J90l66j59L39J03l15P5K57l08l4O3n8O9J47J31l98N21k10k36m4J46L62
$$ 69 44 234 -132 -291 48 151 -164 -89 168 -140 -174 -111 -169 -100 47 178 -220 301 91 -145 -189 -43 319
4445C19r1l78L05j47k24L74l28q2K92O7l52L84j49P6j51J87Jk53N4J98L6l59L65
$$ 319 228 -150 155 8 -216 158 -170 -252 40 107 -245 139 -10 66 -85 102 103 -150 -96 102 138 -221 144
4468A44j60j26L54q5l05R7K66m23L17K00q7j59r2J40j02J54j03K5O2k58K38N1
$$ 144 -16 -142 212 127 -178 -81 185 -238 79 279 192 33 -59 81 -21 133 30 55 117 -141 97 148
4490A48k03L03q3m55K46K11m85J68J93j13j70M58p5m22K49N9k56J24K22oj63K19
$$ 148 -55 248 165 -290 -44 167 -318 -150 43 -70 -240 218 143 -279 -30 29 -227 -103 119 113 -50 169
4512A69M0k46n6J50p4n4L44l49j39J84P8j97K34P9oj77j77L45k50K67j75m9n0
$$ 169 209 -37 -93 57 -17 -71 273 -76 -215 -31 47 -150 84 163 157 -20 -197 148 -102 165 -10 -59 -109
4535a09L07k46O7P3J6q3j25j0K98k56J35p3j07K84j65Q8n5k0k27PK12J34n8k9
$$ -109 198 -48 19 92 108 25 -100 -110 188 -68 67 -6 -113 171 6 94 39 19 -208 -201 11 145 87 58
4559E8j16Q7j2J84k9q8j58L5n0K3l8J37j48L47l00K5K6k30K64q0K67r4j69J11
$$ 58 -58 29 17 201 172 84 -74 -39 -89 -66 -104 33 -115 232 -68 -43 -17 -247 17 -63 204 110 -59 52
4583E2K16k34j79K60L4m49M25Pn4M3K1J7p6L8n8m32M12o7j3O4k9Q7k02K53O0k08
$$ 52 268 34 -145 115 149 -300 125 132 78 121 142 159 83 121 63 -369 43 -24 -37 27 -2 85 -117 136 196 -12
4609a2Q6qK74m85J49J0p6q5M25k58R2J59l35J6J09N2l56Q6N9J23j42J68J32k41
$$ -12 74 66 340 -145 4 14 -62 -147 278 20 112 271 -64 -48 61 113 -243 -157 -98 25 -117 51 183 -58
4633e8K32k46L9J20j75J49j63M8J93k3l75K51o7j03K57J43j78k14K38L0k13J58
$$ -58 174 -72 -33 87 -88 61 -102 -54 139 116 -259 -8 -75 -178 79 222 44 -170 68 98 -115 43
4655D3m9j66M27k2j93%J71J16n04K35J34Jl13J17N5j57L07j21r3Pj23j34P8J77
$$ 43 -6 -172 255 233 40 40 211 327 -177 58 192 193 -120 -3 52 -105 202 81 -12 -5 -128 -262 -184 -7
4679gk9P0K5P7j80p0L70k59n2J84j01k08OK01m9j8J73k78J06J32n1j44J77j74
$$ -7 -36 34 59 136 -44 -114 256 -3 -55 129 28 -180 -174 27 -22 -40 133 -145 -39 93 42 -102 75 -99
4703i9L0j31M56q8k93K16j41J55l53K43J49k59Q6J4J82j54l3L4j28M71m27j91
$$ -99 -69 -200 256 168 -125 91 -50 105 -248 -5 144 -115 -29 -15 167 13 -20 14 -114 357 -70 -261
4725b61L42K0m2K6pp9J29Q7L4m59L09P2j60j2K6N0L0l54L53j47o3J37Pj63L09
$$ -261 81 101 59 85 78 -1 128 215 249 -210 99 171 11 -1 25 75 105 -249 104 -43 -106 31 38 -125 184
4750A84k14R4q4K39l10L5l36O26l85o6J93k7N5q9q9n9K01L5K0k56M64k67j26K05
$$ 184 -30 64 -20 219 -91 -56 -392 234 -151 -217 -24 -51 4 -85 -174 -233 -32 3 23 -233 231 -36 -162 43
4774D3n7J55j86K49m44K66n0l4J3j8N7q6Q8KJ02j73J40qj03j0M2J24p8j4J89l26
$$ 43 -14 141 -45 204 -240 26 -24 -58 -45 -63 -6 -92 -4 -2 100 -73 67 59 -44 -54 -12 112 34 20 209 -117
4800a17Q0J20j16j84L19n2n4L0p2q3K57m7J67m53J01J30j45K48r9r1J2K19k40
$$ -117 -37 83 -33 -217 102 50 -4 26 -46 -129 128 81 248 -205 -104 26 -119 129 30 -61 -49 170 -70
4823g0J34k31L21j03j18L02l11Q1M4J69l10J00K17k41o5J83r0j0l97N16r2j52
$$ -70 64 -167 154 51 -67 235 -76 5 49 218 -92 8 225 -16 -81 102 12 2 -395 121 29 -123
4845a23K45j64j60J53J72l23M23l04R2L8oj63j23J04M1nk61L60J88k28kJ38q4
$$ -123 122 -42 -202 -49 123 -200 223 -81 11 49 43 -120 -243 -139 -98 -103 -364 -4 184 -44 -46 92 8
4868HK33j57j2j89M47k18k00oK34r2k81M17k54k0J28p0j73K28l4K59k01J67j65
$$ 8 241 84 72 -117 330 112 -88 -94 140 48 -233 184 -70 -90 38 -32 -205 23 -11 248 47 214 49
4891D9k0J01J8l88L17N6r7j33K55n7ol06K98J4l75J98L28j97j67J08J0j25J10
$$ 49 29 130 148 -240 77 133 36 -97 158 101 95 -211 87 101 -274 -76 252 55 -112 -4 6 -119 -9
4914iN8k82J32J28l49l8N21j46m8J58j08o7k4J76j20n1jP9J85j48kn5kr0J65j03
$$ -9 49 -233 -101 27 -322 -360 161 15 -33 125 17 -50 -74 102 -18 -69 -70 9 194 46 44 -11 -13 -103 62 -41
4940d1NJ82q5o4J45l42R1J25o6J13m5No7k49L62m7k20L63l2m59L25J57k91K52
$$ -41 -36 146 61 -3 142 -200 -109 16 -50 63 18 23 -44 -293 69 22 -198 165 133 -326 -1 156 -135 117
4964A17j49l01K61J5R5J31j67O8J79q9k48Nj45pL38l38j06M17o7j79Q4K34l84
$$ 117 -32 -333 -72 -57 38 169 2 70 249 160 -88 -83 -228 -235 103 -235 -341 76 9 -170 -86 148 -236
4987b36K27Q4k78o5L05K01k25J44k30j38L63O7k16N2q7Mj75K88q4j5n0m0J50K75
$$ -236 -9 75 -203 -268 37 238 13 157 -73 -211 152 219 3 55 -32 -28 -203 85 1 -14 -64 -104 46 321
5011C21l54k1K8l50M65k3o3O6P6k31PK31j56p2J72j56J57p8J59l22M96j97j48
$$ 321 -33 -54 -26 -376 89 66 3 69 145 -86 -79 152 -4 -76 96 -60 97 19 178 -144 352 155 7
5034Gn7j06J36j30m9K05m4K5J90n9j38m5K42k00k7l0K12m18L85j67O9M7k92K04
$$ 7 -50 -156 -20 -150 -199 6 -38 -13 177 118 -20 -65 177 -23 -50 -80 132 -286 99 -68 1 48 -244 -40
5058d0j4J39n0j27Q8r2j02K81r5N8j01j89L49j10J24K23k34l19K95n4J4q0K6j5
$$ -40 -54 85 35 -92 -4 -96 -198 83 -12 46 -55 -244 105 -5 119 342 108 -211 84 30 44 -36 -10 -25
5082b5n6QJ49k76N1M23l83O8l1J3l6Qj7N5q8L28l7k07K46j92J42j88J04j18j27
$$ -25 -81 -73 76 -200 -149 274 -109 -41 -72 -59 -95 -87 -104 -49 -137 191 154 -53 193 1 143 -45 59 -59 -186
5107a86L08J8j46j58J37K63k72m9j19N5J98j01J73o4J75l07m6L42j55r8o5K56
$$ -186 122 140 -6 -164 -27 236 -36 -85 -204 -149 49 -52 121 57 232 -75 -121 221 66 -32 -97 159
5129A59k87Q5M7J32o04L53L17j86K14k73p7K02R5l19K55p0j1j72J37lk20Q3J59
$$ 159 -128 -43 4 136 -468 -115 202 16 230 -43 -120 82 177 -142 113 43 32 -140 -3 -6 -226 -143 16
5152A6k72K04J28L6Jj79J83L7j53j5K7L3O4rj11q6j54J91O4j51J66k74N9L35j74
$$ 16 -256 -52 76 112 113 -66 117 154 1 -14 13 46 110 101 -10 -96 -250 -59 5 -146 20 -254 -195 140 -34
5177c4M8l8O4j84J2K39k04J58j65J85j86J42J12q6j94N9J58lK38j26l32r5P0K82
$$ -34 14 -24 40 -144 -132 107 -97 61 -104 81 -105 37 149 63 -131 -72 86 83 321 195 -137 -232 -162 120
5201A20m18L40K78l69J51m5J73j32j19J9m11L43J46p5j0J70n7k18J93M5j82k8
$$ 120 -298 42 320 -49 102 57 230 98 -21 -2 -413 -70 76 1 -9 161 104 -114 79 124 -58 -86
5223h6N6j04Q9L5P1l42J3L89k54J82K12Qm58L50Rj47K2P6j96j66M01j04k9p4J54
$$ -86 -30 -134 -45 -10 61 -281 -268 121 -133 49 261 269 -189 161 170 23 45 121 -75 -241 160 56 27 -47 107
5248A07k42J77j67J35l78O25rl51J06k77M04j86J38k55M1R6j70M00j55o6K14k66
$$ 107 -135 42 -125 10 -368 257 248 -103 3 -274 130 -56 82 -173 -132 -36 -206 194 39 -27 187 -79
5270g9Q6P2k13k27K41K99l76J94K18l39J68K82k93j44K45p5j78J92p0j13Q0J59
$$ -79 7 79 -134 -361 -120 179 -197 -3 215 -124 44 326 33 -111 134 59 -119 73 3 -110 -30 129
5292A29p0O2n0j92o5O1K43Q9n2k74K63r7Q4l15M67k68K51k11k2K13q7j79j60R7
$$ 129 59 121 71 -121 -186 -125 118 207 155 -119 144 47 131 -184 283 15 266 55 33 246 159 -20 -180 -83
5316h3L1J78O7l50J79J56k27k2J67k84K39j91lJ52n8K3j19J91j45J85r4O9j30
$$ -83 -52 126 193 -157 22 178 -49 -71 96 -188 51 -140 -143 9 -49 -26 -145 46 -99 86 -8 61 -69
5339f9K0K8%o1M16l30j00K24k83N4K42n7q4nO1k54J29M03m13q2J66K27n04Q4N4
$$ -69 -49 -21 -21 -82 334 4 -96 128 -155 -101 141 84 0 -5 56 -198 -69 334 -79 -161 5 232 -272 -188 -134
5364a34J24L7J15j96Rj59K57J00r1n4J80j59j75K01k42P7K58k99n8K75j52p0K70
$$ -134 -10 27 142 -54 -45 -204 53 153 62 8 188 29 -146 55 -187 -110 148 -151 -209 66 -86 -156 114
5387A14j29j26j3L55j19k91K92p0l8o6J91k50K30j08O5n8M5O1J81l2k50J81j50
$$ 114 -15 -141 -154 201 82 -209 83 13 -25 -91 100 -150 80 -28 37 -21 24 85 266 234 -16 165 15
5410A5k0rr9O8L3L8m57M74qj74K65l84J3J41R3j67J65K0L3k46J48L8r4L30j46
$$ 15 -5 -14 -113 -45 -12 26 -431 43 35 -139 126 -258 -245 -104 -11 -178 -13 7 40 -206 -58 -20 -114 216 70
5435G0l00K82j07Nm3j47L34j41J77j67K3O8J20p2j75J15L7j08j39j14O7Q6K40
$$ 70 -230 52 -55 -50 -93 -240 94 -47 130 -37 -14 54 174 102 -73 42 79 -29 -168 -282 -215 -129 111
5458A11Q4k43q6K76j09k43J29K25j56J80%O7k65q6LJ7J55K29r7l07J40K56k57
$$ 111 195 -48 -134 142 33 -210 -81 144 -12 168 168 235 -30 -116 -113 -96 59 288 191 -116 24 280 23
5481B3j8Jk84J1K19K41j98L02n0j49q7p0K42k57K89p6j50l5K08j69j94L43j86
$$ 23 5 6 -278 -267 -48 193 -5 297 247 98 11 -59 183 -74 215 139 -11 -46 162 -7 -201 142 -44
5504d4r5J58k2q7O3J95j89k06K92P2j16J92j97Q7k15M6K74j39j39j33L51k09K76
$$ -44 -139 19 -3 -90 -27 168 -21 -227 65 137 21 213 16 103 -112 -66 208 69 -70 -203 148 -61 215
5527B15k98M9J27K53m39L6J4R7j00J45j56K47j79Q4k17J74K7m7k53K91K7o5P7
$$ 215 -83 -34 93 346 -93 -57 -43 54 -46 99 -57 190 11 95 -122 52 79 32 -221 70 97 32 109
5550A09k29k4L91j97k54K63Pk59R4o0K72J8j76j85J16J76j09L14k2j57j69L41
$$ 109 -120 -144 247 50 -204 59 66 -193 -99 -159 113 131 -45 -230 -114 62 -47 267 245 88 -81 260
5572B60j69j15K0j60P5K77k14j39K80k97j11J94j17j10J81J90J37k02R5J2R2j85
$$ 260 91 -24 -4 -164 -89 188 -26 -165 115 -182 -293 -99 -216 -326 -145 45 182 -20 75 87 179 -6
5594fQ3J39Pj21K7k30R4J74r6k51J99J23m6m5J9j49J37M1j82o0K31K4j43L65q9
$$ -6 77 216 223 102 129 -101 -7 167 71 -180 19 142 96 51 70 -79 58 99 -83 -143 88 112 -31 334 245
5619B45k40n8rJ11K1R3j90kr1l7K86kj41J21k9N4j94J79k86J64L8p1n0K14k76
$$ 245 5 -53 -62 49 70 163 -27 -29 -120 -157 129 127 -14 107 78 132 -62 117 -169 -5 33 -38 -88 126 -150
5644a50K28N4j68R5n6q7J40j27K09m3j57J27K4p8J00j14L1j07n2K07j38J49M2
$$ -150 78 132 -36 59 3 -84 56 -71 138 95 -62 65 89 11 111 -3 28 -79 -131 76 -62 87 129
5667A29R0k60nN9k16J92j73J43J43l5k15J49K19l50j92K55L30k74k33J43J43o7
$$ 129 219 -41 -46 13 -203 -11 -184 -41 102 67 -148 1 220 -130 -322 -67 263 -11 -244 -101 42 -25
5689b5j51K72j52J02j0P0J09k21L9j9j28K43Jj53OR2J28l66K11lk14L27k21RJ32
$$ -25 -176 96 -56 46 36 106 215 -6 33 14 -114 129 130 -23 -17 75 203 -163 48 45 -169 158 -63 -54 78
5714G8J92k96o8L3N4J88J22k50j91K49Q1k83K48k02Q6j67J04k3j3j11J46l2nk
$$ 78 270 -26 -94 -61 -7 181 303 53 -138 111 192 -91 157 -45 41 -126 -22 -45 -58 -169 -23 -55 -60 -62
5738f2rK16j56J7P6j04j32J77J6q2K55k06p1J10l7j48L48j43k07J88p1J7mk5P5
$$ -62 -71 145 -11 6 82 -22 -154 23 39 -43 212 6 -65 45 8 -140 208 65 -142 46 -25 -8 -12 -37 38
5763C8j18K79j89m8L7O9j29lK57j98J69j81p9J78l6l13M00l43L20J8q8j97K57
$$ 38 -80 199 10 -38 -1 68 -61 -64 193 -5 164 -17 -96 82 46 -267 133 -210 110 128 40 -157 100
5786A00k01J12K35l12m61N25L8l13K78J06l25K55Q7j6j84j22J46j46J85J86j66
$$ 100 -101 11 246 -66 -527 -2 36 -277 1 107 -218 37 124 108 -76 -198 -52 -198 -13 173 7
5807GO1l1n3L3O5J5q8J41k02M6O8j06J57j06pk83K99j31kL13l63K0L44j72oJ24
$$ 7 68 37 -16 17 82 97 9 150 -52 -6 62 -44 113 7 0 -283 16 -115 -117 196 -167 -147 197 25 19 143
5833A43L6k49j5K7J7J48j09mk19M33j47k13M17k34j04j38K18j57K40j52M83n10
$$ 143 179 -70 -85 -58 -41 107 -2 -6 -225 208 61 -152 265 31 -73 -211 7 -150 90 -62 421 -89
5855h9j63K85R6k32L8J39r5J17n6j52k5k1K29q4jJ4K8j62L22o2k72J24L17m19
$$ -89 -252 33 129 -103 -65 74 -21 96 40 -112 -137 -158 71 -13 -14 0 28 -134 188 126 -146 -22 295 -124
5879a24J90j84J87k16M32j91o4j36K16j96o9k3J64j24O4R4l4k55L45j42J44j16
$$ -124 66 -118 69 -147 285 94 30 -106 110 -86 -155 -178 -14 -138 -74 20 -14 -269 76 -66 78 -38
5901c8P4p0J03jk22l5L11k10m1J11p7l1L8J66q1p3O3j08J3P1O2P4lO1k41j37R9
$$ -38 36 -34 69 68 -154 -189 122 -88 -129 -18 -95 -126 -88 78 -3 -76 -13 -121 -108 -37 25 99 96 157 -84 -221 -122
5928a22J50jk56M81k58K10j53J72k11M7m8J40r5m0J44kj04j35K50m54K68o6p0
$$ -122 28 27 -229 252 -6 204 51 223 12 59 11 151 56 16 160 158 54 -81 169 -285 -17 -83 -153
5951a53O1J73P1j97K41m24J36O0j06K10o1K13l67j30L78n3j01P2J18k13J29j10
$$ -153 -92 81 152 -45 196 -228 -92 -32 -138 72 11 224 -143 -273 105 52 -49 23 141 -72 57 -53
5973e3j88J85j50O7k6Q2K23k27J39mj50J29J50k27P0J27l20R7M9N0q9r3M43l42
$$ -53 -241 -56 -206 -139 -165 -83 140 -87 52 48 -102 27 177 -50 20 147 -173 -76 -27 23 -66 -159 284 -58
5997e8M5p8m6p9J45j2p3K10P6l5m5j73J12K8J09k30J96j24j08K82N6l24L33n0
$$ -58 -13 -91 -137 -216 -71 -83 -156 54 130 95 50 -123 -11 17 126 -104 92 -32 -140 142 198 -126 207 157
6021A57k49J40k7o9P4q5K8m0j47M27l19J5P0J31j03k4J2k06L62M9j94Nj4J32j34
$$ 157 -92 48 21 -48 26 -59 -31 -71 -218 209 -110 -95 -25 106 3 -21 -9 -215 147 196 2 7 -7 125 -9
6046ilj63L42m55L34J27k74O7j3j99L09P9m8J8R7k1k42J83p1K33m00M2P0k23K93
$$ -9 -12 -175 167 -288 46 173 -101 -34 -47 -246 63 142 94 112 209 188 -54 129 58 291 -109 -67 3 -220 73
6071G3J34p6p0J03l12qK05M8j12n6pK9j77L10R5l77K03k6K34l52K44J29k03J02
$$ 73 207 131 61 164 -148 -156 49 97 -15 -71 -78 -49 -226 84 179 -198 5 -21 213 -139 105 234 31 133
6095A33j2j76K68j7l50M03k12O7k89K14k74K06K36j33N6k31L8K06j58k5K3O6k47
$$ 133 121 -55 213 196 -154 249 37 104 -185 29 -245 -39 197 64 120 -111 -73 133 -25 -50 -27 39 -208
6118b08L10j74J07l53L50j27M1j0P8k0N7j80oK02j73N2K15n20J69J19J49Q0k33
$$ -208 102 -72 35 -318 32 -95 -54 -64 14 -6 51 -129 -135 67 -106 -54 161 -359 -190 -71 78 158 -75
6141g5J52k02J2j71N1K35j90K41k2n4J39N8l55K23J7m3j51J25L75n52J2K54J09
$$ -75 77 -125 -113 -284 -233 2 -188 53 31 -23 116 174 -181 42 59 16 -135 -10 365 -187 -175 79 188
6164A88l78K40j97J17k36K71K8J09O5q8j14J66l00L39k99K47o9k98K59k8J68l04
$$ 188 -190 50 -147 -30 -266 5 33 142 207 119 5 171 -129 210 -89 158 89 -209 50 22 190 -114
6186a14K40r7Q9k3j21K16j03R1k79L3j6m2J44K7o2j68j31J85P9k15M63j68Q4k74
$$ -114 126 29 118 95 -26 190 87 178 -101 -68 -84 -126 18 45 -17 -185 -316 -131 -52 -267 196 28 112 -162
6210a62L83k33l5K26k21J40j42j62J17J88q6r9m2J52M8O8k58L00p0k5p7Q5m5j42
$$ -162 221 -12 -47 179 -42 98 -44 -206 -89 99 13 -86 -128 24 72 140 -118 182 112 87 10 95 50 -92
6234i2J95n9j37J84k8j98N9K12l27L74k65j13L82m15L87j82j72K59L11k20l10
$$ -92 103 44 -93 91 63 -135 -76 136 -191 183 -82 -195 187 -228 159 -23 -195 64 375 155 -155
6255a55K04J3J23l86M33k14j20L01j78K8p8O7k1K74l28k5m8K43j1j72R1K9P2j30
$$ -155 49 62 185 -201 232 18 -102 199 21 49 -29 38 17 291 -37 -62 -110 133 122 -50 41 70 142 12
6279A2O4Q7k18QJ35l56L21k08P1K49l07R0k29K60K1j41L33M9j07m12J23J73k76
$$ 12 76 163 -55 -47 88 -268 53 -155 -84 165 -142 -52 -281 -21 0 -141 192 241 134 -278 -155 18 -258
6302b58K79J06p4L4K14k57j97R7K53l35J48K22K2k34R9k10J62J4p4m8O7K6j78
$$ -258 21 127 53 87 301 44 -153 -56 197 -138 10 232 254 20 119 -91 71 85 11 -37 30 56 -122
6325a22J38j02N0J43k54K65j63m3l2K94j66Q1j32P6j92O7J44J3n4p4j55L09j13
$$ -122 16 -86 -36 107 -147 118 -45 -88 -120 174 8 89 -43 33 -159 -92 52 65 11 -63 -218 91 -22
6348b2m8J50k41R9P2q1J06O5j38q2K08N7m9mm4j87j33M96k77p1K09k70Q3J25j89
$$ -22 -70 80 -161 -62 10 -71 35 100 -38 -120 88 145 96 92 48 -139 -272 224 -53 -124 85 -185 -102 23 -166
6373a66l5J95K5k09J97J43l76L31k05l3K61j19J61J2L11m50k64J12NP1Qj35K00
$$ -166 -201 -6 19 -190 7 150 -226 105 -100 -133 128 9 170 182 493 43 -221 -109 -104 -33 -25 -160 40
6396D0m8J63R6l55J75N1oj18J2k7j27R3M3j21K14P1J05l58K79l9O8p9Kl86L38
$$ 40 -8 155 251 -104 71 122 116 -2 10 -17 -144 -51 -8 -129 85 156 261 -97 182 143 211 132 134 -252 86
6421H6N1q5j61n2k8R7J02JJ32Jp4m12P6L98j41p6J56J39k14M3l23J63rJ47Q1p0
$$ 86 137 52 -109 -161 -189 -92 10 11 143 144 70 -342 -266 132 -9 -85 71 210 -4 39 -284 -121 -130 17 98 28
6447B8J27j81R5q9j4j30M5J5P0Q9j75r6K16Jm3J79k31M5j7K66k00k25K80Q3j80
$$ 28 155 -26 69 -20 -34 -164 -119 -104 -34 55 -120 -216 0 1 -42 137 -94 -49 -66 200 0 -225 55 138 -42
6472d2M8R5j20L6M0l02L1K61O0k28q3K09K61l30R0M6m66N50L0l18K73r2j23K8
$$ -42 6 101 -19 17 57 -245 -214 47 107 -121 -204 5 266 -64 26 72 -394 156 186 -132 141 49 -74 -46
6496d6o1P9p2J45n2P4J62j27R8k02j49Q9M29m37K42o5M3p2j46J62m1j2K7q6J23
$$ -46 -107 -28 -100 45 -7 67 229 102 200 -2 -151 -62 367 -70 172 107 150 78 -68 94 53 41 68 -18 105
6521A05K7q0k40K63j85L07m00J89R7q2o9n0p0L36j36J6J17l26J7JJ11Rj36j29
$$ 105 132 52 -188 75 -110 197 -203 -14 83 1 -68 -118 -188 148 12 28 145 -181 -164 -163 -52 -43 -179 -308
6545c08M58k1j8jj29j0M0K01k32j91K21k78M17L6k19J98m5r5j39J57R2j79j48
$$ -308 150 129 111 110 -19 -29 11 212 -20 -211 10 -268 149 185 -34 164 119 24 -115 42 134 -45 -193
6568a93L01l1rk00J05J99j36q6O8J02j45j59K67j35O2j28o6K20q5N2K1q9j03K07
$$ -193 108 77 68 -132 -27 172 36 -50 18 120 -25 -184 83 -52 10 -118 -184 36 -49 3 24 -65 -168 39
6592C9n8O9P5k29L70k61o9J12O2j08J84l67K05K13l32j71M16j35p9N1q0J41p3
$$ 39 -19 50 125 -104 266 5 -64 48 110 2 186 -181 24 237 -95 -266 150 15 -64 -13 -93 48 -25
6615b5K6J09k7q6j01J00K2n0J01J83l82J17K5j64J13N4j80L69O4k01j02J20k62
$$ -25 1 110 83 -3 -104 -4 18 -32 69 252 -130 -13 12 -152 -39 15 -165 204 268 67 -35 85 -177
6638a77J31J07p0L5m3L46m02k3K26r8J59l06J0m2K99l11K30l01J60J6j96K68p0
$$ -177 -46 61 -9 26 -17 329 -73 -96 130 32 191 -115 -105 -147 152 -159 71 -230 -70 -54 -250 18 -52
6661e2Q5J16j93k6K54l69L62m12J01J18k11J51j70K42J15J62j55J89n24K35J12
$$ -52 33 149 -44 -70 184 -185 177 -235 -134 -16 -227 -76 -246 -4 111 273 118 307 -217 18 130
6682A30k73K43J56j48j35J45M4k68J56o9j2N8p9J18o8J02o0n2j22K58j10q7j38
$$ 130 -143 100 256 108 -27 118 162 -106 50 -19 -31 27 -52 66 -2 100 40 -12 -134 124 14 -73 -211
6705b11M02j40l5L1O9k39L44j91j64L46k76p6L68k31J84j34J0J15l1j22k01L79
$$ -211 191 51 16 47 116 -123 221 30 -134 212 -64 -140 228 -3 181 47 57 172 141 19 -182 197
6727A97j41k41P9Q9NJ07l4j85J1K27k98J79k4K2n5L1j41N0J95j31J27mQ9k93J07
$$ 197 56 -185 -106 -17 -12 95 61 -124 -113 114 -184 -5 -29 -7 -62 -31 -172 -122 73 -58 69 65 154 -139 -32
6752c2J03j73L6K01j22j89J77o3p4J73j00K58r9k25k2j7J58j11K99k54l4qj84
$$ -32 71 -102 -66 135 13 -176 1 -62 -136 37 -63 195 96 -129 -151 -168 -10 -121 178 -76 -110 -118 -302
6775c02M4K41P3k38K54O6k38R9l4p8J89j73KR8Nk8j59K60M4j39J32l9k43K01J77
$$ -302 -258 -17 56 -182 72 138 -100 -1 -35 -113 76 -97 -95 3 8 -20 -179 81 125 -14 118 79 -164 37 214
6800B14q8q2k28K60j01L35k95O3k62J72J45Q7m91K52K7k89J11L01k36J54J63j89
$$ 214 126 44 -184 76 -25 310 15 78 -184 -12 133 220 -271 -19 8 -281 -170 131 -105 49 212 23
6822B3n5rJ2N4m8J9j99L61j31j45l5O06j94l82J43M9k0j56J53o0j18P1L45k61
$$ 23 -32 -41 -29 25 -23 -4 -203 158 27 -118 -153 453 259 -123 20 69 49 -107 46 -14 -132 -61 284 23
6846B3NJ24J30n39K49j23J12l7J9k69L76m0o2m7l5K91n08K94J64j25mJ89m70K35
$$ 23 28 152 282 -257 -8 -131 -19 -56 -37 -306 70 30 -32 -79 -114 177 -331 -37 127 2 -2 187 -283 -48
6870d8m6L03k43J64k75K50P4k74J53ojl18Q6J79q9J67K8k75K06J58k85p0j08L35
$$ -48 -94 209 -34 130 -145 105 179 -95 58 52 51 -267 -181 -2 -91 76 104 -171 35 193 -92 -162 -270 65
6894F5O4j03j45K5J95j14J0M3k7l65M49l9K47l20J76j93mJ46k6l07K70P9j76K1
$$ 65 129 26 -119 -94 101 -13 -3 40 13 -352 97 58 305 -15 161 -32 -36 110 84 -223 47 126 -50 -29
6918b9R7lK3m36L44J86k42J06J06k50K70q6j49p4m8J99R5n8K1J81l60L56m23J88
$$ -29 68 65 88 -348 -4 182 -60 46 152 -98 172 86 -63 -137 -185 14 109 51 72 253 -107 249 -174 14
6942A4r1k3K94n07L33L8j45n0L68j78p3Q5kj38N5R4k41M8M24k85K14l83K42j18
$$ 14 -77 -100 194 -313 20 58 -87 -137 231 53 -20 65 63 -75 -20 74 -167 -119 305 20 234 -149 93 -25
6966b5k73K24J94k72J77r4m2K11j34p7N5J08m9J19Q4j42o2Q2j36N8j88K12j17
$$ -25 -298 -74 120 -152 25 -69 -111 100 -34 -111 -56 52 3 122 206 64 2 84 -52 6 -182 30 -87
6989h7j16K94K6k88J77k54J99k5J37K11k13m5p2n8R3Q4j38PJ08o9p9K36K5j91
$$ -87 -203 91 117 -171 6 -248 -49 -74 63 274 61 16 -56 -114 -21 63 -75 -68 40 -29 -108 128 153 -38
7013c8J00j27j9L23k63Q4k85M3K91rk81J97M8j48j2p2p1Q6o5L39j92J92k05J6
$$ -38 62 -65 -84 239 -24 60 -225 -182 109 100 -181 16 64 -84 -96 -168 -239 -153 -218 121 -71 121 -84 -68
7037f8R9J5o4K14L8j31r4j46J77J81m99K73r6K04j6J44l37J44Q2j15K3j64K48
$$ -68 31 46 -18 196 234 103 9 -137 40 221 -278 -5 -101 103 87 231 -106 38 120 5 28 -136 112
7060A12m08L88Q6j4o3j73L39m10j07L13m5R7j70P6r9J13j11r5K44j37K8O7k3j17
$$ 112 -296 92 178 164 101 -72 267 -143 -250 63 18 115 -55 21 -78 35 -76 -171 73 -64 -36 31 8 -109
7084a09K73j26P8q5R5k12M19m67K61Jk39Q9l3R4q3K6l05L63k28KK41j19P8j40
$$ -109 164 38 116 31 126 -86 333 -134 127 128 -111 -22 -55 39 -44 -18 -323 40 -188 -186 55 -64 14 -126
7108a26K6%J93M7j54J92l00Q9m7L49m33M5J29J7K0l12L79P7j63j20J24Q4k81L11
$$ -126 -100 -100 93 140 -14 178 -122 -33 -80 269 -164 -119 10 27 47 -265 114 191 28 -92 32 116 -165 146
7132A46m2j67r2m8K11M2q2J69j29R8q3J09k40J11r1M4P5k5K08l11J72R2K5o1m7
$$ 146 104 -63 -155 -203 8 50 -32 137 8 106 23 132 -108 3 -88 -44 31 6 214 -97 75 167 192 131 84
7157H4k00J93p3M9r8J79j9n5j19j74J70O5J36k29N4n7K8J08l1m8j10L86k03k8
$$ 84 -116 77 4 53 -45 134 115 60 -59 -233 -63 2 138 -91 -37 -94 -66 42 11 -37 -147 239 36 8
7181Hk6j9J6k2j0k23L60J2J08m50K13k33J05l5J76K48j32J8k2K6j50m2J05j94
$$ 8 -18 -37 -21 -43 -53 -276 84 96 204 -246 -33 -266 -161 -196 -20 228 96 114 92 118 -32 -74 31 -163
7205a63Q2j7R0n4J89kj14J16J48k73k79K62j5m0J28j86K4P6J03j56L7O1R8m9j82
$$ -163 -81 -98 -8 -62 127 125 11 127 275 2 -277 -15 -30 -70 58 -128 -104 -28 75 -81 -44 17 115 66 -116
7230a16k4K6J34J38l59K96Q7l22L50k81J08N3j22J40J28q7j94K7k5J3J82L8n42
$$ -116 -140 -114 20 158 -201 95 182 -140 210 -71 37 90 -32 108 236 149 -45 -18 -43 -30 152 190 -352
7253c52N38j42n9K3J17J12l14L2j2R9k54J76m8KL4R7J22l3p2j49Q0J46l96L3L41
$$ -352 186 44 -15 8 125 237 -77 -45 -57 42 -212 -36 -84 -82 -48 49 171 138 66 -83 -3 143 -253 -220 121
7278A21k05p5K63k35K78k25N0K01k15N3J80k22R8k76L9K04K11q9J08j32j49R7
$$ 121 -84 -159 104 -131 147 -78 -28 173 -42 11 191 -31 67 -209 -170 34 245 156 264 132 -17 80
7300H0J18k59j02n2L7K53k32J49n3R6P0j5j2J20k1j65m0j18L02j81R2r1N1N9m7
$$ 80 198 -61 -163 -215 -178 75 -157 -8 -61 35 105 90 78 198 177 12 -28 -146 156 -25 67 -24 27 86 39
7325C9n2p3j44L38k11J06m8R0j27j00L09n9j77k3J59n1k14L19k66K12k76K29O6
$$ 39 -13 -86 -230 108 -103 3 -45 45 -82 -182 127 68 -109 -132 27 -24 -238 81 -185 27 -249 -20 46
7348D6pk59J73Q3Lj32P6K01k52O7pm5O1o9l1J22M9l1n9o7J62j25pJ48j30KJ78
$$ 46 39 -220 -47 36 39 -93 -17 184 -68 -1 -8 -53 8 -61 -92 30 79 48 -11 -78 84 -41 -48 100 -30 -28 150
7375A50J0l65K35J05L2j63j86L13%nq0n8j28P4n4L53l63J6L01J02j98nP1j33p
$$ 150 160 -205 30 135 167 4 -182 131 131 126 46 -12 -140 -66 -120 233 -130 -114 187 289 91 86 157 24 17
7400A7p9p8K76R9l76J27K2J6j73K59j80N2K25j26k4L2m0o8N1o8q9Q5J53n2L1j29
$$ 17 -62 -140 136 235 -141 -14 8 24 -149 110 -70 -18 207 81 57 89 49 -19 32 -36 -125 -40 113 61 92 -37
7426c7M5lJ83l20R9J35k03L87j72l09M46m01M0J14J13r4k00L50j11No8K24l18
$$ -37 8 5 188 -132 -33 102 -101 286 114 -195 251 -150 -110 4 117 23 -177 173 62 67 -1 223 -95
7449i5L5j9K76j43q9J10l2p0o3o2m3J29oK9OP4j89L9J55M1j31R5j28K78j46k26
$$ -95 -60 -79 197 54 -35 75 43 -27 -90 -152 -195 -66 -72 -43 -37 37 -152 -113 42 83 -48 47 -81 197 51 -175
7475a75K88j48O3M98n75R9J18ol90K19k34J74J31R4k78o8L26k95K96J5k15Q6R2
$$ -175 113 -35 28 526 -49 50 168 162 -228 -9 -243 -69 62 156 -122 -190 136 -159 137 152 -63 23 115
7498A15jk0K55l62M5p1m9j72K53J33J04m08K37l6PR6k85K19L7l18J20K26k39j39
$$ 115 114 94 349 -13 32 -39 -88 -260 -7 126 230 -178 59 23 30 126 -159 60 97 -221 -101 125 -114 -253
7522b53N1J98j83Q9J26o3O7M3j28j59K70O6j15K91k87l8q2O6j28J42n2K61l62
$$ -253 -202 -4 -187 -98 28 -35 32 75 -53 -212 58 124 9 300 13 -25 -107 -41 -169 -27 -79 182 -180
7545a80K95O1k14k1N6O4Mn4j07qO6j1j03J21mj37J95l7j49Q7j58Q9L16m31M12
$$ -180 115 176 -38 -59 -3 61 65 11 -96 -104 -38 -49 -152 -31 -35 -172 23 -14 -163 -76 -234 -145 171 -260 152
7570A52j38k30L29j69J41k17L33jk79j97J95J09Rj04K44k18J31p7O8l93J62L7
$$ 152 14 -216 113 -56 85 -132 201 200 -79 -276 -81 28 37 -67 177 -41 90 13 81 -312 -150 -113
7592a13K93j18M6N5k11J46m2n2LM7p4p8P4k54L93j62j95K82Q9k74J29r7J93k09
$$ -113 180 62 108 163 -48 98 56 4 7 54 -20 -98 -24 -278 115 -47 -242 40 129 -145 -16 -113 80 -129
7616a29J34j16J97n3P7k26K91r9l11M10j37j40Q9r8K77j28L7j8Q0k52j35K93k45
$$ -129 5 -111 86 33 110 -116 175 76 -235 175 38 -102 -13 -111 166 38 75 57 137 -115 -250 43 -202
7639b02L23J13p2j71j84K56l70J41j18N13ok46L04l36j71K30k5K47k65m6J64k3
$$ -202 121 234 162 -9 -193 63 -307 -166 -284 229 223 -23 281 -55 -226 4 -21 226 -39 -85 79 56
7661E6n4rK0o4J50o8l5J33l3j32ln6K33l5m37J53K38k79L63k56k4K97j72J07l29
$$ 56 2 -7 13 -51 99 31 -4 129 96 -36 -39 -95 138 103 -334 -181 57 -222 141 -115 -139 158 -14 93 -236
7686b36M42j03k21K71m48J11P0J42J37j56l7pLK25l33J45j58J70j78l8J71j51
$$ -236 206 103 -118 153 -295 -184 -114 28 165 9 -28 -35 -32 193 -140 5 -153 17 -161 -199 -28 -179
7708a79m9L61k12J1l1R3K1j84M2j18J28K45o9K6j31m0M80n37J48k6j52J22l5J24
$$ -179 -228 133 -79 -68 -99 -6 15 -169 -127 -245 -117 128 59 85 -46 -86 394 -143 5 -21 -173 -51 -86 38
7732C8j2J68o2j98o2K17M2j15p4J36J0Pn0l3j80K03q9j83J31J20j76j6Q2P2o1
$$ 38 26 194 132 -66 -128 89 131 16 -58 78 88 95 45 12 -168 35 -54 -237 -106 14 -162 -178 -96 -24 -85
7757h5K03Qj81j71M76l13J50j12j76K72P3o8j71Q4O9O6l32J39l2J26n4J73j07
$$ -85 118 126 -55 -226 250 -63 87 -25 -201 71 144 76 -95 -11 58 124 -208 -69 -101 25 -29 144 37
7780C7K45k20lJ7r8m5J55j78J17N4lk42R2P3O8j2L9L1l02J70l2J42qp0m4P9j05
$$ 37 282 62 59 76 -22 -67 88 -90 27 81 78 -164 -72 1 69 57 96 127 -175 -5 -37 105 97 27 -17 62 -43
7807d3N1OP5j38K58j70q2k23K75J44j97R9L9p1q0L19k16J7j91K8Q4K09l60R9J16
$$ -43 8 14 89 -49 209 39 -43 -266 9 153 -44 55 94 23 -57 262 46 63 -128 -100 -16 193 -167 -68 48
7832D8l53L20j55J9M15l49k8K41j49j2J6M6j21j05K04Mk21J22l6j8J10L2j08J06
$$ 48 -305 15 -140 -121 294 -55 -83 158 9 -3 13 59 -62 -167 37 41 -180 -58 -94 -112 -2 30 -78 28
7856B8m8L5J64r8j43K82j51k05M3J60Q0Nl41P1j85K16KJ43j96K63q1j79J50O3
$$ 28 -20 15 179 81 -62 220 69 -136 -93 67 147 152 -189 -118 -303 -87 -85 58 -138 125 44 -135 15 78
7880G8p1r0J56J41m39L38J24l26M8nrl4Q1n5j37J41N6Q5kj31j6M1k44J41J10j90
$$ 78 7 -83 73 214 -225 113 237 -89 -41 -46 -55 -89 -8 -63 -200 -59 -3 82 80 -51 -67 -26 -270 -129 -19 -209
7906b09K4L58j32J20l09L26l70P8L36l63L7J50kj0m3j60Q4K5rJ06j05M9o5J17
$$ -209 -185 173 41 161 -148 178 -192 -114 222 -141 -104 46 44 34 -9 -169 -85 -60 -69 37 -68 -19 -84 33
7930C3J31j75k6l1J44p5K26k38Q2l01O0J01K80l15J34m5q5n7nJ82J25j13j32M8
$$ 33 164 -11 -37 -68 76 1 227 -11 71 -230 -170 -69 211 -104 30 -15 -100 -157 -162 20 145 32 -100 -52
7954e2j36J88j27j29L81j82J30n8k0j47K66l06O2j19L91l75J69r4J61Q8j47P5
$$ -52 -188 0 -127 -256 125 -57 73 15 -5 -152 114 -192 -130 -249 142 -233 -64 -158 3 91 -56 19
7976A9N5Q4k80J13j28J92q7K4l57N34L27q83J81K79j66J89o4%j56j6M6J77j7J12
$$ 19 74 158 -122 -9 -137 55 -32 -8 -365 169 496 -387 -206 73 -93 96 32 32 -124 -140 -94 83 66 178
8000A78p6j75m2N22k96K34m86R7L03n18L65l42K49N9J2j48j00R9k27J54K09j6
$$ 178 102 -73 -115 407 111 345 -141 -44 259 -259 106 -236 13 72 84 -64 -164 -65 -292 -138 71 55
8022E5K8m1o3k92K39N3P8j37Nj27K95qJ6m42Q7j4J07M92p83R8N00j8k07k95k1
$$ 55 83 42 -21 -313 -74 -21 57 -80 -75 -202 93 85 101 -341 -254 -268 -161 331 -452 -354 146 128 -79 -374 -395
8047c95O27r6l3r4M7m44O19m0n50O00o50M25l12L95K23l75nK44p0m62M86o91J034
$$ -395 232 136 103 9 56 -388 231 191 -359 241 -409 16 -296 99 322 -53 -58 186 116 -346 140 -551 483
8070D83r32J13K61K28j9k59o4m89M87N57k39J49o98O68p31L93P13p48l43o4R66
$$ 483 -449 -336 -75 153 134 -125 -189 -678 -191 366 127 276 -422 246 -485 -92 621 -127 -470 -534 432
8091D32m13r71P97K17O65q05L0r91J281l72n83M65J8P86r82j04O70Jj5m93P41
$$ 432 19 -952 -155 62 727 -78 -48 -1039 242 -130 -713 -248 -230 556 -426 -530 140 141 126 -367 374
8112C74q40L62k94j82O75k20K99k54q1K17j8J4k98r2J43O11n3l87q29R79k71k0
$$ 374 -466 -104 -398 -580 95 -125 174 -80 -161 56 38 52 -246 -338 -195 416 363 -24 -853 126 -145 -165
8134a65K2k89N64o50R91o43j32K86L83o00L27j98J020j189m8r7l3J015r66Q38
$$ -165 -143 -432 132 -518 473 -170 -302 -16 367 -233 94 -104 916 -273 -321 -418 -451 564 -402 436
8154D36qm93M36m88l10m7N31j012J104l38o25P08r1K7K45l7K24j91n72L01K69
$$ 436 428 -65 371 -117 -427 -474 57 -955 149 -189 -814 -106 -197 -170 75 38 262 71 -501 -200 69
8175F9K14j50l47M02k79N8O9N24m87K41j58k28M49q11M48j89
$$ 69 283 133 -214 188 -91 -33 36 560 73 314 156 -72 377 -434 14 -175
8191a75
$$ Imaginary data points
##PAGE= N=2
##DATA TABLE= (X++(I..I)), XYDATA
0@%%%%%%%%%%%%qJ6j6K4l2L2m0N2o0P2q8J05j23J46j72J98k28K65l05L45l94M50
$$ 0 0 0 0 0 0 0 0 0 0 0 0 0 -8 8 -8 16 -16 16 -24 28 -32 40 -48 57 -66 80 -92 106 -122 143 -162 183 -211 239
34B39n08N74o46P23q11R07j012J125j247J384j535J695j871K067k277K510k765
$$ 239 -269 305 -341 382 -429 478 -534 591 -656 728 -807 888 -983 1084 -1193 1317 -1448
51a448L044l355L700m083M513m999N553o191O932p810Q870j0176J1834j4017J7042
$$ -1448 1596 -1759 1941 -2142 2371 -2628 2925 -3266 3666 -4144 4726 -5450 6384 -7633 9409
66I409k1548K9064m4686J37799k34554j38604K33142q8248J40406K75002j06898
$$ 9409 -12139 16925 -27761 110038 -124516 -263120 -29978 -118226 22180 297182 190284
77A90284l23501o2274M6142J12700J68734Q2003j03088j94130j47641Q2751J76011
$$ 190284 -133217 -195491 -149349 -36649 132085 214088 111000 -83130 -230771 -148020 27991
88B7991J15592N1275j08912k34435m8667R9053J12036J64680K9294k22177j35291
$$ 27991 143583 194858 85946 -148489 -197156 -98103 13933 178613 207907 -14270 -149561
99a49561J1222J6148J69616J93397j09957j88471n6933l9761O0594K03425R4389
$$ -149561 -138339 -122191 47425 240822 130865 -57606 -114539 -154300 -93706 109719 204108
110B04108r9579j61881r8953K4748J05080J24993R5163r1350k19038l6007Q1860
$$ 204108 104529 -57352 -156305 -131557 -26477 98516 193679 102329 -116709 -152716 -70856
121g0856K6911J55871J25790k15738j86654Q0363J5833J5579K13106N0414k37333
$$ -70856 -43945 111926 237716 21978 -164676 -84313 -68480 -52901 160205 210619 -26714
132b6714j29477N8362M7512O3054J22685K4185j68453j61103M7145J15971N5117
$$ -26714 -156191 -97829 -50317 12737 135422 159607 -8846 -169949 -122804 -6833 48284
143D8284P7581J574j72141j07841N5973P1366J04057Q6019j08057j41205j0638
$$ 48284 125865 127439 -44702 -152543 -96570 -25204 78853 164872 56815 -84390 -95028
154i5028o668O5832J77283M066j50166n7413l2419j8393J31287J30292m1975j09821
$$ -95028 -101696 -35864 141419 145485 -4681 -62094 -94513 -112906 18381 148673 106698 -3123
166c123p8443k5993M6146R0849R4497J121j50347j02511N6914M2288M4911J23366
$$ -3123 -81566 -107559 -61413 29436 123933 125054 -25293 -127804 -70890 -28602 16309 139675
178A39675k7175j81853m1931N4022J7216R7586R0107r6537j22957j6224J4257
$$ 139675 112500 -69353 -111284 -57262 -40046 57540 147647 51110 -71847 -88071 -73814
189g3814N6230J04768L3439q5122j13550k8667N9683O1697N6575M0264p9085j34690
$$ -73814 -17584 87184 120623 35501 -78049 -106716 -47033 14664 71239 111503 32418 -102272
201a02272j974Q1111M7351N9349J6614j07409q7992J5262M4124P6913P1830m7257
$$ -102272 -104246 -23135 24216 83565 100179 -7230 -95222 -79960 -35836 41077 112907 65650
213F5650j03163m0883M789M5121R1477M3847o0420r2723l9185K2462N6995P3975
$$ 65650 -37513 -78396 -73607 -28486 62991 106838 46418 -46305 -85490 -63028 -6033 67942
225F7942L4359p1472r7781j1092L3917M0267Q1540K7917j03146q5315J9505K9730
$$ 67942 102301 30829 -66952 -78044 -44127 -3860 77680 105597 2451 -82864 -63359 -33629
237c3629M0311P9204K583j00048p1621J4207M9187N1792M5594q018q8812p0552
$$ -33629 6682 85886 88469 -11579 -83200 -68993 -19806 31986 77580 69562 -19250 -89802
249h9802K9389N5559M0162M8762k3705j09597l7275N0623L0810M5518N3804n7500
$$ -89802 -60413 -4854 35308 84070 60365 -49232 -86507 -35884 -5074 40444 94248 36748
261C6748j01879p464L8477L7426O0151J4688o8704o6188j2274L2237O0861M6465
$$ 36748 -65131 -72595 -34118 3308 63459 78147 9443 -56745 -69019 -36782 24079 70544
273G0544p592o4561o5231L098M9236L9886M0262J632q6457o3171L7501M2766K6832
$$ 70544 62952 -1609 -66840 -63742 -14506 25380 65642 67274 -19183 -82354 -44853 -2087 24745
286B4745M9074j9546r7158k8489L8490K4458M8768M2018n7288p9264l043K6663
$$ 24745 73819 54273 -42885 -71374 -32884 -8426 40342 82360 25072 -54192 -57235 -30572
298c0572K9029N2655K2263o0115p2495j283M1568L2884L5728J4144n9833o9887
$$ -30572 -1543 51112 73375 13260 -59235 -60518 -18950 13934 49662 63806 3973 -65914
310f5914J0994M5608K8147L7018K635p5528n1964L0775L3561K4253M3902j3756
$$ -65914 -54920 -9312 18835 55853 58488 -17040 -69004 -38229 -4668 19585 63487 49731
322D9731q4010l3042L8760K9966K6946L4444k8648p6757j8528L7526K8385L3884
$$ 49731 -34279 -67321 -28561 1405 28351 62795 34147 -42610 -61138 -23612 4773 38657
334C8657K4103m8330o6103K291L1789K3548M0492J3043o0619n5343J3410L3170
$$ 38657 62760 14430 -51673 -49382 -17593 5955 46447 59490 -1129 -56472 -43062 -9892
346i892K4182L4179J318o0739m6740J9106L5712K3583K9200p288o7500l5025L5061
$$ -9892 14290 48469 49787 -10952 -57692 -38586 -2874 20709 49909 42621 -24879 -59904 -24843
359b4843K6724J6864L7117j9896p7873j4140M2626J6956K1770L0673l7259o4280
$$ -24843 1881 18745 55862 35966 -41907 -56047 -13421 3535 25305 55978 18719 -45561
371d5561m42L1474K1376L2820R303m9577m3957P687K3402K5176L2655m3n4822
$$ -45561 -46003 -14529 6847 39667 48970 -607 -44564 -36877 -13475 11701 44356 44313 -10509
384a0509m1154K1362K9392J3162K9044K336o3898l7053L6752K6687P492L1142
$$ -10509 -51663 -30301 -909 12253 41297 43633 -20265 -57318 -20566 6121 13613 44755
396D4755j0038o8382j7251L9140J5490J6712K9312l1297o0434J520L0882J4225
$$ 44755 34717 -33665 -50916 -11776 3714 20426 49738 18441 -41993 -40473 -9591 4634
408D634K5519J4664m1282m4696O456K5904J9403K5010K258m4285l6646J3871K7190
$$ 4634 30153 44817 3535 -41161 -34705 -8801 10602 35612 37870 -6415 -43061 -29190 -2000
421b000J5284K1577N95m9232l5476K6807L0292O250J8769j691n3298k6098L2729
$$ -2000 13284 34861 35456 -13776 -49252 -22445 7847 14097 32866 31175 -22123 -48221 -15492
434a5492K4452J0229J7824j9585m9603m157K7626J0931K3057J9040m2621m4754
$$ -15492 8960 19189 37013 17428 -32175 -36332 -8706 2225 25282 44322 1701 -43053
446d3053J8918K2669K71K9365J6646n1780m0941K8360K5177k338K3529J2131n0778
$$ -43053 -24135 -1466 -1195 28170 44816 -6964 -47905 -19545 5632 3294 26823 38954 -11824
459a1824l6792L1466K7043r76J8124L492m9456k6047L2709K1664M027J8109j3521
$$ -11824 -48616 -17150 9893 8917 27041 30533 -18923 -44970 -12261 9403 13430 31539 18018
472A8018m5986n690K5385J1470J9523J2999l4850l3040J0623J3934R715K7773
$$ 18018 -27968 -33658 -8273 3197 22720 35719 869 -32171 -21548 -7614 2101 29874
484B9874K539m0424k5240J3675J7221J1996J6103L83l3217k9276J4663K8989O919
$$ 29874 32413 -8011 -33251 -19576 -2355 9641 25744 26127 -7090 -36366 -21703 7286 14205
497A4205O727K218l5427k5911K5552K1719J653J7360q947m7492l941L3642J264
$$ 14205 20932 23150 -12277 -38188 -12636 9083 10736 28096 19149 -28343 -32284 1358 2622
510B622N829K8797k6046n1475J6489L2683q975J1486K5288l4387m3101K1059K8814
$$ 2622 8451 37248 11202 -40273 -23784 8899 -76 11410 36698 2311 -40790 -19731 9083
523I083m449J0721J2962l3064l0895J8838K3554M031R563k118l0654j6134J5607
$$ 9083 4634 15355 28317 -4747 -35642 -16804 6750 10781 20344 18226 -12428 -28562 -12955
536a2955J6187J2082J0278j6791k9702q51J5345O369J6516J3382k7049l1717J1434
$$ -12955 3232 15314 25592 8801 -20901 -21752 -6407 -38 16478 29860 2811 -28906 -17472
549a7472J8267n28J4779J4400l0371l0968J6467J9729K30J1633O798k7911k4098
$$ -17472 795 267 15046 29446 -925 -31893 -15426 4303 4533 16166 22964 -4947 -29045
562b9045J3820K0010M793P123j99k5757j9180J7024J9557R72Q100n22l3588j3290
$$ -29045 -15225 4785 9578 16701 16502 -9255 -28435 -11411 8146 9118 17218 16696 -16892 -30182
576c0182K9123J0714n921J7256n872m1809P38L2888j655L03J9305k0367l3667
$$ -30182 -1059 9655 3734 20990 15118 -26691 -25953 6935 5280 5583 24888 4521 -29146
589b9146J2760K1173m69R793N642k5487j7953J1997J2847P501R720n862k2861
$$ -29146 -16386 4787 4318 14111 19753 -5734 -23687 -11690 1157 8658 18378 12516 -10345
602a0345j0094J1334J1922O511Q825o959k6990o538K0451P039J16J4288q998l3314
$$ -10345 -20439 -9105 2817 9328 18153 11194 -15796 -22334 -1883 5156 5272 19560 10562 -22752
616b2752J663K5847M19J38J5102j4947l0719Q854K2058o01M075Q557j8993k2047
$$ -22752 -21089 4758 5177 5315 20417 5470 -25249 -16395 5663 5062 9137 17694 -1299 -23346
630b3346J1608J6386J731N706K277k1161j5554J4410J4359L27N736j78k3305j1566
$$ -23346 -11738 4648 6379 12085 14362 -6799 -22353 -7943 6416 6743 12479 12301 -11004 -22570
644b2570J8764J2429l277P302j848k6616n812K3858N916l924J1055q385k7820
$$ -22570 -3806 8623 5346 12648 10800 -15816 -21628 2230 8146 4222 15277 6892 -20928
657b0928M583K2180r88J510J0538j7732k1076J2542J4882k012P326L045k1040
$$ -20928 -16345 5835 4847 6357 16895 -837 -21913 -9371 5511 3499 10825 13870 -7170
670g170j2567J3982J0415M23O535j173j9522j0602J5966J1592k913N244j73k2635
$$ -7170 -19737 -5755 4660 5083 11618 10445 -9077 -19679 -3713 7879 4966 10210 10037 -12598
684a2598p476K2074O431o102J0119m165k7182K923K3152k128k016J2865j4102
$$ -12598 -20074 2000 8431 2329 12448 8283 -18899 -15976 7176 5048 3032 15897 1795
697A795k3366J2323J7074n209M103P544j8987j5136J4434J2071k880M521K171
$$ 1795 -21571 -9248 7826 2617 6720 14264 -4723 -19859 -5425 6646 3766 8287 10458
710A0458j7764j0602J4215J1363k921L012J119j8845q280J8867Q076o280O667
$$ 10458 -7306 -17908 -3693 7670 4749 7761 8880 -9965 -18245 622 8698 2418 9085
723I085j547k2614n23K1588k04m028J0664r429k1789R578J6949n290K040Q598
$$ 9085 7538 -15076 -15599 5989 5785 1757 12421 2992 -18797 -9219 7730 2440 4480 13078
737A3078j6417j4779J3962J0625m075N429K137j7128q873J3900Q425l401M673
$$ 13078 -3339 -18118 -4156 6469 2394 7823 9960 -7168 -16041 -2141 6284 2883 7556
750G556M96j7151o851J6922O941o356N923L76k0621k700K1074J236p169J0423
$$ 7556 8052 -9099 -15950 972 7913 1557 7480 7856 -12765 -15465 5609 6845 -324 10099
764A0099m973k2096O434J9137n431j749J0506j2619j6987J3018J2421o290L402
$$ 10099 5126 -16970 -10536 8601 3170 1421 11927 -692 -17679 -4661 7760 1470 4872
777D872N135j5533r622J2980Q082l107L268Q20j4233o320J3056P631m719L183
$$ 4872 10007 -5526 -15148 -2168 5914 2807 6075 6895 -7338 -13658 -602 7029 2310 5493
791E493R28j6008l817J7032L172o530P483k555j9719M340J8068m659l058J0945
$$ 5493 6421 -9587 -13404 3628 6800 270 7753 5198 -14521 -10181 7887 3228 170 11115
805A1115j0818j7135J2462J2463p753K973O980j4773j0128J3304P550m815L699
$$ 11115 297 -16838 -4376 8087 334 3307 10287 -4486 -14614 -1310 6240 1425 5124
818E124J692j3174o179J2304O523m120K475J019j3892l750J4741L849o633O408
$$ 5124 6816 -6358 -12537 -233 6290 2170 4645 5664 -8228 -11978 2763 6612 -21 6387
832F387j208j7276J760J7346k831n285R896o394j7288R197J4234p075n68Q083
$$ 6387 5179 -12097 -10337 7009 4178 -1107 8789 2395 -14893 -5696 8538 1463 895 8978
846H978j1004j2215J2241R138n910K048L681j2068o288J0919N682l051K587n87
$$ 8978 -2026 -14241 -2000 7138 1228 3276 6957 -5111 -11399 -480 5202 2151 4738 4151
860D151j1059k467J0865L585l714L711j389j2955K56J4085r1o070P618l038j6057
$$ 4151 -6908 -9375 1490 5075 1361 5072 3683 -9272 -9016 5069 4978 -1092 6526 3488 -12569
875a2569N740J5320o060l529R496q685j3349J1046R906o920J677N006j1553o379
$$ -12569 -6829 8491 2431 -1098 8398 -287 -13636 -2590 7316 396 2073 7079 -4474 -10853
889a0853J1226M802m408K982J115j0828l786J1306M218n591K884K413j3260k627
$$ -10853 373 5175 767 3749 4864 -5964 -9750 1556 5774 183 3067 5480 -7780 -10407
903a0407J5741J160r632P471J279j6987K999J6824n097n738R512o141j2933R323
$$ -10407 5334 6494 -3138 4333 5612 -11375 -8376 8448 3351 -2387 7125 984 -11949 -2626
917b626Q999n964J672L479r736m220R123K387k203L733j307r335j160Q799K140
$$ -2626 6373 409 2081 5560 -4176 -8396 727 3114 911 4644 3337 -5998 -7158 1641 3781
932C781l580L547K67j1039j238J2369J073o660N140Q55j3107P04J4342k216o835
$$ 3781 201 3748 4015 -7024 -8262 4107 5180 -1480 3660 4515 -8592 -7888 6454 4238 -2597
947b597P079j594j3006M992J2387n141l762P412o009j0435R380Q470p414Q06N537
$$ -2597 4482 2888 -10118 -5126 7261 2120 -1642 5770 -239 -10674 -1294 7176 -238 568 6105
962F105j0246n472J1738L542p185M227K113j0748j911J1369J302n759L232J142
$$ 6105 -4141 -9613 2125 5667 -1518 2709 4822 -5926 -7837 3532 4834 -925 2307 3449
976C449j0034m62J1529On743M572j060j0719M128J0663n168j823O831q110p850
$$ 3449 -6585 -7047 4482 4488 -1255 3317 2257 -8462 -4334 6329 1161 -662 6169 -1941 -9791
991i791J1051M079p449M424L735j1602k175J0748P60m780L594Q96p831k430Q212
$$ -9791 1260 5339 -2110 2314 6049 -5553 -7728 3020 3780 -1000 2594 3490 -4341 -6771 1441
1006A441L926n540M34L615p754m601J1880K827r105M233L302j1857Q02J2917l806
$$ 1441 5367 -173 261 3876 -3878 -8479 3401 6228 -2877 1356 4658 -7199 -6397 6520 2714
1021B714n569P665l723j0269P825P510o544M71N034p963m677Q719L103n014J878
$$ 2714 -2855 4810 1087 -9182 -1357 6153 -391 80 5114 -2849 -7526 1193 4296 -718 1160
1036A160K576p288k954Q286K882n673K030K340q113j183R597J77n417M143k3r161
$$ 1160 3736 -3552 -6506 1780 4662 -1011 1019 3359 -4754 -5937 3660 3837 -1580 2563 2540 -6621
1052f621K535R373l302l969N697k463r179N430Q988n705k590O426m769q262Q514
$$ -6621 -4086 5287 1985 -1984 3713 1250 -7929 -2499 6489 784 -1806 4620 -149 -8411 103
1067A03O180p240K56N443p645m272R333K323n584K369J901p249j191P597J354
$$ 103 6283 -957 -701 4742 -2903 -7175 2158 4481 -1103 1266 3167 -4082 -5273 2324 3678
1082C678m243J311J874o503j356Q480J029o504L554J510r084K094J0284m519m411
$$ 3678 -565 746 2620 -3883 -5239 3241 4270 -2234 1320 2830 -6254 -4160 6124 1605 -2806
1097b806P452m119q767Q751N546p909J638N005p991l128Q612J096m357K219J155
$$ -2806 4646 527 -8240 511 6057 -1852 -214 4791 -3200 -6328 2284 3380 -977 1242 2397
1112B397n829j174O302J692l948O89K541n675k912R302J039p563M249K687r615
$$ 2397 -3432 -4606 1696 3388 -560 129 2670 -3005 -5917 3385 4424 -3139 1110 3797 -5818
1127e818J584J0210m170m914O797k366q272O346O158o448J5M747n428m387P026
$$ -5818 -4234 5976 1806 -3108 3689 1323 -6949 -603 5555 -893 -878 3869 -1559 -5946 1080
1142A080L297n385P33L438n425l149P154K359n579J668K767o312j489Q188l5n355
$$ 1080 4377 -1008 -275 3163 -2262 -5411 1743 4102 -1477 191 2958 -3354 -4843 3345 3310 -2045
1158b045L217J027o752R38P890k099m669M582k73p292L544P275m866k777O000
$$ -2045 1172 2199 -4553 -3615 4275 2176 -2493 2089 1816 -5476 -1932 5343 477 -2300 3700
1173C700l698o184O958M425o921J031M793o716k852Q211L27m882K819J519n869
$$ 3700 2 -6182 776 5201 -1720 -689 4104 -2612 -5464 2747 3074 -1808 1011 2530 -3339
1188c339j91N801M80m006J569J867n016j251P225r9n458L462J449p464J718Q574
$$ -3339 -3530 2271 2751 -1255 314 2181 -2835 -4086 3139 3040 -2418 1044 2493 -4971 -3253 5321
1204E321m484m407P020k285p928P046N461p616P06N029o005k888P393P35m546
$$ 5321 837 -3570 3450 1165 -6763 283 5744 -1872 -1166 3863 -2142 -5030 2363 3098 -1448
1219a448K113J489m565r21N156J265m294R75K454m374j680O880K38n856L399K042
$$ -1448 665 2154 -2411 -3332 1824 3089 -1205 -230 2224 -2150 -3830 3050 3288 -2568 831 2873
1235B873p207J400P865l800m102N637j602p001N511N520o133q04N421m457m272
$$ 2873 -4334 -2934 4931 1131 -2971 2666 1064 -5937 -426 5094 -1039 -1843 3578 -879 -5151
1250e151O792K312n803J055L824m958k097O300R13m869J806K252m968p63O161
$$ -5151 1641 3953 -1850 -795 3029 -1929 -4026 2274 3187 -1682 124 2376 -2592 -3355 2806
1265B806p3m730K474J919n696L48O990k293m513M256L73o566L227O565n295k479
$$ 2806 2733 -1997 477 2396 -3300 -2952 4038 1745 -2768 1488 1861 -4705 -1478 5087 -208 -2687
1281b687N868l030n370O379L012o227J075M419n681k011O796J93m815K522J623
$$ -2687 3181 151 -5219 1160 4172 -2055 -980 3439 -2242 -4253 2543 2736 -2079 443 2066
1296B066m530l19N134k2l743J280J885l970p44N994o76m953L320J322n813J664
$$ 2066 -2464 -2783 2351 2329 -1414 -134 1751 -2219 -2963 3031 2355 -2598 722 2044 -3769 -2105
1312b105O757m144l519N875j951o167O021L806o508K82N110m977k899O718P04
$$ -2105 4652 508 -3011 2864 913 -5254 767 4573 -1935 -1653 3457 -1520 -4419 2299 3003
1327C003m899J849K191m157p97N243R5m181J641K025m103n39N427p14m389K658
$$ 3003 -1896 -47 2144 -2013 -2810 2433 2528 -1653 -12 2013 -2090 -2629 2798 2084 -2305 353
1343C53J796n433J215O027k998m073M928m06o019M234M858n802r37N447l874l764
$$ 353 2149 -3284 -2069 3958 960 -3113 1815 1409 -4610 -376 4482 -1320 -2257 3190 -684 -4448
1359d448O467R36n012J663K882m520o05M875l82l307J543J176l100k39M025j36
$$ -4448 2019 2955 -2057 -394 2488 -2032 -2637 2238 1856 -1451 92 1268 -1832 -2071 1954 1818
1375A818l654K125J457m184K90N302j883m019L872O92n954L090N630n259j772
$$ 1818 -1836 289 1746 -2438 -2148 3154 1271 -2748 1124 1816 -4138 -1048 4582 -677 -2449
1390b449N250k356m844N302K910n522N07M050m297j898N462L02m330J840J994
$$ -2449 2801 445 -4399 903 3813 -1709 -1202 2848 -1449 -3347 2115 2417 -1913 -73 1921
1405A921l849l28M327m13l609K307J462m012J45N141j579m053L522Q97n115J833
$$ 1921 -1928 -2256 2071 1658 -1951 356 1818 -2194 -2049 3092 1513 -2540 982 1879 -3236 -1403
1421a403N653m243k677N151j659m885M993L084n845L01M328l840k274N489p7m425
$$ -1403 4250 7 -2670 2481 822 -4063 930 4014 -1831 -1530 2798 -1042 -3316 2173 2096 -2329
1437b329K556J636l947J12M336j009k893J618J289l061m49M369q36l324K241J468
$$ -2329 227 1863 -2084 -1972 2364 1355 -1538 80 1369 -1692 -2141 2228 1392 -1932 309 1777
1453A777m147O03N237k714l626M208L24n025K822M692n319j069N041k891l368
$$ 1777 -2370 -1767 3470 756 -2870 1338 1662 -3363 -541 4151 -1168 -2237 2804 -87 -3455
1468c455N316R91n112J802K556l621q76M762r63l151J948J375l234J48L537m42
$$ -3455 1861 2852 -2260 -458 2098 -1523 -2399 2363 1400 -1751 197 1572 -1662 -1514 2023 1581
1484A581l365K143J324l670N00M557k249l419L804M04n049K919M344m815j279
$$ 1581 -1784 359 1683 -1987 -1487 3070 821 -2598 1206 1610 -3439 -520 3824 -991 -2270
1499b270M723k387l870N026J588m798J009L267l796j152M765n80l712K071J871
$$ -2270 2453 66 -3804 1222 2810 -1988 -979 2288 -1508 -2660 2105 1525 -2187 -116 1755
1514A755l471K30L379p36k660J397J321k951J31L948j277l223K783R45l909J162
$$ 1755 -1716 -1486 1893 1157 -1503 -106 1215 -1736 -1605 2343 1066 -2157 626 1571 -2338 -1176
1530a176M265l201k468M307q31m412M063K765m915J29M190l454k460N467L3m570
$$ -1176 3089 -112 -2580 1727 896 -3516 547 3312 -1603 -1474 2716 -738 -3198 2269 2302 -2268
1546b268K151K198l794J2L859j116k720J913R53k722M52L220j413k614K206J280
$$ -2268 -117 2081 -1713 -1701 2158 1042 -1678 235 1188 -1534 -1082 2138 725 -1889 317 1597
1562A597l400M26M387k655l072M198Pm717L330L309m524j186M735k413l037M765
$$ 1597 -1803 -1377 3010 355 -2717 1481 1488 -3229 101 3410 -1114 -2300 2435 22 -3015 1750
1578A750M35m344J676K602l499m42L835j013k691J928R64k409J15K853o72k827
$$ 1750 2185 -2159 -483 2119 -1380 -1822 2013 1000 -1691 237 1201 -1208 -1093 1760 1088 -1739
1594a739J792J669l258Q9L849j713k924L149O65m155K064L542l952j150M211j632
$$ -1739 53 1722 -1536 -1447 2402 689 -2235 914 1579 -2576 -512 3030 -922 -2072 2139 507
1610E07l630M290J677m646R15L140l273j121M051k88l461J792J701l254J87L516
$$ 507 -3123 1167 2844 -1802 -887 2253 -1020 -2141 1910 1622 -1839 -47 1654 -1600 -1413 2103
1626B103j204k397J671J255k804j26L689j610k497K352R85l390J168L408k714
$$ 2103 899 -1498 173 1428 -1376 -1502 2187 577 -1920 432 1417 -1973 -805 2603 -111
1641a11k169L508k88l800L168K588m205j05L902k795k461M445J65l990J999K077
$$ -111 -2280 1228 940 -2860 308 2896 -1309 -1414 2488 -307 -2768 1677 1842 -2148 -149 1928
1657A928l379J33L524j571k027J970K24j882J10K605j144k019J496J595l049K47
$$ 1928 -1451 -1318 2206 635 -1392 578 802 -1080 -970 1635 491 -1528 -32 1563 -1486 -1239
1673a239L652j893l098L736M49l985K041L069l766q09L955j922k853M049P38m080
$$ -1239 2413 520 -2578 1158 1607 -2378 -337 2732 -1034 -1843 2112 190 -2663 1386 2124 -1956
1689a956J356K852l299q57L857r62k829J868J428k697K97K572q78k269J645J057
$$ -1956 -600 2252 -1047 -1904 1953 991 -1838 30 1458 -1239 -942 1630 752 -1517 128 1185
1705A185k400K53L080j676k698L178M12l628J558L518l293j707L940j282k912
$$ 1185 -1215 -962 2118 442 -2256 922 1334 -2294 -736 2782 -511 -2218 1722 440 -2472
1720b472L119J417l890J266K385k477j296L454l08l257K132J452k858J01L205
$$ -2472 647 2064 -1826 -560 1825 -652 -1948 1506 1198 -2059 73 1525 -1333 -1232 1973
1735A973j200k366J618J582k660L4K625r33k097J503J215k615O09K662k185j531
$$ 1973 773 -1593 25 1607 -1053 -1019 1606 673 -1424 79 1294 -1321 -712 1950 -235 -1766
1751a766L011k60l302K370K731m051k74L902k471k325L726N16l669J371K087k530
$$ -1766 1245 985 -2317 53 2784 -1267 -1541 2361 -110 -2435 1291 1807 -1862 -491 1596 -934
1767i34l22K912j355j798K023L75k176N17K375j011k457K089J120k798K46L165
$$ -934 -1256 1656 301 -1497 526 901 -1275 -758 1617 606 -1851 238 1358 -1440 -1194 1971
1783A971j460k708K870P03l169J779K399l636k07L312j949k462L974N80m215J922
$$ 1971 511 -2197 673 1376 -1793 -14 2385 -1251 -1458 1854 -95 -2557 1417 1997 -2218 -296
1799b96K486k932p44L079o38k605J724J006k228P55J545r04j232J382M02j804
$$ -296 2190 -742 -1486 1593 955 -1650 74 1080 -1148 -393 1152 248 -984 398 800 -1004
1815a004N13K342j736k045K648O19k956J105K895k909j417L281n59k812K547J176
$$ -1004 -491 1851 115 -1930 718 1337 -1619 -514 2381 -528 -1945 1336 777 -2035 512 1688
1831A688k955M75K467k122j411L595n96l379K255J722k810p4K693q82k029J260
$$ 1688 -1267 -792 1675 -447 -1858 1737 1141 -2238 17 1739 -1071 -1145 1548 666 -1363 -103
1847a03J189j761n08K452r67j570J656N56k351J054K367k320j411L522o84l400
$$ -103 1086 -675 -1183 1269 302 -1268 388 944 -1407 -353 2014 -306 -1717 1805 1121 -2279
1863b279K558K090l656Q2L099j770j942K830J00k646J401J618k458K02K553j476
$$ -2279 279 2369 -1287 -1205 1894 124 -1818 1012 1112 -1534 -133 1485 -973 -771 1782 306
1879C06j841K136N73k182K79K291j232j682J133J408k031j01K157j026j700K006
$$ 306 -1535 601 1174 -1008 -729 1562 330 -1352 -219 1189 -842 -943 1214 188 -1512 494
1895D94L81k415J486J891l039k04L373j566k533L052J127l813J053K511k096j173
$$ 494 875 -1540 -54 1837 -1202 -1406 1967 401 -2132 920 2047 -1766 -713 1798 -298 -1471
1911a471K830m74k130J495P77k057M34J845j584o79J673J87j882M67K278j558
$$ -1471 1359 885 -1245 250 1027 -1030 -596 1249 -335 -1014 659 846 -1036 -569 1709 151
1927A51j627J790R86k521O83K340k062j383K601m40k221K320J013l423J058K694
$$ 151 -1476 314 1300 -1221 -538 1802 -260 -1643 958 518 -1703 617 1630 -1793 -735 1959
1943A959k528j287L599p16l029J967J420k041k19K007o51j387J077N17j403L59
$$ 1959 -569 -1856 1743 1027 -2002 -35 1385 -656 -875 1132 481 -906 171 688 -715 -356
1959c56J570j202j290J650O59k374O06K563j748j742K675K61l127J636K314k818
$$ -356 1214 12 -1278 372 1031 -1343 -737 1826 78 -1664 1011 1272 -1855 -219 2095 -723
1975g23n83K723j596j176K142R6k412J562J660k824k03K830p99k159J690J140
$$ -723 -1306 1417 -179 -1355 787 883 -1529 33 1693 -1131 -1334 1496 697 -1462 228 1368
1991A368k146p0K016q09j424J080P74j327J48J456j183j122K025p2k350J495K130
$$ 1368 -778 -848 1168 359 -1065 15 789 -538 -390 1066 -117 -1239 786 714 -1636 -141 1989
2008A989k816o84L264r16k706K364J343k927N3K558j974p51K175o11j788J769
$$ 1989 -827 -1511 1753 837 -1869 495 1838 -1089 -1036 1522 -452 -1203 972 361 -1427 342
2024C42M53k180J014J806j366j235J701L26j802K85J853q42j555J099R70j581
$$ 342 795 -1385 -371 1435 69 -1166 535 861 -941 -656 1197 355 -1200 -101 869 -712
2040g12K86J563j155j203K186m60k181K427J074l120M85K639k032j714L033n6
$$ -712 -426 1137 -18 -1221 965 505 -1676 751 1825 -1295 -810 1829 -203 -1917 1116 1060
2056A060k671J397J142j346J2J133n14j190J394K23j413M99J282r84j484J901
$$ 1060 -1611 -214 928 -418 -406 727 213 -977 417 640 -773 -274 1008 24 -1460 441
2072D41O47k070L25K587j672k177K727o7j872Q41J740k165j30K078j443j242K275
$$ 441 1088 -982 -657 1930 258 -1919 808 741 -1131 -290 1450 -715 -845 1233 -210 -1452 823
2089H23K44k805J745J627k272o12K636o23k026J306J046j695j2J420p67q35J096
$$ 823 1067 -1738 7 1634 -638 -1250 1386 763 -1263 43 1089 -606 -618 802 35 -800 296
2106B96M3j194Q33R85j257o65J730K75k637J006K531k372j103K483M3k719J615
$$ 296 339 -855 -22 963 -294 -959 771 1046 -1591 -585 1946 -426 -1529 954 997 -1722 -107
2123a07J577k429M42J745j613n10K214p32k356K333O12k430M97K218j409q83Q47
$$ -107 1470 -959 -517 1228 -385 -895 1319 587 -1769 564 1176 -1254 -757 1461 52 -831 16
2140A6J004j600l40J497m47o87M78O51j351P96Q95j304p46K143l98k422K205J502
$$ 16 1020 -580 -920 577 130 -557 -79 572 -779 17 912 -392 -1138 1005 607 -1815 390 1892
2158A892l026R0K531j309j929K575P0j697P68Q41j412K06J266r86q61J542k9j512
$$ 1892 -1134 -1044 1487 178 -1751 824 894 -803 -35 806 -606 -400 866 -120 -981 561 532 -980
2176i80O00J726j214j275J607L82j539j23J618n67j250J436J96j499R40J031j826
$$ -980 -380 1346 132 -1143 464 846 -693 -816 802 235 -1015 421 617 -882 58 1089 -737
2193g37KJ911j255j660K629N02k674N47K366k043p31K156n31j499R48R35j490
$$ -737 -735 1176 -79 -1739 890 1392 -1282 -735 1631 -412 -1143 1013 482 -1017 -69 866 -624
2210f24L99J077j068m07R15J42j261N92J312j327j040J885L41k029M10J949j369
$$ -624 -225 852 -216 -623 292 434 -827 -235 1077 -250 -1290 595 936 -1093 -683 1266 -103
2227a03j167K212m07j684J522O92k348J213J263j679o34K520q41k213J879R85
$$ -103 -1270 942 535 -1149 373 1065 -1283 -70 1193 -486 -1120 1400 559 -1654 225 1210
2243A210j897m9J600p96j045J087O60j400K29R74o35n77R39J08r13K53J262j143
$$ 1210 -687 -736 864 68 -977 110 770 -630 -401 573 -62 -639 300 408 -505 -252 1010 -133
2261a33j228K169J68k438J348J763k430n67K435r81j134J861l42j750J250Q60
$$ -133 -1361 808 976 -1462 -114 1649 -781 -1348 1087 106 -1028 833 491 -1259 -9 851
2277H51j515r2J983j179j110J353P18j667K67J539r93j061R24O92j243M7J144
$$ 851 -664 -756 1227 48 -1062 291 1009 -658 -391 1148 155 -906 18 710 -533 -486 658
$$ [...]
8191C57
##END NTUPLES=NMR FID
##END=
