##TITLE=1H_Ser
 CDCl3
 24 sc, 
 7.6.2023
##JCAMPDX= 6.0         $$ Bruker NMR JCAMP-DX V2.0
##DATA TYPE= NMR FID
##DATA CLASS= NTUPLES
##ORIGIN= UXNMR, Bruker Analytische Messtechnik GmbH
##OWNER= root
$$ XWIN-NMR		Version 3.5
$$ Wed Jun  7 16:15:53 2023 Russian Standard Time (UT+4h)  she@DPX200
##.OBSERVE FREQUENCY= 200.13135
##.OBSERVE NUCLEUS= ^1H
##.DELAY= (6, 6)
##.ACQUISITION MODE= SIMULTANEOUS
##.ACQUISITION SCHEME= undefined
##.AVERAGES= 24
##.DIGITISER RES= 18
##SPECTROMETER/DATA SYSTEM= spect
##.PULSE SEQUENCE= zg30
##.SOLVENT NAME= CDCl3
##.SHIFT REFERENCE= (INTERNAL, CDCl3, 0, 15.7039)
##AUDIT TRAIL= $$ (NUMBER, WHEN, WHO, WHERE, WHAT)
$$ ##TITLE= Audit trail, XWIN-NMR		Version 3.5
$$ ##JCAMPDX= 5.01
$$ ##ORIGIN= Bruker BioSpin GmbH
$$ ##OWNER= she
$$ F:/spectra/data/she/nmr/H-F/1/audita.txt
$$ ##AUDIT TRAIL=  $$ (NUMBER, WHEN, WHO, WHERE, WHAT)
(   1,<2023-06-07 16:15:00.75 +0400>,<she>,<DPX200>,
      <continue with go, POWCHK disabled, PULCHK disabled
       configuration hash MD5:
       00 E9 B6 7A A2 85 ED C7 34 08 36 98 17 FE 4E 26
       data hash MD5: 16K
       2E 41 4C 64 09 49 F9 54 DD B7 C8 AB 7E 2F D8 57>)
$$ ##END=
$$ 
$$ hash MD5
$$ 3B F9 7E 8D 7B C1 57 3E 4D B8 B9 7F 3D 49 F3 63
##$RELAX= 
##$RELAX= 
##$RELAX= 
##$RELAX= 
##$RELAX= 
##$RELAX= 
$$ Bruker specific parameters
$$ --------------------------
##$DU= <F:/spectra>
##$EXPNO= 1
##$NAME= <H-F>
##$PROCNO= 1
##$TYPE= <nmr>
##$USER= <she>
##$AMP= (0..31)
100 100 100 100 100 100 100 100 100 100 100 100 100 100 100 100 100 100 
100 100 100 100 100 100 100 100 100 100 100 100 100 100 
##$AQSEQ= 0
##$AQ_mod= 1
##$AUNM= <au_zg>
##$AUTOPOS= <>
##$BF1= 200.13
##$BF2= 200.13
##$BF3= 200.13
##$BF4= 200.13
##$BF5= 200.13
##$BF6= 200.13
##$BF7= 200.13
##$BF8= 200.13
##$BYTORDA= 1
##$CFDGTYP= 0
##$CFRGTYP= 5
##$CHEMSTR= <none>
##$CNST= (0..31)
1 1 145 1 1 1 1 1 1 1 1 1 1 1 1 1 1 1 1 1 1 1 1 1 1 1 1 1 1 1 1 1 
##$CPDPRG= <>
##$CPDPRG1= <>
##$CPDPRG2= <>
##$CPDPRG3= <>
##$CPDPRG4= <mlev>
##$CPDPRG5= <mlev>
##$CPDPRG6= <mlev>
##$CPDPRG7= <mlev>
##$CPDPRG8= <mlev>
##$CPDPRGB= <>
##$CPDPRGT= <>
##$D= (0..31)
0 1.2 0 0 0 0 0 0 0 0.06 0 0.03 0 0 0 0 0.0002 0 0 0 0 0 0 0 0 0 0 0 0 
0 0 0 
##$DATE= 1686140008
##$DBL= (0..7)
120 120 120 120 120 120 120 120 
##$DBP= (0..7)
150 150 150 150 150 150 150 150 
##$DBP07= 0
##$DBPNAM0= <>
##$DBPNAM1= <>
##$DBPNAM2= <>
##$DBPNAM3= <>
##$DBPNAM4= <>
##$DBPNAM5= <>
##$DBPNAM6= <>
##$DBPNAM7= <>
##$DBPOAL= (0..7)
0.5 0.5 0.5 0.5 0.5 0.5 0.5 0.5 
##$DBPOFFS= (0..7)
0 0 0 0 0 0 0 0 
##$DE= 6
##$DECBNUC= <off>
##$DECIM= 32
##$DECNUC= <off>
##$DECSTAT= 4
##$DIGMOD= 1
##$DIGTYP= 9
##$DL= (0..7)
0 120 120 120 120 120 120 120 
##$DP= (0..7)
150 150 150 150 150 150 150 150 
##$DP07= 0
##$DPNAME0= <>
##$DPNAME1= <>
##$DPNAME2= <>
##$DPNAME3= <>
##$DPNAME4= <>
##$DPNAME5= <>
##$DPNAME6= <>
##$DPNAME7= <>
##$DPOAL= (0..7)
0.5 0.5 0.5 0.5 0.5 0.5 0.5 0.5 
##$DPOFFS= (0..7)
0 0 0 0 0 0 0 0 
##$DQDMODE= 0
##$DR= 18
##$DS= 0
##$DSLIST= <SSSSSSSSSSSSSSS>
$$ [...]
##$SUBNAM2= <"">
##$SUBNAM3= <"">
##$SUBNAM4= <"">
##$SUBNAM5= <"">
##$SUBNAM6= <"">
##$SUBNAM7= <"">
##$SUBNAM8= <"">
##$SUBNAM9= <"">
##$SW= 18.05172834244
##$SWIBOX= (0..15)
0 0 2 0 0 0 0 0 0 0 0 0 0 0 0 0 
##$SW_h= 3612.71676300578
##$TD= 16384
##$TD0= 1
##$TE= 0
##$TE2= 300
##$TE3= 300
##$TEG= 300
##$TL= (0..7)
0 120 120 120 120 120 120 120 
##$TP= (0..7)
150 150 150 150 150 150 150 150 
##$TP07= 0
##$TPNAME0= <>
##$TPNAME1= <>
##$TPNAME2= <>
##$TPNAME3= <>
##$TPNAME4= <>
##$TPNAME5= <>
##$TPNAME6= <>
##$TPNAME7= <>
##$TPOAL= (0..7)
0.5 0.5 0.5 0.5 0.5 0.5 0.5 0.5 
##$TPOFFS= (0..7)
0 0 0 0 0 0 0 0 
##$TUNHIN= 0
##$TUNHOUT= 0
##$TUNXOUT= 0
##$USERA1= <user>
##$USERA2= <user>
##$USERA3= <user>
##$USERA4= <user>
##$USERA5= <user>
##$V9= 5
##$VALIST= <valist>
##$VCLIST= <CCCCCCCCCCCCCCC>
##$VD= 0
##$VDLIST= <DDDDDDDDDDDDDDD>
##$VPLIST= <PPPPPPPPPPPPPPP>
##$VTLIST= <TTTTTTTTTTTTTTT>
##$WBST= 1024
##$WBSW= 4
##$XGAIN= (0..3)
0 0 0 0 
##$XL= 0
##$YL= 0
##$YMAX_a= 213981
##$YMIN_a= -273587
##$ZGOPTNS= <>
##$ZL1= 120
##$ZL2= 120
##$ZL3= 120
##$ZL4= 120
##$ABSF1= 10
##$ABSF2= 0
##$ABSG= 5
##$ABSL= 3
##$ALPHA= 0
##$AQORDER= 0
##$ASSFAC= 0
##$ASSFACI= 0
##$ASSFACX= 0
##$ASSWID= 0
##$AUNMP= <proc_1d>
##$AZFE= 0.1
##$AZFW= 0.1
##$BCFW= 1
##$BC_mod= 2
##$BYTORDP= 1
##$COROFFS= 0
##$CY= 11.3945322036743
##$DATMOD= 1
##$DC= 2
##$DFILT= <>
##$DTYPP= 0
##$F1P= 15.7292609196834
##$F2P= 12.9074282941183
##$FCOR= 0.5
##$FTSIZE= 0
##$FT_mod= 4
##$GAMMA= 1
##$GB= 0.15
##$INTBC= 1
##$INTSCL= 1
##$ISEN= 128
##$LB= 0.24
##$LEV0= 0
##$LPBIN= 0
##$MAXI= 10000
##$MC2= 0
##$MEAN= 0
##$ME_mod= 0
##$MI= 1.114404
##$NCOEF= 0
##$NC_proc= 0
##$NLEV= 6
##$NOISF1= 3.799351
##$NOISF2= 2.8
##$NSP= 1
##$NTH_PI= 0
##$NZP= 0
##$OFFSET= 15.70392
##$PC= 1
##$PHC0= -19904.12
##$PHC1= 9.652719
##$PH_mod= 1
##$PKNL= yes
##$PPARMOD= 0
##$PSCAL= 0
##$PSIGN= 0
##$REVERSE= no
##$SF= 200.130013532006
##$SI= 16384
##$SIGF1= 3
##$SIGF2= 2
##$SINO= 400
##$SIOLD= 16384
##$SREGLST= <1H.CDCl3>
##$SSB= 0
##$STSI= 0
##$STSR= 0
##$SW_p= 3612.71676300578
##$SYMM= 0
##$S_DEV= 0
##$TDeff= 0
##$TDoff= 0
##$TI= <>
##$TILT= no
##$TM1= 0
##$TM2= 0
##$TOPLEV= 0
##$USERP1= <user>
##$USERP2= <user>
##$USERP3= <user>
##$USERP4= <user>
##$USERP5= <user>
##$WDW= 1
##$XDIM= 8192
##$YMAX_p= 0
##$YMIN_p= 0
$$ End of Bruker specific parameters
$$ ---------------------------------
##NTUPLES= NMR FID
##VAR_NAME=  TIME,          FID/REAL,        FID/IMAG
##SYMBOL=    X,             R,               I
##VAR_TYPE=  INDEPENDENT,   DEPENDENT,       DEPENDENT
##VAR_FORM=  AFFN,          ASDF,            ASDF
##VAR_DIM=   8192,          8192,            8192
##UNITS=     SECONDS,       ARBITRARY UNITS, ARBITRARY UNITS
##FACTOR=    0.0002768,     1,               1
##FIRST=     0,             0,               0
##LAST=      2.2672688,     0,               0
##MIN=       0,             -273587,         0
##MAX=       2.2672688,     213981,          0
$$ Real data points
##PAGE= N=1
##DATA TABLE= (X++(R..R)), XYDATA
0@%%%%%%%%%%%%%%%%%%%%%%%%Lj1K3l5M4m8M8m8N0n6O5p5Q5r6J08j19J29j44J61
43H4j79J99k19K39k63K88l17L50l84M24m68N21n79O43p24Q15r20J054j223J441
63G82j727K138k764L798n814J1024m0608j15214J37263Q2688N0037R2378k7851
76A86130j01654l6550L7002k1944r2976J2576j3698n6723J01714L9046r7767o403
88e1247l400k7837M0221N6140K2729m0805j3496J8809o1832N361N6269m9557J2429
101c6216N9710j3271J9661K0782k0014k1723j2619M1702J8086j794L7650n8996
113C2958p4016K0242k2343r16M4618k2038j2116J1327J4877K2856j8036j444r771
126a3802k7192O7043L4821l6521P69m9447m8933L5778J9399J2261L491p661J7605
$$ plain form
0 0 0 0 0 0 0 0 0 0 0 0 0 0 0 0 0 0 0 0 0 0 0 0 0 0 3 -8 15 -20 24 -24 24 -24 26 -30 35 -40 45 -51 57 -62 67 -77 84
43 84 -95 104 -115 124 -139 149 -168 182 -202 222 -246 275 -304 339 -385 430 -490 564 -659 782
63 782 -945 1193 -1571 2227 -3587 7437 -33171 -148385 -11122 71566 121603 213981 186130
76 186130 84476 47926 84928 62984 -29992 -17416 -31114 -87837 13877 52923 -44844 -51247
88 -51247 -54647 -82484 -42263 13877 36606 -4199 -17695 1114 -60718 -55357 912 -48645 -36216
101 -36216 23494 10223 29884 50666 30652 8929 -3690 38012 56098 54304 91954 32958
113 32958 -41058 -20816 -43159 -44075 543 -21495 -33611 -22284 -7407 15449 -2587 -4031 -13802
126 -13802 -40994 26049 60870 24349 25118 -24329 -73262 -37484 -18085 -5824 -2333 -9994 7611
139G611p865J9965K2850n0971P920L6017j4623L3057Q146n1579k4274j8670N750
152b6666J0235q3K5866k5090k1885M1369j5754q521K9864k5179l859K6824R167
165A6288Q725k3036j4707j0914k6710M4570L1303k2535K4406o494k5506K5853
177B1243L669k709k873q341J7119j0423n962P673n3178j6440K0996j3027K5684
190a6569K0082j8279J587r181O802J5271o970K3117P80j3369L0904j1605k0133
203B437P477k6676J243K0761M651J9345j1521j5005K458k1310J5796J7267j7453
216e30J3008p417j9129J3672j4061q687K197j2629K0332J0903N4J8394k0348q072
230a2313J6217q583K0645J0948j6493Q743j1700p257R701j8745M723L327j0326
$$ plain form
139 7611 -254 19711 42561 -8410 -490 35527 20904 53961 62107 10528 -13746 -32416 -26666
152 -26666 -16431 -16514 9352 -15738 -37623 3746 -12008 -20529 9335 -15844 -19703 7121 16288
165 16288 25013 1977 -12730 -23644 -50354 -5784 25519 2984 27390 20896 -4610 21243
177 21243 24912 22203 19330 10989 28108 17685 11723 19396 -33782 -50222 -29226 -42253 -16569
190 -16569 3513 -14766 -13179 -22360 -15558 -287 -7257 15860 16640 3271 34175 22570 2437
203 2437 9914 -16762 -15519 5242 9893 29238 17717 2712 5170 -16140 -344 16923 -530
216 -530 12478 5061 -14068 -396 -14457 -23144 -20947 -33576 -13244 -2341 -2287 16107 -4241 -12313
230 -12313 3904 -4679 15966 26914 10421 19164 7464 207 9908 -8837 -4114 -787 -11113
243a1113K3713j977j0546P897k1714K404J4622o992J6033m366j5659P511j5380
256a5567J539J0423j5279J3609M426p758K0217r316n086Q374j3514J4948R073
269A6089q553J3593j2511r743J0762j5919N908N732j3925J3250l857n520J0804
282F110j6595K038O261j2048J6207J552r845J1682j3584j027J0340j2251J3310
295B150J458q818J5126r864j417J1457j5460R145N206r347J4627o481n508Q710
309A0984j6177N746M194j2802J3457o882q317J2213j4403J826O584j1661J3681
322a557n95m546J4077j0607J029J0012j3380J2058J971r815J2646r588l141Q748
336G312j2747Q013K109r271J4208o533l804J2026j3235L011M235j2260J0197o064
$$ plain form
243 -11113 12600 10623 77 7974 -13740 -11336 3286 -3706 12327 7961 -7698 -187 -15567
256 -15567 -14028 -3605 -18884 -5275 -849 -8607 11610 2294 -2792 5582 -7932 7016 16089
269 16089 7536 21129 8618 -1125 9637 -6282 -374 5358 -8567 4683 826 -4694 6110
282 6110 -10485 -8447 -2186 -14234 1973 3525 -6320 5362 -8222 -9249 1091 -11160 2150
295 2150 3608 -5210 9916 52 -1365 10092 -5368 3777 8983 -364 14263 7782 2274 10984
309 10984 -5193 553 4747 -8055 5402 -1480 -9797 2416 -11987 -10161 -3577 -15238 -1557
322 -1557 -2152 -6698 7379 -3228 -2199 7813 -5567 6491 8462 -1353 11293 1705 -1436 7312
336 7312 -5435 2578 4687 -4584 9624 3091 -713 11313 -1922 1089 5324 -6936 3261 -2803
350b803o989R581j3352K992O313j1437J3169M95o092J5455o840K047R818j1802
364E55R662n63q404J0531j0854l264Q918j3502N947L528r953J1788m208k514J1899
379I566j0969N968L008j2171J0123p846r019R902j1815J767O409j1318J0703P03
393d989m444J5489n357M940Q862j0188R730n24j1031J0316j0021m085Q364j2167
407e105M501R81q280J0628m713r05J0490j1892P030L972j4198Q682n674r098Q082
422e499q455J512K855p229J2760r90k59J7287p441M488J3372j0919O475J791r926
437I822M544r646k894M16j4725Q010o71j1320J3789n146n402J3108o412L062M877
452A412o937P327o896k503R480j2760N939Q628j2128J0796L447n957J2976k346
$$ plain form
350 -2803 -9792 -211 -13563 -10571 -4258 -15695 -2526 -2031 -8123 7332 492 2539 12357 555
364 555 10217 9654 1250 11781 927 -2337 6581 -6921 -974 2554 -7399 4389 181 -2333 9566
379 9566 -1403 4565 7573 -4598 5525 -2321 -11340 -1438 -13253 -11486 -5077 -16395 -5692 -4989
393 -4989 -9433 6056 699 5639 14501 4313 14043 13519 2488 12804 2783 -1302 7062 -5105
407 -5105 -604 377 -7903 2725 -1988 -2893 7597 -4295 2735 6707 -7491 1191 -4483 -13581 -5499
422 -5499 -13954 -12442 -9587 -16816 -4056 -5046 -5305 11982 4541 9029 22401 11482 17957 19748 9822
437 9822 14366 4720 1826 2242 -12483 -4473 -5144 -16464 -2675 -7821 -13223 -115 -6527 -3465 1412
452 1412 -5525 1802 -5094 -7597 1883 -10877 -4938 3690 -8438 2358 5805 -152 12824 10478
466A0478J959N203q471O256m936j0195Q237j2923n101P970j5280K833L552p818
480a8236J0763n43J280J0683n840Q435L269j0105J0077o409o139J1534j2110j829
494e170M278r821P468K227j577J0319o126N900P592j0955R636k577j1568J0509
508A0135p525q921M072r630P33N78l504J0047q007L566J3967j1329Q202Q258j3240
523b598O999K186p686L053n066L892j541p156J2781o195m650K0678m501j457J0526
538A9265j1262r53J032l881P58j3367R81J456j4923Q992M20j6388J4166N399q43
553i148J3005j862J877M68J041J2003q150k519Q693j2703K575P472j5936J674
567a510K589l160R489l068O72j26j0652P891l601q983Q748q502k957P633j1660
$$ plain form
466 10478 12437 17640 9169 15425 10489 294 8531 -4392 -9493 -1523 -16803 -13970 -10418 -18236
480 -18236 -7473 -8016 -6736 3947 -1893 6542 9811 -294 9783 3374 -2765 8769 -3341 -5170
494 -5170 -892 -10713 -3245 -1018 -2595 7724 1598 7498 15090 4135 13771 11194 -374 10135
508 10135 2610 -6311 -2239 -11869 -11136 -10558 -14062 -4015 -12022 -8456 5511 -5818 2384 10642 -2598
523 -2598 4401 6587 -1099 1954 -3112 780 -761 -7917 4864 -1331 -5981 14697 10196 8739 19265
538 19265 8003 7050 8082 4201 4959 -8408 -7427 -5971 -20894 -11902 -11482 -27870 -13704 -8305 -9148
553 -9148 3857 1995 3872 4340 5381 17384 9234 6715 15408 2705 5280 12752 -3184 -1510
567 -1510 1079 -2081 7408 4340 5012 4886 -5766 2125 -1476 -10459 -1711 -10213 -13170 -5537 -17197
582a7197K452M491k891J1223O40J362R981k170Q990K272j1981N937o070l838J2916
597A6117j0839o862J641r880M220J00k379L924o207J0358R092j2285N359l922
611a563j2952J4004L413m180K503q977J294n97J2J1873r513J628J6114q961M667
626H765P429j4080J2J466r58M575o031L881l043j3967R411l175o674J5727k089
641A249l130O213n395R46k357l056N400q645M464J1366j1975L538O39j2057R350
656c450M944K372P648n721L093O07n662P859q816p611R214n813M118N744j4344
671e818k783m168j877J2764k02K701J838j0657P139l3m900Q828n941k71J1236
686G856n250K981p52r995M410j74M600R369p389K172j452j1800Q215j745o095
$$ plain form
582 -17197 -14745 -10254 -13145 -1922 -1282 80 10061 7891 16881 19153 7172 13109 7039 3201 16117
597 16117 5278 -1584 57 -9823 -5603 -5503 -7882 -3958 -10165 193 9285 -3000 2359 -1563
611 -1563 -14515 -511 2902 -1278 1225 -7752 -6458 -7055 -7043 4830 -4683 -3055 13059 4098 8765
626 8765 16194 2114 2126 3592 2634 7209 1178 5059 2016 -11951 -2540 -5715 -12389 3338 1249
641 1249 -1881 4332 -1063 -117 -2474 -5530 -130 -8775 -4311 7055 -4920 -1382 -743 -12800 -3450
656 -3450 1494 3866 11514 5793 8886 9493 3831 11690 2874 -4737 4477 -1336 2782 8526 -5818
671 -5818 -8601 -12769 -14646 -1882 -2084 617 2455 -8202 -1063 -1096 -5996 2832 -3109 -3380 7856
686 7856 2606 5587 4835 -5160 -750 -924 3676 13045 5656 7828 6376 -5424 2791 1046 -5049
701e049P240n674K22M718o055J797o527m086R241k172Q104Q512j2169J768j85
716c15n832R640m3q67L966n542O032o24p903N716q091k264J2638m089L112K088
732G622j1189L28k966K92Q197n365K488J946r099P706r35p377O321m514L361R850
748F666l806L756m843p987P226j451M053Q556r322J829M9p976O896l839l812N604
764A599n267N528L108q667K713o920m143J0821j582M499M457r241L067k019m488
779f535Q364m386J257O885n152O644j164q922M919n318K507R989l916K871k374
794E669r693M291l848j000O684p284K810L135p103O156n009m393P607l343O384
809A063O964o174L200m489o523Q298l567K932N722p688L478k73o038O605n472
$$ plain form
701 -5049 2191 -3483 -3261 1457 -4598 -2801 -9328 -13414 -4173 -6345 1759 10271 -1898 -130 -315
716 -315 -6147 3493 3450 2583 6549 1007 7039 6415 -1488 4228 -3863 -6127 6511 2422 5534 7622
732 7622 -3567 -3239 -6205 -5913 2284 -3081 -593 1353 -7746 -40 -975 -8352 -2031 -6545 -3184 6666
748 6666 2860 6616 1773 -6214 1012 -439 3614 12170 2848 4677 4726 -3250 3646 -193 -4005 1599
764 1599 -3668 1860 4968 -3699 -986 -7906 -12049 -1228 -2810 1689 6146 -3095 -28 -2047 -6535
779 -6535 1829 -2557 -1300 5585 433 7077 5913 -3009 1910 -3408 -901 9088 5172 8043 5669
794 5669 -4024 267 -3581 -4581 2103 -5181 -2371 764 -6339 -183 -5192 -9585 -1978 -5321 1063
809 1063 8027 1853 5053 564 -5959 2339 -1228 1704 7426 -262 3216 2943 -3095 3510 -1962
824a962j65P653m132N620o3r844L521o456j573Q654m621K727J251q051N299j937
840d079k382P156m522M821O167n111O169l776p092M734m261K677N758o355L400
855C304j882o956P072l721L43O213n513N035J657o686L893o381l167O224n195
870e760M716K144p470M549k121l147Q455l561L303N230n284O120j666n356M864
885E016o835R10N379o207N127p12p233M946m462R88P422n223M428O61o152M206
901B259m476k859M096o858M044L618o546N923k431l667P638l120M500M963m134
916B950N175k151m316N601o871J04M238o458L409M05o341M097m730N31N867n409
932c899N269J355o144N069m251l157N198n233K750K892n256O525k359j246P603
$$ plain form
824 -1962 -2127 5526 1394 7014 6951 -2893 628 -5828 -7401 1253 -3368 -641 610 -7441 -2142 -4079
840 -4079 -6461 695 -3827 994 7161 2050 8219 4443 -2649 2085 -2176 501 6259 -96 3304
855 3304 1422 -5534 1538 -2183 -1840 4373 -1140 3895 5552 -1134 2759 -3622 -6789 -565 -5760
870 -5760 -1044 1100 -6370 -1821 -3942 -7089 1366 -2195 1108 6338 1054 7174 5508 152 5016
885 5016 -1819 -909 4470 -1737 3390 2678 -4555 391 -4071 -3083 4339 -884 3544 4205 -1947 2259
901 2259 -2217 -5076 -980 -7838 -3794 -176 -6722 -799 -3230 -6897 741 -2379 2121 7084 2950
916 2950 8125 5974 1658 7259 388 492 4730 -1728 1681 2086 -4255 -158 -4888 -4357 1510 -3899
932 -3899 1370 2725 -3419 1650 -2601 -5758 -560 -5793 -3043 -151 -5407 1118 -1241 -2487 5116
947E116n586K871N704m318M650j742m732L468o270L0K951p187M238r99n161N630
963a337l402j353N837m250N539J150m357N818m823k082N858o354K942L280n898
978c432N198j267k123N695m699L624L810n906N426j559n499M865n127r45K490
993E51n739M737j725m452O756m567k93O130n262M237K469m823N100l422p21M250
1009C226o588L550J302n967O412j52l540O091l760J391L179m602M965k662l149
1024c04N232o724o18L784p492L339O21l931N030l479L20M036l852N081J089m254
1040b122O225l069j700N750n941K579K258n434N293j512l142M777m267K392K537
1055D624o186M338k626l635O857o419j306L901n891L026R80l526L965k375K375
$$ plain form
947 5116 -470 2401 8105 3787 8437 6695 1963 5431 -839 -809 2142 -5045 -807 -1806 -6967 -1337
963 -1337 -4739 -6092 -255 -4505 1034 2184 -2173 3645 -1178 -3260 2598 -3756 -814 2466 -3432
978 -3432 1766 499 -1624 4071 -628 2996 6806 900 6326 4767 -732 4133 -994 -1939 551
993 551 -5188 -451 -2176 -6628 128 -4439 -4732 1398 -3864 373 2842 -1981 3119 -303 -1024 3226
1009 3226 -3362 188 1490 -4477 1935 1783 -1757 4334 574 1965 5144 542 5507 2845 -304
1024 -304 4928 -1796 -2414 1370 -6122 -2783 -2162 -6093 -1063 -4542 -4222 -186 -4038 1043 2132 -2122
1040 -2122 4103 1034 -666 5084 -857 1722 3980 -1454 3839 2327 -815 3962 -305 2087 4624
1055 4624 -1562 2776 150 -3485 3372 -3047 -4353 -452 -6343 -3317 -2337 -5863 -1898 -4273 -1898
1070a898N425o325N977O98n448P910k034l447M480l829J00J248l379L208m668
1085a982n69P383p790K173L213p990M924K588n030K699k483O13J763m310N715
1100I17l219l407Q861l853q84N669n879K735L857k955L538m766J72L594n415L386
1116B351R83p599N987j422l836N138m211L11K223k815L895k793k863N787m334
1131c198J665M224p083L933J591m297N950k235p98L172k945M344l78n020N300
1146D225l453j320N485o263J446J343n222M442k101k005L565m042K551J976o004
1161e377N190r72k693O826l766p40M144m700L842j4j546M487m595J026M296o564
1177a156L722Q03n587N106j519k808K951l898J522P04l782M768l363j282N387
$$ plain form
1070 -1898 3527 -2798 3179 3877 -1571 6339 4305 858 5338 1509 1609 2857 -522 2686 -1982
1085 -1982 -2551 4832 -2958 -785 2428 -5562 -638 1950 -3080 -381 -2864 -2251 -488 -4798 917
1100 917 -2302 -5709 3152 -701 -1585 4084 -1795 940 4797 1842 5380 614 786 4380 -1035 2351
1116 2351 3334 -4265 1722 300 -3536 1602 -2609 -2298 -75 -2890 1005 -1788 -4651 1136 -3198
1131 -3198 -1533 2691 -4392 -459 1132 -3165 2785 550 -248 2924 -21 4323 3945 -1075 4225
1146 4225 772 -548 4937 -1326 120 1463 -3759 683 -1418 -3423 142 -3900 -1349 627 -5377
1161 -5377 -187 -1159 -3852 2974 -792 -1532 2612 -2088 1754 1740 194 4681 86 1112 5408 -1156
1177 -1156 2566 3369 -2218 2888 1369 -1439 1512 -2386 -864 -160 -3942 826 -2537 -3819 1568
1192A568m797M72L883n240M404J73k111L556l105K449K421m933N006p96l534N475
1208D891k812k132L704m863K418l0l079L979l252o01L054m972K861J525m905M683
1224D69j394k280M457l906J492J782m026M850j573j548N567l882O07K699m113
1239g99L233Q95l313M078k708j009K491n320K883k25l899M760k321j526M090n187
1255c877K081J689l748M875j620j638L830l541J554K433m846M488m28k349N105
1270D008k700K10K132m524L692j65l031M661m124j111L173n585K045Q94m351M702
1286g4k515q72L459l385J690J632l266M753j103r32M186m381J310K283m282L644
1302B147m02k559M815l136M01K538n366K904o82k287M574l270p74K285n227K248
$$ plain form
1192 1568 -3229 -2757 1126 -4114 290 463 -1648 1908 -1197 1252 3673 -1260 3746 2950 -584 4891
1208 4891 2079 -53 3651 -1212 1206 1176 -1903 2076 -1176 -1777 1277 -3695 -834 691 -4214 469
1224 469 -925 -3205 1252 -2654 -1162 620 -3406 1444 -129 -1677 3890 8 615 3314 -799
1239 -799 2434 3329 16 4094 1386 377 2868 -2452 431 206 -3693 1067 -1254 -2780 1310 -3877
1255 -3877 -1796 -107 -3855 1020 -600 -2238 1592 -1949 -395 2038 -2808 1680 1252 -1097 4008
1270 4008 1308 1518 3650 -874 2818 2653 -378 4283 159 -952 2221 -3364 -1319 -425 -4776 -74
1286 -74 -2589 -3461 -2 -3387 -1697 -65 -3331 1422 319 -613 3573 -808 502 2785 -1497 2147
1302 2147 1745 -814 4001 865 1266 3804 -1562 1342 660 -1627 2947 -323 -1097 1188 -4039 -1791
1318a791N87l650M907j801q89L901l843K024R33l252M665p82r59M329l626K15
1334I68J423m266L929m58k128M109l420l79L376n240L275p48l219M732k820j29
1350i95K539n626K118l81k147M880j520j000M104m621K602J241l216M557j269
1365A266j227L984l265O48J410m691L237k95j831M246l568M50J306m618K743k5
1381b30k428M083l206J48L560m787J532J39l275N013j558M32L735m567J958O69
1397A218l149M797j136j062L242l122L11J876m299K317p47k191L980l045N24J895
1413A409n345K798k52k341M513j794r9K340m105K732K0l135M232j288k24M480
1429C941l568J235N42m078M074j259O1L654m116M37N62l591K648o26k843L495
$$ plain form
1318 -1791 -1204 -4854 53 -1748 -2637 1264 -2579 -555 378 -2874 1791 1009 50 4379 753 968
1334 968 2391 -1875 2054 1596 -532 3577 157 -222 3154 -2086 1189 441 -2778 1954 -866 -995
1350 -995 1544 -4082 -1964 -2345 -4492 388 -1132 -2132 1972 -2649 -47 1194 -2022 2535 1266
1365 1266 39 4023 758 1406 2816 -1875 1362 1067 -764 3482 -86 364 1670 -2948 -205 -230
1381 -230 -2658 1425 -1781 -1633 1927 -2860 -1328 -1189 -4464 549 -1009 -577 3158 -1409 549 1218
1397 1218 -1931 2866 1730 668 3910 788 1099 2975 -1324 993 246 -1945 2035 -1010 -486 1409
1413 1409 -3936 -1138 -1390 -3731 782 -1012 -1111 1229 -2876 -144 -124 -3259 973 -315 -539 3941
1429 3941 373 1608 2150 -1928 2146 887 948 4602 486 923 1485 -2106 542 -84 -2927 568
1445E68k343Q60J908m140K323j055k320M802j235J20K211l008J605M44k606M326
1461B460j553r57L983l675J461O56l949L349j577j85L169l387J471J73m259L032
1477B12j035k190L551k420M79J637l089K012m42k030M086j903N13L518l870K032
1493A061N01k049K875j033n77K392l064J603L73l384K614j496j297K735k558Q58
1509d46J278l433K175j339k008M050k254q3K448k418J931m23j980M093k658J459
1525C92L440l729K003P91l395K947j499l58K607l027J192r34l490L645j564j755
1541b734L991l256O10J194k060J612j127p21L379k227J146J727l685K892o1k389
1557a709L390j076l01K478k305K308q42k516L657k429r06K744l674J076J474l864
$$ plain form
1445 568 -1775 -915 993 -3147 -824 -1879 -4199 603 -632 -512 1699 -1309 296 740 -1866 2460
1461 2460 907 -50 3933 258 1719 2375 -1574 1775 198 13 3182 -205 1266 1439 -2820 212
1477 212 -823 -3013 538 -1882 -1403 234 -2855 -843 -1285 -3315 771 -1132 -619 2899 -971 1061
1493 1061 1562 -487 2388 1355 778 3170 106 1709 2082 -1302 1312 -184 -1481 1254 -1304 -446
1509 -446 832 -2601 -426 -1765 -3773 277 -1977 -2060 388 -2030 -99 -522 -2502 1591 -1067 392
1525 392 3832 103 2106 2897 -498 2449 950 592 3199 172 1364 430 -3060 585 -979 -2734
1541 -2734 1257 -1999 -1389 -195 -2255 -643 -1770 -2491 888 -1339 -193 1534 -2151 741 680 -1709
1557 -1709 1681 605 304 2782 477 2785 1943 -573 3084 655 -251 2493 -1181 -105 1369 -2495
1573b495K033j724j036L303k613K009J543l867L306n08k058L117j313J96J406
1588A299j806K065q03k740L757j923R55K580l413J968N78k855K328k190m28K086
1604A458k512R07rk814K242j273n41K948l215J430J837k919L250l78j618K811
1620A604j909J420J895l050K016o40j452L367k739p87K918k876J101O54k486J876
1636I12j608p54K444l297J990k40k992L180j383j620L263k114J521J818j996K432
1652A556j392l99L146k440R20K146m091K254O17k876J935j451J58R50k366K047
1668G14n79k966L543j731j229K883l135Q84R59j289J632j057m68K693k567K306
1684E93R49k798K950j27j844L133k101Q4J478k703K131m32k189K579k182l90K583
$$ plain form
1573 -2495 -462 -2186 -3222 81 -2532 -523 1020 -2847 459 -49 -2107 1010 -303 -107 1299
1588 1299 -507 1558 755 -1985 1772 -151 804 3384 -29 1939 2517 -338 1990 -200 -628 1458
1604 1458 -1054 -147 -156 -2970 -728 -2001 -2542 406 -2809 -1379 458 -2461 789 411 -1207 1604
1620 1604 -305 1115 3010 -40 1976 1336 -116 3251 512 -275 2643 -233 868 1522 -964 912
1636 912 -696 -1450 994 -2303 -313 -553 -3545 -365 -1748 -3368 -105 -2219 -698 1120 -876 1556
1652 1556 164 -235 2911 471 1391 3537 -554 1700 2317 -559 1376 -75 83 1033 -1333 714
1668 714 135 -2831 712 -1019 -2248 635 -2500 -1616 -657 -1946 -314 -1371 -1839 854 -1713 593
1684 593 1542 -1256 1694 1567 -277 2856 755 839 2317 -386 1745 1313 -876 1703 -479 -869 1714
1701A714m167K200J62k127K331j478j81J606k110J816L48k652L261j320m77K790
1717A716k042O50J944k252J975l62j188J883k132J285N79k703K012m89j954K152
1733A074k282j49J929k960J763L34j914K251j734O6K913l073J701R77k917L307
1749A286p99j168K959k378J190N94k280K825r72j256K536k727j07J784k872J775
1765C90o1j878K333k095o1J666k741J894p2k406L459j769k44K665k255J127P72
1782G24j663K963j091o16K083k388Q92J046k187J757p64j407K445k406M37J105
1798I30k977K362l89j719K093j647l94K002k250J329k27j278K539j217qK042j708
1815e17J182J292k553K823r28j267K931k250L14Q85k797J944j310j417K307k074
$$ plain form
1701 1714 -2453 -253 -91 -2218 113 -1365 -1546 60 -2050 -234 114 -2538 723 -597 -1074 1716
1717 1716 -326 324 2268 16 1991 1629 441 2324 192 1477 2056 -647 1365 876 -1078 1074
1733 1074 -1208 -1357 572 -2388 -625 -291 -2205 46 -1688 -1622 1291 -1782 -81 896 -2021 1286
1749 1286 487 -681 2278 -100 1090 1684 -596 2229 1257 1 2537 -190 -297 1487 -1385 390
1765 390 329 -1549 784 -1311 -1372 294 -2447 -553 -625 -3031 428 -1341 -1585 1080 -1175 -48 724
1782 724 -939 2024 933 317 2400 12 904 1950 -237 1520 756 -651 1794 -612 -175 930
1798 930 -2047 315 -74 -1793 300 -1347 -1741 261 -1989 -660 -887 -2165 374 -843 -851 1191 -517
1815 -517 665 1957 -596 2227 1299 32 2963 713 1027 1912 -885 1059 -251 -1668 639 -1435
1831a435L75R70k339K101k02j655K551j483J70J587k740K094k85j417K655r81
1847c4j034K820k309J578O65k028K525q68n11K421l346O67Q02k694K003j112j250
1864a705J937k189Q52J084k128J741l26j519K774j210o7J629k580K254m64j050
1880i67K363q68o03K378k257J534O37k045K007m45j569K393k990M21Q57l347K020
1897d81q02j252K422k456N52J709k108K004O66j236J662o41K62J972k480J365
1913A158K41j692K057j190p03K363k144R31M00j961K128r46j350J960k678N00
1929i26R76k692K834j131j419K553k438J302J530k182K301j15j054K596k037N09
1945F07J109j933J080J28j709K610k121k00J771k775J649R00k042K390j430p85
$$ plain form
1831 -1435 -1060 -90 -2429 -328 -530 -2185 366 -1117 -947 640 -2100 -6 -291 -1708 947 -34
1847 -34 -1068 1752 -557 1021 1686 -342 2183 1315 804 3225 -121 546 1348 -1346 657 -455 -1705
1864 -1705 232 -1957 -1105 -21 -2149 -408 -734 -2253 521 -689 -756 873 -1707 547 83 -967
1880 -967 1396 528 -75 2303 46 1580 2217 172 2179 1734 165 2558 -432 -11 846 -2501 -481
1897 -481 -1283 -2535 -113 -2569 -2017 -308 -2416 -412 254 -982 680 39 301 2273 -207 1158
1913 1158 1399 -293 1764 574 -129 2234 90 1021 1421 -540 1588 642 -708 1252 -1426 -926
1929 -926 50 -2642 192 -939 -2358 195 -2243 -941 589 -1593 708 593 -461 2135 98 607
1945 607 1716 -217 863 991 -718 1892 -229 -429 1342 -1433 216 1116 -926 1464 34 -751
1961g51K345l267J241P40k679J889n45k069K886j478O19J230r11J345K07j106
1977c04K796j980M87K035l062J090L69j607J621j525P7J325k171Q21N74k138K212
1994F20j022r68K055k650Q51Q06k277K310j125o47K323j493L25K118k133K573
2010A666o9r43K406j592n32J805k123M17L27j927J659k157K60J071k229J128M57
2027c76j898K679j042r53K138j795K2J393j291J346o56n89J994k148J218J858
2043A900k603K308L90j602J687j159k91J252k453J496r15j601K221j648o66J995
2059C11k104O28P42j201J642n26n5J196j847P42J418k477K517n62o86J848j473
2076A13N4J061j564K286m54j218J520q24m23J096k616P59K29j021J675j987l84
$$ plain form
1961 -751 1594 -1673 -432 308 -2371 -482 -1027 -3096 -210 -1688 -1069 161 -750 595 802 -304
1977 -304 2492 512 999 3034 -28 1062 1431 -176 1445 -80 -3 1322 -849 -28 546 -1592 620
1994 620 -402 -1370 685 -1965 -1114 -308 -2585 -275 -1400 -2047 276 -1217 -892 1226 -907 1666
2010 1666 1597 654 3060 1468 936 2741 618 1035 1362 -565 1094 -1063 -803 268 -1961 -833 -376
2027 -376 -2274 405 -637 -1590 548 -1247 -1225 168 -1123 223 -433 -1022 972 -1176 42 1900
2043 1900 -703 1605 1995 393 2080 921 630 1882 -571 925 10 -1591 630 -1018 -1684 311
2059 311 -1793 -1165 -423 -1624 18 -508 -563 633 -1214 -472 946 -1531 986 424 -262 1586 113
2076 113 167 1228 -336 1950 1496 278 1798 974 551 1647 -969 -210 19 -1002 673 -1314 -1698
2093a698J542k387J224J133k128K764p94k00J340j347O53Q03j833K323o42o13
2109A40J612j786P27J089k252J601k72j363K199j986M07J012k415P65K31j725
2125b016J944j194m85K067j773Q20O11j742K721q30m31K096k082P93R04j957J983
2142A429j43j126K202k239j2J204k014Q83o1j020J992k169N2J053j644J112k29
2159g30q63J363o97o60J790j596J220N20j630K235o87m71J424j026P66N23j986
2176e05J768m26r84J842j870K54Q37j879J711p31j291J541j174o2J467k240J293
2193d49k78j145K313j540L50J959k330R38Q00j856K398q31r2J310j131N06K99
2210A221j456J581L6j664J944j440m73P99j997Q31J13j635K469j490J11J683k004
$$ plain form
2093 -1698 -156 -2543 -1319 -186 -2314 450 -344 -544 796 -551 102 905 -928 1395 753 140
2109 140 1752 -34 693 1782 -470 1131 859 -504 1695 -291 116 1128 -1287 -522 -291 -2016
2125 -2016 -72 -1266 -1751 316 -1457 -637 -26 -1768 953 123 -308 1788 -294 499 1403 -554 1429
2142 1429 1286 160 2362 123 111 1315 -699 184 123 -897 1095 -1074 -1022 31 -1613 -501 -730
2159 -730 -1593 -230 -927 -1587 203 -1393 -173 347 -1283 952 265 -206 1218 192 958 1481 -505
2176 -505 1263 837 -147 1695 -175 79 916 -963 748 17 -1274 267 -907 -969 498 -1742 -449
2193 -449 -727 -1872 441 -1099 -749 1210 -1120 -182 618 -1238 1160 329 237 1547 416 922 1221
2210 1221 -235 1346 1382 -282 1662 222 -251 548 -1449 -618 -505 -2140 329 -1161 -1050 633 -1371
2227a371J023N02j008J643p98j99J817j681R05Mj492K381j018j304K272j799L29
2244B06P73j879J680l23j565J907j449JJ306k479K064j83k248K122j444M04J809
2261G02j964J338O49j929K942j564n9J700j619N16N25j627J479q81p23J921j692
2278b86M84N94j680J937j040o91J702k203P58J037k421J042J90o24R98j156m5
2295a404K025k008J749K95j354K483j306R0J068j157O37N6j654J589j116r04K033
2312A122k179O04O54j071J099n95q73J673j480J09J309j654J233l15p76J259j361
2329a242N71J284j418J440L80j281J698p43k65J741k566J480Rj540J632j374m05
2346e99Q62j776O60J162j566J436p90q12K028j611L93J417j942J278k95r37K028
$$ plain form
2227 -1371 -348 154 -854 789 -9 -208 1609 -72 833 837 -655 1726 708 -596 1676 -123 206
2244 206 979 -900 780 457 -1108 799 -650 -649 657 -1822 242 59 -2189 -67 -1511 -1107 702
2261 702 -1262 76 725 -1204 1738 174 115 1815 196 712 1237 -390 1089 208 -515 1406 -286
2278 -286 198 792 -888 1049 9 -682 1020 -1183 -425 612 -1809 -767 -577 -1201 -203 -1359 -1404
2295 -1404 621 -1387 362 657 -697 1786 480 570 1638 481 1118 1174 -480 1109 -7 -911 1122
2312 1122 -1057 -453 201 -870 229 -366 -1239 434 -1046 -937 372 -1282 -49 -364 -1140 119 -1242
2329 -1242 -671 613 -805 635 1015 -266 1432 689 424 2165 -401 1079 1088 -452 1180 -194 -599
2346 -599 263 -1513 -853 309 -1257 179 -611 -1423 605 -1006 -613 804 -1138 140 -155 -1092 936
2363I36j910M53J890k107J755L83j170J499q70l69J386j772P75l60j342J408j128
2380e43o18J690k349R94O19j632J780p17m62J862o49p01J755j816J475l99m54
2397a65J686j230k24J727j764Q73K74j256J722p90p07J171j782R94l33j765J354
2414b15j034l07J649j848O13J124j758J924l04k20J069q40L46R95j637J409m55
2431E11j89P98q99m57J488j691R35K44q15J309q14o78J074j538N05N13j702J679
2449B73j056j218J524o43K61O61j381J796m30k20J556j368O34J108j611J229l89
2466G26r35J654j289q5Q90j510J423K53j866J020j19n08Q98j478M19J67r72J287
2484b5q89l82P32j398J398O84j587J811k26l30J466r51P04L42j272J313l7r68
$$ plain form
2363 936 -974 -521 1369 -738 1017 1400 230 1729 859 490 1876 104 879 519 -823 585 -543
2380 -543 -1161 529 -1820 -826 -207 -1839 -59 -776 -1238 624 -25 -726 1029 -787 688 289 -165
2397 -165 1521 291 67 1794 30 903 1177 -79 1643 853 146 1317 -465 529 196 -1569 -215
2414 -215 -1249 -1556 93 -1755 -1142 -18 -1776 148 -156 -376 693 -147 199 1194 -443 966 511
2431 511 322 1120 221 -236 1252 -439 496 740 -75 1234 420 -258 816 -722 -217 296 -1406 273
2449 273 -783 -2001 -477 -1120 -859 -198 -1579 217 -213 -433 1123 -245 389 1497 -114 1115 726
2466 726 -209 1445 156 71 961 -549 874 1127 -739 281 162 -346 552 -926 -507 -340 -1312 -25
2484 -25 -914 -1296 -564 -1962 -564 120 -1467 344 118 -212 1254 303 1007 1349 77 1390 1353 385
2502C85O68j067J31N33j447N30M87j534J612j043R9Q01j318N96R0r28J296n51
2520f60j30J530j510O16N06q06J378q24L95J105q29K39Q39k198J166J00j290O90
2538C17o82N08j92p29O92k81r02J738j069j37Q98j542J238M05j572J941j023l00
2556f92J944k139J156P54j149J232k78o40J888j971K47R87j892J258m85r06J600
2573I14j587n8P61j350P59N04j357J365p50j87J322j355R13O74r57J052j39o55
2591a31J241j296M49R05j129P08l05k75J262j466J35M10j135J319j008n12J059
2608B31p87m93J099j300J184m04o06J377P6o20J015j176M62O39r84J626r71r3
2626B75Q33r22K66O33j618R50j123P20K09o29k91J030j184J111k26j020J353j429
$$ plain form
2502 385 1053 -14 117 650 -797 -267 220 -1314 298 -745 -646 155 -1163 -567 -477 -1405 -109 -660
2520 -660 -790 740 -770 -154 352 -454 924 100 495 1600 771 1010 1849 -349 817 917 -373 317
2538 317 -365 143 -49 -778 -86 -367 -1269 469 -600 -737 161 -1381 -143 262 -1310 631 -392 -692
2556 -692 1252 -887 269 1023 -126 1106 828 188 2076 105 352 1339 -553 705 220 -686 914
2573 914 -673 -731 30 -1320 -561 -57 -1414 -49 -799 -986 336 -1019 -106 568 -389 663 524 -131
2591 -131 1110 -186 263 1168 39 747 442 167 1429 -37 98 508 -627 692 -316 -828 231
2608 231 -556 -1049 50 -1250 -66 -470 -1076 301 377 -243 772 -404 58 697 -287 1339 368 275
2626 275 1108 186 452 1085 -533 417 -706 14 223 -406 -697 333 -851 260 34 -986 367 -1062
2644a062P07O52j288J229J04p81J112j001M00O47j024N59K51o57J260o09j11Q34
2662A222j523J266k36j118J055o85j97J068j512K94M83j457J091K42r61J336j435
2679a067J014O1r08Q66m06m40J734j147K20J051j482J081O32q11Q64q82k56J545
2697A669j481J05K96r83R73q79k05L79q40L78L60r13K23N74l86J426j351N16Q80
2716G41j476Q50Q9r68J537l93m02Q27n54O54m39o80J312o45l78O60q89j35P27
2735D38r08N58p45k55J209j404M11J95m54R54K95q70J137j122R14O02j052P47
2753F50J96j172R06r1p47Q81p88J016l76j017P37l63m3P75q60K77K52j113J045
2772A65m27m05P14j433N52Q60j299J296n5m69J325o32L72M99r75O56k8o53J007
$$ plain form
2644 -1062 -355 297 -991 238 342 -439 673 -328 72 719 -305 254 505 -152 1108 499 388 1222
2662 1222 -301 965 729 -389 666 -19 -216 852 -660 -366 117 -1340 -249 -7 -968 368 -1067
2679 -1067 -53 8 -900 -34 -440 -880 854 -293 -73 978 -504 577 1209 398 1262 380 124 1669
2697 1669 188 293 589 -394 579 -300 -505 -126 -966 -588 -228 -1141 -918 -344 -730 696 -655 -139 741
2716 741 -735 115 204 -764 773 380 -22 805 251 905 466 -214 1098 453 75 735 -154 -289 438
2735 438 -470 88 -657 -912 297 -1107 -696 -501 -955 -1 294 -576 561 -561 353 955 -97 650
2753 650 846 -326 580 489 -258 623 -165 851 475 -542 195 -168 -211 564 -296 -19 233 -880 165
2772 165 -262 -667 47 -1386 -834 26 -1273 23 -32 -501 824 192 564 1063 88 744 716 63 1070
2791A070j140l03R96j023P49K1p26J098r84n19P30p10N24J5p02J130o80n05J397
2810D38j198M09P04r22P33K52j45O35j370J180O34j054M34j91q03J014j125k29
2828f04J478j791O30R6o40R91n22J26Q86j192M49J66r96R91k88l90J132j278O96
2847f0P2k95P13k57k59J134m93J81K82j061M42K59o79P21p25j77M11j205P45k60
2867e11n58J008k70k97R74j395P99L36o24P75n75k44J135r93O58J60j219J732
2885H91j61p05J396p69j55J16o86N81l87k86J205j223l70J220j827Q72lj64Q92
2904D37q63l57J102j020M97M83q56P46j11k13Q88j025L44M84o53R80m06n57J431
2923A331j685O43M09p40L92J51j211R01p35q9N82j070P22K07o99P05l66J34N25
$$ plain form
2791 1070 -70 -373 623 -400 349 370 -356 742 -242 -761 -31 -741 -217 -202 -904 226 -454 -959 438
2810 438 -760 -351 353 -569 164 416 271 906 -464 716 1350 296 730 539 -264 750 -375 -604
2828 -604 874 -917 -287 -191 -831 160 -362 -236 650 -542 -93 73 -923 68 -220 -610 522 -756 -60
2847 -60 12 -283 430 173 -86 1048 555 736 1018 -43 399 658 -21 700 -25 -202 209 -996 -251 -511
2867 -511 -1069 -61 -331 -628 346 -1049 -250 86 -538 237 -338 -582 553 -440 218 378 -841 891
2885 891 730 25 1421 652 497 613 -73 508 121 -165 1040 -183 -553 667 -1160 -288 -291 -455 437
2904 437 -426 -783 319 -701 -204 279 -577 169 58 -155 733 -292 52 536 -117 863 457 -100 1331
2923 1331 -354 289 698 -42 350 501 -710 191 -544 -633 -51 -1121 -399 -192 -891 -186 -552 -418 107
2942A07l68P81j80q10J302n96o51R12p92M31N63j045Q14J39p99R01m99n92P66
2961C84r92O95j47p89O29r29K46Q32p72j5Q81j117J106j89j57R30m30L3O00j044
2981b45P93p17j22J024k15j63J54m91J04n49K67P57o06j98O47j279J213j153m21
3000a200J496n83m65R75r01R56l20l21O75m88p4J456j382L07N22r99J220p85q7
3019BJ023j545j55J545j484J252j076l59J081o47K65L82j457J081p5m18R06o15
3037b94kO07p61P18jo26N76m08K86O45j037M96J85q3j67Q7k83L32m76M37K6n13
3059b56L20r9j042J085n87l45R60p39P73j14p14J065p69K31Q64p13P61k66r44
3078e29J618m43n42P09o07K66K33k68O31j019m16P61j109L44J31l17R02r32J15
$$ plain form
2942 107 -261 520 340 -470 832 236 -415 497 -295 136 699 -346 468 607 -192 709 210 -382 384
2961 384 -608 87 -60 -849 -220 -1149 -903 -71 -843 -858 23 -1094 12 -177 -334 596 166 199 799 -245
2981 -245 548 -169 -291 733 518 355 509 18 122 -427 -160 597 -9 -207 440 -839 374 -779 -1200
3000 -1200 296 -287 -752 223 -678 278 -42 -363 312 -176 -250 1206 -176 131 653 -346 874 89 2
3019 2 1025 -520 -675 870 -614 638 -438 -797 284 -363 -98 284 -1173 -92 -167 -585 321 -294
3037 -294 -296 311 -450 268 267 -359 217 -191 95 740 -297 199 384 301 134 221 -62 270 -206 231 257 -256
3059 -256 64 -35 -1077 8 -579 -924 36 -703 70 -44 -758 307 -462 -231 633 -80 681 415 -529
3078 -529 1089 646 104 813 206 472 705 437 1068 49 -367 394 -715 -371 -240 -557 345 -587 -472
3097d72Q83j272J64R05q17M18L92j87K86k99J20N26q79L70N68p86Q48p18L23J46
3117E19q28M43m54q4P42o58J36P43j448M31M25q74Q97K4m16P56n37k22P80q62
3137d87M73L56m03R75j096L87J036j521N31J31j244J240o02k25P57n41N82K54
3155F03q92L91k53o05Q76q28O41J42p67P18J92p49J112r10O18l4n90K53l91j26
3175e99J125p81L37O84r16N48o69O55K13o12l9M73p66J34L66q80M89j88l74R07
3195A07n53N62O08j271J267r24j41M29J08j62L75m99L29J7o79J169q31N17N36
3214I64j029K19k80l32N60k12j80L65p84M28K04j015Q74j48l12J153r48O41J84
3233C52q06N48k3j00Q72r17J77P47j023N44m93J47L32n54M32K4n81O70j53k80
$$ plain form
3097 -472 411 -861 -697 208 -609 -191 201 14 300 1 121 647 -232 138 706 -80 768 50 373 519
3117 519 -309 134 -320 -404 338 -320 -184 559 -889 -458 -33 -907 -10 14 -402 354 -183 -405 375 -487
3137 -487 -14 342 -61 914 -182 205 1241 -280 251 382 -862 378 -224 -449 308 -233 349 603
3155 603 -289 102 -151 -756 120 -708 -67 75 -692 26 218 -531 581 -329 289 255 -335 -82 -473 -599
3175 -599 526 -255 82 766 -150 398 -271 384 597 -15 -54 419 -347 -213 153 -727 -238 -426 -800 107
3195 107 -446 116 724 -547 720 -204 -345 84 192 30 405 -94 235 252 -427 742 -89 428 964
3214 964 -65 154 -126 -458 102 -110 -290 75 -709 -281 -77 -1092 -218 -366 -678 475 -473 168 352
3233 352 -454 94 71 -29 843 -74 103 850 -173 371 -122 25 357 -197 235 259 -322 348 195 -85
3253h5p7m79L69K88l75J69r6l35L51O6p9K48n44Q01L04l10o1l59K41R61j073N67
3275D92O4j068J003M9j525J141k38j00O48j152R37l79l75O30m63k67Q03o48mN06
3295E4k70M96l90m1L89j63Q0O62j083M01N66n93L98n37M54J03j032R43k73l83
3315b19J62J20k75M24p56M92K37r43Q53n98l9Q77j266N84J80L1O87r73j11J201
3335F68j217P67M21j123J399q06n09J039r26J80M97o03O78n79k85M73l8p5K61
3354B22o80O52K10j254J005m52M71l9p83N93J19k85J218r05Q2Q13j126O79j99
3373C41l58N38m60k02N69q37K46N08j171O63P3k64P45p46O8Q55j235M90J28o33
3393f82O67kj23M47o63M47K92p63O93r5j0P83j003N52n82q2q2K51j24O38j398
$$ plain form
3253 -85 -162 -641 -272 16 -359 -190 -286 -621 -270 -204 -283 -35 -579 222 526 216 155 -204 37 998 -75 492
3275 492 556 -512 491 540 -985 156 -82 -182 466 -686 251 -128 -503 127 -336 -603 200 -448 -452 54
3295 54 -216 280 -110 -151 238 75 155 817 -266 135 701 108 506 -31 423 526 -506 437 164 -219
3315 -219 -57 63 -212 212 -544 -52 185 -758 95 -503 -542 335 -931 -347 -167 -136 551 -422 -533 668
3335 668 -549 218 639 -484 915 109 -400 639 -287 -107 390 -213 465 -114 -399 74 36 -39 222
3354 222 -458 194 404 -850 155 -297 174 135 -648 -55 64 -221 997 92 174 987 -139 540 341
3373 341 -17 521 61 -141 428 -409 -163 345 -826 -163 -90 -354 391 -355 -287 568 -667 -177 -49 -682
3393 -682 -15 -17 -140 307 -356 91 383 -380 313 218 208 991 -12 540 -42 -124 -206 45 -79 559 -839
3414h39O37M76q83N71K38n31Q5n25j91J564j071K35O89k38L38k22J95L69r22N16
3434D91q9o5o3r9l28Q47q35J26K66m29M69j09l55J33J39l71M10j015J228m27p53
3455h29J116p38j65N29k82P81j83q18J146m45j85M48j87M77m86n02J060r58M6
3474a75O43r29P19l92l38M32m0J16J18n3k83k17n22J124k41j15O74o42K51k1m74
3495c65N93L57l49K05j30m9j7n64P66p9k74L87k24k02j33q52O98J42q97J400o44
3516b31j20J94k18P4L29k21K81n3J65L89p14L15k86R3N80n27J4L03O7Q5n15n60
3538e56R85l68p3M51l04okk43m20O30q07M83n36J22Q05j108Q45J02k68O23q4k95
3560b4L94j84k20L51j41j63J93k53P77q73k3N58q88M66k68m46O74l9J60l74R9
$$ plain form
3414 -839 -202 274 -609 -38 200 -331 -246 -771 -962 602 -469 -234 455 217 555 333 528 897 -25 491
3434 491 402 337 274 175 -153 694 -141 -15 251 -178 291 182 -173 -40 99 -272 138 -877 351 -76 -829
3455 -829 287 -451 -616 -87 -369 412 229 -589 557 112 -73 375 188 665 179 -323 737 -221 -175
3474 -175 468 -461 258 -134 -472 -40 -80 36 154 101 -182 -399 -921 203 -38 -153 521 -121 130 109 -365
3495 -365 228 585 236 441 311 262 245 -319 447 368 94 481 257 55 -78 -930 -232 -90 -987 413 -231
3516 -231 -351 -157 -375 -301 28 -193 88 35 200 589 -125 190 -96 -3 577 50 64 367 434 519 4 -556
3538 -556 429 61 -12 439 135 129 127 -116 -536 94 -713 -230 -766 -644 161 -947 -102 0 -268 355 271 -24
3560 -24 370 186 -34 317 176 13 206 -47 730 -143 -166 392 -496 -30 -298 -744 -70 -109 51 -323 -224
3581b24K54k19l77N22O6n01Q14l14L60L94p50Q2K60q31J136q74M41j1j03M73k70
3602C28n91M96n82J76M77q20M40o0o6P79o38J13L79p46N85m12o26P54R8P3R1o95
3624d47L10M63l98L02L35m66N88q68M19K73n57j49O05j027Q44l33p8M97o78J15
3644b50N66j006M13L6M89l58l26P26o04j90O76l22J66P72q00J94P0k96M11j9l67
3665a9O35n26k64N41o18O42j65l36N11r41l4J15K94j99Q4j79M99k57k46M16J4
3686c3K03Q8n88K46L10q5L38n53O18j08n01J06J93m48M33l75J96O91j377P79m28
3707b95K14L4n84P60O2m05M24k69j33J89j54M8P5l88K98N12m90N51m62K60K21
3728D68q57M10L77j036J231l29o12L64m2j55N19p81P06j80n62L92l05L42O5p87
$$ plain form
3581 -224 30 -189 -566 -44 22 -479 335 21 381 775 25 107 367 -464 672 -202 239 228 125 598 328
3602 328 -263 233 -349 -173 304 -516 -76 -136 -202 577 -61 52 431 -315 270 -142 -768 -14 84 157 248 -447
3624 -447 -137 326 -72 230 565 99 687 -181 238 511 -46 -195 410 -617 227 -106 -184 313 -365 -250
3644 -250 316 -690 -277 -241 248 -110 -436 290 -314 -504 172 -150 16 788 -12 182 252 -44 367 348 -19
3665 -19 616 90 -174 367 -251 391 226 -110 401 -540 -574 -459 -165 -364 -280 -459 40 -217 -463 -47 -33
3686 -33 170 258 -330 -84 226 141 479 -74 544 436 -65 41 234 -214 219 -156 40 731 -646 133 -295
3707 -295 -81 -47 -631 129 191 -214 210 -59 -192 -3 -157 -109 -34 -422 -124 388 -102 449 -13 247 468
3728 468 -389 21 398 -638 593 264 -348 16 -26 -181 338 -443 263 83 -479 -87 -392 -50 15 -772
3748g72R11J11n25j17L64r4M02l43j23L60J51jm03Q4M15m62j39O70q31M73m35
3769c04K18j26R0J77J34m07J5O3K03Q2r25P01M98q80P77l08n0K85j14l6O3R3j96
3792E3N13o28j07N69p12P95o76l23P34n84M77l52L37o4n68N53k30m01N87L7q6
3813g6P75j085M74l1j83K49J55l57L69o52M51J61p46R67j1o69Q18m90L1K56m35
3834b9K15M3l42O34o45l09L94k65L24J02j05l87M04N5j25Q5j65M08j59J15N18
3855G66q88O18n77j73N15k18j42O0j81K05k51R0M73q58Q57k66q4k87k71N01K71
3876A60n23Q2M45k00P57p49J09J95o59N07L82n46K31j12n70P27J90n57K69J36
3896B74o1j96n48P18m05M22k66j94K41J48k19j47l59M19M29n17M29P8K2L9k8l22
$$ plain form
3748 -772 139 250 -275 -392 -28 -122 280 -63 -186 174 325 324 -79 5 420 -42 -181 489 -342 131 -304
3769 -304 -86 -212 -122 55 189 -218 -203 -140 63 145 -780 -79 419 -461 316 8 -42 243 129 93 156 249 53
3792 53 566 -62 -169 400 -312 483 -193 -516 218 -366 111 -241 96 32 -536 17 -213 -614 -27 10 -76
3813 -76 699 -386 88 57 -126 123 278 -79 290 -362 89 250 -496 471 460 -209 609 119 150 406 -29
3834 -29 186 229 -113 521 -124 -433 -39 -304 20 122 17 -370 34 89 -36 49 -116 292 133 248 766
3855 766 -122 496 -81 -254 261 43 -99 -39 -220 -15 -266 -176 297 -561 296 30 -54 -341 -612 -111 160
3876 160 -363 -281 164 -36 721 -28 81 276 -383 124 506 -40 191 79 -491 236 426 -131 138 274
3896 274 213 17 -531 187 -218 204 -62 -256 -15 133 -86 -233 -592 -173 256 -261 168 246 268 307 279 -43
3918d3L15j86K59k56R4K6K4n39M87k66J80km54L01K61l74k0j09L46K77o78L31
3940b6k08P5J71K53m51R16p23K35L26l97M65l28l91O71o04K1L43l76J01k00k27
3961c54M16J1m14k9O2J38M35o99P58p12K65M01n60l39N17j78N33m27J1oK47Q0
3983A56N12n46J84j6rJ61m01L0L87m33J63l20k83L05o2kP01q37L41j83K34j33
4005e1k87K34K8J33K05R7o05L5j8P8O10p40L40K63l91M85p37P15j55ml66m3J33
4028d1J62K4l29o9M27k80Q1j33J26k57L59J62n56K05L91j12K44j84m35N16J23
4049D24m21L29j47q4J44R1k98j09M30j26j73j40M44p04L65k95j01P94j256M34
4069c99M63n18K09k98k17N46K29k87N51l29M70K22p73N91m69K12J35m31L1m2l57
$$ plain form
3918 -43 272 86 345 89 183 209 233 -306 181 -85 95 93 -361 -60 201 -173 -193 -302 44 321 -357 -26
3940 -26 -234 -159 12 265 -186 730 7 242 568 171 636 308 -83 588 -16 5 348 -28 73 -127 -354
3961 -354 62 73 -341 -370 -308 -170 265 -434 324 -388 -123 278 -282 -621 -104 -282 251 -176 -165 -171 76 156
3983 156 668 122 306 290 281 442 41 71 458 25 188 -132 -415 -110 -172 -174 527 -310 31 -152 82 -51
4005 -51 -338 -104 -76 57 262 359 -246 -211 -229 -151 459 -281 59 322 -69 416 -321 394 239 235 -131 -174 -41
4028 -41 121 145 -184 -253 174 -106 -25 -158 -32 -289 70 232 -324 -119 272 160 404 220 -215 301 424
4049 424 3 332 185 101 245 336 38 -71 359 233 60 -80 364 -340 25 -270 -371 423 -833 -399
4069 -399 64 -454 -245 -543 -760 -214 15 -272 279 -50 420 642 -131 460 -9 203 338 -93 -62 -104 -461
4090d61P65j38l86L96m59j17K25m46L70J93k51K76k61p4Q28p53L75J15K20O6k93
4111A90m68N92j70k10O26p43J94j43k2O46j083L54L91l7k41r7o9Q2n94P31L27
4132B56o80N02J70n78J138p42k82O48o29J97K16l89O69p28L47M79n00M5J13m98
4152b46K56N55n84K76o36M44L01k37l68K00l94M33o2L56q02j69N37O5K41J33j69
4173A30j79O29n93L9M46l99K87k24kj5J69q1r5M83o95n3j24m0K09j86M86m55L62
4196I9j58j50L32m18M56l42Q7J25K19m84K58J37L0L76j87j42O3m38N32l87K51
4217B59j93K52k76L8k51P37n31O0o31N37j36j29j42J97N7j57L36n3P9j24k84Q00
4239D45o10J36J18l0k8J34K80m35J36n36O33l44m29N52j70L72j83l60L59K50o16
$$ plain form
4090 -461 304 166 -220 176 -283 -400 -175 -621 -251 -58 -309 -33 -294 -368 460 -293 82 197 417 483 190
4111 190 -278 314 144 -66 560 -183 11 -132 -154 492 -591 -237 154 117 -124 -221 -290 -208 -802 -71 256
4132 256 -424 78 248 -330 808 66 -216 432 -197 0 216 -173 496 -232 115 594 94 139 252 -246
4152 -246 10 565 -19 257 -379 65 366 129 -239 -39 -433 0 -62 294 -508 -677 -140 -75 166 299 130
4173 130 -49 580 -13 26 472 73 360 136 134 119 288 207 112 595 -100 -153 -277 -317 -108 -294 192 -263 99
4196 99 -59 -209 123 -295 161 -181 -94 31 250 -234 24 161 191 567 380 238 301 -137 395 8 259
4217 259 66 318 42 80 -171 566 35 95 -536 1 -135 -264 -406 -209 -152 -309 27 -26 53 -71 -355 445
4239 445 -165 -29 89 59 31 165 445 10 146 -390 243 -101 -530 22 -148 224 41 -319 40 290 -326
4260c26M03k22J83j55n63L99K73K41j62j95r3K87m65L56p6j86Q28k41k84O95r18
4281b21L39J05l38L9qJ22k07k64P20q21K19K87k15M57l95J70j4J22k50L10j69
4302a2J69L37o18K94O7k88P80n24k8J93p24N79n54O71k79kn38M51q8J03J78l78
4324b11JJ18n75N36j34L13j1k41M26L3j29K70o05M55mk16L26m19m5K78k58K00
4346A08Pq13N49K7J02L48l6r5k90j98j77P95p94l8M63k0K52l72J89J26p1L62m62
4369c8N8K75K38l09L08n22J92j92o47M57J0j00K09K20J95m63L1K16j72n25J32
4390d27L09l21PM14p0Qj97P5L40l50l4M40j00k62J0L29l2l08L64k72K52k00M23
4413C98k11n72O5M83j61k53J41l02Q03n25k96N52m21Q6K4j60M76j69o3K95L01
$$ plain form
4260 -326 77 -145 38 -117 -680 -281 -8 233 71 -124 -217 70 -395 -39 -115 -301 527 286 2 697 -221
4281 -221 118 223 -115 -76 -84 38 -169 -433 287 -534 -315 -28 -243 214 -181 -11 -25 97 -153 157 -12
4302 -12 157 494 -124 170 237 -51 729 205 177 370 -354 225 -329 342 63 61 -477 -26 -114 -11 167 -211
4324 -211 -210 -92 -667 -131 -265 48 37 -204 222 255 126 396 -209 246 242 26 352 -67 -112 166 -92 108
4346 108 115 -698 -149 -122 -20 328 292 197 -93 -291 -468 327 -467 -505 -42 -62 190 -182 7 133 62 424 -38
4369 -38 20 295 533 224 532 10 202 10 -637 -180 -170 -270 -61 159 354 -109 -78 138 -34 -559 -427
4390 -427 -118 -439 -432 -18 -88 -80 -277 -202 138 -212 -246 194 94 -168 -158 171 139 -169 195 -77 175 -25 398
4413 398 187 -385 -320 163 2 -251 -110 -412 391 -134 -430 122 -299 -213 -189 -349 127 -42 -105 190 491
4434D91k62j57l0M12j25m17L48p6n14L30K59j21n50O03l65J40m87N84j76j36J95
4455e4l13K93k24J06K78l08Q6J94m3J65n0l66L03l3L49m28k21M34m9n92L71L26
4477B24m59J60K42o8j47n57L25m5l25O76n60K86J98k26j90J58M44Q4J1R1j49n7
4499A16J48m19m5P00p20L72P29j013Q5j93j59N44K11p32R92q97M04k13p8J81j39
4520a26L18l93j55J33P3m7j5J22j22L6M9N7N6Q6L00l50J90J32m04J13K7K31r2
4543B19k67J31O4n39k49M53q9K76J01q48O15J16m65N95p02P44P9l34l58K45J76
4564c7O28o97L44k79J12L66m19J8P33q96L48Q0m76p5K36m70N56p30M83k6k1K19
4586cL84q20N03j63K06r4o3k25M52n00K78L0N39j70n07N67k1r4j77j9m43M53l03
$$ plain form
4434 491 229 72 42 454 329 -88 260 184 -330 0 259 138 -412 191 -174 -34 -521 63 -113 -249 -54
4455 -54 -367 -74 -298 -192 86 -222 -136 58 15 180 130 -236 67 34 383 -45 -266 168 119 -473 -102 224
4477 224 -235 -75 167 99 -48 -605 -280 -325 -650 26 -534 -248 -50 -276 -466 -308 136 220 231 322 173 116
4499 116 264 -155 -200 500 -220 152 881 -132 -47 -240 -399 145 356 -376 616 -281 123 -90 -168 13 -126
4520 -126 192 -201 -356 -223 -150 -197 -212 -90 -212 -176 -127 -70 -14 72 372 22 212 344 -60 53 80 311 219
4543 219 -48 83 147 -392 -641 -188 -277 -1 100 -748 -133 -17 -482 113 -589 155 234 -100 -458 -213 -37
4564 -37 591 -106 238 -41 71 437 18 36 769 -127 221 301 -175 -250 -14 -484 72 -658 -175 -201 -222 -3
4586 -3 381 -439 64 -99 107 13 -50 -275 177 -323 -45 -15 524 354 -153 414 393 299 122 103 -340 113 -190
4609a90P2K8k00P43l07k14m81J38M26M8l09J4Q0p4P0jL33m03M60m27K10r4J12
4632C4k80J23K64R1R5j09m8L0p72L64K80j36J68L89r08P42k18k13p3k96L73k71
4654c71L13J03m6R3l7k6m3M80o57K95K96p74K12J56K36k55k30N79j87l69L32k53
4676a53N54l24k36k14M22j65J17k22k58J87O83j99j6j12l91N03l34K99J89n35
4696b05M71q30N17j24j31O04j87o60L14L93j88M85p37M67m03k88M32M13l19k07
4716a83j47L54J25m85M33k46N9L33k97K84j37l13J142p81K93J33j11m16O24m49
4736B15n7k06k78J67O71o98K95k94r6p9K94J29j75J5n6k7l9K09L32O2o33O80o32
4759b01K01k0j21K60j83j01N99k49r2l25J00l08K85K54m51N30p42J44R51p55L58
$$ plain form
4609 -190 -118 -90 -290 453 146 -68 -549 -411 15 63 -246 -232 -152 -226 -156 -157 176 -227 233 -194 16 -78 34
4632 34 -246 -123 141 232 327 218 170 200 -572 -208 72 -64 104 493 -415 327 109 -104 -177 -473 -100 -371
4654 -371 -58 45 -1 92 55 29 -14 466 -191 104 400 -374 -162 -6 230 -25 -255 324 137 -232 100 -153
4676 -153 401 77 -159 -373 49 -116 1 -221 -479 -292 391 192 176 64 -327 176 -158 141 330 -205
4696 -205 266 -564 -47 -171 -302 302 115 -545 -231 162 -26 459 -278 189 -214 -502 -70 343 24 -183
4716 -183 -330 24 149 -336 97 -149 -90 243 -54 230 93 -220 922 141 434 567 456 40 664 215
4736 215 158 -48 -326 -159 512 -186 109 -185 -281 -360 -66 63 -112 -97 -153 -180 -219 -10 322 384 -249 431 -201
4759 -201 0 -20 -141 119 -64 -165 434 185 93 -232 -132 -440 -155 99 -352 178 -564 -420 531 -224 134
4780A34n28P16k46m16K79K01R3k5j26j92k05L12N7j25k3K15m4J32j27l15O39r7
4802C09o64N40j70k98J42Q8k78K73M18r28O5K28J03K67k38L13k20K39l00j15m9
4823b75J99J64O1k78P83l75n76P11kn93R7k85L01K87k32ML13l35k14m81Q69m55
4845c12J87J24j49K83K03l84m41O73j68K2l49L70J8l6Q5P28j253L38N46o47Q75
4866G13n07j18N31o72J26P0r48M34j80O32K50m51N2j37KK24k66P5p5K04K65L58
4888E82q18P5J86k97O76q69K96N48n13L78k33L11n57N59L7l53j89J08M07n5k94
4909a5J61n98L00M47q90P02J57l52j72J98J91J83j013J211q42M44k72p2M43k11
4929@j39M47m31K71k17P8j77l1o74R37J34n21N09j04nq63O08J93j90J14O7J13
$$ plain form
4780 134 -394 322 76 -340 -61 140 233 208 82 -110 -315 -3 54 -71 -94 121 77 209 82 -233 406 309
4802 309 -355 185 15 -283 -141 -53 -331 -58 360 -568 -503 -275 -172 95 -143 170 -50 189 -111 -226 -275
4823 -275 -76 88 149 -129 654 279 -297 414 412 -181 -84 -369 -68 219 -13 -9 304 -31 -245 -726 143 -312
4845 -312 -125 -1 -150 133 336 -48 -489 184 16 38 -311 59 77 41 126 854 -399 -61 485 -162 713
4866 713 206 88 619 -53 73 143 -805 -371 -551 81 331 -120 -68 -205 -203 21 -245 -170 -245 -41 224 582
4888 582 -236 -161 25 -272 404 -465 -169 379 -134 244 11 322 -235 324 361 8 -181 -73 334 279 -15
4909 -15 146 -452 -152 295 -595 107 264 -88 -260 -62 129 312 -701 510 -332 112 -160 -232 211 0
4929 0 -139 308 -123 148 -69 9 -168 -199 -873 64 198 -323 186 82 77 -786 -178 15 -175 -61 6 119
4951A19j53q3j3Q3o3K90L03m53j3N81p96K56k98J72K34o96P94m04j37K74j36Q3
4973e6j78M19m36k6j99q6O46P6j75M79m57L04o31L19k27k9O95l93m53P81l51k62
4995b40L60j66K28k16j21P12p08o31Q84k54J08M16n50k21J09k61O89j79N63q0
5015D42p07N78l40j9L52k17k55L34P6l3l02K05K09m04p3L19l05N92m88J22K26
5036C12l23K60m76j19M51l18l26L31k7J24N49o80L03K00l84o3k22P04k80J70j8
5057A68jJ1l11K11k6k26L51J04k11n66L39p2J02M27l58p02P28o0l0J5j3P1K95
5080B46o74N19J10j78O4J78l29p6J83j79K81r7m4P79k38n64j85P6n28J214k50
5101C08n52N33O7m16J1l0mL23l33j0M25p17K43K51J16J93o96K34M54n90m5L55
$$ plain form
4951 119 -34 -117 -130 -47 -110 180 483 30 17 598 -198 58 -240 -68 166 -530 264 -140 -277 -3 -139 -56
4973 -56 -234 185 -251 -277 -476 -562 84 160 -15 464 7 311 -320 -1 -228 -257 438 45 -408 373 22 -240
4995 -240 120 -46 182 -34 -155 557 -151 -782 102 -152 -44 372 -178 -399 -290 -551 138 -41 522 442
5015 442 -265 313 -27 -46 306 89 -166 168 244 211 -91 114 323 -81 -154 165 -140 452 -36 86 312
5036 312 -11 249 -227 -346 105 -213 -539 -208 -235 -111 438 -242 61 261 -123 -186 -408 296 16 186 168
5057 168 167 178 -133 78 52 -174 177 281 70 -496 -157 -229 -127 300 -58 -760 -32 -92 -122 -107 -120 -49 246
5080 246 -428 91 201 23 87 265 -64 -140 43 -136 145 48 4 783 545 -19 -204 -128 -656 558 308
5101 308 -244 289 356 -60 -49 -79 -83 240 -93 -103 322 -395 -152 99 215 408 -288 -54 400 -190 -235 120
5123A20l2m36M62L24m75l34j8M15j08k0k9O50p08j36L43L44n48j58k73N28J22
5144C3m50P75m16M37j1n26K06J17j99K07j5m51L97j4l22L48J29m50K73n75N36
5165B9J7k87L10j88k43L96k53K11J00k10J75K84l25j1p0M46o40K70K75j93p4J17
5187A36l05J74n51J89K22j0N0o8R0J9M14n13M20n30J61j46J17j45pJ66J76L85
5209D44m81K2j94j4J30N10j66M5n75J53J28K15j99k6j56k9J60N3n32M66J46l91
5231b91K71n0J8J25J15n28J92J54k33M70J73o52M72m9M8j73J54J00L5o71K01l44
5253d63Q09m89k02L90m7P2j03J6J4m8n79P73P7k08k34o6p3N61k29N62m41O7k8
5276A31K06r1l16K85m90M27M30o40M9K22m08J95R9j61k67O06l58Lo1k35K90j09
$$ plain form
5123 120 88 -348 114 438 -37 -371 -389 26 -82 -102 -131 519 -189 -325 18 362 -186 -344 -617 -89 33
5144 33 -417 358 -58 379 368 -158 48 165 -34 173 158 -293 104 90 -232 116 245 -205 68 -507 29
5165 29 46 -241 69 -119 -362 34 -219 -8 92 -118 57 341 16 5 -65 381 -259 11 286 93 19 136
5187 136 -169 5 -546 -357 -135 -145 -95 -163 -73 -54 360 -153 267 -263 -102 -248 -131 -276 -283 -117 59 444
5209 444 -37 -15 -209 -223 -93 417 251 296 -279 -126 2 217 18 -8 -164 -193 -33 20 -512 -46 100 -291
5231 -291 -20 -70 -52 73 188 -340 -148 6 -227 243 416 -236 236 187 235 62 216 316 351 -320 -119 -463
5253 -463 346 -143 -345 45 -2 70 -33 -17 -3 -51 -630 143 220 12 -222 -288 -361 200 -29 533 92 159 131
5276 131 337 246 -70 215 -275 152 582 -58 -9 213 -195 0 99 -62 -329 277 -81 -78 -139 -374 -84 -193
5298a93J85J23m75K47O2j81R3J46k6K81l86L69o17k73J097l15l47J80L26p11M79
5319F4L42m0j81l09Q3j07M2n8m29O10K51j18J58j27n13N29n45N71l41k26Q45q04
5341c03K24K70r9N5J79l28p6K21m3L02n12k0q3j10K67J0j08Q7L4p7J81j29M22
5364C64k37j57M53n78l36K37M2k0O1K05jN56n97K74J1%R1l80L62l68m5P9j48J21
5388a1J13o6k78L25j4l20K1O01m17kk97N57n60n2O97j6k51n54O39k26R7K85l83
5411a12j84M03m41M93l4m52P92o59K79ro04L63J13J40l85N1N5O77q51M24L19m19
5433d1J37L09q20N99l03j62Q07p29N57k61n25O44Q8n70K65k15J8j91k2M8M80K00
5455C13k58n86L40J02k50O32j86m33L80J21J43J77p30K77J1l74L47k4l56M49n12
$$ plain form
5298 -193 -8 115 -360 -113 -51 -232 -139 7 -19 262 -124 245 -372 -645 452 137 -210 -30 296 -415 64
5319 64 406 366 185 -124 -41 -148 -106 -164 -593 17 268 150 308 181 -332 197 -348 223 -118 -344 501 -303
5341 -303 -79 191 92 147 326 -2 -78 143 100 402 -110 -130 -213 -323 -56 -46 -154 -67 -33 -110 71 -58 364
5364 364 127 -30 423 -155 -491 -254 -212 -232 -171 34 33 589 -8 266 277 277 368 -12 350 -18 -63 16 -132 -11
5388 -11 102 36 -242 83 69 -251 -230 371 -46 -48 -345 212 -348 -400 297 281 30 -524 115 -111 -14 271 -112
5411 -112 -296 107 -334 159 125 -327 465 -194 85 76 -528 -165 -52 88 -297 -246 -191 486 -365 59 378 -41
5433 -41 96 405 -415 184 -119 -281 526 -203 354 93 -432 212 300 -270 -5 -220 -202 -393 -415 -367 113 313
5455 313 55 -531 -191 -89 -339 293 107 -326 54 175 318 495 -235 42 53 -321 26 2 -354 95 -417
5476d17N73L05o06N01o58K08N53n19j76N09o09L56m20J19N57o87j83O36J44n0
5496A36k02K69k02r2m24J024n27n7l1J15L69l1l42L44n81N77j6n66K80j68R4K13
5518A82K98k89o18M62j90j67L0N06k47j71J70J02N00m87N1N2m69P46j82l53O96
5539F22m02k78K37j34m5j46n57P08n2j74J30l21L13Q1m30k23N42J77j9K14n10
5560b67L01K28k60K77n83O98j04j07j17J2o79P88j36J06m2k74K20n34K07L01L25
5581C60k84r7k19L21l93n9K54m2M43m09j95P16n16P1L45l73K97n95J81L04J2l35
5603b13O23m72j70K40k30K53k41K1j36L25q3N03j9n21m0l6L64l29j80L40r6L50
5625B53Q4j58p6k77N7M30j60m21N01j56k20K20k84O77l79m95O11P7n19L61m16
$$ plain form
5476 -417 156 461 -145 356 -302 -94 459 -60 -236 273 -336 20 -400 -281 276 -411 -594 42 186 136
5496 136 -66 203 1 -91 -515 509 -18 -75 -106 9 378 347 5 349 -232 345 329 -237 43 -125 -31 182
5518 182 480 191 -427 35 -155 -322 -292 214 -33 -204 -34 68 568 81 132 184 -285 461 279 -74 622
5539 622 220 -58 179 45 0 -146 -703 5 -47 -221 -91 -412 -99 -18 -448 -671 -129 48 29 243 -267
5560 -267 34 262 2 279 -304 394 290 183 66 78 -601 187 51 157 115 -159 61 -473 -266 35 360
5581 360 76 -21 -240 81 -312 -371 -117 -159 284 -125 -320 396 -120 -49 296 -77 220 -375 -194 110 122 -213
5603 -213 410 -62 -232 8 -222 31 -210 -189 -325 0 -83 420 401 -120 -160 -196 168 -161 -341 -1 -97 253
5625 253 337 179 103 -174 -117 313 153 -268 233 77 -143 77 -207 470 91 -404 207 284 -235 126 -290
5646b90K52m33Q81l03m27k91L92N01n2m48j84j37M84p8K26k24J37J37L47r5l94
5667AK79N20j019L27K58p88K58L78K02l22o97P10j21j09L71o29M99l2l21N11l75
5688i9J27Q1j70o8J36j83L12j58K38j7q4jl3M3m74M39p1K6r5j69J23M0k0K0q4
5713a41O9j33m33Q57K88m87Q2n66N30QK8K40m24J06M55n10k77J9J18J31P4k86
5735b52O95m84N63m41J50k98P0p4j15J0J59q2K76o56K50PJ18K9k07L41l49M07
5757A17R0n43L36j89j18L70p8L69J09l11n02K42k40Q08m23L49n1j98j70k63L56
5778F0n67K31L9L08l76Q33l46l13M78O1n30M89l20M56n11l92K86O76k39l50l47
5799c74N93n9n07M05l02m9J01N7k12K47n68K19P03n15O15l56m74Q29j59n4n6R1
$$ plain form
5646 -290 -38 -471 410 107 -320 -611 -219 282 230 -218 -402 -539 -55 -133 93 -131 6 143 490 395 1
5667 1 280 800 -219 108 366 -422 -164 214 416 94 -603 107 -14 -123 248 -381 118 86 -235 276 -99
5688 -99 28 109 -61 -129 7 -176 136 -22 216 199 115 114 81 124 -350 89 18 44 -51 -220 -97 -57 -77 -57 -141
5713 -141 -72 -205 -638 219 507 20 102 -464 66 74 102 342 -82 24 479 -31 -308 -289 -171 -40 34 -252
5735 -252 443 -41 522 81 231 -67 3 -71 -186 -176 -17 -99 177 -479 -229 -222 -104 -75 -282 59 -290 117
5757 117 207 -336 0 -189 -307 63 -15 354 463 152 -350 -108 -348 460 37 386 335 137 -33 -296 60
5778 60 -507 -276 -237 71 -305 528 182 -131 347 408 -122 367 47 503 -8 -400 -114 562 323 -27 -374
5799 -374 219 160 -347 58 -244 -293 -192 -135 -347 -100 -668 -449 254 -261 354 -2 -476 353 194 140 84 175
5821A75j11L8jJ59k27R0k92m1K65K70o61P70q95Q05o1j75J2L84o64J73m9l70J
5844d05M61ql91N79l7l01p8L15n82Q27n93K43L79l28l08N63l45j51k8k88M31j11
5866a56L26j9J18m51M82m97k71M43L42j24o42Q02m12R9R9k08L0J22j3l74M66N5
5888B17o2K99k87J29j43j93K5O2K15J08p15J45j27K64L63m29j8J5l4K10l08j28
5910c92J13N69j84l11J03M57k49o8r9j88j7Q42k75J33j83k44M27k91J37l47k22
5931b89M89l88P0M05k01j33L01r17N74J89k81M13r8j73j25M11l72O69n37K33l75
5952a35J60J74j81l39K07l83L53j05N56m0j81J75j90k89O15p37K8K93p00R08m25
5973b36J6o1J71OJ06K18k90l00K83k11o0J15M59J80Jp24R19q26M18q6j94j4j46
$$ plain form
5821 175 64 102 101 260 33 123 -169 -210 55 325 -336 434 -461 344 283 108 120 504 -160 13 -36 -406 -405
5844 -405 56 48 -343 236 199 -102 -180 135 -447 380 -213 30 409 81 -227 336 -9 -160 -188 -476 -45 -156
5866 -156 170 151 269 -182 300 -197 -468 -25 317 193 -449 353 -59 40 139 -69 -39 83 70 -304 162 217
5888 217 155 454 167 296 153 -40 -15 47 262 370 -345 -200 -327 -63 300 -129 -147 -132 -166 44 -264 -392
5910 -392 -279 290 106 -205 -102 355 106 38 -61 -249 -266 576 301 434 251 7 434 143 280 -67 -289
5931 -289 200 -188 -118 287 86 -47 254 -663 -89 100 -181 232 134 -39 -164 247 -125 544 7 240 -135
5952 -135 25 199 18 -321 -114 -497 -144 -249 307 267 86 261 71 -218 397 -340 -312 -19 -719 189 -236
5973 -236 -220 -281 -110 -104 2 220 -70 -370 -87 -298 -358 -243 216 396 397 -327 592 -234 184 98 -96 -110 -256
5996b56O95j71n59L84o50Q63m08j10n6j49l7J074n98k73L54m85J94N41K16p30
6016a61K04m54M49Ll4j99L99j01p8l28L40k81K18N02j199J033j59j05j32k87L02
6037f8J65k49K50k73r3K51Q4o3K33l01N09n11O8k42K28K13p5N2J06l10N88m79
6059H3k87j56P65l05k56J76l5N04o18J33K91n27N57j54l21J92R3j15K98l83L99
6080C34j79L67m55L04j96k85M2L38k20j42L68r20N32K3K81j47K11n55j49O80o60
6101d28J81k49J12N34J5l5n09n9M76k38j24O18n96L69r4j84K37Q9l37J25K51j42
6123A2K38n33K95q3PP4p37R31j83Q0M11K27j004L58j64l27L75L58l09K34m74j20
6145c34P6N02j01n9m5N24l18l97L63k17k3k72N08o16L14p8N42n58N32o33N77j04
$$ plain form
5996 -256 439 268 -291 93 -557 306 -102 -212 -268 -417 -454 620 22 -251 103 -382 -188 353 569 -161
6016 -161 43 -411 38 41 7 -192 207 106 28 -300 40 -241 -23 479 -720 313 154 49 -83 -370 -68
6037 -68 97 -152 98 -175 -268 -17 67 4 237 -64 445 -66 2 -240 -12 201 126 178 284 -26 562 83
6059 83 -204 -360 405 100 -156 20 -15 489 -129 4 295 -232 325 171 -150 42 135 20 318 -65 334
6080 334 155 522 67 371 175 -110 -68 270 50 -92 276 -644 -112 -89 192 45 256 -299 -448 232 -428
6101 -428 -247 -496 -384 150 165 130 -379 -438 38 -200 -324 294 -302 67 -27 -211 26 115 -222 -97 154 12
6123 12 250 -283 12 -71 -64 10 -727 204 21 101 512 739 -265 93 -71 -398 -23 335 26 260 -214 -334
6145 -334 -258 244 143 84 39 563 245 -152 211 -6 -29 -301 207 -409 -95 -173 369 -189 343 -290 287 183
6167A83j48jN3k16L1M4L23q1K42j75J71m62J44l83M33m5l64K95O7pJ06l73K60
6190I7j3L02o70J77P1J71J60m34M1K2k2j50J52M74m15l6j5r1J57L85m26L2L52
6213C21m07K16L45m09R9l0k32J36k45K94q6l55M44j56K07J09k82L45m51r8K45
6234A0l0J34l26Q8l8K67m05K88m04K37K6j74M87r0J03l61k03O26k01L72k22m62
6256b78J9L75J15j70Q7k41k36N41o98M07J28j28m4Ok73P55Ll28K14m18M39j22
6278A53n00P60j79k5l90N85r93L29P18j58O1J52n55J7j91K49q9K56m91L33J53
6299A95O8k3n81J98K74r1M05j06l74K08k08K20q1J40m63M25o09L74K45j87M48
6320D77n85j22J90k16P19o4l90K4j85KJ42J77k37L38m00L26K53l80J26n23P09
$$ plain form
6167 183 35 34 87 -129 -98 -54 269 188 430 255 426 -36 108 -275 158 113 -251 44 111 104 210 -163 97
6190 97 84 386 -284 -107 -36 135 295 -139 -98 -76 -98 -248 -96 378 -37 -73 -88 -179 -22 363 -63 -31 321
6213 321 -86 130 475 66 165 135 -97 39 -206 88 2 -353 91 -65 142 251 -31 314 -137 -235 10
6234 10 -20 114 -212 -124 -162 105 -300 -12 -416 -179 -153 -327 160 70 173 -188 -391 235 34 406 184 -278
6256 -278 -259 116 231 61 148 -93 -329 212 -486 -79 49 -79 -123 -117 -390 365 368 40 254 -164 275 153
6278 153 -347 413 234 209 -181 404 -589 -260 458 300 361 513 -42 -25 -216 33 -56 200 -291 42 195
6299 195 263 240 -341 -143 131 40 445 339 -35 173 -35 185 104 244 -219 206 -403 -29 216 29 477
6320 477 -108 -230 -40 -256 463 399 9 33 -152 -150 -8 169 -68 270 -130 196 449 69 195 -328 381
6341C81r2m27L00n1j77L05m38K87M52o57o5M70l49N87k10q73N16Q6j02m30K59
6362b28OK34n83L09k80P10L3n03j55O95p06Q27k35k76K39L5N66j117J90K97N3
6383A11k28L35l89j69N23l93J37J32k13l67J51M58k79k32M33K41K10o20M06l64
6403a17K71n21J48J88J88l46J06L15P7m03q6M50p44N54m00j18M06O2l32K92j17
6424a27o5n27N78M56n39J56L75n26L91O9k92j42j5N41q6m07J71k4l72O14k16K82
6446B95k92l58L65k52RM63j35O6l62j87K68M08l73K4J77P3J98m75K97j29j86M22
6468C16m48L44J08k47k28P1K10j49K35k59M64o73N0J42l35r2O21o5k26L48n45
6489c58P31l00k93Q0K28o1k6J3M46l10j42k57N88k62J34R8l97Q1n3O6J96j59k67
$$ plain form
6341 381 289 -138 162 111 -66 239 -199 88 540 -117 -182 288 -61 526 316 -557 -41 45 -57 -487 -228
6362 -228 -222 12 -571 -262 -542 168 201 -302 -457 238 -468 359 124 -152 87 122 688 -429 -239 58 111
6383 111 -117 218 -171 -340 183 -210 -73 59 -154 -521 -370 88 -191 -423 10 251 461 -159 247 -117
6403 -117 154 -367 -219 -31 157 -189 -83 232 309 -94 -180 270 -474 80 -320 -438 -32 30 -302 -10 -127
6424 -127 -192 -719 -141 315 -224 -68 307 -219 172 241 -51 -193 -208 333 247 -160 11 -13 -385 229 13 295
6446 295 3 -355 10 -242 -233 230 95 161 -201 -388 -120 288 -85 -61 116 189 387 -88 209 80 -106 316
6468 316 -132 212 320 73 -155 -84 126 -23 212 -47 417 -256 -206 -64 -399 -491 130 65 -161 187 -358
6489 -358 373 73 -220 -140 88 27 1 14 460 150 8 -249 339 77 211 309 -88 -7 -60 6 202 43 -224
6512b24n7Q10r20K45o0J7L99q2j11%k97M32k26l14O29M3l53K16n90j16L71O5j66
6535b89M68J99m40L21m17J78l59L31K74k10K02K9r49Q34J16k66k70K41m0j63J19
6556i1K8l38J58L19k50M52r49O17lP04r20J64J86l28M90l19J95o9pK2k18J53O17
6579F13j200K04N14J78l09j59M30m58j03O52l12n22L83j00L11P1m09K5N05m13
6599i9N42m45j28M71j89l02J28J10K15k03n56R73o72K43j19l01R1O19m33J63n86
6620d78j2N02K97k06o7l04M44l60K69m48K26J75k89k05K31N93J24n27K03k22K83
6641B29l63L02r8l3L66l36r49J100k04K27l03j39j47L75J19p2m36L8K60J36j94
6662a22O14j43k55K79n08M56n47M43j5LK22j083N62L77p49M77L91o35L30k2j12
$$ plain form
6512 -224 -281 529 -391 -146 -206 -189 210 128 17 17 -280 152 -74 -388 241 284 -69 147 -443 -559 -188 -123 -289
6535 -289 179 378 -62 259 -158 20 -339 -8 266 56 258 287 -662 172 288 22 -248 -7 -47 -210 -91
6556 -91 -63 -401 -243 76 -174 278 -671 -54 -57 647 -273 -109 77 -251 239 -80 115 46 39 61 -157 -4 613
6579 613 -587 -383 131 309 0 -159 271 -187 -290 362 50 -472 -89 -189 122 193 -216 -191 314 -99
6599 -99 443 -2 -130 341 152 -150 -22 88 303 100 -456 517 -155 88 -31 -332 -241 378 -55 108 -478
6620 -478 -490 12 309 103 36 -268 176 -184 85 -363 -137 38 -251 -456 -225 368 492 -35 168 -54 229
6641 229 -134 168 70 37 403 67 -882 218 14 241 -62 -201 -348 27 146 74 -362 -324 -64 72 -122
6662 -122 492 349 94 373 -135 321 -226 217 202 205 427 -656 -94 283 -466 11 402 -233 97 75 -37
6683c7J63o71N59l12k71L97J21l76L08K29M19j92n82O55p72Q86n02L08l86Q51
6703G95j085L93l01p4N11j19J81k64r7j1j02j7K63q6j88k56O29k52K77J84R6q02
6725c25M75p3l9O4l9k21k03O56k56J40m42L61O3p95J132o79K61o3qk68m6L9N26
6748B60k15k21L04l61K34K62j79J05L2p40P97m39M91k09r8k05N64n61J14k19M09
6769A25J13q47M67J40K25j20Q1l28k92R7O30k36j84%l6nl38M48k28K79n19P71
6791B43p53P29o5j87K48J86o85L81L25m57Oj65O78o85M66Ql79n09P61l36J32M88
6813D30p52K22O06m59R7N2j46K16Q8n81L20J05m27J62L5J08L71l73j75J31k53
6834b23N1J88J56J65o61L13m37K68O2o7m4J77L11J43p65J08J40L01k47j09j94
$$ plain form
6683 -37 126 -545 14 -298 -569 -172 -51 -427 -119 110 529 337 -245 410 -362 524 22 330 -56 795
6703 795 -290 103 -198 -272 239 120 301 37 -60 -71 -173 -190 73 -13 -201 -457 172 -80 197 381 477 -325
6725 -325 150 77 38 102 63 -158 -361 295 39 179 -263 98 161 -634 498 -181 80 17 9 -259 -305 -266 260
6748 260 45 -176 128 -233 1 263 84 189 221 -519 278 -161 330 121 23 -182 382 -179 -65 -284 125
6769 125 238 -609 -142 -2 223 103 184 -144 -436 -339 291 55 -129 -129 -165 -170 -508 -60 -288 -9 -528 243
6791 243 -510 219 154 -33 215 401 -284 97 422 -35 -29 -194 484 -201 265 273 -106 -615 146 -190 -58 430
6813 430 -322 -100 506 47 144 196 50 266 354 -227 93 198 -229 -67 -32 76 447 74 -101 30 -223
6834 -223 -172 16 172 337 -324 -11 -448 -180 -118 -185 -229 -52 259 402 -363 -255 -115 186 -61 -170 -364
6855c64M98j91k5K00J19mk30Q5J9l73J20P66o07K70m52O0J29K68n27M21l55Q2
6877i1K58k16L30m59J06L42j55n73N61m2m56M39l94N05n71L04k14N86k43j99J19
6898f3R2K93n49j65J64K62m05Q31j61j050P54L97o75K1L58J57j31n75o2Q91m16
6919c2m7P48n22K9K4K61j64k16k03K00m12L18N57l51p9J38o40O62k41j44O5m83
6941e32Q88n89O9j4Q5M83p47M86j36k29M52m76R8O8J75N1n5k68K25l52j84Q59
6963C57o46N65m52K75m32Q04k25j87K92l86J70n33M91o14P42j90qL7m98O73m76
6984b41M27J00K26o08j38K82m0j15Qm84P04m50Q3K37n2k09N0k93j9P06O1q48L84
7007b29J20P5J58P8j93J3l4M03lj98r4K42k82K45o80L47k88K41K92n70M85J96
$$ plain form
6855 -364 134 -57 -82 118 237 233 3 88 107 -266 -146 620 13 283 -169 -109 20 288 -239 182 -173 -91
6877 -91 167 -49 281 -178 -72 270 115 -458 103 61 -395 44 -350 155 -416 -112 -326 260 17 -182 -63
6898 -63 29 322 -227 -392 -228 34 -371 460 299 -751 3 400 -275 -254 104 261 130 -445 -507 384 -32
6919 -32 -79 669 147 176 200 461 297 81 -122 78 -334 -16 541 190 111 249 -391 271 30 -114 -49 -532
6941 -532 356 -233 -164 -178 -93 390 -357 129 -7 -236 216 -260 -162 -94 81 132 77 -191 34 -318 -502 357
6963 357 -289 276 -176 99 -333 471 246 59 351 -35 135 -398 93 -521 221 31 23 60 -438 235 -241
6984 -241 186 286 512 -96 -234 48 8 -107 -99 -583 121 -329 -246 -9 -61 -270 -220 -513 -532 174 235 -613 -229
7007 -229 -109 -34 124 202 9 22 -12 391 388 190 96 338 56 301 -379 -32 -320 -79 213 -357 128 324
7029C24n52P25k66m28P3n76R78l14k89M52j90J66J75m17j55L34p5N5O54q22O34
7050D86n38J5L64k40J14p6l77N20P4r8k15J90j24j45O1M21q3k17k39P8K90j95
7072F6j82O03r19N57L58m67o54Q85m24R96p46k35N00l30J29N97o42j63O11m67
7092G3J87J03l52J9L7J41mN80n17j84n26N56K40o24k09k6N02n62K99L57j5L80
7114D55l72k13l9K03R1l23L36M45j83j000J098p40L17L79p13L88l25kJ50j65J22
7135i1K31p7Q2K20p9r4J49m81Q49l85K0k50j66J31O43p39j61N76n41L23q25L82
7157b83PL63K0k19j98M65n38L73M44q85K54N2J46L90n39j25M04l06k8l2J94r3
7179a34Q0O9k91L04m08N03l48J32l17L87J71j26M3J12m66k8P8j79P13n62P0K86
$$ plain form
7029 324 -228 497 231 -197 -124 -700 278 -36 -325 127 -63 103 278 -139 -294 40 -35 20 674 -148 486
7050 486 -52 -37 327 87 201 125 -252 268 342 244 29 219 95 -50 11 432 349 132 -107 -29 261 66
7072 66 -116 487 -432 125 483 16 -638 247 -177 819 73 -162 338 8 137 734 92 -71 540 73
7092 73 260 363 11 30 67 208 204 784 267 83 -443 113 353 -271 -480 -506 -4 -566 -267 90 75 455
7114 455 83 -130 -169 34 125 -198 138 583 400 -600 498 -242 75 454 -259 129 -196 -198 -48 -213 -91
7135 -91 140 63 145 365 286 192 341 -140 709 324 344 94 -72 59 702 -37 -198 378 -163 160 -665 -283
7157 -283 -276 87 107 -112 -310 155 -383 -10 434 -451 -197 -145 1 391 -148 -273 131 -175 -203 -235 -41 -134
7179 -134 -54 15 -276 28 -380 123 -225 -93 -410 -23 148 22 65 177 -289 -317 -239 -418 295 -267 -197 89
7201H9o67L91K70j33m5j17K29Mj37J15L21p39O07k14M18j29J15m56N42k14l9k69
7223e8M98l08l04j95L80k06M28L35q02L86n33J99N98o09L41j06%n6lQ6m50J59
7245b20L57K5j58J53m38L09l66K59k31O95m63J55j26K41j33n3j50L85n54K16N9
7266c8R3j41M26R5m34j62P4K02j83L05j03K36k76K02k42J56l29J8q3L38K9k12
7288b9L4K1l3Lo27L55j38L74M19p02K07J62l02j7L83k22k00K32P5M30q88N40Q8
7311A65K60j07n01J14o4l13O81q5k58J76k60j02J44J5l78M22K96k60n9P6K02j18
7333D6L66j81M9o37K22M4r1M00k82K05o9l1k00L7M20l29n09N37J4N6o1j70m6L15
7357A05L57L2m55j48k01J99J95J09l87J86M6n17O95J4o49N98j8j87j16K79N5J54
$$ plain form
7201 89 -578 -187 83 -50 -95 -212 17 21 -116 -1 320 -419 188 -26 392 263 378 -78 464 250 211 -58
7223 -58 440 132 -172 -367 13 -193 235 570 -232 154 -379 -180 418 -191 150 44 44 -12 -15 71 -379 -220
7245 -220 137 162 4 157 -281 28 -338 -79 -310 385 -78 77 -49 192 59 6 -144 241 -313 -97 -38
7266 -38 55 -86 340 435 1 -161 -87 115 -68 237 134 370 94 296 54 210 -119 -101 -184 154 183 -29
7288 -29 5 26 -7 -4 -631 -276 -414 -40 379 -323 -116 46 -256 -273 110 -112 -312 -80 -5 425 -463 77 165
7311 165 425 318 -183 -69 -133 -446 235 150 -108 68 -192 -294 -150 -135 -513 -91 205 -55 -114 -38 164 46
7333 46 412 231 280 -357 -135 -91 -182 218 -64 141 72 41 -159 -122 298 -31 -540 -3 11 67 6 -164 -210 105
7357 105 462 494 39 -109 -310 -111 84 193 -194 -8 38 -479 216 230 -419 179 161 -26 -142 137 192 346
7379C46m7Rj31k36J51n06P26k32q2J05j77L74m2j65J71n33J71J74k70L02J79q1
7401B06j87K0K6k08J32L79l27L43p44L86k36K17m06P32l8o9j14k96M17m96M09
7422A46Ol82J15K52l08P2L86Q6j91J27m11L6Pj00j46Q10m33j18j79K86M26q6n47
7445a46M09l3j78Q3l71L85k01j71L48k69j00lQ9L71j07k44K80j40J10O25l92J42
7467D87o76j80N24j45o49J055n48N7O01q42J50j55K93k25J3m0N56k59J63k16R2
7488E6j52J48k85L1J45P4k39J87J3K47J34o36M61k20J30k22J13j61L72J27l36
7509a3l26K00O93n30L70m5m58R5J20o8l51N28k53K25p7l27k50J67N01l8N0r4k28
7532a09j6l84J17M45j72M6M92l78J61l39j60K42M62m85P8l3k3J00K6j64J66j66
$$ plain form
7379 346 299 308 177 -59 92 -414 312 80 -2 103 -74 300 258 93 264 -269 -98 76 -194 108 287 206
7401 206 19 39 65 -143 -11 368 41 384 -360 26 -210 7 -399 333 295 226 112 -184 233 -263 146
7422 146 152 -230 -115 137 -171 -99 287 373 182 309 -102 -66 -59 -159 -305 505 72 -46 -225 61 487 401 -146
7445 -146 263 230 52 135 -236 149 -52 -223 125 -144 -244 -247 -158 213 106 -138 142 2 112 737 345 487
7467 487 -189 -369 155 10 -639 416 -132 -75 526 -316 -166 -321 -28 -253 -240 -280 276 17 180 -36 56
7488 56 -96 52 -233 -202 -57 17 -222 -35 -22 225 359 -277 184 -36 94 -128 -15 -176 196 323 -13
7509 -13 -339 -139 554 24 394 349 -109 -14 106 38 -313 215 -38 187 110 -217 -467 -300 201 163 213 119 -109
7532 -109 -125 -509 -392 53 -119 -73 419 41 202 -137 -297 -55 407 -78 0 -33 -56 44 70 -94 72 -94
7554i4j61J81j69P7M83l41j91M0K25nn76N63j40k83O39l54r3L32m57M71L2j61
7576A8J50m17K48n21N30m85M12k42n2N91q04P85o14J13M52J10q8j53n56O32L26
7597D35m58k75O5M86j68r9L68l43j64J08m3m4K15l08M97n43J78L77r1j83j45j10
7619b45K74j11L38k59K1n60N20n1J10m05K33K20m0J31K28k33j49K60o89P03k48
7640D8j78Q7j2l13N61K39p7k40n41L09J50m79M75k74L8j34K10O09o80J32p7N3
7662i4K81K67o51K81n15M91o97M94L66k49m44M72k5l25O32q19O83j55k43k42P24
7683B32r2n19K01kM50m11M36K03n58n2k86L80J96m64K94k9l5J74k28k44O60j65
7705A41m18j05om5M48j22k06K04j46K39L36M05j98p45J36J73n63K89K55J32p1
$$ plain form
7554 -94 -255 -74 -243 -166 317 -24 -215 -175 50 45 -531 32 -108 -391 248 -106 -199 133 -324 147 179 18
7576 18 168 -249 -1 -522 8 -477 -65 -307 -359 232 -572 213 -401 -288 164 274 186 33 -523 109 435
7597 435 -23 -298 -233 253 85 -14 354 11 -153 -45 -88 -132 83 -225 272 -271 -93 284 193 10 -135 -245
7619 -245 29 -82 256 -3 18 -542 -22 -73 37 -368 -135 85 45 176 404 171 22 282 -407 296 48
7640 48 -130 -43 -55 -368 193 432 355 115 -426 -117 33 -446 29 -245 -207 -341 -131 478 -202 -70 -147 -94
7662 -94 187 454 -197 84 -431 60 -637 -143 223 -26 -470 2 -23 -348 284 -535 148 -7 -250 -492 232
7683 232 140 -379 -178 -180 270 -141 295 498 -60 -112 -398 -18 178 -286 8 -21 -56 118 -110 -354 306 141
7705 141 -277 -382 -388 -433 15 -107 -313 -109 -255 -16 320 725 527 -218 -82 91 -472 -183 72 204 133
7726A33p13O39Jl60N35J17n73J54J9L36k62P2L84m3k33K21l43k35j41J65J84k18
7748a61J92j48k54N80l52q9L57m09P86o0m15M06n83j64M76m17N57k00K5j97l44
7769d14P82m81j6L86K82n64J16N3r3N9q9K31m24M36r8r6j62K1J38k6j37K40o7
7792G7M46m67O8j43J76k72M84n64J17K72O3j22l70R7l29L85L07k7l55m9M16Q7
7814B97l17p7J2M38n47O00m28L52j60L47r01L83N32k04m32L98J21m65L4P61q35
7835i1j30L76o51P33n74Q50n62l26L25k46j4j1j70O41n80N44j08k18K77R5k79
7856a19K52k00m7J03m41K88r4K86j70L89k44k77K80Kj87L9M35J02j7j60m63l09
7878e52L18Q5M26m04J63J19l88L32j83K01m05LM33j48k53K20Q7K5K53n22L01j67
$$ plain form
7726 133 -580 59 60 -300 235 352 -221 -67 -48 288 26 98 482 439 206 427 84 -151 -292 -127 57 -161
7748 -161 31 -117 -371 209 -143 -232 125 -284 502 442 27 433 -150 -314 162 -255 302 102 127 -70 -414
7769 -414 368 -113 -129 257 539 -25 91 144 51 110 21 252 -172 264 166 70 -92 -71 67 41 -96 144 77
7792 77 523 56 124 -19 157 -115 369 -195 -78 194 257 135 -235 -138 -467 -82 225 198 -157 -206 210 297
7814 297 -20 -97 -85 353 -194 406 -22 330 170 517 -384 -1 531 327 -105 293 414 -51 -17 744 -91
7835 -91 -221 155 -496 237 -337 513 -49 -375 -50 -296 -310 -321 -491 150 -430 114 6 -212 65 160 -119
7856 -119 133 -67 -114 -11 -452 -164 -258 28 -142 247 3 -274 6 8 -179 -140 295 397 380 220 -243 -552
7878 -552 -234 -149 277 -127 36 155 -233 99 -84 117 -288 -285 148 0 -253 -33 54 79 332 -190 111 -56
7900e6q3J93j48K75Q9m49O6O1Q58j005M56p61K91N7K30l27RK38P6k20M28j57l69
7923b48J27j59K78Q8K78n94L93j57l4J92j37k05K70l91K00K29m81Q83m75N5j63
7944e1j88j36L63pj01J50K81j23k24K78l42J29kk49R2L38J58l67K02k84P0k10
7966b23l1M46n8j96m46J13J97K96m12J63m36O51l53N11l73K71k33J08k17J9O92
7987D89l13j77r0L89P5n44J16R01l84J47l95l46M29l87k19J38J92K13j48j93k21
8008c28J28M24Q6j22k38P61m58k93J08j47R8m6K34L14j94l95k31RP02n80M3L75
8030B50K79p65L60K51L8o48J05j36K13k9Q1J62R7n2j95J72j01q5j8o6M6o5J03
8053cM73p02J2N00m19M97m39M63k91J51m47L37L0j26l45N98j58J1l77K95K39m74
$$ plain form
7900 -56 -139 54 -94 181 270 -179 -113 -52 806 -199 257 -504 -213 -156 74 -253 -244 -6 70 -150 278 121 -248
7923 -248 -121 -280 -2 86 364 -230 163 6 -28 164 27 -178 92 -299 -99 130 -351 532 57 112 -51
7944 -51 -239 -375 -12 -19 -120 30 311 188 -36 242 -100 29 27 -222 -130 208 366 -1 201 -83 -13 -223
7966 -223 -254 192 134 -62 -508 -395 -198 98 -314 -151 -587 64 -289 222 -151 120 -113 -5 -222 -203 489
7987 489 176 -1 -91 298 373 -171 -55 846 462 609 214 -132 297 -90 -309 -171 21 234 86 -107 -328
8008 -328 -200 224 310 188 -50 711 253 -40 68 -79 19 -27 207 521 327 -68 -299 -290 412 -168 -125 250
8030 250 529 -236 124 375 413 -235 -130 -266 -53 -82 -1 161 258 206 11 183 82 -3 -21 -87 -41 -106 -3
8053 -3 470 -232 -220 280 -139 358 -81 382 91 242 -205 132 162 36 -309 289 131 142 -235 60 299 -175
8075a75L49M3l79K06O7o7K82m51K03j9o4K68q3k01j43K39l3j14r1j60J86j73M96
8098A86n57K53J23n37P61n8m74N41k91k77P9N65j75n72M07q2K76L03n35L6K57
8119B29j85M52n10j9n2J16k7J75j87K86j7p32M61N9J90j65l68L41j96k1L08K06
8141C44m31k05M35l8k30j17N60q43O70J82l93j22L09j10m55N56n38N10j96L87
8161B75k63j51j54P36k79J56l97l16K15N18j49k5j26L0j91J08j89r4Q37l15p88
8182e62M92N76m70j7Ln7j92R7L57
$$ plain form
8075 -175 174 217 -162 44 111 44 326 -125 78 59 -5 263 180 -21 -164 75 42 -72 -163 -323 -137 -310 186
8098 186 -371 -118 5 -532 229 171 -303 238 -53 -330 -251 314 139 -433 -26 -108 168 471 -64 -28 229
8119 229 44 496 -14 -33 -85 31 4 179 -8 278 261 -471 -10 49 239 74 -294 47 -149 -170 138 344
8141 344 -87 -292 143 105 -125 -242 318 -525 145 327 -66 -188 121 11 -444 112 -426 84 -112 275
8161 275 12 -139 -293 443 164 320 -77 -393 -178 340 191 166 40 70 -121 -13 -202 -296 541 226 -562
8182 -562 -70 506 36 19 22 -35 -227 -130 227
8191B27
$$ Imaginary data points
##PAGE= N=2
##DATA TABLE= (X++(I..I)), XYDATA
0@%%%%%%%%%%%%%%K4m8M8m8M8o9R3r6J20j44J66j90K16k62K96l31L81m42N03n65
34c00O39p22Q14r12J018j137J266j406J564j732J913k118K343k586K848l135L456
51A813l807M193m627N107n649O266o966P773q723R858j1229J2936j5134J8082
65I893k2262K8702m0045O6034k43226p2683K33924k8714R3389k7401m4334J7387
77b9336J05514K1200m6230Q839M9860o3116M8290K4994j32711m6766M1233j9976
89c8205M2897M6019m323n0055k5357K9735k5986j9048O5370l8322k9043N5194
101H876k7373k8211J5415k9830r834J8817N5347M4444j2011K0621k2608o1594
113b7941M9168K6820j6929L3927k9093m7130M567m061K561k1284j4939J8758l791
$$ plain form
0 0 0 0 0 0 0 0 0 0 0 0 0 0 0 0 24 -24 24 -24 24 -45 48 -48 72 -72 94 -96 120 -142 154 -177 204 -238 265 -300
34 -300 339 -383 431 -481 537 -600 666 -740 824 -908 1005 -1113 1230 -1356 1492 -1643 1813
51 1813 -1994 2199 -2428 2679 -2970 3296 -3670 4103 -4620 5238 -5991 6945 -8189 9893
65 9893 -12369 16333 -23712 42322 -200904 -273587 -39663 -68377 25012 -2389 -46723 -29336
77 -29336 76178 97378 51148 59987 109847 46731 95021 120015 -12696 -59462 -18229 -38205
89 -38205 4692 50711 46388 -3667 -29024 711 -25275 -44323 21047 -17275 -46318 8876
101 8876 -18497 -46708 -31293 -61123 -70957 -52140 3207 47651 35640 56261 33653 -27941
113 -27941 21227 48047 31118 65045 35952 -11178 -6611 -10672 -8111 -29395 -44334 -25576 -29367
126b9367N4138M6725n6389j5707r075l5177M7774L1017j8638j2068k6227j106
138b4100n335p468K3404l2677J388O5437k202R969J9566m7094j0883J9364J5478
151B4847K0672j2058k21k1386m1274L0607p23l2199K9931r092j3457L7398O097
164A9142n480j8382k0353Q070j0745K6966L2454m4097p500N678l1960K4845K2041
177F79p515J3702M802K0489O823j4369J2324k7956j8731M0597o461m869J0013
190B9528m0887j7539j452l860J8359n847Q358J2544j7988K3425M104k9046J5884
203d417l758k559L0481k345j380j1239k5089J0044j854J1121L1029j5493J540
216A6081Q366k2478J2565j545j7649R131q791N328J0691k0324Q24j5389j7684
$$ plain form
126 -29367 24771 71496 15107 -600 -9675 -44852 2922 33939 15301 3233 -22994 -24100
138 -24100 -29435 -36903 -13499 -46176 -44788 20649 18447 28416 47982 888 -9995 9369 24847
151 24847 45519 33461 33240 11854 -29420 1187 464 -31735 -1804 -10896 -24353 13045 19142
164 19142 13662 -4720 -25073 -17003 -27748 -782 31672 -12425 -19925 -14247 -46207 -21362 679
177 679 -6836 6866 11668 32157 38980 24611 36935 8979 -9752 30845 24384 19515 29528
190 29528 -11359 -28898 -30350 -34210 -15851 -21698 -13340 -796 -18784 4641 8745 -20301 -4417
203 -4417 -8175 -10734 19747 17402 16022 4783 -20306 -10262 -12116 -995 30034 14541 16081
216 16081 24447 1969 14534 12989 -4660 4471 -4320 1008 11699 -8625 -7801 -23190 -40874
229d0874K6053K233P829J8525j9314L749N309j0316J6390o104m481J5660j2265
242B394J0228K882k4244O256p716k772K6396n155M286L545k1223Q895k432p575
256f235J6722j4340j3J0524j7741P530l536j6557J3998m431N955J8642j3281O655
270C892n57j3533J7299l741j967J5069j3377N008M849j4607R437q288p612J5728
284G600j0028O067Q665j8448O784l152r816J4905p799J741R190j6299R166n60
298a984j1735J4750r058m64J4561j0449Q129L097j2832J1900o018n64J6187j1987
312C533O358M402j6206J1432n713r448J2849j1431J544O780j4132Q687m897q946
326a5188J4824q887L410J1887j2302Q394O40j0375J3514p624j121J0138j2535
$$ plain form
229 -40874 -14821 -12588 -4759 13766 -5548 -1799 3510 -6806 9584 3480 -1001 14659 2394
242 2394 12622 15504 -8740 -2484 -10200 -12972 13424 8269 12555 16100 -5123 3772 1340 -6235
256 -6235 10487 -3853 -3866 6658 -11083 -3553 -7089 -23646 -9648 -14079 -8124 10518 -2763 3892
270 3892 3335 -10198 7101 3360 1393 16462 3085 8093 12942 -1665 7772 -516 -8128 7600
284 7600 -2428 3639 12304 -6144 640 -2512 -12328 2577 -5222 -3481 5709 -10590 -1424 -1984
298 -1984 -13719 1031 -8027 -8491 6070 -4379 3750 6847 -5985 5915 -103 -667 15520 3533
312 3533 9891 14293 -1913 9519 3806 -5642 7207 -4224 -2680 4100 -10032 -1345 -6242 -15188
326 -15188 -364 -9251 -5841 6046 -6256 2138 2778 -7597 5917 -1707 -2828 7310 -5225
339e225Q084K261j1882J3290m980m191J3985r248N701N118j2493R788o255p884
353c931J0740j3419J379N162j4916Q666p55q809J4305o826K621J0765j0256J0940
367E666J145r411J3506q288l134J0129j4297N262K416j0859J1726m015l023J3152
381I975j0173P416N146j1493J0506m147q363Q989j3382j179L783j3704P348j268
395a0546o278J2616o406L869J1149j0191J1387L471q160J2145o295m622P044j1524
409b341M441J025p879J0803o574l58J2565j2095N857P779j1946P611k481q799
423b392M001j1102P85q6j2839J0465m910o543J8346n182K077J4412o120Q790M184
438A3886l265Q308q369J238N664j7233N109R42j5086J0210k357o203Q699o407
$$ plain form
339 -5225 2859 5120 -6762 6528 1548 -2643 11342 2094 7795 12913 420 10208 3953 -3931
353 -3931 6809 -6610 -5231 -69 -14985 -6319 -7074 -15883 -1578 -8404 -5783 4982 -5274 5666
367 5666 6811 -2600 10906 2618 -516 9613 -4684 578 2994 -7865 3861 -154 -3177 9975
381 9975 -198 7218 12364 871 11377 7230 -1133 7856 -5526 -6705 -2922 -16626 -9278 -10546
395 -10546 -16824 -4208 -10614 -6745 4404 -5787 5600 9071 911 13056 6761 2139 9183 -2341
409 -2341 2100 3125 -4754 6049 -525 -883 11682 -413 5444 13223 1277 8888 6407 -2392
423 -2392 1609 -9493 -8708 -8794 -21633 -11168 -16078 -22621 -4275 -9457 -7380 7032 912 9702 13886
438 13886 10621 18929 10560 11798 17462 229 5338 6280 -8806 1404 -953 -7156 1543 -4864
452d864M022J537o799J0295p714m428J1087j3921q35P592j1925P386K483m059
466a0143J0813l020O053R013p153J1471J08q029J1392r623p409N891j3614J045
480c205K87j0110P051n094o67R766q883R274N991p353J2955m149q971Q643r610
495d075m14N789r089L881m280l450J1522p191N459J1511q894J1846M629j1595
509E649Q763m073m819L471q771J466n607q684J1722r443k942J3596j0708L415
523f965J2159p397L806J498k173J542j0885N577m59j2485J5205N60j1255J2808
537A536j920j416J3447J593M050l045j567Q191j3307k82M034k1469K094P268j3033
552a3826K775k529p340N430R36J0650J994o173J3993k848m112J3096j1189l709
$$ plain form
452 -4864 -842 695 -6104 4191 -3523 -7951 3136 -10785 -11620 -4028 -15953 -8567 -6084 -10143
466 -10143 670 -2350 3703 12716 5563 17034 17142 9113 20505 10882 3473 9364 -4250 -3205
480 -3205 -2918 -13028 -5977 -11071 -11738 -1972 -10855 -1581 4410 -2943 10012 5863 -3108 5535 -4075
495 -4075 -4489 1300 -7789 -3908 -8188 -11638 -116 -7307 -1848 9663 769 12615 17244 5649
509 5649 14412 10339 5520 8991 220 1686 -3921 -12605 -883 -10326 -13268 328 -10380 -6965
523 -6965 5194 -2203 1603 3101 928 2470 -8415 -2838 -3297 -15782 -577 -17 -11272 1536
537 1536 -384 -1800 11647 13240 17290 14245 12678 20869 7562 7280 11314 -10155 -8061 -793 -13826
552 -13826 -11051 -13580 -20920 -15490 -14554 -3904 -1910 -8083 5910 3062 -1050 12046 857 -2852
566b852J0340m979N022o43n638L713o189P022P898r734Q778l08r754P404j0359
581b79q039N866r498Q72O48q549P112j510K189Q363q964Q186Q776k756J5577k016
597A5978j1688P007o130o61M671q000J916l944K27R367j4336j200P373j0234J2522
612B868J0352j0664J44o090k745L503m275N804n133p737J4817n132o062J2377
626B027q963m68J2944J83N891k625j682J486j3202N871N396j1939J0964J820j2542
641d839N671l160j708M196k884O609j899j751J1020j1668o980N534j2433N202
655i090Q844m320K980l862j721O196l462P243J870p189J3195K150l947O532j3881
670A538o073M689k109R342m61p974J590j0515K757O597p823O908J025o081J1505
$$ plain form
566 -2852 7488 2509 7531 6888 1250 4963 -1226 5796 13694 3960 12738 12430 2676 10080 -279
581 -279 -8318 -2452 -11950 -11078 -10430 -18979 -11867 -13377 -11188 -2825 -11789 -3603 5173 2417 17994 15978
597 15978 4290 11297 5167 4506 9177 1177 3093 -851 -624 8743 -5593 -6793 580 -9654 2868
612 2868 13220 2556 2700 -3390 -6135 -2632 -6907 -1103 -6236 -13973 844 -4288 -10350 2027
626 2027 -6936 -7404 5540 5723 11614 8989 7307 8793 -4409 1462 6858 -5081 5883 7703 -4839
641 -4839 832 -2328 -4036 160 -2724 3885 1986 235 11255 -413 -7393 -1859 -14292 -9090
655 -9090 -246 -4566 -1586 -5448 -7169 -973 -4435 2808 4678 -2511 10684 12834 8887 15419 1538
670 1538 -4535 154 -1955 7387 6926 -1048 542 -9973 -7216 -619 -8442 -1534 -509 -6590 4915
685D915m141o038L326r351M614O941k1Q146o714m125M999q454Q236P593q395P848
701I379r21n724O146o827l233r00n996R144K74k714O373j3083m345P813n147Q018
717a743N175n944M443l524J052M261q877M506J135m775J3615j595n162M065j0116
732c484m91O497k203Q331l198m498M366r203K368L930j0542N269J380k567R067
747E022o169l978J04p526Q171M790p08Q753q021m110O515o273N834K892o268P633
763F661j239q97N242j0506k100J420n149J0683J082m563M263j0754j268N062m470
778f533O729L79m235P959n425p44K070r297M790K722j047J1210l035m202K368
793C709p942M460M655l272P773m451k961M776q520N05M90q197P139O32j434P235
$$ plain form
685 4915 774 -5264 -1938 -11289 -6675 266 245 8391 1677 -2448 2551 -5903 2333 9926 1531 9379
701 9379 8458 2734 8880 2053 -1180 -2080 -8076 1068 1342 -1372 5001 -8082 -12427 -4614 -9761 -1743
717 -1743 3432 -2512 1931 -1593 -541 3720 -5157 -651 484 -4291 9324 7729 2567 6632 -3484
732 -3484 -3975 2522 319 8650 5452 954 5320 -3883 -1515 2415 -8127 -2858 -1478 -4045 5022
747 5022 -1147 -5125 -5021 -12547 -4376 414 -294 8459 438 -3672 2843 -3430 2404 5296 -972 6661
763 6661 5422 4525 9767 -739 -2839 -1419 -6568 4115 5197 634 4897 -5857 -7125 -2063 -6533
778 -6533 196 575 -3660 4299 -1126 -1870 200 -9097 -4307 -1585 -2632 8578 5543 1341 3709
793 3709 -4233 227 4882 1610 9383 4932 1971 6747 -1773 -1268 -778 -8975 -1836 -1204 -2638 4597
809D597q778j722K765o015R472K005k495O800o952j733L832o844M301R69l963
824c761R450k153r10L890r614K261K831k567R686k375m178K689r394N61K270o527
840g841O701k059k317P966n852K3K691p444P252K445m41Q047o536k032J510p650
856e537N758J091m805P819l612q74N810o951K097R36m715R187j874j616L660r689
872c315J81J409o534O611o69l501O316n405J553L544n966O070J194k290Q645m644
888C199p83K056q636L808M32k997P206k968j637N214o878L626J868m700O886l152
904B544j228N203q701K5N6p713N808m91j926O222m484J119L551m931O920Q3k274
921b17Q496m276j21L339p553J475L91l746O789m297m52M955p431L248J402n187
$$ plain form
809 4597 -4181 -5903 -3138 -9153 319 2324 -171 6629 -323 -2056 1776 -5068 -767 202 -3761
824 -3761 5689 3536 2626 6516 -3098 -837 1994 -573 9113 6738 2560 5249 -4145 -3584 -1314 -7841
840 -7841 -1140 -3199 -5516 2450 -3402 -3379 -688 -8132 -880 1565 1124 9171 2635 603 2113 -5537
856 -5537 221 1312 -3493 4326 714 -160 5650 -1301 796 1732 -2983 6204 4330 2714 6374 -3315
872 -3315 -3134 -1725 -8259 -1648 -2317 -5818 498 -4907 -3354 190 -5776 294 1488 -802 7843 3199
888 3199 2416 4472 -4164 -356 76 -2921 4285 1317 -320 4894 -1984 1642 3510 -1190 5696 2544
904 2544 1316 6519 -2182 -2157 -2101 -9814 -4006 -4497 -6423 -201 -4685 -3566 -15 -4946 1974 2057 -217
921 -217 8279 4003 3882 7221 -332 1143 1534 -2212 4577 280 -172 4783 -2648 600 2002 -3185
937c185N972j577k818N017p621R94J197o940O009k110k409Q100l824J743M371
952B919m703N640o0q79O731n376O21K330q450K946q08n871O288l391n43M133o422
969d895L895M05m713P708k362k293N863o031R53J338n910N081k001q36O524n474
985b748K922M046n645N082R39l106N954m291m16K406p681M242j361n864O724l424
1001b221j201N031n654L245M92k853N784l569j209N317p108K691K642o965N108
1016d70r26k864O030k971K174L041m997O628j695l050P172o023j00L706o631J792
1032H16q16n150M504k810K1L444o164L836J205m361O743k416k005O306n038J758
1048a27K845o215M930p07q21M422n222K983K649n055O252j543n011O463m105k238
$$ plain form
937 -3185 2787 1210 -1608 3409 -4212 -3218 -2021 -8961 -2952 -5062 -7471 629 -3195 -1452 2919
952 2919 -1784 3856 3796 2917 9648 4272 4893 7223 -1227 1719 911 -4960 1328 -2063 -2606 1527 -4895
969 -4895 -1000 -595 -5308 2400 38 -2255 3608 -2423 -1470 -132 -6042 -961 -2962 -3798 2726 -2748
985 -2748 174 4220 -1425 3657 4596 1490 7444 3153 2737 5143 -2538 1704 343 -5521 1203 -2221
1001 -2221 -3422 1609 -4045 -800 -308 -3161 2623 -946 -2155 3162 -3946 -1255 1387 -5578 -470
1016 -470 -1396 -4260 1770 -1201 973 4014 -983 5645 3950 900 8072 2049 1949 5655 -976 816
1032 816 0 -5150 -646 -3456 -3435 9 -6155 -2319 -1114 -5475 1268 -1148 -3153 3153 -1885 -127
1048 -127 2718 -3497 1433 726 -95 4327 -895 2088 4737 -318 5934 4391 -620 5843 1738 -500
1064e00M046o480J086r65j991M461n712R91M880o674N177M015o477N286N99k093
1080c51M279k794J195o73k390O572m742l135O916o612J124N479n472J785L0k538
1096a327L256l690K033N77o634O078p82o395O879l315j624O486l018N62O50k218
1112b482O061k855N10M461p319L525L757p015M376j049l493M527k723N58K12m794
1128c743N407j234l229N242o295K30M537m672K673L84l693M361j759P41L133n266
1144c183L730J792l942O983l236k352M452l763K012J942n138L372j682j932M020
1159C075n886K080K158o136M989n81m890N651k863p36L930l829L447j084k989
1174c664O824l704k48N370o100L500K190m333K746j519l89L209m387K897n08m902
$$ plain form
1064 -500 3546 -2934 -1848 -2813 -4804 -343 -6055 -5064 -184 -6858 -1681 2334 -4143 1143 1742 -351
1080 -351 3928 1134 2329 1656 -734 5838 1096 -2039 4877 -1735 -611 4868 -604 1181 1211 -1327
1096 -1327 1929 -1761 272 849 -5785 293 -489 -6884 -5 -3320 -4944 1542 -1476 -914 -264 -2482
1112 -2482 3579 724 1234 5695 -1624 1901 5658 -1357 3019 1970 -1523 3004 281 839 1051 -3743
1128 -3743 1664 430 -2799 2443 -3852 -3622 915 -3757 -1084 -700 -4393 -32 -1791 -1050 2083 -3183
1144 -3183 547 2339 -1603 5380 2144 -208 4244 481 2493 4435 -703 2669 987 -945 3075
1159 3075 -2811 -731 1427 -4709 280 -301 -5191 460 -2403 -3139 791 -3038 409 -675 -3664
1174 -3664 3160 -544 -792 4578 -1522 1978 4168 -165 2581 1062 673 3882 -505 2392 1884 -3018
1190c018O299l197l303N304m502LL292m521K753j263j178M249m630J746L903n395
1206c458M436J793m596M514k071m26L758l602K031J63l973N284l914o29M561n959
1222b088K582J367m785L625j555k110L515l552J389K356n183M955j146l626N443
1237A187l819R56L740l734L585p4k753M978k913m18L598m753L184O28n011M167
1253B548l024j609M365m513J786J383m080L550j522k268M270m020J086K632m830
1268d246M705j291k527M560l049J348L668l855M064k16l173M522k941k38L600
1283D931m890K168j38l850L297l621j119L926m628K757K012m696M280j971k386
1298c928N510l651J591K250m069L145J00k673M287l436R43L548l914L664j78l489
$$ plain form
1190 -3018 3281 84 -3219 2085 -2417 -2414 878 -3643 -890 -2153 -3331 918 -3712 -1966 1937 -3458
1206 -3458 978 2771 -1825 2689 618 192 3950 348 2379 2542 -1431 3853 -61 -690 3871 -2088
1222 -2088 494 1861 -2924 701 -854 -2964 551 -3001 -1612 744 -4439 516 -630 -4256 1187
1237 1187 -2632 -1676 2064 -1670 1915 1841 -912 4066 1153 735 4333 -420 2764 3392 -1619 2548
1253 2548 -476 -2085 2280 -2233 -447 936 -3144 406 -1116 -3384 886 -3134 -2048 584 -4246
1268 -4246 459 -832 -3359 1201 -1848 -500 3168 -687 3377 3161 -12 4510 1569 1331 4931
1283 4931 41 2209 2071 -1779 1518 -2103 -3222 704 -3924 -1167 845 -3851 429 -1542 -3928
1298 -3928 1582 -2069 -478 1772 -2297 848 948 -1725 2562 -874 69 3617 -297 3367 3189 -300
1314c00L349k887j55L032l899K241j80l952L665k579j797L867m178K193J961l326
1330b945M128j896k627M605l427K425K589l855L355j243k708M770l091J41K976
1345C197l670L251l2k852K943l400j061L863l909L280j70m028K861l059q71L597
1361f0l231J756J469k841M179j637j295L418l656J288L585k942L607j579k788
1376g27L422l303O74K403l691L144K47k952L856l926p03K562m194K911J151l491
1392b617L281k932p80K887l306K574K191l857M113j287j322L936l685J317K174
1407B687k673L867j762k000K631l717l72M055m009L246m01l233K793l171m6K652
1423E47l616K613J57k528L675k052j474K798k918K340K101k373L956j826k134
$$ plain form
1314 -300 3049 162 7 3039 -860 1381 1201 -2751 914 -1665 -3462 405 -3773 -1580 381 -2945
1330 -2945 1183 -713 -3340 1265 -2162 263 2852 -1003 2352 1109 -1599 3171 80 221 3197
1345 3197 -473 2778 2746 -106 2837 -563 -1624 2239 -1670 1610 1440 -2588 273 -2786 -3657 -60
1361 -60 -3291 -1535 -66 -2907 1272 -365 -1660 1758 -1898 -610 2975 33 3640 2061 -727
1376 -727 2695 -608 66 2469 -1222 1922 2169 -783 3073 -853 -1556 1006 -3188 -277 874 -2617
1392 -2617 664 -2268 -3048 -161 -3467 -893 1298 -2559 1554 267 -1055 2881 -804 513 2687
1407 2687 14 3881 2119 119 2750 -967 -1339 2716 -1293 1953 1552 -1681 1112 -2059 -2105 547
1423 547 -3069 -456 -299 -2827 848 -1204 -2678 120 -2798 -458 1643 -730 3226 1400 -734
1438g34L409l222J396K275l595L185p89j438J850l555l28K154l331L508L79l038
1454a874K638k837o10K831l572L415J54k480L970k392j578L522l404J686K670
1469B139k347K957j704j327L284l890J661K307l273K346k10k609K910l492n73
1484a821K562m091L420m21k929M345k974q07K279k950K966P43k085L912k454j8
1500c23K940l771K360J283k900L233j030j576K816l980J410J312l283L616j325
1515G82k607L208l034j022K342l130K333J41k000L314k267j56K496k898K336J950
1531A788j882K943j473m45J404l285K611J108l555L596j398k301K541k894J74
1546a068J274k321L222j967j153L036l165k16K770l406K246Q51k702L025j371
$$ plain form
1438 -734 2675 -547 849 3124 -471 2714 1925 487 2337 -1218 -1546 608 -2723 785 1164 -1874
1454 -1874 764 -2073 -2683 148 -3424 -9 145 -2335 1635 -757 -2335 1187 -2217 -531 2139
1469 2139 -208 2749 1045 -282 3002 -888 773 3080 -193 2153 1943 -666 2244 -1248 -1821
1484 -1821 741 -3350 70 -351 -3280 1065 -1909 -2716 -437 -3387 -421 322 -1763 2149 -305 -323
1500 -323 2617 -1154 1206 2489 -411 2822 1792 216 3032 -948 462 1774 -1509 2107 782
1515 782 -1825 1383 -1651 -2673 -331 -3461 -1128 -987 -2987 327 -1940 -2096 400 -2498 -162 1788
1531 1788 -94 2849 1376 931 2335 -950 1661 2769 -786 2810 1412 -889 1652 -1242 -1068
1546 -1068 206 -2115 1107 -860 -2013 1023 -2142 -2358 412 -2994 -748 103 -2599 426 -945
1561i45o4K492l372L190O62k591L961j765j067K931k968L65R74k462K447j366
1577D22j481K154l100K75K186l288K193K10j535L077k128k69J009k602K630J35
1593a12j036K788k328n06K860k791K378P08k111L616j177j688K090l050J638Q33
1609B112k851K437j994j638K638l287P52J450l121K403L80j516K965k651O92K202
1625I73l106K996k68k069L263j201n17K212k530J443M20j254K750j779r45K225
1641B613l590J876N62m353K687l77j807K318k420M01R00k143L312r88j114L220
1657A097k076N71K185k450J292J96q54K742j931K48J156l011K814R9l056K719
1673A741j275j088K090k152M05k4j985K732j724j196L058l413J321K208k836K032
$$ plain form
1561 -945 -1009 1483 -1889 1301 1963 -628 3333 1568 501 3432 464 829 1803 -659 1788 422
1577 422 -1059 1095 -2005 -1730 456 -2832 -639 -429 -1964 1113 -1015 -1284 -275 -2877 -247 -112
1593 -112 -1148 1640 -688 -1194 1666 -1125 1253 1961 -150 3466 2289 601 2691 -359 1279 2112
1609 2112 -739 1698 -296 -1934 704 -2583 -1831 -381 -3502 -1099 -719 -2235 730 -1921 -1229 973
1625 973 -2133 863 595 -1474 1789 588 71 2283 -247 1196 1616 362 3112 1333 388 2613
1641 2613 -977 899 1461 -2892 -205 -582 -2389 -71 -2491 -2090 -1190 -3333 -21 -1009 -2123 1097
1657 1097 -979 -408 1777 -673 619 815 -39 2703 772 1020 2176 -835 1979 2078 -978 1741
1673 1741 466 -622 1468 -684 -279 -303 -2288 444 -1280 -2476 582 -2831 -1510 698 -2138 -106
1689a06K79j276K005r24O10J461k546K655q40j696K956k539p9K803k877Q62K74
1706A022j799J674j014q53K492l316J044Q40l146K716q23j505L238k197P28J736
1722H37k591K566q97m54K435k173R63K119k863K096J81k605K605j608k05J123
1738A529k756J215M06k205K640j938o36K475k817Q70J028k545K728j378r9K368
1754H85k234J264J105k199K579o25j388K712k115N31K020k439J324q5j882K703
1770B156k654J42J846l166J340N50k764K410j270r99K333k641K034N34k132K858
1786E77p95p62K977k557O28J654k156K346o95r44J880k414Q52J295k832K131L6
1803A221k197K465j768k85J225k714J435M28k379K378j113n74J887j971J738L65
$$ plain form
1689 -106 173 -1103 902 -22 588 2049 -497 2158 1318 -378 2578 39 -40 2763 -114 748 1022
1706 1022 -777 897 -117 -970 1522 -1794 -750 90 -3056 -340 -1163 -2668 570 -1627 -899 837
1722 837 -1754 812 -85 -539 1896 -277 686 2805 -58 2038 2219 -386 2219 611 406 1529
1738 1529 -1227 -12 394 -1811 829 -1109 -1745 730 -2087 -1217 -189 -2734 -6 -1384 -1483 885
1754 885 -1349 -85 1020 -1179 1400 775 -613 2099 -16 515 2535 96 1420 1335 -547 2156
1770 2156 -498 -356 1490 -1676 -336 214 -2550 -140 -1410 -2409 -76 -2717 -683 -149 -2281 577
1786 577 -218 -980 1997 -560 68 1722 -434 1912 1217 273 2153 -261 591 1886 -946 1185 1221
1803 1221 -976 1489 -279 -564 661 -2053 -618 -190 -2569 -191 -1304 -1878 9 -1962 -224 141
1819A41j482K794p29o03J952j856R22R43k161J506K48k296K178j797N6J710k767
1836a241J762k21j954K688k278j14K073k824J629K07j904K198j146o69J842j644
1852a596J290Q59j566K389m62l31K289k413M16J655k604J803l79j972K405k406
1868f23R6J942k949J346m67j741K888j607n23J658k169R40R16j863K205j273k37
1885a461K607k090J869M14j279K009j109l95K544k083M57J023k700J298n74j511
1901i81K008k274k27J632k894J855p6j050K035j179J48J900k438J559R11k208
1917a279K727j175o59K196j706Q35M09j664K317j111j009K884k906J065N13k883
1933a446J703q79q70J859k040J7J472k359J536P02j658K480r83J34J634j655J292
$$ plain form
1819 141 -1341 1453 724 121 2073 217 1139 2082 -79 1427 1675 -621 1557 -240 -184 1526 -1241
1836 -1241 521 300 -1654 1034 -1244 -1358 715 -2109 -480 -273 -2177 21 -1125 -1794 48 -1596
1852 -1596 -306 553 -1013 1376 914 583 2872 459 875 2530 -74 1729 1350 -622 1783 -623
1868 -623 -527 1415 -1534 -188 -655 -2396 492 -1115 -1638 20 -2149 -1209 -293 -2156 49 -1224 -1461
1885 -1461 1146 -944 925 1339 60 2069 960 565 3109 1026 1483 2506 -194 1104 530 -981
1901 -981 1027 -1247 -1474 158 -2736 -881 -957 -2007 28 -1151 -1003 897 -1541 18 929 -1279
1917 -1279 1448 273 -386 1810 104 939 1348 -316 2001 890 -119 2765 -141 924 1437 -1446
1933 -1446 257 -622 -1492 367 -1673 -1656 -184 -2543 -1007 -305 -1963 517 -466 -332 1302 -353 939
1950I39m7k071K399p87j248L027k446P91P49j939K382j379m62K626k687N68J061
1967A476k980K098k48k192J648k242O06J382j801K073r53j238L189j411k12L010
1983B205k916J397J236j575J355j576j18K028k331J763N60k508K269j551q24J907
1999A321j436j06R51k436J683j118j337J747j569K06K220k108J576J14j096K708
2015A320j196M44K099k224J450k13j677J903j347o13J711k356J178P48k793J720
2031A54n51q13J844j657P13J09k110K115j138n34K241k445M25J844j516J538O05
2048H24r41J551q77N50J281k335K387m2k458J965j512j202K251k672Q41M87j804
2065a706K098j474p20J888j580Q51J140j746J088n68j090K245j847J017J537k269
$$ plain form
1950 939 892 -1179 1220 433 -815 2212 -234 557 1306 -633 1749 370 -92 2534 -153 415 1476
1967 1476 -1504 594 346 -1846 -198 -2440 -1834 -452 -2253 -180 -1133 -2371 818 -593 -805 2205
1983 2205 -711 686 1922 347 1702 126 8 2036 -295 1468 2028 -480 1789 238 -586 1321
1999 1321 -115 -221 730 -1706 -23 -1141 -2478 -731 -2300 -2094 126 -1982 -406 -292 -1388 1320
2015 1320 124 568 2667 443 1893 1680 3 1906 559 -54 1657 -699 479 1227 -1566 154
2031 154 -397 -1210 634 -1023 -310 -201 -2311 -196 -1334 -1868 373 -2072 -1647 197 -1319 219 824
2048 824 -117 1434 557 1107 2388 53 2440 2398 -60 1905 393 -809 1442 -1230 -389 98 -1706
2065 -1706 392 -1082 -1802 86 -1494 -643 497 -1249 -161 -729 -1819 426 -1421 -404 1133 -1136
2081a136K433p20p16J916j290K63J431j552O52P7k044K101j743l35J777k795J272
2098d09N2j576J367m19o34J498j124N86J051j946J968q0j345K685j994J33J088
2115I01q27J100p5j112J743j328k08J583k195Q91N96j968K095j460r70J487k651
2132b398J673N43j393J280q32o93J815j081N76J564j224J167n12j365K398j996
2148d78J083J452k321J310Q0j202K018k296K51J575k240J294J93j723J306j006
2164g04m97J177j850J426M73k111K020r49p65K394j841J266O49j279J466n6j251
2181d32K369j483N07Q63j868J496J78j770J349j546o89K158k153J161j10j904
2197a874K202j392p05J590j424Q91R31j600K088r39o41K083k268J292J030j539
$$ plain form
2081 -1136 1297 577 -139 1777 487 750 2181 629 1281 1358 -686 1415 -328 -663 1114 -1681 -409
2098 -409 -357 -1933 -566 -985 -1619 -121 -1245 -659 392 -1554 414 334 -1011 1674 -320 -187 901
2115 901 74 1174 1099 -13 1730 402 194 1777 -418 473 1069 -899 1196 -264 -1234 253 -2398
2132 -2398 -725 -182 -1575 -295 -1127 -1820 -5 -1086 -510 1054 -170 997 485 -880 1518 -478
2148 -478 605 2057 -264 1046 1126 -76 1942 -354 -103 1472 -768 526 719 -1004 302 -704
2164 -704 -1201 -24 -1874 -448 25 -2086 -66 -1015 -1780 614 -1227 39 688 -591 875 819 -432
2181 -432 1937 454 961 1824 -44 1452 1630 -140 1209 -337 -1026 1132 -1021 140 30 -1874
2197 -1874 328 -1064 -1769 -179 -1603 -712 219 -1381 707 -232 -873 1210 -1058 234 1264 -275
2213b75J768j43j490J653j203M78N82j624J456l17j666J639j732m07J734j535
2229a082P6O67j168J439j238O87R92j467Q03J003k188K342l87j061K430j799M25
2246D74M76j193J509q12n98K305k451L34R92j851J791r84q38J323j627O0J062
2263b8j403M31O48j504K249j030N9J292j553J646N32j896J584n88r85K128k344
$$ plain form
2213 -275 1493 1350 -140 1513 310 788 1370 -254 1202 885 -781 858 -874 -1281 453 -1082
2229 -1082 -1006 -339 -1507 -68 -1306 -619 373 -1094 -291 712 -1476 866 479 -582 1848 49 474
2246 474 950 -243 1266 454 -144 2161 -290 44 1036 -815 976 -8 -846 477 -1150 -1090 -28
2263 -28 -1431 -1000 -352 -1856 393 -637 -578 714 -839 807 1339 -557 1027 439 -546 1582 -762
$$ [...]
8191a87
##END NTUPLES=NMR FID
##END=
