##TITLE=1H_Ser-i-Pr
 CDCl3, 8 sc, 
 1.10.2020
##JCAMPDX= 6.0         $$ Bruker NMR JCAMP-DX V2.0
##DATA TYPE= NMR FID
##DATA CLASS= NTUPLES
##ORIGIN= UXNMR, Bruker Analytische Messtechnik GmbH
##OWNER= root
$$ XWIN-NMR		Version 3.5
$$ Thu Oct  1 12:38:05 2020 Russian Standard Time (UT+4h)  she@DPX200
##.OBSERVE FREQUENCY= 200.1315066352
##.OBSERVE NUCLEUS= ^1H
##.DELAY= (6, 6)
##.ACQUISITION MODE= SIMULTANEOUS
##.ACQUISITION SCHEME= undefined
##.AVERAGES= 8
##.DIGITISER RES= 18
##SPECTROMETER/DATA SYSTEM= spect
##.PULSE SEQUENCE= zg30
##.SOLVENT NAME= CDCl3
##.SHIFT REFERENCE= (INTERNAL, CDCl3, 0, 15.7039)
##AUDIT TRAIL= $$ (NUMBER, WHEN, WHO, WHERE, WHAT)
$$ ##TITLE= Audit trail, XWIN-NMR		Version 3.5
$$ ##JCAMPDX= 5.01
$$ ##ORIGIN= Bruker BioSpin GmbH
$$ ##OWNER= she
$$ F:/spectra/data/she/nmr/H-F/1/audita.txt
$$ ##AUDIT TRAIL=  $$ (NUMBER, WHEN, WHO, WHERE, WHAT)
(   1,<2020-10-01 12:37:10.18 +0400>,<she>,<DPX200>,
      <created by zg, POWCHK disabled, PULCHK disabled
       configuration hash MD5:
       00 E9 B6 7A A2 85 ED C7 34 08 36 98 17 FE 4E 26
       data hash MD5: 16K
       DC DB 9B D9 78 F9 6D C5 71 1A 39 47 19 45 67 76>)
$$ ##END=
$$ 
$$ hash MD5
$$ 79 7A C7 70 0D 5A 46 A2 5B 42 44 79 B8 A0 D2 70
##$RELAX= 
##$RELAX= 
##$RELAX= 
##$RELAX= 
##$RELAX= 
##$RELAX= 
$$ Bruker specific parameters
$$ --------------------------
##$DU= <F:/spectra>
##$EXPNO= 1
##$NAME= <H-F>
##$PROCNO= 1
##$TYPE= <nmr>
##$USER= <she>
##$AMP= (0..31)
100 100 100 100 100 100 100 100 100 100 100 100 100 100 100 100 100 100 
100 100 100 100 100 100 100 100 100 100 100 100 100 100 
##$AQSEQ= 0
##$AQ_mod= 1
##$AUNM= <au_zg>
##$AUTOPOS= <>
##$BF1= 200.13
##$BF2= 200.13
##$BF3= 200.13
##$BF4= 200.13
##$BF5= 200.13
##$BF6= 200.13
##$BF7= 200.13
##$BF8= 200.13
##$BYTORDA= 1
##$CFDGTYP= 0
##$CFRGTYP= 5
##$CHEMSTR= <none>
##$CNST= (0..31)
1 1 145 1 1 1 1 1 1 1 1 1 1 1 1 1 1 1 1 1 1 1 1 1 1 1 1 1 1 1 1 1 
##$CPDPRG= <>
##$CPDPRG1= <>
##$CPDPRG2= <>
##$CPDPRG3= <>
##$CPDPRG4= <mlev>
##$CPDPRG5= <mlev>
##$CPDPRG6= <mlev>
##$CPDPRG7= <mlev>
##$CPDPRG8= <mlev>
##$CPDPRGB= <>
##$CPDPRGT= <>
##$D= (0..31)
0 1.2 0 0 0 0 0 0 0 0.06 0 0.03 0 0 0 0 0.0002 0 0 0 0 0 0 0 0 0 0 0 0 
0 0 0 
##$DATE= 1601541429
##$DBL= (0..7)
120 120 120 120 120 120 120 120 
##$DBP= (0..7)
150 150 150 150 150 150 150 150 
##$DBP07= 0
##$DBPNAM0= <>
##$DBPNAM1= <>
##$DBPNAM2= <>
##$DBPNAM3= <>
##$DBPNAM4= <>
##$DBPNAM5= <>
##$DBPNAM6= <>
##$DBPNAM7= <>
##$DBPOAL= (0..7)
0.5 0.5 0.5 0.5 0.5 0.5 0.5 0.5 
##$DBPOFFS= (0..7)
0 0 0 0 0 0 0 0 
##$DE= 6
##$DECBNUC= <off>
##$DECIM= 32
##$DECNUC= <off>
##$DECSTAT= 4
##$DIGMOD= 1
##$DIGTYP= 9
##$DL= (0..7)
0 120 120 120 120 120 120 120 
##$DP= (0..7)
150 150 150 150 150 150 150 150 
##$DP07= 0
##$DPNAME0= <>
##$DPNAME1= <>
##$DPNAME2= <>
##$DPNAME3= <>
##$DPNAME4= <>
##$DPNAME5= <>
##$DPNAME6= <>
##$DPNAME7= <>
##$DPOAL= (0..7)
0.5 0.5 0.5 0.5 0.5 0.5 0.5 0.5 
##$DPOFFS= (0..7)
0 0 0 0 0 0 0 0 
##$DQDMODE= 0
##$DR= 18
##$DS= 0
##$DSLIST= <SSSSSSSSSSSSSSS>
$$ [...]
##$SUBNAM2= <"">
##$SUBNAM3= <"">
##$SUBNAM4= <"">
##$SUBNAM5= <"">
##$SUBNAM6= <"">
##$SUBNAM7= <"">
##$SUBNAM8= <"">
##$SUBNAM9= <"">
##$SW= 16.880792210976
##$SWIBOX= (0..15)
0 0 2 0 0 0 0 0 0 0 0 0 0 0 0 0 
##$SW_h= 3378.37837837838
##$TD= 16384
##$TD0= 1
##$TE= 0
##$TE2= 300
##$TE3= 300
##$TEG= 300
##$TL= (0..7)
0 120 120 120 120 120 120 120 
##$TP= (0..7)
150 150 150 150 150 150 150 150 
##$TP07= 0
##$TPNAME0= <>
##$TPNAME1= <>
##$TPNAME2= <>
##$TPNAME3= <>
##$TPNAME4= <>
##$TPNAME5= <>
##$TPNAME6= <>
##$TPNAME7= <>
##$TPOAL= (0..7)
0.5 0.5 0.5 0.5 0.5 0.5 0.5 0.5 
##$TPOFFS= (0..7)
0 0 0 0 0 0 0 0 
##$TUNHIN= 0
##$TUNHOUT= 0
##$TUNXOUT= 0
##$USERA1= <user>
##$USERA2= <user>
##$USERA3= <user>
##$USERA4= <user>
##$USERA5= <user>
##$V9= 5
##$VALIST= <valist>
##$VCLIST= <CCCCCCCCCCCCCCC>
##$VD= 0
##$VDLIST= <DDDDDDDDDDDDDDD>
##$VPLIST= <PPPPPPPPPPPPPPP>
##$VTLIST= <TTTTTTTTTTTTTTT>
##$WBST= 1024
##$WBSW= 4
##$XGAIN= (0..3)
0 0 0 0 
##$XL= 0
##$YL= 0
##$YMAX_a= 15924
##$YMIN_a= -9587
##$ZGOPTNS= <>
##$ZL1= 120
##$ZL2= 120
##$ZL3= 120
##$ZL4= 120
##$ABSF1= 10
##$ABSF2= 0
##$ABSG= 5
##$ABSL= 3
##$ALPHA= 0
##$AQORDER= 0
##$ASSFAC= 0
##$ASSFACI= 0
##$ASSFACX= 0
##$ASSWID= 0
##$AUNMP= <proc_1d>
##$AZFE= 0.1
##$AZFW= 0.1
##$BCFW= 1
##$BC_mod= 2
##$BYTORDP= 1
##$COROFFS= 0
##$CY= 11.3945322036743
##$DATMOD= 1
##$DC= 2
##$DFILT= <>
##$DTYPP= 0
##$F1P= 16.9975609425685
##$F2P= -3.02152046262296
##$FCOR= 0.5
##$FTSIZE= 0
##$FT_mod= 4
##$GAMMA= 1
##$GB= 0.15
##$INTBC= 1
##$INTSCL= 1
##$ISEN= 128
##$LB= 0.24
##$LEV0= 0
##$LPBIN= 0
##$MAXI= 10000
##$MC2= 0
##$MEAN= 0
##$ME_mod= 0
##$MI= 1.114404
##$NCOEF= 0
##$NC_proc= 0
##$NLEV= 6
##$NOISF1= 3.799351
##$NOISF2= 2.8
##$NSP= 1
##$NTH_PI= 0
##$NZP= 0
##$OFFSET= 15.70392
##$PC= 1
##$PHC0= -9967.24
##$PHC1= 16.00089
##$PH_mod= 1
##$PKNL= yes
##$PPARMOD= 0
##$PSCAL= 0
##$PSIGN= 0
##$REVERSE= no
##$SF= 200.130013532006
##$SI= 16384
##$SIGF1= 3
##$SIGF2= 2
##$SINO= 400
##$SIOLD= 16384
##$SREGLST= <1H.CDCl3>
##$SSB= 0
##$STSI= 0
##$STSR= 0
##$SW_p= 3612.71676300578
##$SYMM= 0
##$S_DEV= 0
##$TDeff= 0
##$TDoff= 0
##$TI= <>
##$TILT= no
##$TM1= 0
##$TM2= 0
##$TOPLEV= 0
##$USERP1= <user>
##$USERP2= <user>
##$USERP3= <user>
##$USERP4= <user>
##$USERP5= <user>
##$WDW= 1
##$XDIM= 8192
##$YMAX_p= 0
##$YMIN_p= 0
$$ End of Bruker specific parameters
$$ ---------------------------------
##NTUPLES= NMR FID
##VAR_NAME=  TIME,          FID/REAL,        FID/IMAG
##SYMBOL=    X,             R,               I
##VAR_TYPE=  INDEPENDENT,   DEPENDENT,       DEPENDENT
##VAR_FORM=  AFFN,          ASDF,            ASDF
##VAR_DIM=   8192,          8192,            8192
##UNITS=     SECONDS,       ARBITRARY UNITS, ARBITRARY UNITS
##FACTOR=    0.000296,      1,               1
##FIRST=     0,             0,               0
##LAST=      2.424536,      0,               0
##MIN=       0,             -9587,           0
##MAX=       2.424536,      15924,           0
$$ Real data points
##PAGE= N=1
##DATA TABLE= (X++(R..R)), XYDATA
$$ plain form
0 0 0 0 0 0 0 0 0 0 0 0 0 0 0 0 0 0 0 0 0 0 0 0 0 0 4 -7 7 -8 8 -8 8 -9 14 -15 16 -18 22 -23 28 -30 33 -37 42 -45 52
45 52 -55 61 -69 75 -83 91 -101 112 -122 135 -149 165 -183 202 -227 253 -284 326 -372 436 -520
66 -520 642 -841 1266 -7890 8387 -6333 -3689 5688 -6882 -523 6130 -5766 781 7797 -7828
81 -7828 7556 2406 -2247 5782 2886 -929 6577 3561 -2775 9289 195 2027 7536 443 3048
96 3048 6389 1966 778 8673 -2025 4190 5785 -2069 4566 3090 -1061 2241 4881 -4653 5006
111 5006 382 -4150 5510 -2605 -1653 2207 -1836 -3929 3783 -5175 -2343 2405 -7407 620 -1847
126 -1847 -5040 -1577 -964 -6007 -473 -2012 -7275 1611 -5402 -3176 -871 -3491 -3441 -19 -2913 -3894
142 -3894 2059 -5256 -53 -98 -2771 -556 487 -1483 -573 2900 -3377 3038 763 -816 3271 924
$$ packed form
0@%%%%%%%%%%%%%%%%%%%%%%%%Mj1J4j5J6j6J6j7K3k9L1l4M0m5N1n8O3p0P9q7R7
45E2j07J16j30J44j58J74j92K13k34K57k84L14l48L85m29M80n37O10o98Q08r56
66e20J162j483K107r156J6277j4720K644R377j2570O359O653j1896O547P016j5625
81g828J5384n150m653Q029k896l815P506l016o336J2064r094J832N509p093K605
96C048L341m423j188P895j0698O215J595p854O635j476m151L302K640r534R659
111E006m624m532R660q115R52L860m043k093P712q958K832M748r812Q027k467
126a847l193L463O13n043N534j539n263Q886p013K226K305k620N0L422k894r81
142c894N953p315N203m5k673K215J043j970R10L473o277O415k275j579M087k347
$$ plain form
158 924 504 2851 2534 -1005 5712 9 2002 5168 4 3222 3354 1758 2077 5241 -334 4145
174 4145 3268 -667 4975 489 1535 2308 1978 -181 3195 25 -813 3449 -2392 1446 59 -718
190 -718 -1002 582 -1813 -1349 649 -3759 377 -2684 -2199 -1485 -2196 -2813 -1928 -1090 -4580 71 -4009
207 -4009 -2127 -1542 -3157 -2433 -1627 -1950 -3271 610 -4102 -269 -1041 -2782 -297 -1678 -1080 -863 770
224 770 -2473 1937 -696 -502 2158 -745 1710 1103 1633 359 3102 326 1701 2842 150 3509
240 3509 1159 2317 1808 3088 1239 2853 2466 758 3845 288 2571 1691 1766 1114 1957 1111 206
257 206 2813 -1023 1668 -20 553 208 170 -281 -1128 677 -2509 487 -1613 -1289 -631 -1978 -1565 -2238
275 -2238 -1212 -3065 -287 -3173 -1541 -1770 -2946 -1192 -2494 -1318 -2856 -548 -3191 -945 -1464 -2447
$$ packed form
158I24m20K347l17l539O717n703J993L166n164L218J32j596L19L164n575M479
174D145q77l935N642m486J046P73l30k159L376l170q38M262n841L838j387p77
190g18k84J584k395M64J998m408M136l061M85P14p11o17Q85Q38l490M651m080
207d009J882N85j615P24Q06l23j321L881m712L833p72j741K485j381N98K17J633
224G70l243M410k633J94K660k903K455o07N30j274K743k776J375J141k692L359
240C509k350J158n09J280j849J614l87j708L087l557K283q80P5o52Q43q46r05
257B06K607l836K691j688N73l45l8m51q47J805l186K996k100L24O58j347M13o73
275b238J026j853K778k886J632k29j176J754j302J176j538K308k643K246n19r83
$$ plain form
291 -2447 -187 -2121 -626 -1673 31 -1524 217 -762 -919 1485 -1380 1399 -60 967 264 1615
307 1615 704 903 2394 12 2880 451 2101 1596 1830 1416 1803 2445 610 3491 722 2508 1630
324 1630 1550 1937 1178 1829 304 2401 -127 1947 630 617 924 189 565 -479 929 -1130 643 -970
342 -970 -909 39 -1578 -298 -1821 -607 -2308 -604 -2161 -1519 -1139 -2692 -641 -2620 -1071 -2174 -1290
359 -1290 -2149 -1404 -1383 -2298 -165 -2363 -290 -1687 -867 -1265 -760 -597 -1283 606 -1337 799 -513 480
377 480 131 597 791 374 1707 -145 2173 565 1759 1229 1479 1803 796 2453 476 2557 745
394 745 1931 1719 958 2026 1080 2354 395 2049 466 1389 790 615 1337 -284 1289 -377 1013
411 1013 -621 504 -337 -302 38 -1181 117 -1703 -379 -1362 -1071 -1504 -1270 -860 -2079 -667 -2318
$$ packed form
291b447K260j934J495j047J704j555J741r79j57K404k865K779j459J027p03J351
307A615r11J99J491k382K868k429J650n05K34m14L87O42j835K881k769J786q78
324A630q0L87p59O51j525K097k528K074j317j3L07p35L76j044J408k059J773j613
342i70O1R48j617J280j523J214j701J704j557O42L80j553K051j979J549j103Q84
359a290q59P45K1r15K133k198K073j397Q20l98N05J63o86J889j943K136j312R93
377D80l49M66J94m17J333j852K318j608J194n30K50L24j007J657j977K081j812
394G45J186k12p61J068r46J274j959J654j583R23n99j75P22j621J573j666J390
411A013j634J125q41L5L40j219J298j820J324r83K91m33K34M10j219J412j651
$$ plain form
428 -2318 -1058 -1966 -1037 -1564 -1896 -1111 -2207 -457 -2010 -893 -1582 -873 -1126 -1100 -203 -1110 192 -1238
446 -1238 148 -669 101 37 -294 889 -232 1374 -270 1398 238 1267 1457 610 1652 499 1757
463 1757 588 2106 879 1759 1251 889 1903 741 2183 645 2188 709 1466 1104 616 1283 166
480 166 1538 -15 963 108 384 103 -349 632 -820 608 -858 -131 -827 -723 -705 -1208 -242 -1843 -595
499 -595 -1974 -1004 -1474 -1081 -1134 -1766 -764 -1827 -385 -1963 -576 -1549 -1362 -687 -1367 -505 -1343 -7
517 -7 -1246 34 -934 -561 31 -570 710 -542 773 -319 612 308 632 1092 227 1555 -24 1585
535 1585 600 1571 1024 1151 1400 664 1543 771 1692 647 1561 1046 875 1497 443 1471 294 1503
553 1503 599 616 363 435 862 -67 918 -654 537 -673 199 -206 -549 -199 -785 -15 -1566 -307 -1229
$$ packed form
428b318J260r08R29n27l32P85j096J750j553J117o89P09k53K6Q97r07J302j430
446a238J386q17P70o4l31J183j121J606j644J668j160J029J90q47J042j153J258
463A757j169J518j227Q80n08l62J014j162J442j538J543j479P57l62m88O67j117
480A66J372j553R78q55K76k81m52R81j452J428j466P27o96J04J8n03R66j601J248
499e95j379R70m70L93n3o32J002j063J442j578J387r73J87O75o80Q62q38J336
517gj239J280r68L73N92o01J280j252J315j092R31l04L24M60q65J328j579J609
535A585r85R71n47J27K49p36Q79p72R21j045R14n15j71O22j054J028j177J209
553A503r04J7k53P2M27r29R85j572J191j210Q72m05l43L50n86P70j551J259r22
$$ plain form
572 -1229 -740 -1136 -1327 -753 -1507 -635 -1520 -646 -1900 -1060 -1060 -1417 -889 -1426 -559 -1571 -356 -1219 -615 -564
592 -564 -726 -223 -1033 439 -747 380 -330 359 620 -21 832 -150 1128 -113 1056 496 1154 883
610 883 568 1316 714 1802 659 1433 1028 1436 731 879 1289 471 1558 604 1057 634 870 890 418 1090
630 1090 17 955 -139 662 108 216 13 -636 311 -996 106 -749 -408 -844 -675 -627 -1302 -546 -1798
649 -1798 -259 -1574 -690 -1274 -927 -700 -1442 -577 -1245 -235 -1486 -365 -1051 -892 -598 -1111 -24 -1227
667 -1227 -142 -713 -106 -334 10 76 -376 504 -560 885 -294 470 525 486 883 680 1271 191 1527
686 1527 591 1198 920 830 1087 574 1433 725 1493 682 1234 939 630 1082 494 1186 -180 1183 146
705 146 653 184 352 459 -359 512 -501 352 -676 -192 -716 -561 -415 -1005 -81 -1348 -636 -1303 -651
$$ packed form
572a229M89l96j91N74p54Q72q85Q74j254Q40%l57N28n37Q67j012J215q63O04N1
592e64j62N03q10J472j186J127p10O89K61o41Q53r82J278j241J169n60O58k71
610H83l15P48o02J088j143P74m05M08p05J48M10q18J087r54M53m23K36K0m72O72
630A090j073R38j094Q01n54J08k03o49R47j307J102q55L41m36J69M8o75P56j252
649a798J539j315Q84n84L47K27p42Q65o68J010j251J121o86J59K94n13J087j203
667a227J085n71O07k28L44O6m52Q80j064J445j179P64N5l9L97k03N91j080J336
686A527r36O07k78r0K57n13Q59p08P68q11N52k95l09M52n88O92j366J363j037
705A46N07m69J68J07q18Q71j013Q53j028M84n24J55J46n90R24j267P12o67O52
$$ plain form
724 -651 -1028 -796 -720 -1563 -221 -1584 -583 -1135 -795 -872 -856 -577 -984 -377 -996 -153 -989 -483 -614 -330
744 -330 -110 -671 398 3 560 -382 368 72 151 833 63 931 80 1194 315 954 964 348 1030 448
764 448 1147 509 1195 565 947 924 660 1050 346 1030 7 945 483 667 399 116 684 -32 523 -535
784 -535 442 -237 -100 -50 -637 -247 -822 -7 -793 -26 -583 -569 -691 -959 -527 -1154 -259 -1067 -524 -1099 -640
805 -640 -538 -852 -533 -1103 -381 -1089 -532 -854 -471 -331 -791 -21 -451 -22 -730 155 -218 49 203 100
825 100 882 -6 745 70 749 261 527 792 285 946 248 1106 433 890 435 775 996 312 973 378
845 378 1013 340 1045 496 556 724 25 509 -195 603 57 318 61 264 412 -467 145 -759 207 -792 -48
866 -48 -679 -722 -415 -973 -428 -958 -386 -734 -448 -490 -612 -663 -1022 -349 -1037 -650 -667 -526 -513 -664 -594 -883 -223
$$ packed form
724f51l77K32P6q43J342j363J001n52L40p7J6K79m07O07o19Q43q36N06j31K84
744c30K20n61J069l95N57r42P50k96P9O82p70Q68q51J114q79O39J0o16O82n82
764D48O99o38O86o30L82k3k64L90p04O84j023R38m62J84k68k83N68p16N55j058
784e35R77o79J37N0n87L90n75Q15p86P67n57J4j22k68M32o27Q95q08N43n75M59
805f40J02l14L19n70P22p08N57l22L83J40m60P70m30M29p08Q85l73K67J54j03
825A00P82q88P51o75O79m88K66K65n07O61o98Q58o73M57m55L40K21o84O61n95
845C78O35o73P05n49O0J68o99M84p04P98n46K61k57K03J48q79O12r04R66r99P44
866d8o31m3L07n58N45n30N72l48K86m2j22n1l59O73o88L87j7J41J3j51P0k89O60
$$ plain form
889 -223 -837 -10 -553 -88 -190 -220 130 -206 441 -47 272 118 426 329 226 476 273 965 57 837 490
910 490 698 490 402 892 368 961 165 942 504 556 564 624 739 150 848 -36 808 -56 569 249 143 523
932 523 -164 182 -455 125 -468 -172 -257 -494 71 -923 -2 -845 -334 -712 -534 -625 -772 -203 -1077 -204 -993
953 -993 -395 -902 -474 -497 -739 -421 -873 0 -731 -106 -637 -382 -318 -361 218 -608 375 -738 371 -173 64
974 64 304 194 444 -29 643 -8 554 372 588 550 440 669 193 960 181 657 374 676 691 410 867
995 867 70 795 244 694 330 447 492 11 487 -46 625 43 213 165 -229 -101 -413 258 -686 136 -480
1016 -480 -223 -522 -325 -289 -560 -254 -616 -214 -941 -217 -791 -725 -516 -723 -302 -904 -354 -682 -259 -196 -360
1037 -360 -322 -572 -206 -401 219 -277 224 74 -137 94 -286 564 -166 527 -225 573 587 289 666 228 884
$$ packed form
889b23o14Q27n43M65j02l0L50l36O47m88L19j54L08r7j03K50k03O92r08P80l47
910D90K08k08q8M90n24N93p96P77m38N2QO0J15n89O98q84Q44q64O25l20j06L80
932E23o87L46o37N80n93K96q5k37N65r94R21q43N11l78J78r1j47N69q74Q73p89
953i93N98n07M28k3k42L18m52Q73p31O25n31K55O4m3N79q26R83j113J109n44K37
974F4K40j10K50m73O72o51N62j82K16l8j10K29m76P67p79M76k83L02J5k81M57
995H67p97P25n51M50l64J17M5m81M76n33O71n82J70m8l94J28l12O71r44Q22o16
1016d80K57k99J97L6k71L06l62M02p27P24n74O6K09k07M21o02N50l28M23O3j64
1037c60L8k50L66j95O20m96N01j50k11K31l80Q50p30O93p52P98J4k98L77m38O56
$$ plain form
1058 884 358 564 114 590 578 436 645 206 743 106 592 236 588 413 305 343 -240 572 -37 449 15
1079 15 289 307 -177 132 -463 449 -532 -112 -610 -177 -196 -335 -93 -631 -141 -760 -26 -711 -197 -298 -605
1100 -605 -113 -1010 -560 -638 -223 -445 -442 -321 -695 -135 -621 1 -647 41 -347 -201 -283 -12 15 -336 144 -93
1122 -93 414 -55 263 610 257 740 -1 684 63 702 249 504 609 423 679 275 716 366 553 400
1142 400 498 725 252 624 -37 472 246 758 218 -73 133 214 357 -332 153 -193 302 -258 -97 -341 -254
1163 -254 -81 -666 -160 -660 -186 -359 -307 -284 -597 -116 -476 -142 -729 -305 -497 -480 -370 -677 -160 -611 -7
1184 -7 -500 -205 -630 -365 -113 -419 24 -388 176 -211 19 -70 -98 261 3 647 -111 284 253 573 348 292
1206 292 346 164 651 198 558 341 342 210 514 697 44 622 87 576 182 311 380 167 452 255 327 -72
$$ packed form
1058H84n26K06m50M76j2j42K09m39N37o37M86l56L52j75j08L8n83Q12o09M86m34
1079A5K74J8m84L09n95R12r81M20m98M33j9j39K42n38M90o19P34o85N14j01l07
1100f05M92q97M50p8M15k22LJ21l74N60m86O22o48O88l88J46q2K71K7l51M80k37
1122i3N07m69L18L47l53M83p41O85o21O39m53K55J05j86K56m04M41l50J87j53
1142D00R8K27m73L72o61N09k26N12n40k91K06Q1J43o89M85l46M95n60J61k44Q7
1163b54J73n85N06n00M74j73N2K3l13M81l60L34n87M24j92J7J10l07N17m51O04
1184gm93K95m25K65K52l06M43m12N64l87K30q9k8L59k58O44p58L95l1L20k25n6
1206B92N4j82M87m53L60k17Jj32L04J83o53N78n35M89l94J29O9k13K85j97P2l99
$$ plain form
1228 -72 465 -100 -55 -64 -200 -6 -403 -165 -335 -176 -338 -327 -350 -537 -312 -182 -260 -495 -250 -520 -399 -395 -514
1251 -514 -74 -738 34 -421 -209 -529 -60 -133 -408 -143 -492 130 -404 75 -248 17 153 -126 197 -125
1271 -125 256 -53 305 238 406 -14 284 382 -12 433 -53 350 75 211 401 148 472 213 433 104 197
1292 197 -31 170 351 57 281 69 117 -148 401 205 38 109 -111 17 -302 116 -225 104 -234 -301 -273
1313 -273 -535 -46 -543 -163 -526 -173 -427 -319 -325 -841 -433 -261 -236 -543 -129 -284 -339 -522 -422 -246 -563
1334 -563 -429 -332 -57 -239 -285 97 -136 -197 -337 180 -19 357 43 219 277 41 475 44 661 163 412
1355 412 254 111 398 334 298 -125 636 411 472 341 224 302 246 466 -86 234 226 158 -46 165 70 -314 151
1378 151 -237 28 -171 118 -35 -272 -164 -298 -9 -292 -252 -450 -256 -205 -424 -164 -300 -26 -418 -161 -401
$$ packed form
1228g2N37n65M5rj36J94l97K38j70J59j62J1k3j87K25J30p8k35K45k70J21Mj19
1251e14M40o64P72m55K12l20M69p3k75K65l49O22n34M79l23K65J36k79L23l22
1271a25L81l09L58o7J68m20K98R8l94M45m86M03k75J36J90k53L24k59K20l29R3
1292A97k28K01J81k94K24k12M8k65N49j96j67P1k20J28l19M18l41L29l38o7K8
1313b73k62M89m97L80l63L53k54J08on16M08J72K5l07M14j55n5j83J00J76l17
1334e63J34R7K75j82m6L82k33o1j40N17j99L76l14J76N8k36M34m31O17m98K49
1355D12j58j43K87o4l6m23P61k25O1j31j17P8n6K20n52L20qo8k04K11r5l84M65
1378A51l88K65j99K89j53k37J08j34K89k83M0j98J94N1k19K60j36K74l92K57k40
$$ plain form
1399 -401 -379 -513 -217 -169 -586 68 -377 -147 -184 -444 -389 -322 -95 -194 -164 -277 239 -70 142 134 -260 55 -24
1422 -24 405 232 429 33 115 246 -7 411 171 505 -9 368 173 275 309 274 583 84 530 -139 531
1443 531 178 151 142 -130 139 24 263 -155 67 -4 -143 98 -149 81 65 -65 -107 78 -259 -187 -248 -399 115
1466 115 -353 130 -174 81 -283 -288 -250 -342 -56 -364 -161 -383 -175 -441 -447 -44 -261 -20 -327 24 -391 -47
1488 -47 -206 37 93 -6 181 17 123 -175 275 131 58 285 79 395 345 393 330 379 220 204 230 228 635 18
1512 18 279 146 141 244 226 217 14 165 -136 399 53 154 -143 -83 95 35 280 -77 208 -307 -324 -328 -350 -325
1536 -325 -305 -220 -391 -181 -353 -186 -270 -280 -126 -164 -112 -244 -218 -382 -126 -186 -310 -35 -241 180 -159 -94 -330
1559 -330 -132 81 -218 36 -391 -24 -30 81 -140 1 -37 -114 140 -144 439 14 142 78 552 306 16 564
$$ packed form
1399d01K2j34K96M8m17O54m45K30l7k60N5O7K27r9L0j13N16l09K12ql94L15p9
1422b4M29j73J97l96Q2J31k53M18k40L34n14L77j95J02L4l5L09m99M46o69O70
1443E31l53k7rk72K69j15K39m18K22p1j39K41k47K30j6j30m2J85l37P2o1j51N14
1466A15m68M83l04K55l64nL8r2K86l08K03k22K08k66oM03k17K41l07L51m15L44
1488d7j59K43N6r9J87j64J06k98M50j44p3K27k06L16n0M8o3M9j59j6K6kM07o17
1512A8K61j33nJ03j8rk03J51l01N35l46J01k97O0J78o0K45l57K85n15j7mk2K5
1536c25K0Q5j71K10j72J67q4j0J54l8N2j32K6j64K56o0j24K75k06M21l39O5k36
1559c30J98K13k99K54m27L67oJ11k21J41l8p7K54k84N83m25J28o4M74k46k90N48
$$ plain form
1581 564 63 610 45 428 147 332 160 59 233 -76 328 146 416 229 131 266 121 159 26 243 -132
1602 -132 30 -286 -133 16 -268 -73 -277 -51 -206 -169 97 -198 -333 -205 -157 -563 -95 -233 -149 -119 -65 -180
1624 -180 -406 -24 -165 -77 -117 -168 -203 -73 -341 -304 -42 -124 226 -164 143 71 15 77 -164 286 37 304 108
1647 108 65 17 100 49 123 114 150 209 144 158 -3 204 302 263 332 188 446 246 265 331 209 107 -87 295 194
1672 194 298 -14 98 -15 -312 -11 -486 -3 -198 -141 -137 -34 -241 -88 196 -436 -147 -318 -138 -239 -87
1693 -87 -66 -186 -194 -32 -218 -493 -98 -269 33 -159 -37 -386 -190 -46 -159 -42 -68 3 -85 -132 62 -164 175
1716 175 -47 96 -111 -74 129 176 152 106 209 9 340 157 7 211 220 326 6 197 211 195 205 123 53 -108
1740 -108 225 228 236 98 179 128 -79 119 -140 247 -151 73 -73 -265 -31 176 6 -156 114 -423 4 -484
$$ packed form
1581E64n01N47n65L83k81J85j72j01J74l09M04j82K70j87r8J35j45L8j33K17l75
1602a32J62l16J53J49k84J95k04K26j55L7K66k95j35J28M8m06M68j38Q4L0N4j15
1624a80k26L82j41Q8m0n1l5J30k68L7K62q2L50l90L07p2n6O2k41M50k49K67j96
1647A08m3m8Q3n1P4rL6N9o5J4j61K07R8l9O9j44K58k00J9O6j22j02j94L82j01
1672A94J04l12J12j13k97L01m75M83j95N7MJ03k07J53K84o32K89j71J80j01J52
1693h7K1j20qJ62j86k75L95j71L02j92J22l49J96J44j13J17k6P1q8m7J94k26L39
1716A75k22J43k07L7K03M7k4m6J03k00L31j83j50K04RJ06l20J91J4j6J0q2p0j61
1740a08L33LQj38Q1n1k07J98k59L87l98K24j46j92K34K07j70j62K70n37M27m88
$$ plain form
1762 -484 -261 -221 -15 -147 -174 -29 -177 -44 -150 -140 -240 -159 -264 -118 -10 -91 -205 -365 75 -187 29 -76
1784 -76 -296 17 -24 109 -6 82 -112 50 262 -78 46 -231 131 -13 -48 249 -119 11 88 126 141 111 26
1807 26 64 100 111 -11 201 196 83 287 -210 42 255 -274 141 -311 364 -190 333 49 -45 -93 190 -21 -268
1830 -268 80 -80 85 -8 -67 -193 -359 -208 -320 -97 -421 -14 -103 -40 -146 -202 -200 -267 137 -190 -266 -58 -75
1853 -75 -98 22 105 -78 -49 -201 -8 -177 -82 -115 18 88 -17 109 76 350 158 259 -44 38 85 96 118 -27
1877 -27 82 310 31 38 29 69 584 188 -100 159 258 84 197 170 383 -109 219 81 -20 -72 -76 94 23 134
1901 134 234 -53 18 -5 31 -181 -14 20 101 -230 -68 -80 -133 -23 -124 -35 -244 32 -62 -68 -311 -30 -249 -203
1925 -203 -49 6 182 -81 13 -65 58 -129 -114 -4 -142 80 -88 74 -278 27 -77 -12 192 -21 529 3
$$ packed form
1762d84K23M0K06j32k7J45j48J33j06J0j00Q1j05J46J08q1j14j60M40k62K16j05
1784g6k20L13m1J33j15Q8j94J62K12l40J24k77L62j44l5K97l68J30P7L8J5l0q5
1807B6L8L6J1j22K12nj13K04m97K52K13n29M15m52O75n54N23k84r4m8K83k11k47
1830b68L48j60J65r3n9j26j66J51j12K23l24M07q9O3j06n6Ko7M04l27p6K08j7
1853g5k3J20Q3j83K9j52J93j69R5l3J33P0j05J26l3K74j92J01l03Q2M7J1K2j45
1877b7J09K28k79PrM0N15l96k88K59R9j74J13k7K13m92L28j38j01n2mJ70p1J11
1901A34J00k87P1k3L6k12J67L4Q1l31J62j2n3J10j01Q9k09K76r4ok43K81k19M6
1925b03J54N5J76k63R4p8J23j87J5J10j38K22j68J62l52L05j04O5K04k13N50n26
$$ plain form
1947 3 281 226 203 88 180 82 206 224 -79 159 169 370 194 -341 74 150 131 -150 167 -16 -86 36 485 132
1971 132 57 137 168 -63 40 72 43 -173 -361 -183 74 -86 -31 -160 -281 173 83 70 -63 144 -118 -19 -339
1994 -339 -97 -311 -185 -307 -277 44 -37 143 -221 -36 261 -163 -15 -50 71 -72 48 -96 21 32 59 -102
2016 -102 -69 -82 -219 136 146 -42 74 -15 374 100 34 84 289 207 216 125 33 59 -34 257 73 303 -46 378
2040 378 79 21 47 134 148 -110 174 72 -109 116 -267 -209 -146 -84 -149 59 155 -218 130 -189 20 -205 59
2063 59 -144 10 -119 -180 -47 117 -48 -309 -96 -158 -160 -116 -328 -66 -140 -15 9 -7 132 -126 -72 -37 89 45
2087 45 70 -182 -26 -85 125 81 227 151 223 -162 -92 138 -67 125 223 -98 84 4 211 -57 306 141 -48
2110 -48 56 47 32 -18 -43 59 20 -41 169 57 -121 54 348 163 -57 18 -108 224 74 -107 -111 -23 51 -201
$$ packed form
1947CK78n5k3j15R2r8J24J8l03K38J0K01j76n35M15P6j9k81L17j83p0J22M49l53
1971A32p5Q0L1k31J03L2k9k16j88J78K57j60N5j29j21M54r0j3j33K07k62R9l20
1994c39K42k14J26j22L0L21q1J80l64J85K97m24J48l5J21j43J20j44J17J1K7j61
2016a02L3j3j37L55J0j88J16q9L89k74o6N0K05q2Rr1r2K6r3K91j84K30l49M24
2040C78k99n8K6Q7J4k58K84j02j81K25l83N8O3O2o5K08R6l73L48l19K09k25K64
2063E9k03J54j29o1J33J64j65k61K13o2kM4k12K62p4J25K4j6J39k58N4L5J26m4
2087D5K5k52J56n9K10m4J46p6P2l85P0K30k05J92R8l21J82q0K07k68L63j65j89
2110d8J04rj5n0k5J02l9o1K10j12j78J75K94j85k20P5j26L32j50j81mQ8P4k52
$$ plain form
2134 -201 -4 51 -79 73 174 -98 24 138 -157 43 -216 -62 -163 20 -89 -45 301 -237 85 -205 133
2155 133 -113 -92 73 -81 -252 -124 -45 -55 60 189 56 115 276 77 183 158 23 137 103 104 185 261 318 -26
2179 -26 232 74 175 163 -7 70 -18 -19 74 262 22 -104 397 110 244 -253 18 129 -28 -152 -207 123 -150
2202 -150 -61 -30 85 144 -100 -82 -199 27 -228 32 60 -76 -132 24 -48 -49 111 -176 159 110 -24 18 -234 76
2226 76 220 173 -39 25 -171 -19 -80 -52 89 -86 -14 65 -206 -24 73 -117 107 106 6 39 27 210 -202 -16
2250 -16 -12 218 82 143 167 -96 27 -161 -181 -110 149 -156 131 122 40 152 42 142 -114 35 -145 -87 398 -146
2274 -146 -166 -201 46 38 132 -8 -84 -12 129 -44 -112 -205 -150 -86 -105 -51 6 -268 -63 -127 -154 -240 -81 29 131 43
2300 43 -197 369 14 157 -70 -116 -99 58 84 -162 -14 -9 -129 114 126 -102 251 117 -12 60 -114 6 -33
$$ packed form
2134b01J97N5j30J52J01k72J22J14k95K00k59J54j01J83j09M4L46n38L22k90L38
2155A33k46K1J65j54j71J28P9j0J15J29j33N9J61j99J06k5j35J14l4JQ1P6N7l44
2179b6K58j58J01j2j70P7q8jR3J88k40j26N01k87J34m97K71J11j57j24n5L30k73
2202a50Q9L1J15N9k44J8j17K26k55K60K8j36n6J56p2jJ60k87L35m9j34M2k52L10
2226G6J44m7k12O4j96J52o1K8J41j75P2P9k71J82R7j90K24jj00L3j2J83m12J86
2250a6MK30j36O1K4k63J23j88k0P1K59l05K87rq2J12j10J00k56J49j80N8M85n44
2274a46k0l5K47qR4j40p6P2J41j73o8r3N5O4j9N4N7k74K05o4k7q6J59J10J02q8
2300D3k40N66l55J43k27m6J7J57K6k46J48Nj20K43J2k28L53j34j29P2j74J20l9
$$ plain form
2323 -33 82 169 104 -121 124 -142 128 403 196 44 58 44 -47 162 12 -65 193 43 188 -51 -69 37 -114
2346 -114 -78 176 -26 -218 137 139 -181 175 25 111 -100 -52 -24 -52 -128 -227 -147 -194 160 20 -239 -115 -198 46
2370 46 -100 168 -25 -315 -140 -199 -58 -20 32 -68 89 -81 33 -102 -106 324 -48 30 -196 -247 11 -10 140
2393 140 -104 220 95 53 203 61 -197 119 95 -34 95 122 191 97 66 -40 164 39 0 44 156 -63 80
2416 80 2 45 129 -79 173 174 285 115 -271 -85 -28 -17 -214 50 266 -44 4 -276 55 -172 21 -114 -225
2439 -225 -137 -247 -212 -262 5 -57 231 78 -15 -85 -200 -7 -7 -120 -80 179 -32 -195 -70 -150 -17 -55 169 -61
2463 -61 99 -16 195 160 -196 0 -18 129 50 103 186 166 253 -99 254 33 -12 92 74 68 -63 251 148 70
2487 70 -86 74 119 135 -10 -24 -93 70 -36 -11 188 -94 24 131 -21 148 -240 -113 246 -232 -56 75
$$ packed form
2323c3J15Q7o5k25K45k66K70K75k07j52J4j4r1K09j50p7K58j50J45k39j8J06j51
2346a14L6K54k02j92L55Kl20L56j50Q6k11M8K8k8p6r9Q0m7L54j40k59J24q3K44
2370D6j46K68j93k90J75n9J41L8N2j00J57j70J14j35mM30l72P8k26n1K58k1J50
2393A40k44L24j25m2J50j42k58L16k4j29J29K7O9r4l1j06K04j25l9M4J12k19J43
2416H0p8M3Q4k08K52JJ11j70l86J86N7J1j97K64K16l10M8k80L31k27J93j35j11
2439b25Q8j10L5n0K67o2K88j53r3p0j15J93%j13M0K59k11j63J25q0J33l8K24k30
2463f1J60j15K11l5l56J96j8J47p9N3Q3k0Q7l52L53k21m5J04j8oj31L14j03p8
2487G0j56J60M5J6j45j4o9J63j06K5J99k82J18J07j52J69l88J27L59m78J76J31
$$ plain form
2509 75 110 -314 103 -58 -50 -216 -366 -114 60 78 102 -179 159 -26 -128 20 -2 30 17 18 46 -4 -84 -55 30
2534 30 86 -87 -7 48 99 -37 188 136 141 53 62 37 85 73 172 102 -199 76 152 -33 -58 -57 50 113 44 96 169 -59
2562 -59 -65 -75 -82 -57 107 91 32 106 239 -130 -147 47 -24 -46 8 -73 34 -71 -291 -42 -8 -119 69 -147 265
2587 265 -46 -52 12 217 -96 -49 -274 154 4 168 -168 -259 -261 60 -10 -137 -131 59 128 -20 -45 35 49 133 -36
2612 -36 266 -103 -12 340 -79 -27 -131 -66 187 42 113 68 142 139 156 -51 -7 -113 3 78 130 -31 48 5 60
2637 60 208 -48 -133 -114 -85 -27 84 -100 292 107 135 -173 -157 -43 232 -118 -122 -172 -66 -274 44 -23 -31 35 4
2662 4 -164 63 -79 -30 7 -223 -18 -72 -188 104 219 -29 -73 38 153 -6 -44 62 -75 -191 256 -43
2684 -43 79 -60 50 58 -50 72 6 73 20 187 -71 75 -25 -15 -111 28 -11 -75 -64 -50 106 -206 12 0
$$ packed form
2509G5L5m24M17j61Qj66j50K52J74J8K4k81L38j85j02J48k2L2j3JK8n0q0K9Q5
2534C0N6j73Q0N5N1j36K25n2Nq8Rk5M8j2R9p0l01K75P6j85k5JJ07O3o9N2P3k28
2562e9oj0pK5J64j6n9P4J33l69j7J94p1k2N4q1J07j05k20K49L4j11J88k16M12
2587B65l11oO4K05l13M7k25M28j50J64l36r1kL21p0j27OJ90O9j48k5Q0J4Q4j69
2612c6L02l69R1L52m19N2j04O5K53j45P1m5P4lJ7k07M4j06J16P5N2j61P9m3N5
2637F0J48k56q5J9K9N8J11j84L92j85K8l08J6J14K75l50mn0J06k08L18o7qO6l1
2662Dj68K27j42M9L7k30K05n4j16K92J15k48m4J11J15j59l8J06j37j16M47k99
2684d3J22j39J10Qj08J22o6O7n3J67k58J46j00J0r6J39l9o4J1J4J56l12K18j2
$$ plain form
2708 0 -29 49 101 -143 19 56 121 -23 241 -95 191 309 112 108 31 108 -110 -14 192 -142 2 32 -355 -93
2732 -93 -75 199 30 -98 -120 -12 -112 97 71 -14 -88 -18 -67 -19 -202 -139 175 -80 -249 -219 -19 38 -122 -1
2756 -1 -79 46 -137 65 51 120 -106 -215 178 -67 -64 190 -44 121 -62 -70 109 149 230 71 -131 59 20 -30
2780 -30 165 107 -69 -192 -128 -160 301 70 317 -136 256 9 -50 -97 24 -63 -294 178 28 18 -85 21 105
2803 105 30 -73 178 -216 91 128 -187 -60 -88 -6 192 41 -11 -37 -99 -97 -23 -39 304 -105 109 -8 71 137
2827 137 -129 127 -84 28 23 -35 89 87 -57 60 -56 111 -64 42 -46 200 17 114 -110 44 96 143 57
2850 57 166 103 -6 235 61 221 11 -96 138 -92 -95 -180 34 66 -178 -7 -144 -63 -63 201 1 -30 95
2873 95 -67 17 -88 123 -114 239 -34 158 -57 -42 -99 179 12 -17 6 -116 -222 -62 -70 -237 2 181 209
$$ packed form
2708@k9P8N2k44J62L7O5j44K64l36K86J18j97mp7P7k18R6K06l34J44L0l87K62
2732i3J8K74j69j28k2J08j00K09k6q5p4P0m9M8j83O3L14k55j69L0K00N7j60J21
2756ap8J25j83K02j4O9k26j09L93k45LK54k34J65j83qJ79M0Q1j59k02J90l9n0
2780c0J95n8j76j23O4l2M61k31K47m53L92k47n9m7J21q7k31M72j50j0j03J06Q4
2803A05p5j03K51l94L07L7l15J27k8Q2J98j51n2k6o2KP4j6L43m09K14j17P9O6
2827A37k66K56k11J12nn8J24kj44J17j16J67j75J06q8K46j83R7k24J54N2M7q6
2850E7J09o3j09K41j74J60k10j07K34k30lq5K14L2k44J71j37Q1%K64k00l1J25
2873I5j62Q4j05K11k37L53k73J92k15J5n7K78j67k9K3j22j06J60qj67K39J79K8
$$ plain form
2896 209 136 -73 -205 -4 -104 1 -199 -151 -105 33 84 176 58 -171 -98 -48 77 -72 22 24 -85 205 -329
2919 -329 63 -114 -92 223 203 106 58 -82 208 63 310 -11 -72 257 165 -14 -44 176 15 -125 -155 294 24
2942 24 -53 -118 76 -78 213 -336 133 164 -15 -48 9 -13 -221 42 -7 3 -111 -19 -341 -92 -131 -133 267 6
2966 6 -233 -130 116 140 121 -57 -9 -203 77 156 32 -60 21 -3 -142 -21 -32 -203 -59 -86 135 -191 58 -47
2990 -47 14 294 -49 -30 19 60 9 3 -93 28 -36 242 -116 -18 -76 -40 -73 51 -144 276 87 -301 85 66 -22
3015 -22 -250 -224 -112 -168 5 363 -28 92 14 -12 186 -13 124 31 92 -88 -20 -57 29 -44 93 -102 47 -250
3039 -250 86 -159 135 -43 -20 -51 -73 116 155 -20 23 80 -52 -7 -42 246 120 -315 24 -276 116 85 110
3062 110 -4 16 -12 52 121 -143 -68 -17 188 -89 127 142 -18 125 -244 45 -35 127 -76 166 192 -15 264
$$ packed form
2896B09p3k09j32K01j00J05k00M8M6J38N1R2j18k29P3N0J25j49R4Kj09K90n34
2919c29L92j77K2L15k0r7m8j40K90j45K47l21o1L29r2j79l0K20j61j40l0M49k70
2942B4p7o5J94j54K91n49M69L1j79l3N7k2k08K63m9J0j14R2l22K49l9kM00k61
2966Fk39J03K46K4j9j78M8j94K80P9j24r2Q1k4j39J21j1j71J44k7K21l26K49j05
2990d7O1K80l43J9M9M1n1or6J21o4K78l58R8n8L6l3J24j95M20j89l88L86j9q8
3015b2k28K6J12n6J73L58l91J20p8k6J98j99J37r3O1j80O8l7Q6p3J37j95J49k97
3039b50L36k45K94j78K3l1k2J89L9j75M3N7j32M5l5K88j26m35L39l00L92l1K5
3062A10j14K0k8O4O9k64P5N1K05k77K16J5j60J43l69K89q0J62k03K42K6k07K79
$$ plain form
3085 264 -177 95 95 38 -71 -89 -14 84 -256 243 -198 -31 46 85 -24 84 15 -9 103 226 69 -57 61
3108 61 -57 105 96 9 103 28 -141 30 -57 59 165 113 -134 -58 -15 -22 95 123 18 282 39 -55 116 -301 -63
3133 -63 -170 -141 34 -94 87 -224 -19 -69 152 -134 -194 172 105 134 -55 -25 -149 150 -158 -77 134 34 -110
3156 -110 67 468 89 191 63 21 40 -19 140 72 24 208 95 -175 14 12 -8 167 -35 39 94 -26 -90 111
3180 111 205 158 -133 -179 19 174 92 51 22 192 -84 -218 52 100 44 -118 140 -49 271 -235 32 -135 -107
3203 -107 -160 -193 -99 -12 -78 -35 86 106 -108 -102 131 -123 -63 29 189 -19 -242 38 6 36 -53 155 50 279 142
3228 142 -82 363 164 178 268 -48 148 7 27 41 -16 -72 -111 246 125 -185 107 11 177 -124 85 15 63
3251 63 -77 -111 -128 -133 -147 -102 99 -130 211 50 -186 32 30 -217 148 134 -32 -81 25 107 48 -88 100 -1
$$ packed form
3085B64m41K72%n7j09j8P5R8l40M99m41J67P7L9j09J08o9k4J12J23j57j26J18
3108F1j18J62rq7R4p5j69J71q7J16J06n2k47P6M3pJ17K8j05K64k43r4J71m17K38
3133f3j07K9J75j28J81l11K05n0K21k86o0L66o7K9j89L0j24K99l08Q1K11j00j44
3156a10J77M01l79J02j28m2J9n9J59o8m8J84j13k70J89kk0J75k02P4N5j20o4K01
3180A11R4m7k91m6J98J55q2m1k9J70k76j34K70M8n6j62K58j89L20n06K67j67K8
3203a07n3l3R4Q7o6M3J21K0k14OK33k54O0R2J60k08k23K80l2L0q9K08j05K29j37
3228A42k24M45j99J4R0l16J96j41K0J4n7n6l9L57j21l10K92r6J66l01K09p0M8
3251F3j40l4j7nj4M5K01k29L41j61k36K18kk47L65j4j66m9J06Q2n9j36J88j01
$$ plain form
3275 -1 125 -2 108 -67 249 -10 -40 -133 123 73 19 145 120 175 59 83 -239 -156 215 -208 52 -23 -22 9 -1
3300 -1 26 69 214 -65 50 144 229 96 173 -91 -34 56 33 114 -87 -133 -2 41 -197 195 -79 5 -38 -61 -37 -164
3326 -164 18 -73 21 41 -39 -48 -100 -185 -262 2 31 6 -12 -119 94 -79 -17 -90 -89 74 243 85 -49 68 -81
3351 -81 31 -370 140 90 3 -286 -123 207 237 90 257 239 83 31 -19 -14 11 -134 -19 0 -16 207 40 14
3375 14 -117 57 10 145 -25 27 -51 -56 -68 14 111 -76 82 4 261 -49 238 -171 -212 -23 -45 32 139 25
3399 25 -82 -84 -319 28 -151 -197 131 43 -76 -71 59 -144 -278 -225 49 218 -87 -82 -56 171 120 -24 26 193
3423 193 -135 125 63 37 100 39 -96 -69 5 103 53 21 -268 96 -8 -100 94 -95 27 -316 79 -1 295 34
3447 34 177 -186 -1 -120 48 135 -199 -80 -117 81 94 -38 -25 -48 182 76 -35 -93 -183 81 -230 84 -50
$$ packed form
3275aJ26j27J10j75L16k59l0r3K56n0n4J26k5N5j16K4l22Q3L71m23K60p5JL1j0
3300aK7M3J45k79J15R4Q5j33P7k64N7R0k3Q1k01m6J31M3k38L92k74Q4m3k3K4j27
3326a64J82r1R4K0q0rn2q5p7K64K9k5j8j07K13j73O2p3JJ63J69j58j34J17j49
3351h1J12m01N10n0q7k89J63L30L0j47J67j8j56n2n0NK5j45J15J9j6K23j67k6
3375A4j31J74m7J35j70N2p8nj2Q2R7j87J58p8K57l10K87m09m1J89k2P7J07j14
3399B5j07kk35L47j79m6L28q8j19NJ30k03j34N3K74J69l05NK6K27n1j44N0J67
3423A93l28K60o2k6O3o1j35K7P4R8n0l2k89L64j04r2J94j89J22l43L95q0K96k61
3447C4J43l63J85j19J68Q7l34J19l7J98J3j32J3k3K30j06j11n8r0K64l11L14j34
$$ plain form
3470 -50 -51 57 -177 18 -140 -151 -8 -114 236 109 -76 37 -157 81 303 -122 -200 -33 82 -13 -168 -212
3492 -212 156 -275 22 104 136 95 -63 33 80 -57 -41 79 156 150 15 -56 4 42 -52 56 114 105 -2 -27 -98 -44
3518 -44 18 260 28 18 160 -102 -210 -132 20 42 58 -63 207 -61 -36 56 -239 55 -135 128 -161 -34 23
3541 23 -34 16 -160 -276 47 -16 -304 157 -118 -47 -160 -166 -237 -7 -94 34 49 -95 35 -99 -266 -44 -94 -47
3565 -47 -129 -19 161 -120 -59 120 45 0 -64 -58 -27 81 -124 127 107 148 29 -99 75 102 229 -161 69 92
3589 92 274 81 62 291 64 -137 -46 58 124 108 -55 -198 -100 61 169 254 -17 -121 90 -175 -96 -65 64
3612 64 81 -255 -48 -104 -104 44 69 -144 -73 -139 -84 175 74 -17 -28 -135 206 -154 66 97 -179 -82 201 -22
3636 -22 -201 -211 -110 -23 29 52 -201 -118 -17 136 216 -103 22 126 61 12 -141 197 135 92 -318 108 -15 277
$$ packed form
3470e0jJ08k34J95j58j1J43j06L50j27j85J13j94K38K22m25p8J67J15r5j55m4
3492b12L68m31K97Q2L2m1j58R6M7j37J6J20P7oj35p1O0L8r4J08N8rj07k5p1N4
3518d4O2K42k32j0J42k62j08P8J52K2J6j21K70k68K5R2k95K94j90K63k89J27N7
3541B3n7N0j76j16L23o3k88M61k75P1j13op1K30q7J28J5j44J30j34j67K22n0M7
3565d7q2J10J80k81O1J79p5m5o4OL1J08k05K51k0M1j19j28J74K7J27l90K30K3
3589I2J82j93j9K29k27k01R1J04O6j6j63j43R8J61J08Q5k71j04K11k65P9L1J29
3612F4J7l36K07n6%J48K5k13P1o6N5K59j01r1j1j07L41l60K20L1k76R7K83k23
3636b2j79j0J01Q7N2K3k53Q3J01J53Q0l19J25J04o5m9j53L38o2m3m10M26j23K92
$$ plain form
3660 277 5 163 51 -212 135 138 -35 -49 250 208 282 193 -4 -288 25 -153 -76 -156 -46 60 -60 -142 93
3683 93 -227 64 233 44 7 -152 69 36 34 48 -64 31 -84 -133 -48 39 -26 7 -77 42 -55 -138 -96 -143 17 -176
3709 -176 -68 42 0 -151 22 279 -90 -49 118 82 324 87 173 108 183 -203 -23 0 189 -55 25 -2 103
3732 103 219 61 -8 -18 -238 -235 -123 -189 140 170 25 170 -69 148 -75 51 123 70 29 -5 -28 -121 -28 -16 -37
3757 -37 -129 61 141 -231 48 -153 -59 -301 -105 19 252 151 -41 164 -147 -175 89 -113 -63 -340 -25 42
3779 42 -82 15 263 -18 105 26 -303 6 5 -254 -34 -72 -32 125 -180 105 127 -144 -26 336 -14 -39 -108
3802 -108 -11 -29 68 -103 -61 93 40 67 97 51 73 -145 37 119 209 133 104 -41 -59 -98 -7 23 -114 70 -65 -14
3828 -14 -21 84 109 -28 76 175 156 107 6 -17 78 -56 -223 -114 10 -153 -145 -26 -98 -73 -159 -12 -281 -2 -92
$$ packed form
3660B77k72J58j12k63L47Lj73j4K99m2P4q9j97k84L13j78P7q0J10J06j20q2K35
3683I3l20K91J69j89l7j59K21l3kJ4j12R5j15m9Q5Q7o5L3q4J19r7q3M2m7J60j93
3709a76J08J10m2j51J73K57l69M1J67l6K42k37Q6o5P5l86J80K3J89k44Q0k7J05
3732A03J16j58o9j0k20LJ12o6L29L0j45J45k39K17k23J26P2n3m1l4k3r3R3J2k1
3757c7r2J90Q0l72K79k01R4k42J96J24K33j01j92K05l11k8K64k02N0k77L15O7
3779D2j24R7K48k81J23p9l29L09jk59K20l8M0J57l05K85K2k71J18L62l50k5o9
3802a08R7j8R7j71M2J54n3K7L0m6K2k18J82Q2R0p6k9j45j8l9R1L0j37J84j35N1
3828a4pJ05K5j37J04R9j9m9j01k3R5j34j67J09J24j63QJ19p2K5q6J47k69K79r0
$$ plain form
3853 -92 -99 -110 -147 -1 -67 2 157 46 47 234 -160 73 -321 343 -23 -77 -205 -147 267 90 61 -142 -95 -241
3877 -241 104 -71 60 177 93 -116 90 -74 -75 -15 38 -165 26 104 73 -129 -165 125 -157 -12 129 7 88
3900 88 -151 -72 -241 24 -126 56 74 -139 -20 128 146 117 -149 17 -72 65 184 87 74 124 52 25 -37 78
3924 78 57 -120 -144 -4 11 -271 -248 46 64 -82 245 -63 -32 -101 8 69 -285 -13 64 19 -109 -201 65 -117
3948 -117 217 118 -170 119 -81 78 13 -11 -53 69 3 78 63 -24 11 -194 36 61 137 -51 82 140 97 51 67
3973 67 252 27 -95 -124 -82 -51 1 60 -261 -114 -52 58 102 -101 -28 -20 94 62 -26 -59 -252 -35 -31 46 104 -204
3999 -204 4 -2 -195 -135 -71 135 -222 143 194 -139 84 -205 115 90 -315 -6 224 126 -17 151 58 -250 72
4022 72 151 98 74 106 48 93 91 -7 -37 127 97 -41 27 48 -181 -115 113 -48 -69 135 -87 18 196 53 196
$$ packed form
3853i2pj1l7J46o6O9J55j11JJ87l94K33l94O64l66n4j28N8M14j77k9k03M7j46
3877b41L45j75J31J17q4k09K06j64jO0N3k03J91P8l1k02l6K90k82J45J41j22Q1
3900H8k39P9j69K65j50J82J8k13J19J48J8k9k66J66q9J37J19r7j3N0p2k7o2J15
3924G8k1j77k4J40J5k82K3K94J8j46L27l08L1o9J09O1l54K72P7m5j28r2K66j82
3948a17L34r9k88K89k00J59o5k4m2J22o6P5j5q7L5k05K30K5P6j88J33N8m3m6J6
3973F7J85k25j22k9M2L1N2N9l21J47O2J10M4k03P3QJ14l2q8l3j93K17MP7N8l08
3999b04K08oj93O0O4K06l57L65N1l33K23k89L20k5m05L09K30r8j43J68r3l08L22
4022G2P9n3k4L2n8M5kr8l0J64l0j38O8K1k29O6K28j61k1K04k22J05J78j43J43
$$ plain form
4047 196 -43 327 -86 -90 -234 79 230 -39 328 93 -94 -38 -194 -207 171 111 192 46 61 160 26 -195 -48
4070 -48 -158 42 99 -58 45 14 94 105 -7 112 17 -115 -154 -67 -67 -80 187 10 -91 300 215 -51 86 -33
4094 -33 35 21 124 61 288 137 72 -15 12 -74 -160 63 -427 -228 -152 68 -168 -61 179 -130 -103 326 -66 142
4118 142 96 -63 60 -17 -176 -176 -175 -31 -104 64 -259 126 92 -60 -84 -100 -31 83 -213 81 -134 -46 -158 78
4142 78 266 -73 -181 125 236 -243 -1 -123 25 -137 -68 -82 91 -115 -92 -94 -189 -93 135 80 53 84 169 -46
4166 -46 -34 -4 217 67 129 23 151 24 330 55 -124 -54 -7 -175 -39 -1 176 109 -53 120 76 62 -107
4189 -107 81 -26 47 69 54 147 21 121 122 164 141 30 -5 -49 225 -181 -83 -165 52 70 -84 14 -185 -90 49
4214 49 -176 -104 -127 -120 -43 -111 -68 -133 34 -182 36 112 -43 -138 103 -1 195 -14 -96 27 -24 1 -153 0 -38
$$ packed form
4047A96k39L70m13mj44L13J51k69L67k35j87N6j56j3L78o0Q1j46J5R9j34k21J47
4070d8j10K00N7j57J03l1Q0J1j12J19r5j32l9Q7%j3K67j77j01L91q5k66J37j19
4094c3O8j4J03o3K27j51o5q7K7q6q6K23m90J99P6K20k36J07K40l09K7M29l92K08
4118A42m6j59J23p7j59%JJ44p3J68l23L85l4j52k4j6O9J14k96K94k15Q8j12K36
4142G8J88l39j08L06J11m79K42j22J48j62O9j4J73k06K3kr5R6K28n5k7L1Q5k15
4166d6J2L0K21j50O2j06J28j27L06k75j79P0M7j68J36L8J77o7j62J73m4j4j69
4189a07J88j07P3K2j5R3j26J00JM2k3j11l5m4K74m06R8q2K17J8j54R8j99R5J39
4214D9k25P2k3PP7o8M3o5J67k16K18P6j55r5K41j04J96k09q2J23n1K5j54J53l8
$$ plain form
4239 -38 -6 -101 6 219 106 92 195 12 -109 30 -49 10 134 176 -32 -13 2 -29 -31 -18 65 266 184 126 173 144
4265 144 214 -59 56 105 109 49 -80 -56 -112 49 115 77 -37 28 -175 -36 40 -100 -16 90 40 -13 -145 35 -23
4290 -23 -206 -170 -109 77 -157 56 -51 126 -51 -76 -74 -112 10 -160 -166 -46 108 -82 12 176 -14 160 -211
4313 -211 84 18 6 -85 -39 -143 9 351 52 -39 -274 285 -6 99 19 -185 -70 85 75 377 228 202 -9
4336 -9 -200 131 109 143 -40 -90 -19 140 89 -140 -130 230 -94 -38 100 16 -70 77 43 -23 -13 38 164 -178 170
4361 170 -54 -75 -93 -246 -248 -234 44 -159 -149 -46 -34 -126 -94 334 -95 45 -88 -142 -144 114 9 -210 33 -333
4385 -333 67 -137 225 180 25 179 17 -243 -218 -54 -22 -93 24 117 103 186 -69 49 -22 -29 109 -19 224
4408 224 28 85 123 -35 96 -191 -40 92 81 78 -193 250 -37 61 189 40 160 180 -43 -206 -144 -342 11
$$ packed form
4239c8L2r5J07K13j13j4J03j83j21J39p9N9J24M2k08J9J5l1kJ3Q3K01q2n8M7k9
4265A44P0k73J15M9Mo0j29K4n6J61O6l8j14O5k03J39P6j40Q4J06n0n3j32J80n8
4290b3j83L6O1J86k34K13j07J77j77k5Kl8J22j70oJ20J54j90R4J64j90J74l71
4313b11K95o6j2r1M6j04J52L42k99r1k35N59k91J05q0k04J15J55j0L02j49k6k11
4336ij91L31k2L4j83n0P1J59n1k29J0L60l24N6J38q4q6J47l4o6J0N1J26l42L48
4361A70k24k1j8j53kJ4K78k03J0J03J2r2L2M28m29J40j33n4kK58j05k19K43l66
4385c33M00k04L62m5j55J54j62k60K5J64L2p1J17R3j4Q3k55J18p1pJ38j28K43
4408B24j96N7L8j58J31k87J51J32j1lk71M43k87R8J28j49J20K0k23j63O2j98L53
$$ plain form
4431 11 -276 51 -118 -50 132 -41 -61 -10 295 30 27 -22 -9 -131 330 -126 28 166 -35 -66 -313 25 -78
4454 -78 145 -89 39 -125 146 -260 -384 58 -51 -235 99 223 54 27 206 52 -231 -72 58 8 -149
4475 -149 -57 -27 293 69 -19 53 199 125 -25 -39 75 -97 -38 73 185 58 -123 -269 -71 94 0 242 100
4498 100 -21 -277 162 39 24 31 102 203 -174 -400 -234 -21 -3 103 -14 16 -196 42 -12 -170 -328 37
4520 37 -173 -275 -5 151 -79 54 118 -1 -19 -207 86 -59 110 23 75 -18 -47 137 -102 72 139 73 -20
4543 -20 -14 117 -96 91 93 214 -220 -45 17 -140 -121 77 17 -96 127 -59 218 -23 24 22 108 -64 -90 -94 -232
4568 -232 290 43 234 124 -12 -149 6 123 -121 45 -41 -117 -18 -7 101 158 -171 -65 -8 -176 91 -37
4590 -37 -39 131 -141 -115 63 110 15 247 -51 -111 85 -132 -64 152 33 -224 -78 28 16 -24 122 80 96 40
$$ packed form
4431A1k87L27j69O8J82j73k0N1L05k65lm9J3j22M61m56J54J38k01l1k47L38j03
4454g8K23k34J28j64K71m06j24M42j09j84L34J24j69k7J79j54k83J59J30n0j57
4475a49R2L0L20k24q8P2J46p4j50j4J14j72N9J11J12j27j81j46J98J65r4K42j42
4498A00j21k56M39j23j5PP1J01l77k26J66K13J8J06j17L0k12K38n4j58j58L65
4520C7k10j02K70J56k30J33O4j19j8j88K93j45J69q7N2r3k9J84k39J74O7o6r3
4543b0OJ31k13J87KJ21m34J75O2j57J9J98o0j13K23j86K77k41M7kQ6j72k6mj38
4568b32N22k47J91j10j36j37J55J17k44J66q6p6R9J1J08N7l29J06N7j68K67j28
4590c7kJ70k72K6J78M7r5K32k98o0J96k17O8K16j19k57J46J06j2m0J46m2J6n6
$$ plain form
4614 40 302 -121 -71 221 -136 226 -102 -251 -149 126 237 -78 -148 -107 212 85 60 86 53 112 -235 46 69
4637 69 -30 -45 131 -5 -42 -248 -29 -127 65 134 -118 78 -117 28 -33 98 147 35 -40 -238 -247 -42 -63 109
4661 109 87 -65 134 35 31 -22 118 -144 -101 -145 84 171 22 26 -154 -98 13 -206 -203 -242 -35 129 -72 -41 51
4686 51 38 272 41 -27 44 158 15 23 78 36 -213 106 58 109 -51 -79 -58 -59 -29 150 177 192 140 64 -102 -26 131
4713 131 165 175 108 -114 122 -82 114 68 37 135 244 160 113 68 -220 -102 54 64 -152 15 63 7 -30 -185
4737 -185 -104 141 -15 -53 94 -14 137 181 -141 -192 -306 -81 -20 -165 -264 -124 66 -89 26 66 220 -96
4759 -96 329 113 158 125 118 -41 -220 57 6 -37 -140 -212 -21 22 188 -80 143 -6 5 21 -75 180 -75 115
4783 115 92 -169 83 33 118 -86 10 65 81 24 -194 -43 6 75 -26 62 -71 -155 -28 15 149 -168 -28 -285
$$ packed form
4614D0K62m23N0K92l57L62l28j49J02K75J11l15p0M1L19j27k5K6l3N9l47K81K3
4637F9r9j5J76j36l7k06K19r8J92O9k52J96j95J45o1J31M9j12p5j98rK05k1J72
4661A09k2j52J99r9mn3J40k62M3m4K29Q7j49Mj80N6J11k19Ll9K07J64k01L1R2
4686E1j3K34k31o8P1J14j43QN5m2k49L19m8N1j60k8K1jL0J79K7J5n2p6j66P6J57
4713A31L4J0o7k22K36k04J96m6l1R8J09q4m7m5k88J18J56J0k16J67M8n6l7j55
4737a85Q1K45j56l8J47j08J51M4l22n1j14K25O1j45r9J40J90j55J15M0J54l16
4759i6M25k16M5l3pj59j79K77n1m3j03p2J91M3J66k68K23j49J1J6r6K55k55J90
4783A15k3k61K52n0Q5k04R6N5J6n7k18J51M9O9j01Q8j33q4J27M3J34l17J40k57
$$ plain form
4807 -285 17 242 -117 -160 -16 -258 -226 17 188 -55 -38 -146 22 -17 -168 -51 -161 212 22 -44 69 -31
4829 -31 -135 110 73 34 138 -134 -134 65 -42 97 -41 -49 94 -31 -211 48 14 70 -77 199 33 -78 42
4852 42 -36 -13 162 62 139 56 53 219 -111 -129 -87 60 -203 -263 134 5 244 -158 -82 -38 66 -124 83 -182
4876 -182 -12 154 -71 51 13 -130 -117 58 -69 111 -111 -47 2 179 -342 43 11 267 20 37 -43 -2 -107
4899 -107 92 5 -83 -164 -78 -38 2 -186 -265 -14 -218 -26 70 -101 65 118 49 298 -61 -43 -48 -13 -65 156 41
4924 41 213 47 29 -292 49 26 -114 39 4 -51 -37 61 53 -291 -99 -70 52 -38 12 13 -2 -113 51 -74 -175
4949 -175 -10 -107 19 48 -136 -95 109 57 -132 -42 89 -90 -11 -83 21 -181 -361 -147 -65 34 -120 110 -55
4972 -55 245 280 -116 14 5 -135 113 35 -101 -429 78 180 189 216 47 51 -131 -70 127 16 60 -59 -116 28
$$ packed form
4807b85L02K25l59m3J44k42L2K43J71k43J7j08J68l9j51J17j10L73j90o6J13j00
4829c1j04K45l7l9J04k72%J99j07J39j38qJ43j25j80K59l4N6j47K76j66j11J20
4852D2p8K3J75j00P7q3lJ66l30j8M2J47k63o0L97j29K39m02P6M4J04j90K07k65
4876a82J70J66k25J22l8j43J3J75j27J80k22O4M9J77n21L85l2K56k47J7q0M1j05
4899a07J99q7q8q1Q6M0M0j88p9K51k04J92R6j71J66N3o9K49l59J8nL5n2K21j15
4924D1J72j66j8l21L41k3j40J53l5n5J4R8ql44J92K9J22r0N0Jj5j11J64j25j01
4949a75J65r7J26K9j84M1K04n2j89R0J31j79P9p2J04k02j80K14Q2R9j54K30j65
4972e5L00L5l96J30rj40K48p8j36l28N07J02RK7j69Mj82O1J97j11M4j19n7J44
$$ plain form
4996 28 -33 -150 15 49 -198 144 -93 89 -15 255 -221 135 156 -89 -173 -175 -179 -12 297 -153 -203 -63 -81 -72
5020 -72 38 183 40 152 -154 4 83 248 15 108 -209 -75 -317 -71 131 -67 7 55 105 -66 -152 -47
5042 -47 -50 -181 18 106 -298 -265 20 2 -130 -41 178 -87 -80 -31 163 -77 33 -126 -7 2 -210 6 -75 117
5066 117 -102 -231 24 -156 -173 -60 -184 -4 -285 4 242 199 208 105 94 10 -36 -85 92 -196 102 -12 124
5089 124 -43 14 -21 -93 -52 -15 201 -49 -119 126 19 -303 40 123 -77 -264 -69 -66 -87 -124 -407 -254 -115 -152
5113 -152 -224 -49 -164 221 55 -194 14 -57 154 -101 -13 1 28 -108 -231 71 122 118 32 -91 264 4 159
5136 159 -134 -53 179 -106 78 91 225 89 -52 73 25 -110 3 79 133 192 -23 -81 14 140 37 -18 -45
5159 -45 123 165 83 -218 -129 39 89 92 -56 129 -32 -105 197 -13 106 -177 81 -52 -165 76 10 173 150
$$ packed form
4996B8o1j17J65L4k47L42k37J82j04K70m76L56K1k45q4kmJ67L09m50n0J40j8R
5020g2J10J45j43J12l06J58P9J65k33R3l17J34k42K46K02j98P4M8N0j71q6J05
5042d7lj31J99Q8m04L3K85j8j32Q9K19k65PM9J94k40J10j59J19Rk12K16q1J92
5066A17k19j29K55j80j7J13j24J80k81K89K38m3Rj03j1q4m6m9J77k88K98j14J36
5089A24j67N7l5p2M1L7K16k50p0K45j07l22L43Q3k00j87J95Lk1l7k83J53J39l7
5113a52p2J75j15L85j66k49K08p1K11k55Q8J4K7j36j23L02N1mq6j23L55k60J55
5136A59k93Q1K32k85J84J3J34j36j41J25m8j35J13P6N4N9k15n8R5J26j03n5k7
5159d5J68M2q2l01Q9J68N0Lj48J85j61p3L02k10J19k83K58j33j13K41o6J63k3
$$ plain form
5182 150 169 110 -172 -116 -129 -62 -64 246 -71 -47 51 -63 -109 276 170 21 -45 -1 -170 -74 -301 144 -63 38
5206 38 -13 163 84 81 -289 -93 90 -47 -2 -30 85 6 289 49 -103 164 -39 106 117 -144 68 152 21
5229 21 54 -58 46 -36 195 -291 -233 -34 -140 149 59 -265 -244 -209 -116 -79 23 102 -101 211 -17 -159 39
5252 39 -58 -125 19 216 109 159 186 -91 -220 178 21 -166 -155 -174 -26 124 102 -100 -220 247 -79 -365 -78
5275 -78 -146 -130 199 -78 -70 130 -183 -57 248 -17 -120 16 175 176 -15 -226 190 29 -103 197 32 -84
5297 -84 91 142 -85 -102 -39 144 -38 -14 31 -17 -145 -79 152 -182 -198 80 -175 -65 150 -66 -22 -120 -214 -87
5321 -87 -151 44 -154 97 113 62 208 0 64 -110 14 67 -199 67 10 -213 -18 -206 -71 36 -270 -31
5343 -31 -59 -92 -62 15 -184 -98 148 -50 -6 -11 28 11 185 -84 -116 173 -83 -65 71 211 116 -12 -67 -97 16
$$ packed form
5182A50J9n9k82N6j3O7kL10l17K4R8j14m6L85j06j49o6M4j69R6k27M45k07J01
5206C8n1J76p9ll70J96J83j37M5k8J15p9K83k40j52K67k03J45J1k61K12Q4j31
5229B1L3j12J04q2K31m86N8J99j06K89r0l24K1L5R3L7J02P9k03L12k28j42J98
5252C9r7o7J44J97j07N0K7k77j29L98j57j87J1j9J48J50k2k02j20M67l26k86K87
5275g8o8J6L29k77QK00l13J26L05k65j03J36J59Jj91k11M16j61j32L00j65j16
5297h4J75N1k27j7O3J83j82K4M5m8j28O6K31l34j6K78k55J10K15k16M4r8r4J27
5321h7o4J95j98K51J6n1J46k08O4j74J24N3k66K66n7k23J95j88J35J07l06K39
5343c1k8l3L0P7j99Q6K46j98M4nL9j7J74k69l2K89k56J8J36J40r5j28n5l0J13
$$ plain form
5368 16 106 60 69 405 404 -38 -92 66 120 15 -190 280 -82 -87 -73 -139 43 -7 29 -72 62 51 -61 213 24
5393 24 -37 38 1 91 -107 -10 57 -91 260 276 144 27 73 -51 160 -46 63 -99 -65 -15 -42 152 -1 -84
5417 -84 258 -7 34 347 12 312 -21 6 24 -68 -102 41 -174 -6 263 -119 -100 -40 8 -81 -87 19 -36 187
5441 187 -67 177 -85 290 -47 38 143 4 187 53 -12 55 -12 -24 5 159 78 -142 204 108 -241 161 148
5464 148 102 -285 -108 150 43 65 6 174 -2 122 -15 -134 100 171 53 -239 -32 -287 158 46 -136
5485 -136 76 -126 99 -57 -26 -82 -104 3 -108 148 -90 3 -152 82 -89 215 13 -139 329 309 -167 -102
5507 -102 5 -6 -183 -108 -53 -118 -57 104 -57 228 46 -26 -20 -60 -5 -365 -21 84 -47 -177 -18 -71 -176 115
5531 115 -69 81 188 247 -32 -120 -25 25 -62 129 -79 22 12 26 20 24 -136 -101 5 97 39 -92 -247 -223 234
$$ packed form
5368A6R0m6RL36jm42n4J58N4j05k05M70l62nJ4o6J82n0L6j01J34j1j12K74j89
5393B4o1P5l7R0j98R7O7j48L51J6j32j17M6j24K11k06J09j62L4N0k7J94j53q3
5417h4L42k65M1L13l35L00l33K7J8r2l4J43k15J68K69l82J9O0M8q9oJ06n5K23
5441A87k54K44k62L75l37Q5J05j39J83j34o5O7o7j2K9J54q1k20L46r6l49M02j3
5464A48m6l87J77K58j07K2n9J68j76J24j37j19K34P1j18k92K07k55M45j12j82
5485a36K12k02K25j56L1n6k2J07j11K56k38R3j55K34j71L04k02j52M68k0m76O5
5507a02J07j1j77P5N5o5O1J61j61K85j82p2Om0N5l60L44J05j31j30J59n3j05K91
5531A15j84J50J07N9k79q8R5N0q7J91k08J01j0J4oMj60L5J06R2n8j31j55K4M57
$$ plain form
5556 234 -178 175 -173 -156 15 -137 -84 -120 73 -170 11 223 -164 -211 -142 191 19 154 -89 80 117 84
5578 84 -38 113 -208 -195 -101 -30 5 -4 -16 -21 -213 125 106 141 38 -93 221 -87 -60 8 -97 352 148 -81 45
5603 45 -57 113 -45 -41 -73 -142 172 69 -16 -147 -27 -150 -182 12 -194 -130 53 -155 51 -72 149 -116 -110
5626 -110 -13 -109 -159 41 54 -27 25 -127 -116 24 -74 -6 85 -319 29 -179 -54 9 -74 23 -132 115 -89 -57 56
5651 56 197 -203 62 58 211 -142 47 119 267 131 16 130 84 35 230 16 222 -300 49 36 -150 -34
5673 -34 28 -97 2 -41 -62 -67 70 -188 6 93 -98 79 -273 42 14 14 -54 -242 41 103 -112 127 120 9 -92
5698 -92 -67 2 -129 -73 75 -127 120 -90 -62 -80 -93 296 -73 113 43 -30 -152 32 24 63 23 -257 156 128 -4
5723 -4 90 -130 -262 -54 -121 -49 0 -157 66 117 126 176 100 -122 71 -116 -139 118 168 393 379 208 435 -213 -85
$$ packed form
5556B34m12L53l48J7J71j52N3l6J93k43J81K12l87m7O9L33j72J35k43J69L7l3
5578H4j22J51l21J3R4P1L5rj2nj92L38j9L5j03j31L14l08K7O8j05M49k04k29J26
5603D5j02J70j58Ml2o9L14j03q5j31J20j23l2J94k06O4J83k08K06j23K21k65O
5626a10R7r6n0K00J3q1N2j52J1J40r8O8R1m04L48k08J25O3q3R7j55K47k04L2J13
5651E6J41m00K65mJ53l53J89P2J48j36j15J14m6m9J95k14K06n22L49j3j86J16
5673c4O2j25R9m3k1nJ37k58J94Q7j91J77l52L15k8%o8j88K83O2k15K39pj11j01
5698i2K5O9j31N6J48k02K47k10K8j8j3L89l69J86p0p3j22J84qL9m0k80M13k8j32
5723dR4k20j32K08o7P2M9j57K23N1RN0p6k22J93j87k3K57N0K25j4j71K27o48J28
$$ plain form
5748 -85 -90 10 -330 164 722 318 117 -195 -283 152 -237 136 -126 253 -223 -135 -71 -47 33 -6 100 -111 -55
5771 -55 -21 8 -16 96 -22 199 -165 -6 -30 102 -236 43 26 -114 -61 186 85 -138 145 -67 161 -114
5793 -114 231 56 44 216 277 226 -168 58 14 11 -31 -27 118 15 30 -41 -152 138 23 3 -77 -14 -119 70 -404
5818 -404 -28 -40 36 -94 219 44 123 215 -10 181 -7 314 -55 -236 119 152 -155 25 198 226 44 48 -43
5841 -43 -52 16 -73 -205 197 -118 -50 177 -104 87 65 215 -160 67 10 -123 277 -166 -120 40 -8 22 72 -68
5865 -68 -101 -177 151 -98 29 49 -155 -118 -65 255 166 -24 38 14 -111 62 229 21 -44 15 179 -26 33 164
5889 164 4 156 -20 103 -40 190 -226 -115 -49 70 -296 94 7 -6 60 58 128 -120 191 156 69 60 -102 -62
5913 -62 -68 -69 -64 -33 -23 -79 -308 -2 60 -171 44 -92 48 -15 -95 -87 -96 -176 -172 61 4 -120 72 -19 -312 17 190
$$ packed form
5748h5nJ00l40M94N58m04k01l12q8M35l89L73k62L79m76Q8O4K4Q0l9J06k11N6
5771e5L4K9k4J12j18K21l64J59k4J32l38K79j7j40N3K47j01k23K83k12K28k75
5793a14L45j75j2J72O1n1l94K26m4lm2MJ45j03J5p1j11K90j15k0q0O3j05J89m74
5818d04L76j2P6j30L13j75P9R2k25J91j88L21l69j81L55L3l07J80J73K8j82Mr1
5841d3rO8q9j32M02l15O8K27k81J91k2J50l75K27n7j33M00m43M6J60m8L0N0j40
5865f8l3p6L28k49J27K0k04L7N3L20q9j90O2k4j25J73J67k08o5N9J64k05N9J31
5889A64j60J52j76J23j43K30m16J11O6J19l66L90q7j3O6kP0k48L11l5q7rj62M0
5913f2ojNL1J0n6k29L06O2k31K15j36J40o3q0Qrq0MK33n7j24J92r1k93L29J73
$$ plain form
5940 190 179 -163 -296 -276 221 -20 -185 -178 -331 -93 -55 -214 5 129 46 -82 -137 48 25 279 -14 -126 -70
5963 -70 67 -157 -8 131 84 291 -180 251 -235 -140 90 -77 -181 45 205 -130 -98 168 -284 150 -43
5984 -43 -134 -315 1 156 111 211 258 -19 -174 -151 -67 10 -252 -28 -17 -154 22 76 0 26 5 -80 13 -88 -6
6009 -6 26 -132 248 239 -66 37 190 169 -106 -60 48 117 -40 47 -187 110 28 271 -28 -68 -362 -169 -26 12
6033 12 90 -62 168 45 78 -49 -149 -159 45 116 129 45 -25 97 -113 -232 65 -43 -32 -23 39 -88 11 -49 -144
6058 -144 -62 92 105 66 -120 230 2 -154 -20 273 8 -168 -45 187 -163 -170 -194 -54 104 -133 12 -277
6080 -277 76 -63 -62 -83 -165 -163 155 106 -82 29 67 -51 141 79 101 -47 146 -116 -71 60 48 -250 -115 53
6104 53 55 50 -131 -49 48 -40 -45 -5 -115 -18 -22 -24 -71 -120 70 58 -174 94 26 -15 -185 -158 -81 68 139 -134 -24 -99
$$ packed form
5940A90j1l42j33K0M97k41j65Pj53K38L8j59K19J24q3j28n5J85k3K54k93j12N6
5963g0J37k24J49J39m7K07m71M31m86R5K30j67j04K26J60l35L2K66m52M34j93
5984d3r1j81L16J55m5J00M7k77j55K3Q4P7k62K24J1j37J76N4p6K6k1q5R3j01Q2
6009fL2j58L80rl05J03J53k1k75M6J08O9j57Q7k34K97q2K43k99m0k94J93J43L8
6033A2P8j52K30j23L3j27j00j0K04P1J3q4p0J22k10j19K97j08J1RO2j27R9o0r5
6058a44Q2J54J3l9j86L50k28j56J34K93k65j76J23K32l50pk4J40J58k37J45k89
6080b77L53j39Jk1q2KL18m9j88J11L8j18J92o2K2j48J93k62M5J31j2k98J35J68
6104E3Knj81Q2R7q8nM0j10R7mkm7m9J90j2k32K68o8m1j70K7P7J49P1k73J10p5
$$ plain form
6132 -99 -78 63 -9 -134 -213 -67 141 -150 -156 43 157 43 -136 1 -65 90 -63 -83 -16 59 -8 -102 106 53
6156 53 -26 39 -34 -173 -6 -102 -49 171 -56 -110 11 -1 -170 26 -22 -25 -254 -154 110 -54 262 -79 -94 172
6180 172 -70 200 -255 -40 11 137 -142 -123 -152 57 366 41 151 -116 70 -4 -23 -24 -10 -406 145 57 35
6203 35 129 -109 -58 -81 -142 -165 -248 37 153 12 150 293 -225 7 -49 -286 -14 114 60 -48 -29 -122 79 73
6227 73 -23 -80 195 36 -221 24 55 -114 30 -115 -212 -65 -136 126 -313 52 105 -68 -77 124 54 5 -50 11
6251 11 130 -137 -64 258 196 50 57 -262 157 228 102 -80 -123 -46 -44 301 114 145 233 233 96 31 -221 81 67
6276 67 -21 -17 -115 8 -173 115 154 48 -41 19 -140 -116 140 34 -220 -65 142 -160 60 170 -2 -353 -356 99
6300 99 106 24 -89 -48 108 -190 64 -11 -80 -100 -21 -106 240 -18 -259 -214 -106 123 -193 107 124 16 -2 -11 -170
$$ packed form
6132i9K1J41p2j25p9J46K08k91oJ99J14j14j79J37o6J55j53k0O7P5o7r4K08n3
6156E3p9O5p3j39J67r6N3K20k27n4J21j2j69J96m8lk29J00K64j64L16l41j5K66
6180A72k42K70m55K15N1J26k79J9k9K09L09l25J10k67J86p4j9jJ4l96N51q8k2
6203C5R4k38N1k3o1k3q3K85J16j41J38J43n18K32n6k37K72J28n4j08J9r3K01o
6227G3r6n7K75j59k57K45L1j69J44j45r7J47p1K62m39L65N3j73rK01p0m9n5O1
6251A1J19k67P3L22o2j46Pl19M19P1j26j82m3P7KL45j87L1Q8%j37o5k52L02j4
6276F7q8Mr8J23j81K88L9j06q9O0j59K4K56j06k54J55K07l02K20J10j72l51lM55
6300I9Pq2j13M1J56k98K54p5o9k0P9q5L46k58k41M5J08K29l16L00J7j08j8rj59
$$ plain form
6325 -170 -49 -68 270 130 31 -18 112 113 144 -39 66 61 119 101 -63 66 -106 85 78 331 -3 -112 -32 71
6349 71 -18 -98 192 -37 -32 -106 104 110 112 31 -92 246 217 93 -108 50 51 145 -118 -102 217 48 -82 -189 23
6374 23 -60 20 -48 -18 -15 141 28 -3 47 -120 94 29 -30 -7 111 -77 -95 201 34 93 -138 -63 -45 -166 -55
6399 -55 99 -207 -242 -4 -151 -100 -43 -53 125 256 -74 -9 50 -103 4 102 -123 8 -242 -49 41 -5 97
6422 97 68 58 -77 -153 -119 158 147 114 140 122 17 -216 -73 -13 -30 -209 214 -140 -159 -312 245 16 132 -37
6446 -37 -119 0 17 15 -193 -27 -46 149 92 -168 19 55 115 109 316 215 -75 -39 116 -163 194 98 178 -113 -91
6471 -91 169 99 -30 -188 62 -186 -110 -241 -142 30 31 -142 41 154 106 -6 266 -35 114 -96 -13 26 -117
6494 -117 49 -91 -244 -127 147 -84 88 -79 191 -25 73 0 -160 -48 240 20 20 49 -121 180 -80 -31
$$ packed form
6325a70J21j9L38j40r9m9J30JL1j83J05nN8j8j64J29j72J91pK53l34j09Q0J03
6349G1q9q0K90k29Np4K10OKq1j23L38k9j24k01J58JR4k63J6L19j69j30j07K12
6374B3q3Q0o8L0LJ56j13l1N0j67K14o5n9K3J18j88j8K96j67N9k31P5J8j21J11
6399e5J54l06l5K38j47N1N7j0J78J31l30O5N9j53J07R8k25J31k50J93R0m6J02
6422I7k9j0j35p6L4K77j1l3K6j8j05k33J43O0j7j79M23l54j9j53N57k29J16j69
6446c7q2J19J7kk08J66j9J95n7k60J87L6O0oK07j01k90L6J55k79L57r6Q0k91K2
6471i1K60p0j29j58K50k48P6j31R9J72Jj73J83J13m8j12K72l01J49k10Q3L9j43
6494a17J66j40j53J17K74k31J72j67K70k16R8p3j60J12K88k20%K9j70L01k60M9
$$ plain form
6516 -31 -112 120 -30 102 109 -75 -69 28 111 -10 147 -58 91 -182 -141 -20 -81 123 9 169 92 -86 -187 -127
6540 -127 -298 107 -33 -19 18 1 39 7 -239 351 -262 167 -85 216 162 -263 -25 -171 143 67 -117 -325
6562 -325 154 69 -65 18 22 197 -20 -98 116 4 59 -63 -123 53 48 213 39 69 -18 38 -102 79 107 62 -26
6587 -26 -6 97 -6 18 33 53 -194 -30 -72 150 -1 38 -11 -71 -129 11 -49 -96 -55 -34 -2 104 172 51 74 69
6613 69 -164 -112 -181 -47 -122 152 180 -6 -8 -58 61 -152 120 -54 99 -155 113 -123 -143 27 88 -207 55
6636 55 -248 22 11 -123 -20 121 -56 -54 128 97 -100 132 37 -10 216 189 160 151 29 -59 -59 105 -135 -24 159
6661 159 64 327 -88 -148 -12 -45 23 164 -134 47 55 259 62 -13 93 -133 173 144 52 121 -39 39 -187 -30
6685 -30 -111 -23 -34 -237 23 228 -12 -15 -237 -72 -50 89 15 -9 -11 55 -114 45 98 173 -23 -60 299 -62 0
$$ packed form
6516c1q1K32j50J32Pj84OR7Q3j21J57k05J49k73M1J21o1K04j14J60p7j78j01O0
6540a27j71M05j40J4L7j7L8l2k46N90o13M29k52L01n4m25K38j46L14p6j84k08
6562c25M79q5j34Q3MJ75k17p8K14j12N5j22o0J76nJ65j74L0q7N6j40J81K8m5q8
6587b6K0J03j03K4J5K0k47J64m2K22j51L9m9o0n8J40o0m7M1K1L2J06O8j21K3n
6613F9k33N2o9J34p5K74K8j86kn0J19k13K72j74J53k54K68k36k0J70O1k95K62
6636E5l03K70j1j34J03J41j77KJ82l1j97K32r5m7K26k7k9rj22q8%J64k40J11J83
6661A59r5K63m15o0J36l3O8J41k98J81QK04j97p5J06k26L06k9r2O9j60P8k26J57
6685c0q1Q8j1k03K60K05k40lk22J65K2J39p4k4kO6j69J59N3P5j96l7L59l61O2
$$ plain form
6710 0 -142 -47 111 40 -61 83 31 78 52 258 110 -19 173 14 -39 -89 164 -203 105 -6 8 198 -23
6733 -23 143 216 -60 31 201 -60 -38 153 -20 148 111 -240 73 -148 -122 -43 -155 121 -81 -32 -130 139 -81
6756 -81 -128 -105 -121 256 31 196 90 19 -42 -7 -68 141 -79 -149 -216 -86 71 -19 -49 58 265 14 150 -163
6780 -163 42 -266 -16 166 -35 181 96 71 169 159 -39 -61 157 -124 -153 -158 -38 -96 44 103 86 -177 135 -47
6804 -47 151 -80 -185 -308 -117 -77 108 173 -9 34 -129 138 9 34 272 122 -96 170 -64 -185 91 -101
6826 -101 -137 -7 -49 -36 -54 -61 120 134 10 -126 -120 -2 9 156 -2 52 38 -208 -87 -36 112 41 53 -22 63 119
6852 119 13 64 317 -75 -57 -14 96 -3 -10 -123 75 38 123 -117 50 93 111 -18 82 -64 -33 52 -105 -181
6876 -181 234 -189 103 133 -107 74 -109 158 209 14 129 -151 170 21 138 -10 -73 2 -26 136 -58 89
$$ packed form
6710@j42R5J58p1j01J44n2M7k6K06j48j29J92j59n3n0K53l67L08j11J4J90k21
6733b3J66P3k76R1J70k61K2J91j73J68l7l51L13k21K6P9j12K76k02M9r8K69k20
6756h1m7K3j6L77k25J65j06p1o1L5o1K09k20p0o7J30J57r0l0J07K07k51J36l13
6780a63K05l08K50J82k01K16q5k5R8j0j98k2K18k81k9nJ20n8J40N9j7k63L12j82
6804d7J98k31j05j23J91M0J85O5j82M3j63K67j29K5K38j50k18K66k34j21K76j92
6826a01l6J30m2J3j8pJ81J4j24j36OJ18J1J47j58N4j4k46J21N1J48p1J2p5Q5N6
6852A19j06N1K53l92J8M3J10r9pj13J98l7Q5k40J67M3J8j29J00j46L1Q5j57p6
6876a81M15m23K92L0k40J81j83K67N1j95J15k80L21j49J17j48o3P5k8J62j94J47
$$ plain form
6898 89 31 58 -16 102 -123 198 15 -159 -257 304 -88 -42 -197 83 -195 -54 -103 -201 82 11 98 -180 5
6921 5 -114 48 -72 92 -25 36 12 -3 22 65 -39 118 42 103 -105 -9 -5 52 412 162 154 -223 -83 -86 164 218
6947 218 -131 113 -131 -151 155 103 -21 -116 201 -64 70 104 -99 -82 10 -80 89 129 -152 68 -132 92 -167
6970 -167 82 -209 125 -60 108 53 212 180 -99 -145 74 -101 -11 154 -128 98 178 148 171 -120 -66 -5 18
6993 18 95 -48 32 32 16 -133 -176 -115 -193 238 88 53 88 -126 43 -217 118 -50 32 44 -12 84 113 -155 43
7018 43 25 -16 41 13 -17 -94 -11 -23 179 -82 70 -5 -125 5 55 126 56 137 69 23 80 -86 402 66 -42 -86
7044 -86 190 -140 70 -69 70 -249 62 -213 -34 101 -4 13 -150 -23 -8 56 -134 -21 -16 94 -135 -32
7066 -32 184 37 -68 -73 240 -109 -121 180 -231 15 -58 -52 -82 68 113 -142 -77 -179 61 57 -57 76 -45 94
$$ packed form
6898H9n8K7p4J18k25L21j83j74r8N61l92M6j55K80k78J41m9r8K83p1Q7k78J85
6921Ej19J62j20J64j17O1k4j5K5M3j04J57p6O1k08R6MN7L60k50ql77J40lK50N4
6947B18l49K44k44k0L06n2j24r5L17k65J34L4k03J7R2r0J69M0k81K20k00K24k59
6970a67K49k91L34j85J68n5J59l2k79m6K19j75R0J65k82K26Q0l0K3k91N4O1K3
6993A8P7j43Q0%j6j49m3O1p8M31j50l5L5k14J69k60L35j68Q2J2n6R6K9k68J98
7018D3j8m1N7k8l0p7Q3j2K02k61J52p5j20J30N0P1p0Q1o8m6N7j66M88l36j08m4
7044h6K76l30K10j39J39l19L11k75J79J35j05J7j63J27J5O4j90J13NJ10k29J03
7066c2K16j47j05nL13l49j2L01m11K46p3Ol0J50M5k55O5j02K40mj14J33j21J39
$$ plain form
7090 94 -37 147 -215 41 -38 -40 95 14 48 -10 -32 -39 177 110 51 80 94 14 210 88 387 -76 60 118 -74
7115 -74 156 36 -186 -3 -137 -190 -201 201 -102 7 48 -275 103 -27 31 -110 -18 22 -70 193 154 47 -193
7138 -193 -24 -131 -31 91 -73 93 -192 -22 107 -96 -65 -22 -49 65 151 39 -108 189 -9 75 -104 37
7160 37 17 49 28 39 -12 135 -81 -203 5 -245 -239 148 -168 -85 -68 -53 67 179 -65 3 -188 -39 106 -46
7184 -46 -105 -151 -104 -159 12 73 -86 6 -89 -99 109 -49 -195 144 -127 54 214 -12 -17 -197 -34 -52 137 -212
7208 -212 320 -66 -1 -171 30 81 62 -186 -33 61 -192 27 1 100 -82 167 6 -182 21 71 10 73 177
7231 177 -146 75 -68 -97 61 -167 -30 -29 196 20 -64 50 31 -56 179 177 -217 31 9 -42 -60 -10 42 162
7255 162 18 -161 -176 174 107 70 122 -18 168 -98 16 116 -41 65 103 -216 -31 123 288 -150 -89 61
$$ packed form
7090I4j31J84l62K56p9kJ35q1L4n8k2pK16o7n9K9J4q0J96j22K99m63J36N8j92
7115g4K30j20k22J83j34n3j1M02l03J09M1l23L78j30N8j41R2M0r2K63l9j07k40
7138a93J69j07J00J22j64J66k85J70J29k03L1M3k7J14Q6j12j47K97j98Q4j79J41
7160C7k0L2k1J1n1J47k16j22K08k50OL87l16Q3J7J5J20J12k44O8j91J49J45j52
7184d6n9m6M7n5J71O1j59R2r5j0K08j58j46L39k71J81J60k26nj80J63j8J89l49
7208b12N32l86O5j70K01N1j9k48J53R4k53K19k6R9j82K49j61j88K03N0o1O3J04
7231A77l23K21j43k9J58k28J37JK25j76q4J14j9q7K35kl94K48k2n1j8N0N2J20
7255A62j44j79j5L50o7l7N2j40J86k66J14J00j57J06L8l19J85J54J65m38O1J50
$$ plain form
7277 61 -300 -79 44 -274 -151 186 -27 137 -99 28 49 9 151 -188 19 20 -111 115 -60 -295 106 -20
7299 -20 21 181 154 -58 -86 -189 53 136 -113 108 98 -151 -287 5 -67 -157 13 -153 -34 -310 357 -94 -204
7322 -204 153 29 -13 5 59 -27 -32 -124 86 -120 -39 -74 -198 -127 86 -109 -25 -73 40 -50 -273 -18 -164 -108 -122
7347 -122 -75 207 -85 112 -28 91 -102 -121 28 -23 34 23 150 -63 16 -234 -34 185 72 -108 -224 114
7369 114 -118 -209 -112 -53 14 -88 -13 -55 -330 -7 67 45 114 220 93 -113 38 -85 10 -2 196 -105 -73 -88
7393 -88 -106 93 55 -119 155 -127 -77 -185 78 -179 -97 152 37 186 -30 49 -245 34 -69 -78 -68 155 125
7416 125 113 -340 24 -35 -72 -136 0 -31 169 -124 -10 118 175 -191 -109 -69 36 -79 -223 210 45 2 59
7439 59 133 31 18 -214 -153 -113 1 -31 12 -180 -41 -7 -101 -119 -115 -51 39 5 -83 -42 -8 -45 -162 -127 27 63 156
$$ packed form
7277F1l61K21J23l18J23L37k13J64k36J27K1m0J42l39K07Jj31K26j75k35M01j26
7299b0M1J60k7k12k8j03K42Q3k49K21j0k49j36K92p2r0J70j66J19k76O67m51j10
7322b04L57j24m2J8N4q6nr2K10k06Q1l5j24P1K13j95Q4m8J13r0k23K55j46N6j4
7347a22M7K82k92J97j40J19j93j9J49n1N7j1J27k13P9k50K00K19j13j80j16L38
7369A14k32r1R7N9O7j02P5m2k75L23P4k2O9J06j27k06J51j23R5j2J98l01L2j5
7393h8j8J99l8j74K74k82N0j08K63k57Q2K49j15J49k16P9k94K79j03rJ0K23l0
7416A25j2m53L64n9l7o4J36l1K00k93J14J28N7l66Q2M0J05j15j44M33j65m3N7
7439E9P4j02j3k32O1M0J14l2M3j92J39L4r4j8MO4R0l4q8M1L4l7j17L5J54L6R3
$$ plain form
7466 156 -56 118 0 113 93 -80 75 -17 52 -77 182 -37 -183 130 -101 140 18 -149 70 -66 273
7487 273 -214 -20 21 -62 26 -99 -160 -48 46 56 42 37 -37 -64 -173 -104 -62 -185 269 333 -31 -244 223 144 112
7512 112 93 49 129 34 -10 111 88 -61 -211 -257 -64 -41 51 -24 226 -126 -65 -184 -26 -90 -225 150 -60 -165
7536 -165 101 -60 -35 -42 259 185 -216 245 190 24 -199 -79 23 234 -10 300 28 -64 -214 -37 -125 -63 -144
7559 -144 85 21 78 17 -9 -88 1 47 33 -129 38 -66 181 102 4 174 -145 89 77 -162 -184 69 -14 169
7583 169 164 -262 -177 -127 92 35 196 -82 65 84 -54 -34 157 118 -137 22 97 -17 -237 119 -190 76 39
7606 39 221 -15 25 -122 102 114 11 -232 88 -68 -11 -141 101 53 -38 -218 -85 245 70 -45 -103 -69 -40
7629 -40 -166 -137 278 25 -117 -94 -30 92 -229 0 9 -158 118 -29 -163 64 -167 31 177 21 -34 11 125
$$ packed form
7466A56k12J74j18J13k0j73J55r2O9j29K59k19j46L13k31K41j22j67K19j36L39
7487B73m87J94M1q3Q8j25o1J12R4J0j4np4k7j09O9M2j23M54O4l64k13M67p9l2
7512A12j9m4Q0r5m4J21k3j49j50m6J93K3R2p5K50l52O1j19J58o4j35L75k10j05
7536a65K66j61K5pL01p4m01M61n5j66k23J20J02K11k44L10k72r2j50J77q8O2q1
7559a44K29o4N7o1k6p9Q9M6j4j62J67j04K47p9r8J70l19K34j2k39k2K53q3J83
7583A69nm26Q5N0K19n7J61k78J47J9j38K0J91l9k55J59P5j14k20L56l09K66l7
7606C9J82k36M0j47K24J2j03k43L20j56N7j30K42m8r1j80J33L30j75j15n8L4K9
7629d0j26K9M15k53j42K3O4J22l21K29Rj67K76j47j34K27k31J98J46j56n5M5J14
$$ plain form
7652 125 -152 -186 -80 -131 44 -112 -77 -286 -174 -20 -65 -171 -65 -20 217 -22 -143 -127 -18 183 -59 -96
7674 -96 4 90 -128 3 94 101 10 42 -3 368 39 144 -55 -12 200 -259 89 104 -65 68 -106 -46 -81 -62
7698 -62 18 -64 22 -21 -167 125 -41 136 -162 268 -38 -16 -170 -82 -97 -6 40 154 29 -165 201 -48 225
7721 225 19 39 181 -29 26 181 179 -188 216 117 -64 -108 -205 24 -173 35 -68 8 -166 148 -93 65 -179
7744 -179 63 236 4 -160 53 -107 -127 -1 96 71 -79 -147 241 11 -133 -161 -288 89 133 -139 -29 -149
7766 -149 -27 -213 -81 -17 6 -304 -20 -263 -156 78 -13 183 190 -72 -86 -233 -299 235 106 145 104 59 216
7789 216 -71 -184 -30 2 138 26 -66 -90 -273 -50 -6 72 3 27 -94 14 67 223 8 193 18 -48 184
7812 184 9 -84 -36 97 -18 -26 111 -36 -69 -42 155 -71 -1 -113 -75 279 7 3 -82 -50 17 -8 132 41 -181
$$ packed form
7652A25k77l4J06n1J75j56L5k09J12J54m5j06J06M5K37k39j21J6J09K01k42l7
7674i6J00Q6k18J31R1Pr1L2m5L71l29J05j99M3K12m59L48J5j69J33j74O0l5J9
7698f2Q0q2Q6m3j46K92j66J77k98M30l06K2j54Q8j5R1M6J14j25j94L66k49K73
7721B25k06K0J42k10N5J55kl67M04r9j81m4r7K29j97K08j03P6j74L14k41J58k44
7744a79K42J73k32j64K13j60k0J26R7k5j50o8L88k30j44k8j27L77M4k72J10j20
7766a49J22j86J32O4K3l10K84k43J07K34r1J96Pk62j4j47o6N34j29L9m1m5J57
7789B16k87j13J54L2J36j12r2k4j83K23M4P8o9K4j21J08N3J56k15J85j75o6K32
7812A84j75r3M8J33j15qJ37j47l3K7J97k26P0j12L8L54k72mq5L2O7k5J40r1k22
$$ plain form
7837 -181 85 84 -44 -133 153 143 -39 23 19 -13 5 28 21 -266 175 -182 110 80 -199 74 -51 -42 155 35 -280
7862 -280 48 -15 70 77 -33 218 -277 -168 -27 -1 -62 184 -57 -109 41 202 175 59 -55 114 -208 -122 -76
7885 -76 -302 -8 40 88 23 -156 164 -28 149 66 -47 293 -185 -132 -33 -51 66 103 -91 41 -3 14 274 -38
7909 -38 90 87 139 23 228 114 -4 148 -116 104 -189 55 -50 110 115 5 -41 26 381 44 -239 145 -29
7932 -29 245 -247 -181 126 115 -21 74 150 -48 -75 38 7 -77 34 -26 -93 101 -48 -21 72 66 108 -123 -54 -236
7957 -236 176 -96 54 2 -114 44 -93 -161 -36 -95 131 41 -81 -173 -176 -222 -122 -32 87 -154 -199 94 -4 -62
7981 -62 -44 28 -144 -75 -225 -102 -111 119 66 -120 186 5 90 66 66 4 55 202 -36 -111 40 -1 267 251 -140
8006 -140 101 42 229 2 -20 -24 -9 98 2 6 -162 140 75 41 139 112 131 -101 -16 -106 60 242 88 -65 138
$$ packed form
7837a81K66jj28q9K86j0j82O2ml2J8K3pk87M41l57K92l0k79K73j25RJ97j20l15
7862b80L28o3Q5Pj10K51m95J09J41K6o1K46k41n2J50J61k7j16j14J69l22Q6M6
7885g6k26K94M8M8o5j79L20j92J77q3j13L40m78N3R9j8J17L7j94J32m4J7K60l12
7909c8J28lN2j16K05j14j18J52k64K20k93K44j05J60Nj10m6O7L55l37k83L84j74
7932b9K74m92O6L07j1j36R5P6j98k7J13l1q4J11o0o7J94j49K7R3oM2k31O9j82
7957b36M12k72J50n2j16J58j37o8J25n9K26r0j22r2lm6J00R0J19k41m5K93r8n8
7981f2J8P2j72O9j50J23rK30n3j86L06j81Q5k4%o2N1J47k38p5J51m1K68j6l91
8006a40K41n9J87k27k2mJ5J07r6Mj68L02o5l4R8k7J9k32Q5r0J66J82j54j53K03
$$ plain form
8031 138 39 156 -9 55 -14 -284 -3 -133 -46 88 68 -119 93 42 -272 128 23 -166 29 -148 73 -13
8053 -13 214 -4 41 11 71 -152 -164 174 -53 -137 -242 -72 -42 78 89 -70 -72 -14 -7 67 4 81 29 69 -62 104
8079 104 90 -3 121 152 -92 -1 91 -11 13 46 48 -320 82 -47 -135 -41 113 61 114 9 -107 68 40 -224 150
8104 150 -175 -36 -135 347 -58 134 -155 111 -98 -58 172 -29 -19 169 117 -53 114 0 34 152 -87 -32
8126 -32 66 184 117 1 -24 -205 -116 -155 -115 -147 -70 190 90 -134 -124 187 -136 176 9 -142 121 -17 -157
8149 -157 93 70 176 -17 16 26 17 -55 38 208 356 -220 49 -11 -67 67 -40 89 -159 165 -54 16 32 23
8173 23 151 123 9 42 58 -118 95 -44 -28 103 -315 -138 -107 -39 -4 58 -287 -163
$$ packed form
8031A38r9J17j65O4o9k70K81j30Q7J34k0j87K12n1l14M00j05j89J95j77K21q6
8053a3K27k18M5l0O0k23j2L38k27q4j05J70L0J20J1j59kN8PP4o3P7n2M0j31J66
8079A04j4r3J24L1k44R1R2j02K4L3Kl68M02j29q8R4J54n2N3j05j16J75k8k64L74
8104A50l25J39r9M82m05J92k89K66k09M0K30k01J0J88n2j70J67j14L4J18k39N5
8126c2R8J18o7j16k5j81Q9l9M0l2P7K60j00k24J0L11l23L12j67j51K63j38j40
8149a57K50k3J06j93L3J0rp2R3J70J48n76K69o0n6J34j07J29k48L24k19P0J6r
8173B3J28k8j14L3J6j76K13j39J6J31m18J77L1O8L5O2l45J24
8191a63
$$ Imaginary data points
##PAGE= N=2
##DATA TABLE= (X++(I..I)), XYDATA
$$ plain form
0 0 0 0 0 0 0 0 0 0 0 0 0 0 0 0 0 0 0 0 0 0 -5 8 -8 8 -8 8 -8 13 -16 16 -17 22 -24 26 -31 33 -38 44 -48 55 -60 67
42 67 -73 81 -91 101 -109 122 -132 147 -162 179 -196 215 -239 265 -294 327 -365 410 -466 534 -616
63 -616 728 -877 1091 -1427 2040 -3522 15924 8757 -6057 13263 -792 1007 9202 1464 -1936
78 -1936 12775 -3234 3491 9188 -3545 5918 5009 -694 3943 5283 -4022 5031 3363 -4375 6124
93 6124 -1835 -1715 1767 -232 -4428 3352 -2530 -4381 4323 -6431 -1603 356 -4801 -3136 1189
108 1189 -6740 -3109 1276 -9587 1004 -2679 -6597 144 -2661 -5893 232 -1878 -6688 3385
122 3385 -5764 -2252 1333 -4949 -744 589 -2648 -936 2956 -4855 2932 1110 -2568 3857 198
137 198 335 2434 2539 -1157 5168 989 818 5426 -349 3157 3307 2521 1103 5463 539 2427 5401
$$ packed form
0@%%%%%%%%%%%%%%%%%%%%nJ3j6J6j6J6j6K1k9L2l3L9m6N0n7O4p1Q2r2J03j15J27
42F7j40J54j72J92k10K31k54K79l09L41l75M11m54N04n59O21o92P75q76J000j150
63f16J344j605J968k518L467n562J9446p167j4814J9320j4055J799Q195p738l400
78a936J4711j6009O725N697j2733R463r09n703M637J340r305R053j668p738J0499
93F124p959J20L482j999m196P780n882j851Q704j0754M828J959n157J665M325
108A189p929L631M385j0863J0591l683l918O741k805l232O125k110m810J0073
122C385r149L512L585o282M205J333l237J712L892p811P787j822l678O425l659
137A98J37K099J05l696O325m179j71M608n775L506J50p86j418M360m924J888K974
$$ plain form
154 5401 -678 4600 2407 1111 2363 3581 -886 3498 2344 -2001 5248 -1196 191 2004 -550
169 -550 -836 1958 -1668 -1975 2238 -4906 722 -1076 -3342 -616 -1385 -3082 -1521 -923 -4892 470
185 470 -3589 -3006 -621 -3931 -2090 -2251 -2412 -3678 65 -4103 -1569 -614 -3550 -544 -1803 -1314 -1782
202 -1782 777 -2698 500 116 -1807 2125 -919 528 665 1249 -590 2665 765 408 4136 -447
218 -447 3134 2021 1722 1843 3275 1337 2549 3763 9 4422 1206 1894 2573 1681 1576 2171 2317
235 2317 -69 3461 -941 2028 1234 -112 780 253 542 -740 1423 -2390 747 -996 -1602 -207
251 -207 -2021 -973 -1814 -582 -3133 -459 -2814 -2329 -937 -3088 -1163 -2706 -1781 -3020 -884 -3043
267 -3043 -1842 -962 -3387 -341 -2166 -1151 -1838 -721 -1802 -342 -402 -1769 1380 -1888 642 -61
$$ packed form
154E401o079N278k193j296J252J218m467M384j154m345P249o444J387J813k554
169e50k86K794l626l07M213p144N628j798k266K726p69j697J561N98l969N362
185D70m059N83K385l310J841j61j61j266L743m168K534R55k936L006j259M89m68
202a782K559l475L198l84j923L932l044J447J37N84j839L255j900l57L728m583
218d47L581j113k99J21J432j938J212J214l754M413l216O88O79q92j05N95J46
235B317k386L530m402K969p94j346Q92n27K89j282K163l813L137j743o06J395
251b07j814J048q41J232k551K674k355M85J392k151J925j543R25j239K136k159
267c043J201Q80k425L046j825J015o87J117j081J460o0j367L149l268K530p03
$$ plain form
283 -61 545 330 1059 932 406 2665 -576 2529 1033 1392 1815 1546 1968 1469 2743 561 3632 1042
301 1042 2262 2548 1322 2203 1547 2405 638 2846 514 1971 1395 390 1814 132 1215 -171
317 -171 1280 -854 762 -200 -989 284 -1670 35 -1533 -406 -2060 -805 -1628 -1694 -539 -2870 -720
334 -720 -2211 -1245 -2318 -1381 -2039 -2011 -951 -2764 -403 -2572 -1027 -1769 -1340 -1291 -1249 -832 -1577 571 -1789
353 -1789 474 -472 -346 355 -257 624 -322 1721 -276 1396 646 1023 1660 862 1803 871 2225 783
371 783 2567 1346 1829 1964 1086 2394 895 2166 825 2238 1080 1504 1639 598 1760 221 1299
388 1299 73 1057 -159 398 338 -635 751 -1208 134 -1033 -174 -1198 -667 -1040 -1715 -250 -2568
405 -2568 -396 -1986 -894 -1549 -1785 -1353 -2054 -1148 -2477 -691 -2292 -1097 -1679 -1676 -1086 -1596 -425 -1658
$$ packed form
283f1O06k15P29j27n26K259l241L105j496L59M23k69M22m99J274k182L071k590
301A042J220K86j226Q81o56Q58j767K208k332J457n76j005J424j682J083j386
317a71J451k134J616r62p89J273j954J705j568J127j654J255q23o6J155k331K150
334g20j491R66j073R37o58K8J060j813K361k169J545p42M29M9M2M17p45K148k360
353a789K263r46J26P01o12Q81r46K043j997J672p50L77O37p98R41r32J354j442
371G83J784j221M83J35q78J308j499J271j341J413j158M24J35j041J162j539J078
388A299j226R84j216N57o0r73J386j959J342j167Q59j024N31l73o75J465k318
405b568K172j590J092o55k36M32p01R06j329J786j601J195n82LN90n10J171j233
$$ plain form
423 -1658 -61 -1495 -64 -648 -696 234 -772 834 -706 969 -265 850 374 232 1159 331 1433
440 1433 454 1907 220 1502 1057 1242 1888 1036 2255 810 2166 1045 2000 1096 1301 1408 244
457 244 1778 217 1514 769 896 397 571 851 -393 1232 -689 563 -311 55 -635 -707 -129 -1031
475 -1031 -95 -1602 -384 -1698 -1056 -1161 -1582 -803 -1856 -544 -1894 -840 -1713 -1198 -1075 -1442 -928 -1933
493 -1933 -758 -1882 -427 -1270 -836 -250 -1196 200 -1116 67 -831 580 -603 272 382 -306 1044
510 1044 -163 1217 -60 1331 595 1292 915 948 1719 382 2131 545 1655 1019 1368 1223 1027 1751
528 1751 586 1809 255 1646 670 1015 729 454 1512 -56 1120 -261 469 -41 362 -6 -814
545 -814 297 -1028 196 -1042 -357 -884 -798 -946 -1450 -411 -1712 -551 -1832 -900 -1627 -1320 -1187 -1583
$$ packed form
423a658J597j434J431n84m8R30j006J606j540J675j234J115m76j42R27q28J102
440A433r79J453j687J282m45J85O46q52J219j445J356j121R55r04K05J07j164
457B44J534j561J297p45J27m99J74K80j244J625j921J252q74L66o90p2N78r02
475a031R36j507J218j314O42j05m21P79j053J312j350J054q73N15J23l67N14j005
493a933J175j124J455q43M34N86r46J396j316J183q98J411j183Q75J10o88J350
510A044j207J380j277J391p36O97l77L3P71j337J749j586J110o36L49j45j96P24
528A751j165J223j554J391r76L45k86k75J058j568J176j381P30n10M03l68q08
545h14J111j325J224j238O85n27Q6j48n04J039j301J161j281R32p27L07J33l96
$$ plain form
563 -1583 -595 -1493 -688 -1550 -524 -1133 -984 -526 -1570 87 -1341 -103 -1130 121 -275 -170 197 -462
581 -462 689 -461 1024 -291 736 333 773 1084 338 1312 626 1666 312 1414 1050 892 1513 412
599 412 1508 704 1854 706 1468 830 775 1212 205 1324 207 1337 168 773 446 97 814 -157
617 -157 479 -619 259 -683 -147 -210 -573 -241 -1213 -281 -1464 -263 -1236 -985 -1244 -1243 -756 -1700 -401 -1667
637 -1667 -506 -1508 -1093 -802 -1125 -698 -1240 -190 -1284 -173 -814 -368 -479 -843 -51 -578 479 -460
655 -460 480 42 475 304 292 587 -213 1188 214 970 792 861 1112 428 1343 543 1449 684 1310 652 992
676 992 1313 573 1450 242 1351 226 1188 526 548 658 426 895 -216 663 -608 204 -114 -34 69
695 69 -503 -5 -1170 -90 -1020 -185 -1024 -818 -488 -1511 -448 -1265 -722 -1359 -807 -862 -884 -847 -1393 -308
$$ packed form
563a583R88q98Q05q62J026o09J49M58j044J657j428J238j027J251l96J05L67o59
581d62J151j150J485j315J027m03M40L11p46R74o86J040j354J102l64j58O21j101
599D12J096q04J150j148P62o38n5M37j007J119j117J130j169O05l27l49P17r71
617a57O36j098Q78r42N36o3l63L32r72R32j183J201r73K51k59JM87r44J299j266
637a667J161j002M15K91l23M27n42J050j094J111o41M46j11l64P92n27J057r39
655d60R40m38M33j71j2K95q00J401r74P56j78O9K51o84R15q00R06p65O26o58L40
676I92L21p40Q77j208J109j125R62o62K2J10k32M69j111Q79j271Q12l18Q0J03
695F9n72M98j165J080r30Q35q39K06L30j023J063q17N43o37N52n5k2L7n46J085
$$ plain form
715 -308 -1475 -294 -973 -414 -733 -588 -508 -694 14 -993 37 -490 295 -313 39 299 -135 549 -128
734 -128 1104 184 776 486 627 844 421 1342 53 1408 545 1120 932 915 959 304 1171 576 1397 242
754 242 834 480 579 846 -100 1168 28 654 37 353 161 176 265 -437 177 -727 123 -512 -393 -367 -750
775 -750 -292 -622 -203 -1351 -512 -1306 -625 -958 -959 -601 -1184 -366 -1289 -456 -1035 -380 -716 -583 -447 -985 20
796 20 -934 -171 -445 -213 -250 -364 178 -434 449 -293 650 233 603 514 316 954 366 999 304 914 421
817 421 1010 944 531 915 506 1268 198 1324 508 707 886 255 834 338 866 240 821 174 196 231 -11
838 -11 481 -353 388 -394 80 -305 -179 -11 -500 -77 -909 0 -1089 -261 -922 -543 -543 -1200 -515 -1366 -642
859 -642 -1065 -486 -1017 -849 -640 -906 -293 -900 -176 -742 -297 -553 -312 66 -454 2 -600 553 -486 299
$$ packed form
715c08j167J181o79N59l19J45Q0j86P08j007J030n27P85o08L52K60m34O84o77
734a28J232r20N92k90J41K17m23R21j289J355q63N75j88j7M4o55Q67n95Q21j155
754B42N92l54R9K67r46J268j140O26o17L16j92J5Q9p02O14r04Q50o35J19K6l83
775g50M58l30M19j148Q39p94O81l33jL58n83Q18r23Q33n79O55l36J33J36n38J005
796B0r54P63k74K32l7j14N42o12Q83p42R43m17L70q9j98O38n88O33o95O10m93
817D21N89o6m13L84m09P62j070J126q16J99J79o31N79m96N28o26N81o47K2L5k42
838a1M92q34P41p82M74l85J26J68m89M23q32R09j089Q28o61L79%o57O85q51P24
859f42m23N79n31J68K09k66O13o07P24n66M45k56K41L78n20M56o02J153j039P85
$$ plain form
879 299 -175 125 373 -24 709 237 844 29 653 620 253 767 404 930 325 890 358 906 542 689 922
900 922 548 1117 415 1230 452 742 393 286 689 157 304 -168 549 -338 522 -19 34 34 -570 -66 -809
921 -809 -7 -598 54 -482 -706 -390 -974 -308 -861 -436 -547 -493 -321 -995 -588 -1153 -515 -864 -415 -846 -301
942 -301 -709 -481 -9 -683 -58 -707 229 -498 66 99 -104 302 -145 620 -208 437 -164 377 647 496 705
963 705 346 888 268 893 279 873 580 504 765 235 792 48 640 488 534 541 415 488 -39 741 238 659
985 659 -16 161 74 -248 137 -275 331 -413 156 -523 -281 -377 -418 75 -907 -129 -736 -251 -543 -606 -803 -814
1007 -814 -258 -942 -228 -910 -84 -666 -227 -331 -835 -314 -844 -56 -436 -89 -308 -236 -106 -237 153 -475
1027 -475 230 95 280 129 234 378 215 648 55 940 93 666 555 340 643 274 619 482 1043 403
$$ packed form
879B99m74L00K48l97P33m72O07q15O24l3l67N14l63N26o05N65n32N48l64J47K33
900I22l74N69p02Q15p78K90l49j07M03n32J47m72P17q87Q60n41N3%o04N04p43
921h09Q02n91O52n36k24L16n84O66n53M25j11N4J72o74M07n65O38l49M49m31N45
942c01m08K28M72o74O25o49R36p27N64L3k03M06m47P65q28O45o01N41K70j51K09
963G05l59N42o20O25o14N94k93p6K61n30N57p44N92j52M6Pj26P3n27P80n03M21
985F59o75J77q7l22L85m12O06p44N69o79K42r6m1M93r82P78o07M85k92o3j97j1
1007h14N56o84P14o82Q26n82M39j04n04N21n30P88l80L47k19P2J30j31L90o28
1027d75P05j35J85j51J05J44j63M33n93Q85q47N73j11k15L03l69L45j37N61o40
$$ plain form
1047 403 814 425 509 692 317 1029 -97 780 277 487 252 383 406 -133 136 -557 309 -354 9 -216
1067 -216 -240 -226 -544 -196 -566 -165 -802 -169 -291 -492 -307 -902 -72 -797 -222 -679 -734 -684 -551 -392 -726
1088 -726 -317 -862 22 -291 -288 -362 -173 -151 -454 35 -467 3 -149 383 80 126 490 -39 475 -4 578 165
1110 165 280 410 58 366 289 537 137 735 547 364 687 561 596 269 726 53 487 341 385 161 126
1131 126 366 -23 362 26 291 -267 153 -377 -3 40 -238 50 -404 -138 -566 -279 -457 -395 -319 -615 -192
1152 -192 -908 -79 -332 -433 -374 -658 -432 -751 -164 -523 -253 -623 -395 -489 -348 -162 -553 0 -393 -50 -40
1173 -40 -132 129 49 311 -29 454 -12 446 83 165 363 155 413 190 823 260 541 405 438 506 222 674
1195 674 400 761 302 745 226 466 278 367 469 -365 451 160 290 383 147 180 50 143 -223 92 -227
$$ packed form
1047D03M11l89Q4J83l75P12j126Q77n03K10k35J31K3n39K69o93Q66o63L63k25
1067b16k4J4l18L48l70M01o37O33j22k01J85n95Q30p25N75m57n5N0J33J59l34
1088g26M09n45Q84l13Lp4J89K2l03M89n02M70j52N32l03M6L64n29N14m79N82m13
1110A65J15J30l52L08p7K48m00N98j88j83L23j26L5l27M57o73M34j46M4k24l5
1131A26K40l89L85l36K65n58M20n30L74M3k78K88m54K66m28K87j78O2P6k96M23
1152a92p16Q29k53j01N9k84K26l19N87l59K70l70K28r4J41J86l91N53l93L43J0
1173d0r2K61q0K62l40M83m66M58l63Q2J98k08K58k23O33n63K81j36L3O8k84M52
1195F74k74L61m59M43n19K40j88Q9J02q34Q16k91J30R3k36L3j30R3l66L15l19
$$ plain form
1216 -227 -152 -241 -289 -118 -296 65 -449 -46 -577 -145 -663 -319 -439 -773 -378 -461 -327 -488 -408 -163 -560 -288
1238 -288 -554 9 -572 -172 -407 -235 -7 -255 31 -268 239 -267 329 -115 307 47 296 329 153 235 14
1259 14 536 354 520 621 468 727 412 532 191 584 373 384 521 352 646 167 548 102 679 -33 555
1280 555 -155 32 272 4 247 -240 -1 -183 307 55 -158 -63 -393 -134 -335 22 -392 -444 27 -480 -103
1301 -103 -640 -230 -659 -284 -427 -277 -344 -492 -183 -676 -131 -563 -132 -177 -139 -83 -303 -48 -194 72 -255
1322 -255 105 71 84 66 -337 223 -56 462 -3 426 333 327 404 317 656 210 446 243 655 345 236 584 32
1345 32 505 179 284 284 386 163 226 408 -158 570 -25 323 93 126 -76 -34 125 16 408 -415 126 -340
1367 -340 -17 -274 -412 -152 -538 92 -615 -191 -367 -211 -201 -289 -198 -517 -84 -534 44 -290 -84 -343 -221
$$ packed form
1216b27P5q9m8J71j78L61n14M03n31M32n18L44j20l34L95q3J34j61Q0K45l97K72
1238b88k66N63n81M00k35J72K28k48K86k99N07n06N96m44M22k60K49L3j76Q2k21
1259A4N22j82J66J01j53K59l15J20l41L93k11J1J37j69K94m79L81m46N77p12N88
1280E55p10J87K40k68K43m87K39j82M90k52k13R5l30K59k01L57m14n2M71n07L77
1301a03n37M10m29L75j43J50o7j48L09m93N45m32M31m5L8N6k20K55j46K66l27
1322b55L60l4J3j8m03N60k79N18m65M29r3oP7q7L39m46K36k03M12l10j09L48n52
1345C2M73l26J05%J02k23O3J82n66P28n95L48k30L3k02M2J59j09L92q23N41m66
1367c40L23k57j38K60l86O30p07M24j76J56J0q8R1l19M33m50N78l34K06k59J22
$$ plain form
1388 -221 -135 -474 61 -417 -91 -214 13 -28 -283 -213 -270 60 22 160 -62 218 164 74 325 42 407 126
1410 126 651 180 518 271 321 306 -23 398 55 463 236 382 285 248 345 223 391 -102 335 -128 109 19
1432 19 70 91 0 303 -328 -45 -280 -186 -222 -126 -18 -106 -139 -598 -259 -399 -307 -302 -267 -137 -522 -105 -411 4
1456 4 -284 -351 -337 -371 -4 -313 -208 -186 196 -263 -285 52 -296 2 -47 26 -193 359 -126 179 456 -4 297
1479 297 -184 412 -188 341 315 121 386 130 270 -55 514 230 492 435 190 360 109 549 -31 287 72
1500 72 188 220 -60 44 74 69 -196 187 49 141 -159 -75 -130 -72 207 -248 13 -177 -71 -243 -199 -404 -112
1523 -112 61 -313 -52 -351 -278 -326 -224 -219 -313 -500 -391 -155 -526 -169 -179 -326 -67 -249 -37 13 226 -263
1545 -263 98 121 32 -115 -9 423 -78 237 -17 176 -104 113 128 308 210 308 496 247 427 119 165 233
$$ packed form
1388b21Q6l39N35m78L26j23K27m1k55P0n7L30l8J38k22K80n4r0K51k83L65k81
1410A26N25m71L38k47N0j5l29M21l43M08k27J46r7l7R7j22J68m93M37m63K37r0
1432A9N1K1r1L03o31K83k35R4l6R6J08q8l3m59L39j40R2NL5J30l85M17l06M15
1456Dk88o7J4l4L67l09J05K2L82m59k2L37l48K98m9P3k19N52m85L05K77m60L01
1479B97m81N96o00N29k6j94K65k56J40l25N69k84K62n7k45J70k51M40n80L18k15
1500G2J16L2k80J04L0nk65L83j38R2l00Q4n5N8K79m55K61j90J06j72M4k05K92
1523a12J73l74K61k99P3m8J02Nr4j87J09K36l71L57j0j47K59j82K12N0K13m89
1545b63L61K3q9j47J06M32n01L15k54J93k80K17J5J80r8R8J88k49J80l08M6O8
$$ plain form
1567 233 100 370 269 302 286 111 143 113 39 139 35 -35 81 -57 -66 -143 -70 233 -348 -5 -202 33 -230
1590 -230 -91 -325 -186 -34 -376 223 -385 -373 -295 -187 -442 -169 37 -351 -125 -401 -95 -354 4 -60 -362
1611 -362 -200 -256 -25 -215 -104 -105 -64 -10 -182 169 2 59 -270 323 -15 -196 154 -10 202 26 38 -103
1633 -103 356 140 130 154 61 408 -274 276 224 64 -73 75 180 143 177 -37 88 -204 295 53 8 -38 -87
1656 -87 202 -14 143 65 99 -119 -136 -43 5 97 19 -64 -163 -35 -199 -95 4 -434 -398 -202 -100 -275 -97 -146
1680 -146 -334 -202 -342 -192 -384 87 -433 -51 -104 -186 205 -175 213 70 119 -253 109 -130 76 6 -18 418
1702 418 9 86 25 559 529 -9 221 116 215 133 211 96 303 114 101 57 -24 313 337 235 287 270 44 142
1726 142 273 147 -83 87 190 -1 59 -97 -203 223 -108 32 -84 -24 -150 11 -236 -357 14 -187 -71
$$ packed form
1567B33j33K70j01L3j6j75L2l0p4J00j04p0J16j38rp7P3L03n81L43j97K35k63
1590b30J39k34J39J52l42N99o08J2P8J08k55K73K06l88K26k76L06k59L58o4l02
1611c62J62n6K31j90J11jM1N4j72L51j67N7l29N93l38j81L50j64K12j76J2j41
1633a03M59k16j0K4r3L47o82N50n2j60j37J48J05l7L4k14J25k92M99k42m5m6m9
1656h7K89k16J57p8L4k18j7R3M8R2p8q3r9J28j64J04R9m38L6J96J02j75J78m9
1680a46j88J32j40J50j92M71n20L82n3q2L91l80L88j43M9l72L62k39K06p0k4M36
1702D18m09P7o1N34l0n38K30j05R9q2P8j15K07j89j3m4q1L37K4j02N2j7k26R8
1726A42J31j26k30J70J03j91O0j56j06M26l31J40j16O0j26J61k47j21L71k01J16
$$ plain form
1747 -71 -202 -32 -182 -9 -89 -228 -251 -180 -91 -261 -18 4 -96 54 -64 -40 -114 15 -300 -108 -68 -47 -265
1770 -265 -8 10 135 257 50 10 -266 160 359 120 -62 166 358 -66 261 -9 203 103 20 177 34
1791 34 211 143 -168 271 141 -10 19 203 129 -20 -148 123 57 1 165 101 -261 156 -131 -121 -43 -110 -158 20
1815 20 -193 -207 -51 -141 -111 144 -210 -225 -77 -101 -236 -330 -232 -65 37 -173 -136 -7 -156 -42 -307 -304 -23 -122
1839 -122 10 -164 22 -65 232 -149 144 184 6 -11 183 197 -183 -94 141 197 -153 273 217 17 104 -18 354
1862 354 30 205 192 45 264 222 275 4 77 112 260 11 234 182 151 94 89 70 68 229 -80 -40 80 70 46
1887 46 10 -67 -222 -22 -128 -135 35 -161 -302 -231 102 -314 -121 -217 19 -96 -183 18 15 -107 -46 21 -73 -31 90
1912 90 100 73 -85 -226 -351 -166 -104 82 18 -274 117 -156 266 -17 -153 -170 43 236 121 55 -267 -52
$$ packed form
1747g1j31J70j50J73q0j39k3P1Q9j70K43K2j00J50j18K4p4J29l15J92M0K1k18
1770b65K57J8J25J22k07m0k76M26J99k39j82K28J92m24L27k70K12j00q3J57j43
1791C4J77o8l11M39j30j51K9J84p4j49j28K71o6n6J64o4l62M17k87J0P8o7m8J78
1815B0k13j4J56r0L0K55l54j5J48k4j35r4R8J67J02k10L7J29j49J14k65LK81r9
1839a22J32j74J86q7K97l81K93M0j78j7J94J4l80Q9K35N6l50M26n6k00Q7j22L72
1862C54l24J75j3j47K19m2N3k71P3L5J48k49K23n2l1n7nj9kJ61l09M0J20j0k4
1887D6l6p7j55K00j06pJ70j96j41P1L33m16J93r6K36j15q7K01lj22O1O7r4M2J21
1912I0J0k7j58j41j25J85O2J86o4k92L91k73M22k83j36j7K13J93j15o6l22K15
$$ plain form
1934 -52 -84 145 -24 350 -9 -6 208 -138 331 -118 101 169 -89 149 -163 168 122 279 -138 82 57 230
1956 230 31 -80 193 113 209 -80 -102 -116 -122 -229 59 -11 -77 -61 50 -99 -99 -46 81 -179 -68 -108 -126 -49 39
1981 39 -304 -68 -200 -127 62 -85 -18 -130 219 -29 -101 102 -244 17 -230 279 -192 111 127 124 227 108
2003 108 102 -88 173 -106 237 100 190 271 23 166 62 39 -109 -39 43 -56 -54 -163 212 -34 203 -136 310
2026 310 202 120 283 73 -10 -156 319 -83 -110 -77 -85 62 -211 81 -97 -1 -126 -60 -39 -102 54 -156 -207 135
2050 135 -146 -91 83 -173 -121 84 -40 -266 -122 -17 -71 -156 5 120 93 108 335 -20 80 184 -234 42
2072 42 85 127 -14 149 146 123 186 -107 127 99 288 5 97 70 -86 256 142 178 127 133 -13 223 189 1 -60
2097 -60 131 169 -265 202 62 177 -126 -41 -49 163 73 45 -73 -45 52 -77 187 -239 60 -39 -201 -146 -55 6
$$ packed form
1934e2l2K29j69L74l59LK14l46M69m49K19O8k58K38l12L31m6J57m17K20k5J73
1956B30j99j11K73q0R6k89k2j4oj07K88p0o6J6J11j49%N3J27k60J11m0j8P7Q8
1981C9l43K36j32P3J89j47O7j12L49k48p2K03l46K61k47N09m71L03J6lJ03j19
2003A08oj90K61k79L43j37R0Q1k48J43j04k3j48P0Q2r9Kj09L75k46K37l39M46
2026C10j08q2J63k10q3j46M75m02k7L3qJ47k73K92j78R6j25O6K1o3J56k10n1L42
2050A35k81N5J74k56N2K05j24k26J44J05n4q5J61J15k7J5K27l55J00J04m18K76
2072D2M3M2j41J63lk3O3k93K34k8J89k83R2k7j56L42j14L6n1Oj46K36l4j88o1
2097f0J91L8m34M67j40J15l03Q5qK12r0k8j18K8R7j29K64m26K99r9j62N5R1O1
$$ plain form
2121 6 -289 136 -21 -84 -116 5 69 14 -25 -177 93 -48 99 -139 -70 -94 -86 -225 90 -55 149 -109 -70 198
2145 198 -202 -121 -110 -57 347 29 128 -3 50 232 39 130 210 164 1 34 408 128 240 17 95 30 173 -136
2169 -136 72 6 -182 -58 104 144 92 -132 142 127 14 35 15 5 -158 118 62 154 -105 -10 -149 -34 -203
2192 -203 -70 -216 5 -128 34 -62 -9 54 -24 92 44 -113 -148 4 -144 -85 -36 -63 -221 -140 -15 121 294
2215 294 -62 -123 131 -142 149 294 -121 -55 -139 -55 -43 58 7 -45 131 115 32 -62 32 209 -55 134 4 -215
2239 -215 337 48 217 13 -68 -5 51 15 8 -106 -60 52 47 87 -53 28 -84 -304 -134 -103 64 115 -186 91
2263 91 130 -101 -259 161 -91 0 -167 -37 -68 -50 -120 42 -190 -324 -109 56 -14 105 53 -72 149 -67 122
2286 122 10 198 -168 19 -44 66 -124 176 -135 144 145 106 7 53 -94 50 212 73 -6 118 186 -113 55
$$ packed form
2121Fk95M25j57o3l2J21O4n5l9j52K70j41J47k38O9k4Qj39L15j45K04k58L9K68
2145A98m00Q1J1N3M04l18R9j31N3J82j93R1Q0m6j63L3L74k80J12k23P8o5J43l09
2169a36K08o6j88J24J62M0n2k24K74j5j13K1k0j0j63K76n6R2k59R5j39J15j69
2192b03J33j46K21j33J62r6N3O3p8J16m8j57l5J52j48N9M9k7j58Q1J25J36J73
2215B94l56o1K54k73K91J45m15O6q4Q4J2J01n1n2J76j6q3r4R4J77k64J89j30k19
2239b15N52k89J69k04q1O3N6l6pj14M6J12nM0j40Q1j12k20J70L1J67N1l01K77
2263I1L9k31j58M20k52R1j67J30l1J8p0J62k32j34K15J65p0J19n2j25K21k16J89
2286A22j12J88l66J87o3J10j90L00l11K79Jl9r9M6j47J44J62j39p9J24O8k99J68
$$ plain form
2309 55 -69 -1 29 83 -7 113 237 89 198 -20 15 -175 32 4 127 23 -212 4 199 140 70 160 -180
2332 -180 -31 -100 227 -395 -115 84 10 132 152 -233 29 -185 -108 5 -314 236 -224 -121 -116 -388 -94 -52
2354 -52 -20 -65 107 53 -187 -100 -65 182 -213 -438 -136 105 57 34 124 -10 -29 240 79 213 105 40 183 283
2378 283 69 30 -49 -73 45 101 -154 -88 198 102 -181 48 112 39 206 246 -232 34 50 -185 55 -146 110
2401 110 -40 63 -35 -59 -69 217 -137 -7 -152 3 -63 -126 -123 43 167 -274 -158 -130 -99 54 117 -193 -127 -11
2425 -11 63 150 -63 18 -194 -72 -96 -10 -130 -214 -32 -82 16 -118 -313 206 75 -82 -89 7 58 130 113 -38 203
2450 203 -179 201 148 19 330 -17 -73 -43 -131 133 -76 -144 264 -211 158 -105 151 -76 30 237 378 32
2472 32 116 171 -87 8 -93 -145 35 -127 199 122 137 126 123 -216 -147 -27 -92 229 -21 -77 -190 -103 1 -86 -27
$$ packed form
2309E5j24O8L0N4r0J20J24j48J09k18L5j90K07k8J23j04k35K16J95n9p0R0l40
2332a80J49o9L27o22K80J99p4J22K0l85K62k14P7J13l19N50m60J03Nk72K94M2
2354e2L2m5J72n4k40Q7L5K47l95k25L02K41m8k3R0j34j9K69j61J34j08o5J43J00
2378B83k14l9p9k4J18N6k55O6K86r6k83K29O4p3J67M0m78K66J6k35K40k01K56
2401A10j50J03r8k4j0K86l54J30j45J55o6o3LJ66J24m41J16K8L1J53O3l10O6J16
2425a1P4Q7k13Q1k12J22k4Q6j20q4J82n0R8j34j95N19j31j57pR6N1P2j7j51K41
2450B03l82L80n3j29L11l47n6L0q8K64k09o8M08m75L69k63K56k27J06K07J41l46
2472C2Q4N5k58R5j01n2J80j62L26p7J5j1ll39O9J20o5L21k50n6j13Q7J04q7N9
$$ plain form
2497 -27 -18 -147 -63 -7 33 37 -94 -45 76 -95 -129 -129 -69 56 -137 184 51 2 -9 -167 -22 133 148 35 289
2522 289 170 -175 -54 -10 158 240 259 187 -91 -15 -83 219 -35 88 -63 -14 -74 28 2 56 -71 -7 228 -50
2546 -50 20 -74 -61 -1 83 186 -159 67 25 167 6 64 -28 48 -265 -266 -45 -92 90 15 -65 89 -33 -58 -283
2571 -283 -99 16 -325 -146 0 -33 161 138 -24 -140 -91 -112 -60 -271 -79 45 44 -172 243 116 108 39 52 279
2595 279 105 47 147 204 -48 -38 -3 97 45 128 -90 13 -15 38 198 -313 -12 -104 -112 -23 -11 3 96 182 -103
2620 -103 126 37 195 93 136 10 -32 -136 -138 290 206 53 -51 74 191 65 -108 -11 4 238 -49 82 101
2643 101 159 -58 47 148 155 -102 -134 -204 57 16 125 191 -74 16 -172 95 173 -39 243 9 -39 -72 43 44
2667 44 -19 136 -16 -104 -145 143 16 156 160 51 148 -30 62 -61 161 -21 -29 37 -169 13 -56 239 -148 -128
$$ packed form
2497b7Rj29Q4N6M0Mj31M9J21j71l4%O0J25j93L21j33m9j1j58J45J55J5j13K54
2522B89j19l45J21M4J68Q2J9p2k78P6o8L02k54J23j51M9o0J02k6N4j27O4K35k78
2546e0P0r4J3O0Q4J03l45K26m2J42j61N8r2P6l13jK21m7J82p5q0J54j22k5k25
2571b83J84J15l41J79J46l3J94k3j62j16M9k1N2k11J92J24jk16M15j27qo9J3K27
2595B79j74n8J00N7k52J0L5J00n2Q3k18J03k8N3J60n11L01r2qQ9J2J4R3Q6k85
2620a03K29q9J58j02M3j26m2j04kM28q4j53j04J25J17j26j73R7J5K34k87J31J9
2643A01N8k17J05J01Pk57l2p0K61m1J09O6k65R0j88K67P8k12K82k34m8l3J15J
2667D4o3J55j52q8m1K88j27J40Mj09R7j78R2j23K22j82qO6k06J82o9K95l87K0
$$ plain form
2691 -128 147 55 -1 -188 -23 78 -36 -271 -23 -141 -27 130 112 233 80 218 -55 -231 -115 -53 -175
2712 -175 -132 50 -192 218 -127 47 -61 -260 -58 103 154 60 -169 -5 -48 -62 -55 -33 -21 46 -296 139 -82
2735 -82 364 244 -70 -111 -170 -6 84 98 -218 7 -29 -82 116 -1 73 -94 104 69 48 27 -51 -42 151 158 94 14
2761 14 -71 -110 -39 -247 -116 123 76 -341 37 194 108 17 -77 152 -178 -77 6 43 -76 97 -304 27 95 99
2785 99 54 261 152 -161 48 -122 -28 233 114 -237 -253 -90 -183 -281 -55 -154 -65 -230 -23 -275 139 -226 -15
2808 -15 -156 -86 -26 -108 27 -109 167 -32 5 108 26 -191 237 287 -44 -20 75 -167 -260 233 20 -65 13 91
2832 91 -200 -1 62 -163 183 77 -40 95 162 287 7 109 -5 -39 135 143 -278 243 -148 -140 208 123 222
2855 222 -50 -15 -15 -127 -136 -64 -27 -83 72 95 -43 69 108 -43 -86 102 21 46 -79 -10 117 -57 -66 -304 -249 120
$$ packed form
2691a28K75r2n6j87J65J01j14k35K48j18J14J57j8J21j53J38k73j76J16O2j22
2712a75M3J82k42M10l45J74j08j99K02J61N1r4k29J64m3j4PK2J2O7l42M35k21
2735h2M46j20l14m1n9J64R0J4l16K25l6n3J98j17P4j67J98l5k1k1p8RJ93Po4q0
2761A4q5l9P1k08J31K39m7m17L78J57q6r1r4K29l30J01Q3L7j19J73m01L31O8M
2785I9m5K07j09l13K09j70R4K61j19l51j6J63r3r8K26r9Q9j65K07k52M14l65K11
2808a5j41P0O0q2J35j36K76j99L7J03q2k17M28N0l31K4R5k42r3M93k13q5P8P8
2832I1k91J99O3k25L46j06j17J35O7J25k80J02j14l4J74Qm21N21l91QL48q5R9
2855B22k72L5%j12rP2L7n6J55K3j38J12L9j51m3J88q1K5j25O9J27j74rk38N5L69
$$ plain form
2881 120 -162 -33 -52 -156 67 280 -267 92 -222 31 -87 -148 135 55 36 -195 -35 232 358 31 -103
2902 -103 241 -148 -46 -236 -35 -54 -85 160 46 44 106 86 35 -151 -506 22 -97 181 -4 -37 129 -3 162
2925 162 -133 -36 90 14 77 -31 -85 150 -107 60 -11 165 -82 -84 -53 -46 -216 110 172 -141 0 153 264 -383
2949 -383 -49 -13 -340 -67 -332 -40 -79 102 -230 -94 -65 -79 87 -52 -180 -113 -110 -38 118 208 -18 -105 0
2972 0 -21 -237 -36 189 -20 -7 61 73 192 -14 50 -38 113 8 142 24 261 -254 23 227 149 98 -194
2995 -194 129 -138 -13 82 20 -205 54 -78 -119 -11 -229 87 -193 -98 45 24 19 179 -80 -163 3 -186 -22
3018 -22 241 -62 -65 -123 -198 -210 -70 -99 39 124 -6 104 -282 43 42 -11 -2 132 96 29 -164 -138 -5 8 -1 -90 -53
3045 -53 48 127 -6 90 101 154 -274 19 -46 127 151 -13 161 203 63 70 -126 48 158 -131 188 141 -149 34
$$ packed form
2881A20k82J29j9j04K23K13n47L59l14K53j18o1K83q0j9k31J60K67J26l27j34
2902a03L44l89J02j90K01j9l1K45j14kO2k0n1j86l55N28j19K78j85l3J66j32J65
2925A62k95R7J26p6O3j08n4K35k57J67p1J76k47kL1Pj70L26O2l13J41J53J11o47
2949c83L34L6l27K73k65K92l9J81l32J36K9j4J66j39j28O7LP2J56R0k26q7J05
2972@k1k16K01K25k09J3O8J2J19k06O4q8J51j05J34j18K37n15K77K04p8n1k92
2995a94L23k67J25R5o2k25K59j32m1J08k18L16k80R5J43k1nJ60k59q3J66j89J64
3018b2K63l03ln8p5j2J40k9J38Q5j30J10l86L25jn3RJ34l6o7j93K6J33J3rq9L7
3045e3J01P9j33R6J1N3m28K93o5J73K4j64J74M2j40Pj96J74J10k89L19m7k90J83
$$ plain form
3069 34 15 24 -35 -37 50 -4 -78 7 15 -99 185 -16 -122 29 38 -93 -21 -73 -70 -93 73 -73 177 18 26 -7 -116 86
3097 86 77 48 -223 -74 2 -33 32 -51 20 -10 22 -47 146 -207 -123 61 16 -138 183 -42 -14 47 -169 -80 79 275
3123 275 -14 -7 -8 93 -179 -6 32 200 17 82 25 100 163 175 30 -22 -104 -253 217 49 -124 -111 -24 60 92
3148 92 101 -132 125 -193 47 39 -68 33 104 -52 106 -127 -233 22 -225 -116 -125 60 132 49 -116 31 -193
3171 -193 -24 -16 -14 -82 -55 -111 44 128 -108 -44 10 59 -104 -124 -225 -83 50 211 25 118 223 40 26 -17 243
3196 243 177 118 62 -41 248 -92 -240 53 50 -104 243 93 156 -11 164 1 -47 -28 -154 98 85 119 -48
3219 -48 102 204 -33 -82 -181 -151 50 -46 -131 -261 0 -29 19 -202 -24 9 35 -144 -310 -325 57 130 -54 -292
3243 -292 136 192 12 -44 -198 195 -132 -80 216 9 -7 -31 5 93 7 -59 51 -5 31 95 134 -37 165 55
$$ packed form
3069C4j9Rn9kQ7n4p4Q5Qj14K84k01j06J51Rj31P2n2Lk3J66j46K50j59Ql3j09K02
3097H6rk9k71J49P6l5O5q3P1l0L2o9J93l53Q4J84m5j54L21k25K8O1k16Q9J59J96
3123B75k89PjJ01k72J73L8J68j83O5n7P5O3J2j45n2q2j49M70j68j73J3Q7Q4L2
3148I2Rk33K57l18K40qj07J01P1j56J58k33j06K55k47J09rJ85P2q3j65J47k24
3171a93J69QKo8K7n6J55Q4k36O4N4M9j63k0j01J42J33J61j86R3J05j83j4m3K60
3196B43o6n9n6j03K89l40j48K93lj54L47j50O3j67J75j63m8J9j26K52j3L4j67
3219d8J50J02k37m9r9L0K01r6q5j30K61k9M8k21J78L3K6j79j66j5L82P3j84k38
3243b92M28N6j80n6j54L93l27N2K96k07j6k4L6Q8q6o6J10n6L6O4L9j71K02j10
$$ plain form
3267 55 -184 -8 198 -341 56 -162 170 -157 -90 -74 88 82 125 -164 -99 -203 -12 26 121 147 -63 -14 -269 231
3291 231 -273 92 151 22 -265 53 82 60 139 -124 -116 -199 -232 -133 0 -246 101 49 -5 -61 -360 52 -38 -54 112
3316 112 160 -297 -6 74 -349 -71 -18 -62 -69 -215 -62 198 207 97 -58 -156 8 371 -250 -16 -30 125 -9
3339 -9 359 79 67 -16 -89 -81 -44 114 89 -56 273 -57 222 14 169 55 92 34 192 161 -60 -6 48 71 54
3364 54 -25 -200 -55 -102 30 -34 -78 121 -184 -159 -156 157 -234 -19 -15 -379 101 245 238 -124 -60 -8 24 112 83 -118
3390 -118 -68 176 -80 73 -8 -13 106 239 -22 -239 -228 -269 208 126 119 -255 158 32 62 109 57 142 5 88 34
3415 34 61 -18 99 -130 -108 -26 31 104 -109 -110 148 1 71 36 -128 -27 149 89 88 -128 -46 72 128 259 -116
3440 -116 58 112 3 103 16 -5 -48 40 -177 -139 20 -152 -74 83 33 -85 242 -19 -141 -67 -258 93 -298
$$ packed form
3267E5k39J76K06n39L97k18L32l27O7J6J62oM3k89O5j04J91L8R5K6k10M9k55N00
3291B31n04L65N9j29k87L18K9k2P9k63Qq3l3R9J33k46L47n2n4n6k99M12r0j6J66
3316A12M8m57K91Q0m23K78N3m4pj46J53K60Rj10j55r8J64L63o21K34j4J55j34
3339iL68k80j2q3p3QL7J58k5j45L29l30K79k08J55j14L7n8J58l1k21N4N4K3j7
3364E4p9j75J45m7J32o4m4J99l05K5LL13l91K15Ml64M80J44pl62O4N2L2Q8k9k01
3390a18N0K44k56J53q1nJ19J33k61k17J1m1M77q2pl74M13j26L0M7n2Q5j37Q3n4
3415C4K7p9J17k29K2Q2N7P3k13jK58j47P0l5j64J01J76o0jk16Q2J18N6J31l75
3440a16J74N4j09J00q7k1m3Q8k17L8J59j72P8J57n0j18L27k61j22P4j91L51l91
$$ plain form
3463 -298 -86 -73 -16 55 101 -179 -255 122 -236 -21 -102 12 -62 -141 -117 53 -90 -20 27 244 -203 118 59 28
3487 28 -33 -142 226 -138 63 -109 258 136 200 39 -35 -85 101 116 216 -205 -66 -33 1 41 139 59 116 0
3511 0 -24 336 50 9 151 -276 -85 20 120 -126 60 82 121 -11 -147 -42 -166 -10 -84 -72 228 381 0
3534 0 76 318 245 -96 -88 19 105 -188 96 138 65 232 171 -66 176 45 -128 -4 77 -13 -21 111 -27 30 122
3559 122 129 -19 51 -16 -74 -2 119 10 249 13 -25 54 -69 -33 36 223 -89 1 173 -22 -188 -59 141 110
3583 110 -72 -13 58 -158 -66 -96 -261 197 -81 -157 5 -3 6 76 -205 -80 39 -251 -192 -34 -217 -45 44 31
3607 31 182 75 -53 -16 -8 22 -84 128 -115 148 -164 58 25 -126 -91 -3 119 -156 12 -224 145 36 62
3630 62 -65 250 141 90 75 -187 233 -30 54 48 12 20 200 89 -129 -161 4 -50 192 -56 -169 180 101 -39
$$ packed form
3463b98K12J3N7P1M6k80p6L77l58K15q1J14p4p9K4J70j43P0M7K17m47L21n9l1
3487B8o1j09L68l64K01j72L67j22O4j61p4n0J86J5J00m21J39L3L4M0R8q0N7j16
3511@k4L60k86m1J42m27J91J05J00k46J86K2L9j32j36J05j24J56p4J2L00J53l81
3534@P6K42p3l41QJ07Q6k93K84M2p3J67o1k37K42j31j73J24Q1r0qJ32j38N7R2
3559A22Pj48P0o7n8P2J21j09K39k36l8P9j23L6O9J87l12R0J72j95j66J29K00l1
3583A10j82N9P1k16R2l0j65M58k78p6J62qRP0k81J25J19k90N9J58j83J72Q9j3
3607C1J51j07j28L7QL0j06K12k43K63l12K22l3j51L5Q8J22k75J68k36L69j09K6
3630F2j27L15j09n1j5k62M20k63Q4ol6QJ80j11k18l2J65n4K42k48j13L49p9j40
$$ plain form
3654 -39 265 118 -86 238 125 25 29 191 13 -203 -96 -20 -103 133 -72 142 -55 51 133 124 -67 -140 66
3677 66 32 -37 14 -83 66 156 -108 57 -91 -201 84 57 -143 99 160 -74 107 -189 183 -60 93 107 -96
3700 -96 23 -31 113 -183 97 40 63 -45 160 72 105 -84 84 45 174 85 -212 -16 -26 -70 -15 -19 161 298
3724 298 94 -46 45 342 -33 -169 155 198 -2 13 -55 -299 -16 60 82 83 271 -38 -53 -32 -58 72 -16 45
3748 45 42 111 -26 -145 -72 -29 -68 100 189 222 92 196 101 -361 -5 14 77 -83 -94 258 28 -65 -72 440 173
3773 173 0 -53 -94 108 35 -302 -26 81 -6 -103 133 183 48 159 210 176 -104 111 171 -156 -34 -10 86 144
3797 144 -11 80 120 75 117 -67 73 -172 92 -148 -69 59 31 9 66 65 -39 -86 -27 152 195 99 -97 -105 -30 34
3823 34 -174 -140 -61 -71 -20 176 -15 -51 99 186 33 -134 -60 -337 -22 22 197 260 87 163 -82 108 -65 -110
$$ packed form
3654c9L04j47k04L24j13j00MJ62j78k16J07P6q3K36k05K14j97J06Q2rj91p3K06
3677F6l4o9N1r7J49R0k64J65j48j10K85k7k00K42O1k34J81k96L72k43J53J4k03
3700i6J19n4J44k96K80n7K3j08K05q8L3j89J68l9J29q9k97J96j0m4N5mJ80J37
3724B98k04j40R1K97l75j36L24M3k00J5o8k44K83P6K2JJ88l09j5K1k6J30q8O1
3748D5lO9j37j19P3M3l9J68Q9L3j30J04r5m62L56J9O3j60j1L52k30r3pN12k67
3773A73j73n3m1K02p3l37K76J07q7r7K36N0j35J11N1l4k80K15O0l27J22K4R6N8
3797A44j55R1M0m5M2j84J40k45K64k40P9J28k8k2N7jj04m7N9J79M3r6j96qP5O4
3823C4k08L4P9j0N1J96j91l6J50Q7j53j67P4k77L15M4J75O3j73P6k45J90j73m5
$$ plain form
3847 -110 103 -14 116 -66 -141 -240 13 -41 -36 99 -30 256 80 22 -311 143 -178 108 29 -15 78 100 28 163
3871 163 81 70 -73 58 141 -205 -39 16 128 -9 -26 6 64 113 -12 -272 -32 114 170 14 57 10 -23 193
3895 193 -119 238 -76 -55 -57 52 -45 -117 -121 -93 -119 58 -78 219 156 -151 -257 191 12 3 -181 -28 31 -108
3919 -108 -47 -74 43 -6 -62 -54 -56 44 141 -259 38 -124 119 -96 196 249 -188 -183 -132 143 17 98 226 -112 314
3944 314 54 -90 115 122 156 116 217 64 -32 -79 71 -108 49 -18 -11 -173 -11 21 -167 -57 -123 -143 158 263
3968 263 127 26 18 40 81 -137 38 -57 -96 94 -130 -55 -66 -95 -61 -42 209 95 -75 86 233 66 38 -116
3992 -116 -79 49 -75 190 -125 264 -210 -8 -64 -18 19 168 100 -61 -97 65 -66 -123 81 -105 131 -7
4014 -7 -24 -232 224 -81 -92 -290 175 -152 114 35 140 35 33 -95 7 88 101 137 30 102 183 21 49 -250
$$ packed form
3847a10K13j17J30j82p5r9K53n4NJ35j29K86j76n8l33M54l21K86p9m4R3K2p2J35
3871A63q2j1j43J31Q3l46J66N5J12j37j7L2N8M9j25k60K40J46N6j56M3m7l3K16
3895A93l12L57l14K1kJ09r7p2mK8k6J77j36K97o3l07j06M48j79rj84J53N9j39
3919a08O1k7J17m9n6QkJ00R7m00K97j62K43k15K92N3m37NN1K75j26Q1J28l38M26
3944C14k60j44K05PL4m0J01j53r6m7J50j79J57o7Pj62J62L2j88J10o6k0L01J05
3968B63j36j01qK2M1k18J75r5l9J90k24P5j1k9L4J9K51j14j70J61J47j67k8j54
3992a16L7J28j24K65l15L89m74K02n6M6L7J49o8j61l6J62j31n7K04j86K36j38
4014gj7k08M56l05j1j98M65l27K66p9J05j05kj28J02Q1J3L6j07P2Q1j62K8k99
$$ plain form
4038 -250 67 -128 79 42 -84 167 -168 -149 -95 136 3 -67 -114 -65 -26 -112 -179 -76 -75 179 289 207 -93 103
4062 103 -134 171 -211 -118 66 -143 37 67 -9 -42 146 -28 -53 -47 -38 119 -11 -231 35 -121 77 107 92 56
4086 56 165 -322 -60 -2 47 159 -14 -112 155 -3 105 -8 11 91 25 -105 -35 -65 256 -55 -69 -48 -11 43
4110 43 303 113 -161 10 -287 -114 124 -247 -135 -98 -71 -118 -135 -79 -181 267 142 -42 293 -260 55 -149
4132 -149 -110 -104 4 -132 -173 253 -226 27 -48 -83 -58 -14 -209 63 293 -103 -54 123 -75 52 50 -53 18 196
4156 196 47 160 -95 126 233 -123 75 67 30 -109 -80 79 96 -170 97 -67 92 81 75 -62 113 -132 164
4179 164 -126 375 60 -132 26 103 -205 35 55 -272 -253 56 139 77 -17 162 174 52 129 -43 -148 31 -76
4202 -76 175 17 -27 -95 87 -54 -100 -18 -11 77 7 0 -248 80 70 -89 -186 10 -9 -179 202 -8 121 134 -21
$$ packed form
4038b50L17j95K07l7j26K51l35J9N4K31j33p0m7M9L9q6o7J03JK54J10q2l00J96
4062A03k37L05l82R3J84k09J80L0p6l3J88j74k5ORJ57j30k20K66j56J98L0j5l6
4086E6J09m87K62N8M9J12j73r8K67j58J08j13J9Q0o6j30P0l0L21l11j4K1L7N4
4110D3K60j90k74J71k97J73K38l71J12L7K7m7j7N6j02M48j25j84L35n53L15k04
4132a49L9OJ08j36m1M26m79K53p5l5K5M4j95K72K30l96M9J77j98J27kj03P1J78
4156A96j49J13k55K21J07l56J98ql7j39K9J59J7k66K67j64J59j1oj37J75k45K96
4179A64k90N01l15j92J58P7l08K40K0l27J9L09Q3o2r4J79J2j22P7j72j05J79j07
4202g6K51j58m4o8J82j41m6Q2PQ8p0pk48L28j0j59r7J96j9j70L81k10J29J3j55
$$ plain form
4227 -21 -36 -102 25 78 2 41 76 -126 -144 72 -57 151 -115 61 -93 157 -54 84 -5 -139 -77 -20 -63 -332
4251 -332 -103 93 160 -138 100 -256 169 -18 -214 48 235 -169 -191 186 14 -65 -48 -129 264 123 107 -75
4273 -75 -233 290 186 -74 -135 -72 169 -149 111 -17 -182 56 120 -5 -178 174 101 -147 53 -20 -77 237
4295 237 223 1 -21 49 -33 67 128 -91 151 -18 -112 61 60 58 -99 -52 95 -50 106 162 36 -187 76 -128
4319 -128 129 143 54 151 172 96 -68 102 -56 73 205 8 46 172 -31 -97 -161 -70 55 -62 131 20 -79
4342 -79 -23 -90 22 -7 -102 -78 206 -74 -195 1 168 65 3 -231 -27 2 -157 -223 10 58 85 -75 -48 -185
4366 -185 -147 24 -31 -177 -111 -23 210 -27 -71 131 116 143 -8 -38 171 23 34 22 -58 80 -34 -13 -73 217
$$ packed form
4227b1j5o6J27N3p6L9L5k02j8K16j29K08k66J76j54K50k11J38q9j34O2N7m3k69
4251c32K29J96O7k98K38l56M25j87j96K62J87m04k2L77j72p9J7q1L93j41j6j82
4273g5j58N23j04k60o1O3K41l18K60j28j65K38O4j25j73L52p3k48K00p3n7L14
4295B37j4k22k2P0q2J00O1k19K42j69r4J73jkj57M7J47j45J56N6j26k23K63k04
4319a28K57J4q9R7K1p6j64J70j58J29J32j97L8J26k03o6o4R1J25j17J93j11r9
4342g9N6o7J12k9r5K4K84k80j21J96J67j03o2k34K04K9j59o6K33M8K7j60K7j37
4366a85L8J71n5j46O6Q8K33k37m4K02j5K7j51l0K09j48J1j2q0J38j14K1o0K90
$$ [...]
8191a09
##END NTUPLES=NMR FID
##END=
