##TITLE=1H_Ser-DNG
 CDCl3, 8 sc, 
 27.2.2020
##JCAMPDX= 6.0         $$ Bruker NMR JCAMP-DX V2.0
##DATA TYPE= NMR FID
##DATA CLASS= NTUPLES
##ORIGIN= UXNMR, Bruker Analytische Messtechnik GmbH
##OWNER= root
$$ XWIN-NMR		Version 3.5
$$ Thu Feb 27 15:30:07 2020 Russian Standard Time (UT+4h)  she@DPX200
##.OBSERVE FREQUENCY= 200.1315
##.OBSERVE NUCLEUS= ^1H
##.DELAY= (6, 6)
##.ACQUISITION MODE= SIMULTANEOUS
##.ACQUISITION SCHEME= undefined
##.AVERAGES= 8
##.DIGITISER RES= 18
##SPECTROMETER/DATA SYSTEM= spect
##.PULSE SEQUENCE= zg30
##.SOLVENT NAME= D2O
##.SHIFT REFERENCE= (INTERNAL, D2O, 0, 15.7039)
##AUDIT TRAIL= $$ (NUMBER, WHEN, WHO, WHERE, WHAT)
$$ ##TITLE= Audit trail, XWIN-NMR		Version 3.5
$$ ##JCAMPDX= 5.01
$$ ##ORIGIN= Bruker BioSpin GmbH
$$ ##OWNER= she
$$ F:/spectra/data/she/nmr/H-F/1/audita.txt
$$ ##AUDIT TRAIL=  $$ (NUMBER, WHEN, WHO, WHERE, WHAT)
(   1,<2020-02-27 15:29:00.71 +0400>,<she>,<DPX200>,
      <created by zg, POWCHK disabled, PULCHK disabled
       configuration hash MD5:
       00 E9 B6 7A A2 85 ED C7 34 08 36 98 17 FE 4E 26
       data hash MD5: 16K
       92 43 23 B3 E0 0C D7 16 0A 3A D5 D5 98 94 5D 2E>)
$$ ##END=
$$ 
$$ hash MD5
$$ 17 E0 D2 4B A8 66 19 17 94 19 AC AD 0B E0 31 26
##$RELAX= 
##$RELAX= 
##$RELAX= 
##$RELAX= 
##$RELAX= 
##$RELAX= 
$$ Bruker specific parameters
$$ --------------------------
##$DU= <F:/spectra>
##$EXPNO= 1
##$NAME= <H-F>
##$PROCNO= 1
##$TYPE= <nmr>
##$USER= <she>
##$AMP= (0..31)
100 100 100 100 100 100 100 100 100 100 100 100 100 100 100 100 100 100 
100 100 100 100 100 100 100 100 100 100 100 100 100 100 
##$AQSEQ= 0
##$AQ_mod= 1
##$AUNM= <au_zg>
##$AUTOPOS= <>
##$BF1= 200.13
##$BF2= 200.13
##$BF3= 200.13
##$BF4= 200.13
##$BF5= 200.13
##$BF6= 200.13
##$BF7= 200.13
##$BF8= 200.13
##$BYTORDA= 1
##$CFDGTYP= 0
##$CFRGTYP= 5
##$CHEMSTR= <none>
##$CNST= (0..31)
1 1 145 1 1 1 1 1 1 1 1 1 1 1 1 1 1 1 1 1 1 1 1 1 1 1 1 1 1 1 1 1 
##$CPDPRG= <>
##$CPDPRG1= <>
##$CPDPRG2= <>
##$CPDPRG3= <>
##$CPDPRG4= <mlev>
##$CPDPRG5= <mlev>
##$CPDPRG6= <mlev>
##$CPDPRG7= <mlev>
##$CPDPRG8= <mlev>
##$CPDPRGB= <>
##$CPDPRGT= <>
##$D= (0..31)
0 1.2 0 0 0 0 0 0 0 0.06 0 0.03 0 0 0 0 0.0002 0 0 0 0 0 0 0 0 0 0 0 0 
0 0 0 
##$DATE= 1582802939
##$DBL= (0..7)
120 120 120 120 120 120 120 120 
##$DBP= (0..7)
150 150 150 150 150 150 150 150 
##$DBP07= 0
##$DBPNAM0= <>
##$DBPNAM1= <>
##$DBPNAM2= <>
##$DBPNAM3= <>
##$DBPNAM4= <>
##$DBPNAM5= <>
##$DBPNAM6= <>
##$DBPNAM7= <>
##$DBPOAL= (0..7)
0.5 0.5 0.5 0.5 0.5 0.5 0.5 0.5 
##$DBPOFFS= (0..7)
0 0 0 0 0 0 0 0 
##$DE= 6
##$DECBNUC= <off>
##$DECIM= 24
##$DECNUC= <off>
##$DECSTAT= 4
##$DIGMOD= 1
##$DIGTYP= 9
##$DL= (0..7)
0 120 120 120 120 120 120 120 
##$DP= (0..7)
150 150 150 150 150 150 150 150 
##$DP07= 0
##$DPNAME0= <>
##$DPNAME1= <>
##$DPNAME2= <>
##$DPNAME3= <>
##$DPNAME4= <>
##$DPNAME5= <>
##$DPNAME6= <>
##$DPNAME7= <>
##$DPOAL= (0..7)
0.5 0.5 0.5 0.5 0.5 0.5 0.5 0.5 
##$DPOFFS= (0..7)
0 0 0 0 0 0 0 0 
##$DQDMODE= 0
##$DR= 18
##$DS= 0
##$DSLIST= <SSSSSSSSSSSSSSS>
##$DSPFIRM= 0
$$ [...]
##$SUBNAM2= <"">
##$SUBNAM3= <"">
##$SUBNAM4= <"">
##$SUBNAM5= <"">
##$SUBNAM6= <"">
##$SUBNAM7= <"">
##$SUBNAM8= <"">
##$SUBNAM9= <"">
##$SW= 24.9337058887773
##$SWIBOX= (0..15)
0 0 2 0 0 0 0 0 0 0 0 0 0 0 0 0 
##$SW_h= 4990.01996007984
##$TD= 16384
##$TD0= 1
##$TE= 0
##$TE2= 300
##$TE3= 300
##$TEG= 300
##$TL= (0..7)
0 120 120 120 120 120 120 120 
##$TP= (0..7)
150 150 150 150 150 150 150 150 
##$TP07= 0
##$TPNAME0= <>
##$TPNAME1= <>
##$TPNAME2= <>
##$TPNAME3= <>
##$TPNAME4= <>
##$TPNAME5= <>
##$TPNAME6= <>
##$TPNAME7= <>
##$TPOAL= (0..7)
0.5 0.5 0.5 0.5 0.5 0.5 0.5 0.5 
##$TPOFFS= (0..7)
0 0 0 0 0 0 0 0 
##$TUNHIN= 0
##$TUNHOUT= 0
##$TUNXOUT= 0
##$USERA1= <user>
##$USERA2= <user>
##$USERA3= <user>
##$USERA4= <user>
##$USERA5= <user>
##$V9= 5
##$VALIST= <valist>
##$VCLIST= <CCCCCCCCCCCCCCC>
##$VD= 0
##$VDLIST= <DDDDDDDDDDDDDDD>
##$VPLIST= <PPPPPPPPPPPPPPP>
##$VTLIST= <TTTTTTTTTTTTTTT>
##$WBST= 1024
##$WBSW= 4
##$XGAIN= (0..3)
0 0 0 0 
##$XL= 0
##$YL= 0
##$YMAX_a= 166325
##$YMIN_a= -76998
##$ZGOPTNS= <>
##$ZL1= 120
##$ZL2= 120
##$ZL3= 120
##$ZL4= 120
##$ABSF1= 10
##$ABSF2= 0
##$ABSG= 5
##$ABSL= 3
##$ALPHA= 0
##$AQORDER= 0
##$ASSFAC= 0
##$ASSFACI= 0
##$ASSFACX= 0
##$ASSWID= 0
##$AUNMP= <proc_1d>
##$AZFE= 0.1
##$AZFW= 0.1
##$BCFW= 1
##$BC_mod= 2
##$BYTORDP= 1
##$COROFFS= 0
##$CY= 11.3945322036743
##$DATMOD= 1
##$DC= 2
##$DFILT= <>
##$DTYPP= 0
##$F1P= 16.9975609425685
##$F2P= -3.02152046262296
##$FCOR= 0.5
##$FTSIZE= 0
##$FT_mod= 4
##$GAMMA= 1
##$GB= 0.15
##$INTBC= 1
##$INTSCL= 1
##$ISEN= 128
##$LB= 0.24
##$LEV0= 0
##$LPBIN= 0
##$MAXI= 10000
##$MC2= 0
##$MEAN= 0
##$ME_mod= 0
##$MI= 1.114404
##$NCOEF= 0
##$NC_proc= 0
##$NLEV= 6
##$NOISF1= 3.799351
##$NOISF2= 2.8
##$NSP= 1
##$NTH_PI= 0
##$NZP= 0
##$OFFSET= 15.70392
##$PC= 1
##$PHC0= -9795.252
##$PHC1= 24.60082
##$PH_mod= 1
##$PKNL= yes
##$PPARMOD= 0
##$PSCAL= 0
##$PSIGN= 0
##$REVERSE= no
##$SF= 200.130013532006
##$SI= 16384
##$SIGF1= 3
##$SIGF2= 2
##$SINO= 400
##$SIOLD= 16384
##$SREGLST= <1H.CDCl3>
##$SSB= 0
##$STSI= 0
##$STSR= 0
##$SW_p= 3612.71676300578
##$SYMM= 0
##$S_DEV= 0
##$TDeff= 0
##$TDoff= 0
##$TI= <>
##$TILT= no
##$TM1= 0
##$TM2= 0
##$TOPLEV= 0
##$USERP1= <user>
##$USERP2= <user>
##$USERP3= <user>
##$USERP4= <user>
##$USERP5= <user>
##$WDW= 1
##$XDIM= 8192
##$YMAX_p= 0
##$YMIN_p= 0
$$ End of Bruker specific parameters
$$ ---------------------------------
##NTUPLES= NMR FID
##VAR_NAME=  TIME,          FID/REAL,        FID/IMAG
##SYMBOL=    X,             R,               I
##VAR_TYPE=  INDEPENDENT,   DEPENDENT,       DEPENDENT
##VAR_FORM=  AFFN,          ASDF,            ASDF
##VAR_DIM=   8192,          8192,            8192
##UNITS=     SECONDS,       ARBITRARY UNITS, ARBITRARY UNITS
##FACTOR=    0.0002004,     1,               1
##FIRST=     0,             0,               0
##LAST=      1.6414764,     0,               0
##MIN=       0,             -76998,          0
##MAX=       1.6414764,     166325,          0
$$ Real data points
##PAGE= N=1
##DATA TABLE= (X++(R..R)), XYDATA
$$ [...]
2096c57j049P67Q59p44o61Q03O74n32m42J26J45k71k65N03R83j241k23J035k33
2115a23p11j06J142K22j266j65O36J217p26r92J9M42L26p4J23L77l76k88j79L49
2135a53M12K34j91m41n3L44K49j89m10J12M94j4J39n01N21J98k48o98k39L81O21
2156E68N28o54k65O27m5o15l46P61L69m62j92j87M59L82j4o42j50J77L04l4l49
2177B20l28P35K95m27j162Q10P97j49o38n1O10n1q05l3M60r2l21K82J26J53k41
2198A90j27j04l40k97P94P03q14n95M65R13n70j248J75J513l97j047M36Q67m91
2217B6r49o6Q90p5l68M3N26l23j012P95J136j037j217J051J593j442j147P22J357
2236E03o09j667M16J667J94j343p4J288k65j354k09J808J89j191j03J105m60j132
$$ y = [-357, -1406, -639, 220, -524, -1185, -382, 292, -240, -682, -556, -411, -682, -947, -444, 539, -702, -925, 110, -123, -834, -940, 202, 424, -842, -1007, -371, 846, 120, -872, -853, -411, -85, -159, -36, 341, -35, -323, -502, -153, 259, 493, 302, -139, -192, 152, 401, 212, -198, -86, 408, 394, 533, 32, 553, 751, 503, -195, -434, -53, 568, 1096, 442, 177, 804, 759, 144, -202, 559, 928, 466, 274, 87, 546, 928, 914, 272, 122, 299, 603, 569, 220, -108, 627, 922, 495, -667, 143, 940, 791, 153, 102, 712, 661, -144, -177, 283, 191, -130, 152, 278, 431, 190, 63, -41, -381, -678, 116, 819, 5, -590, -125, 788, 218, -1030, -855, 658, 261, -786, -350, 517, 26, -923, -989, -99, -174, -542, -499, 27, -296, -1308, -513, 623, -414, -1631, -580, 1013, -429, -1576, -854, 503, -106, -1773, -1357, 310, 504, -839, -913, 375, 110, -1244, -1453, 355, 544, -647, -750, 355, -105, -1237]
2254a237R07J107n11k029Q85J976k73j633o09K297m74j320j54K412N9j748k61
2271f06Q06M29r59j3R68N21j444m1O38L38j008K3J230K5j227q4J179R15j769p88
2291h67J481P21r48r67J315J252j373j591Q84J612o78j215Q10Q17p90q97P22P84
2309A072l60j238O10J322o07j512R03J160q30j781N58K370p45j625n0J881l55
2326G73k017L80J846k15j481j19J217L50j412k23J329k70j125L66J667k44j570
2343g48m15J840n91j880n4K383J007k194r61J856O13j863r90J601J145j120j159
2360a530J695N75j487p61J175P23j090m24J374N39j598m66J531M33j516j221J956
2377i2J309j530j246J478J313j955j107J202J969o69j351N33R23j145j096J294
$$ y = [-1237, -330, 777, 266, -1763, -878, 1098, 825, -808, -1417, 880, 406, -914, -1068, 1344, 1403, -345, -606, 200, 629, -330, -343, 625, 1146, -298, -339, 299, 637, -371, -348, 882, 907, -320, -404, 775, 1690, -79, -867, 614, 1335, 387, -580, 735, 1987, 614, -977, -93, 1519, 841, -374, 436, 1253, 463, -434, 288, 1072, 712, -526, 84, 1406, 799, -713, 190, 1350, 520, -1261, -703, 1667, 922, -703, -753, 1128, 773, -1244, -864, 982, 767, -714, -833, 384, 734, -678, -901, 428, 158, -967, -601, 1066, 822, -748, -1163, 677, 86, -1794, -1848, 535, 1542, -652, -1613, 243, 856, -1007, -1997, -396, 749, -371, -1530, 165, 740, -747, -1508, -333, 390, -700, -1124, 250, 789, -809, -1275, 256, 689, -827, -2048, -92, 1217, -313, -1559, -81, 1232, -723, -1830, -628, 1341, 672, -679, -146, 777, -368, -1464, -170]
2393a70J093n74j285J212P88j348j029J137J365j436j311J947K086j342k036N72
2409c31J375j080j675J540J983j32k139l7J290m72j178O18J489o15j237O73J958
2426B030r72j917K32J835q99j294P96K394k97k691k99K149K19j875l21K062p2
2443A080j465j23J549K74j824l53J266M0j204J70J590j28j667j87J660M06k277
2460a193P2K021P8j792o81J894J000j823j092J620N83j086r85J692K65j148q58
2477a433J405O27j332l52J424K62j606p76J401J210j812n38J544J261j447j664
2493a826J324J140j323r45J044J845p18j713J070O12j074o82O71J397j222m28
2509h28J070R16j089j815J094J372q94j286J301J898r90k093M46J719l43j425
$$ y = [-170, 923, 349, -936, 276, 1064, -284, -1313, -176, 1189, -247, -1558, 389, 2475, 1133, -903, -331, 1044, -36, -1711, -171, 1812, 1680, -459, -496, 794, 322, -856, -238, 1251, 636, -601, 72, 2030, 1058, -859, -627, 1208, 309, -985, -189, 2205, 1908, -783, -1082, 1067, 1286, -589, -910, 1152, 1080, -385, -508, 1041, 1315, -509, -862, 404, 444, -760, -590, 1000, 872, -795, -982, 678, 1084, -1193, -1121, 900, 978, -814, -1495, 399, 1399, -424, -1516, 104, 687, -399, -1384, 308, 573, -575, -1433, -28, 599, -733, -1085, 339, 601, -1005, -1781, -380, 830, -982, -1520, 24, 1285, -162, -1826, -502, 638, -685, -1630, -586, 1259, 541, -1172, -102, 510, -564, -1246, -575, 822, -400, -828, 242, 1158, 69, -1746, -652, 720, -174, -1460, -159, 1739, 749, -1344, -898, 821, 478, -947]
2525i47N26J915l79j611l50J359j16j074J94J125M6o55J68J076n65j781L46J870
2543A147k70j246J03J787o06j721r38K653P40j493p55J362M73j494l93J531J51
2560A031j219p6Q05M57j109l74J366k09j378k05J948M36j652o19J610J33j312
2577c67r23J923O64j255j044J330P37p78p74M99P17q32o55O37R13r29o04J104
2595C63J25j038m38O59Q76q27j170J272Q08n81q73O18O81q45j116Q65J101k53
2613B27q96r8J088m02p51N39L27k49l69L55O46q52p70O38Q70k12j157Q45J073
2632H52p07r23k02J113p6p44J83Q92m0n21k12K54K05m14j1N40J66n67M05M66n89
2653G0r29N15R53k53p54K98P51k58j052J94J024O3n44n32K70O62k43n31P09j00
$$ y = [-947, -421, 1494, 1115, -496, -846, 513, 397, -677, -483, 642, 688, 33, 201, 1277, 712, -1069, -723, 1147, 877, -369, -266, 1521, 915, -806, -1744, 909, 1649, 156, -599, 763, 1236, -258, -651, 880, 1031, -188, -264, 541, 998, -111, -485, 881, 672, -706, -911, 1037, 1473, -179, -798, 812, 945, -367, -1290, 633, 1297, 42, -1002, 328, 1065, 287, -487, 12, 729, -103, -758, -121, 792, -137, -741, 363, 488, -550, -988, -329, 547, -280, -1450, -178, 630, 49, -824, -206, 475, -370, -1486, -621, 480, 227, -669, -767, 321, -81, -832, -293, 34, -215, -584, -229, 417, -435, -1205, -567, 303, 91, -1066, -221, 852, 145, -778, -980, 133, 57, -687, -504, 388, 348, -173, -385, -131, 74, -340, -351, 189, 355, -212, 193, 659, 70, -859, -344, 609, 356, -398, -100, 651, 393, -659, -465, 559, 622, 78, -454, -184, 478, 235, -296, 413, 313]
2673C13l72k4R79m54k97N2N09q04m60O35R81M32j087o22J098j44r91q3P81N89
2693A031q83j11L34K56n92L5j2p0p7K74K67K16o25l56P47jn89o0R03L61j126p47
2715h25O81N75o16j28L29P37l86n51J10J82l61k21j2O29J05l69M72j06p03m65
2735i23P70M47m01k52K69L91n69n83J37J279j73r25l57R50L46q21j82p3M01p5
2755c44J03K10N1L6n45K9l34K67M60M04O8l17n49M61l12l90M8P31K34m32k76M47
2777E0P30q44o51K52P29L01k81n20N33J96m66k79M85j23K76O7k65l33k05O32K85
2798E69k01l63L70O07k65r34J13N26K10k96J15M3N5k70n72J66J36O95j1n01q5
2819A07N3J62j46j00L71K4K01o64o7M80m69j00m2Q3L20L22J97n38n21J59J13q0
$$ y = [313, -59, -83, 896, 442, 145, 197, 706, -98, -558, 77, 1058, 1490, 403, -219, 879, 735, -256, -339, 442, 1031, 148, 37, 371, 627, 35, 70, 58, -12, -89, 185, 452, 668, 43, -313, 434, 433, -156, -216, 687, 1048, -78, -825, -144, 431, -185, -313, 16, 753, 367, -184, -74, 108, -253, -474, -486, 143, 248, -121, 351, 245, -458, -923, -153, 294, -107, -359, -90, 301, -268, -851, -714, 565, 392, -533, -890, 60, 406, -415, -597, -670, -269, -344, -241, -31, 20, 56, -489, -460, -794, -527, -67, 337, 405, 88, -461, 0, -312, -702, -654, 77, 311, -121, -397, 50, 780, -64, -715, -463, 266, 567, 286, -234, 299, 495, 29, -250, 235, 112, 388, 455, 190, -143, -348, 284, 569, 368, 5, 375, 982, 717, -217, -104, 422, 632, 336, 451, 494, 549, 279, -293, -127, 9, 704, 693, 192, 107, 160, 322, 176, 76, 447, 471, 672, 8, -59, 421, -48, -148, -190, -107, 213, 535, 732, 194, -327, -168, -55, -135]
2841a35m4O58M68m00q29l58N59M29n10r4L26N43p16k78J25M5K54l26P2J33r1K56
2863H7J0o88l14J2P43M24M6n59O48l93q28p99J064Q95l78o29L81M59l80n80j41
2884i20M00J92pM20K81n50m94M42k64k29O9R72N75j023m67J74N40m8o21L86P99
2905F27P3q74k74N65j20k75j48M97M37m67K6J62m26j50K39K57j10q1P06j49k68
2926B47m84K55L00J47m59p4O69l09P8n64K49J73K88k72J18j95L13q4m62J9q7L76
2948B42K99j40m30L57j36r6j44J63M39L5n18o5L57K48l55n45mK64M08k73k19j11
2970b24n5M52J7Q7l18K43j68j68m82M19N82j08m77m23M41N36m68m79N5Q36n29
2991b31l11N19L09k09k65l41N2P3J8N68l03m2n5J57j58k4j55M02L05o89n49M87
$$ y = [-135, -179, 479, 947, 547, -282, -640, -81, 348, -162, -256, 70, 613, -103, -381, -256, -211, 43, -283, -211, -78, -169, 87, 97, -591, -905, -893, -150, 274, 320, -239, 409, 16, -812, -1611, -547, 348, -30, -659, -278, 181, -199, -779, -920, -520, -328, -335, 85, 366, -184, -678, -236, -500, -729, -660, 312, 887, -136, -603, -429, 111, 63, -558, -172, 627, 700, -174, -448, 117, -3, -278, -426, 71, 508, 41, 67, 229, -197, -347, -108, 149, 39, -42, 664, 515, 247, -237, 18, 318, 465, 6, -68, 601, 292, 370, -194, 55, 228, 516, 244, 362, 167, 480, 396, -66, -47, -134, 242, 541, 401, -29, 328, 192, 96, -48, 115, 554, 589, 71, 6, 363, 611, 256, -289, -293, -29, 379, 106, -113, -224, -279, 173, 190, 277, -41, 202, 34, -134, -616, -197, 385, 277, -200, -623, -182, 354, -114, -593, -538, 298, -231, -542, -23, 286, 77, -188, -529, -477, -404, -386, 182, -121, -163, -218, -61, -219, -243, -398, 4, 309, -380, -929, -442]
3013d42R02o07m13N2O52j65l07r0M17K5m80J8j4O05m61L44L90l09n40M40N06o05
3035h2k03N05N4k30m77K29O98l03r26L54P15P6m83M7K84L4l49k70M84M06l01p8
3057A84K31r7o33J34O66k43l84L35N18k10o53J26N63J69p57j01M59J90k34m96
3077b33L19O59l34l80K01J57j7k43L26k97o1j5L88J58n26m84Q23J44p42l36M89
3098dL26o7q21J3P30k29L3k95Q62l47m64j27K07j29K11l5m5m2RK2L55k55l93K23
3122b62J72k38m17J89R17j97q30p0R83k44m63K09k01L27k06o9J49J85j78O5K0
3143a59k74K55PK79l68m46J71N67J35l91j49O52q8p87KN64L31j58m86J31K46j0
3165B4q5K58k0j43m18M18J15k27K35r6j90k35K79O24jk28q13P49K81p04%J48O31
$$ y = [-442, 460, -147, -560, -508, 144, -21, -328, -418, -1, 24, -456, -438, -452, 153, -308, 36, 426, 117, -423, 17, 523, -82, -285, 220, 274, 44, -433, -204, 494, 191, -735, -381, 334, 410, -73, -26, 258, 292, -57, -327, 157, 563, 262, 184, 415, 318, -315, -181, 485, 242, -142, 193, 711, 501, -152, -26, 537, 706, -51, -152, 307, 497, 263, -233, 86, 745, 411, 31, 232, 389, 372, 129, 455, 158, 97, 82, 470, 628, 102, -382, 441, 585, -157, -493, -4, 322, 255, -566, -553, 177, -52, -19, -314, 548, 201, -263, -390, -183, -312, -101, -136, -181, -223, -214, -192, 163, -92, -485, -262, -90, -328, -745, -556, 361, 164, -666, -736, 247, 3, -460, -251, -452, -125, -331, -400, -251, -66, -244, -179, -159, -433, -178, -171, 108, -260, -706, -535, 32, 167, -224, -373, 279, 191, -596, -594, -30, 301, 143, -343, -212, 34, 24, -61, 197, 177, 34, -384, 34, 149, -78, 157, 61, -129, -364, -85, 539, 538, 310, -503, 246, 527, -177, -177, -29, 602]
3188F02l60k63K53l5K00k41n6N0K20m8j87L40l05j56L85J72m78l23Q51J45q21
3209e5j08j31Q46l0m26M9K61K09p95K5K67L21o12Q4K16K58k59q5L49n04k8l9K02
3232A5r3p6K78L78l33m95M4O41j28p79k6Q88j68q9n30K15L35r8l03M2J87j58m50
3255g03N54Qp9j2K72l32n04K68Q06l01n31K54LN51l41n84Q14J25o17k7j55N05
3277b6K93o15J84J42m2p7Q1p9k72J85L43l35J25j27K3P03p77m62O29L37M8k99
3299a8N7K71j18o66J39N95o0j39q1p1N69m46P2L4J58k49K8L11r9l03N13j48j63
3322A86m56K80P85k44n04k24P17p5k35j63p1P39n99j8RK65q9k29J55j19m8J61
3344B23J13J60k77P6J53l3l48p8K96k8m03m78O70L12l76j72K01M66m83j81j42
$$ y = [602, 242, -21, 232, 197, 397, 156, 100, 150, 370, 322, 135, 475, 170, 14, 399, 571, 93, -230, 621, 766, -55, -163, -294, 552, 522, 96, 145, 406, 615, -180, -155, 112, 433, -179, -95, 121, 379, 120, 35, 384, -120, -148, -187, 15, -78, -154, 124, 502, 169, -326, -282, 359, 231, -548, -574, 314, 146, 57, -473, -258, 77, -21, -324, -282, -95, -253, -703, -149, -141, -220, -232, 40, -292, -796, -528, 278, -23, -554, -300, -297, 254, -87, -671, 143, 268, -349, -376, -531, -26, 267, -348, -164, -22, -64, -141, -60, -139, -411, -226, 117, -218, -93, -220, -197, 506, -271, -733, -104, 233, 281, -18, 39, 310, 192, -474, -335, 260, 200, 61, -20, -91, 478, 32, 104, 138, 296, 47, 75, 386, 287, -16, 497, 349, 186, -270, 10, 795, 551, 47, -177, 540, 465, 230, 67, -4, 735, 136, 118, 127, 392, 303, 74, 229, 110, 62, 223, 336, 496, 219, 295, 448, 415, 67, -11, 285, 257, -146, -624, 46, 358, -18, -190, 11, 477, -6, -187, -329]
3365c29L62J75m08L0Q2oN7K6j62k67L60J56J73o67J11J16K02rl89L12L94l92m16
3388d89j21K18M28l05R8k97M13N0k81k77O0j07M84j64N1NK88k0R6p23L48O47O7
3411D69n32l33M46j26k42l0j24J005m27k46M8R1L09l67k15J4L21J99J67m79J98
3432A46j09q4p7j70K76M58k28l71k20J78M84J55m14L13M5M4j48l18J89k01M26
3453C74k30m9k70N55J75l66j65n7N68n69J09K38j5L5m53j35M59L36j45l16k71
3474a92K16L39j85j99M3k46K51J15l17L27J65Q2l47l88K06M55j38m91NM19P5k87
3496i2j92M69J74n62k17J16J01L94k02l35O1R0q3M55j72m17K23mJ19p9j40L50
3518E7j00l42K68J4J38j81k57r2K67N36l95l4j77M85m90N0J04K05oj2m57j1L37
$$ y = [-329, 33, 208, -200, -170, -88, -94, -37, -11, -173, -440, -80, 76, 249, -418, -307, -191, 11, 2, -387, -75, 319, -73, -489, -610, -392, 36, -269, -171, -468, -55, -5, -286, -563, -503, -610, -126, -290, -239, -234, 54, 34, 130, -593, -245, 402, 469, -63, -396, 50, -76, -318, -348, -472, 533, 106, -140, -92, -1, 308, -59, -274, -260, 61, 260, 427, -52, 146, 37, -47, -124, -294, -18, 440, 212, -159, -379, -201, 283, 438, 24, 337, 382, 426, 278, -40, 149, -52, 374, 144, 95, -175, 380, 555, 189, 24, -33, 535, -34, 75, 313, 298, 333, -120, -255, 204, 540, 395, 79, -192, 24, 363, 178, -21, 22, -224, 27, 142, -175, 152, 317, 399, 52, -336, -130, 325, 187, -304, -299, 120, 195, -92, -284, 185, 359, -203, -420, -304, -203, 191, -11, -346, -285, -195, -278, 177, 5, -412, -189, -193, -74, -153, -293, 57, -43, -385, -117, -103, 35, -146, -403, -495, -228, 308, -87, -121, -298, 187, -303, -253, -149, 56, 50, 38, -419, -430, -93]
3541i3K19j3k01q3M2L54l35m2R9L28j66k92j86K08L92p2l20L05J26J90j82n25
3563b47J53K28n7j99L38o5M54l17k39j98J20K75j29j29Q9K54R7O3n71J92K90p1
3585C31l17oP14j22l22k87qj57J07J93R8j38q9L48k32l31L63J86K94q09J22L89
3607C27j18j15l30NJ36K28j50K91N7p4n9n95K57k9M16P2k55k32L53J16n07l12
3629e18K31J89n6J17k23L63L8m70j50k05M88L46J1q7k23j41J17k77k38k9P03L73
3651C59l93l38J61M12m48k75m5K97L77j14m1q9J52m39j05K45N25j40j12N6l03
3672b58p5K88R5k24J60J07M49k56l40j05J74J39o16M90J80K02j11o42L71j32o3
3693a67pK18M93n04Q3J47k53k12O43k53ql07M41L3J48m09k16M67o6m5k07L0m4
$$ y = [-93, 126, 113, -88, -171, -129, 225, -110, -152, -53, 275, 109, -183, -369, -161, 231, 159, -161, 144, 270, 460, 278, -247, -94, 134, 77, -122, 216, 151, 605, 288, 49, -149, -29, 246, 117, -12, 77, 331, 428, 491, -80, 112, 402, 331, 14, 8, 722, 600, 278, -9, -17, -174, -67, 126, 224, 86, -3, 345, 113, -218, 145, 331, 625, -184, -62, 327, 209, 94, -236, -231, -95, 133, -17, 274, 331, 257, 198, -397, -140, -169, 247, 319, 64, -168, 185, 301, -206, -518, -287, -98, -154, -37, -260, 103, 141, -329, -479, -684, -196, 150, 161, 74, -149, -290, -173, -450, -688, -717, -14, 359, -34, -372, -211, 201, -247, -522, -567, -270, 107, -7, -48, -137, 15, -424, -529, -284, 241, 101, -11, 45, -258, -333, -45, 50, -174, -14, 93, 542, 286, -54, -159, 15, 154, -462, 28, 208, 410, 299, -343, 28, -104, -167, -174, 44, 537, 33, 116, 263, 10, -202, 441, 188, 180, -127, 314, 347, 495, 86, -130, 337, 271, 226, 19, 49, 5]
3716EJ76l5k00L46K02j28j46j51r4K32J24l06J98o1L54m87mJ7J54J56m60J5l8
3739a31L26j01j97l68L40L77J33k17J76j81j60m08M9K54L64J54m72j97m2K63J25
3760H7p20L37P9K02n3j85M32k25j45j43k6K90K92l65ql2N1o6R9J11K60j29M8n6
3784A35n64J96J00N4J86k85K33J58l48j40M6pp3J16j87L83L6M24l40m21m15P86
3806G3k11j48L84k66Q2J73j01l0j11K54L5r1j69J59J09p4k35L37o0J06kj07N7
3829A64j35k38j1Q0M83%l02k65M14M48l73M3m33K13K19o1l20K11K05j57n69M29
3851D5K79P5k95j51K79r7k14M41l32L3J43l42K03j75j90O78j54l01l0K94J03k60
3873C2Rl27J09L59k02o6K02m9k5m62n1N75N8l01r2m7O3K94Q6k96R5J52k86j09
$$ y = [5, 181, 146, -54, 292, 494, 366, 220, 69, -25, 207, 331, 25, 223, 162, 516, 29, 25, 42, 196, 352, -108, -93, -131, 195, 94, -103, -471, -131, 246, 379, 162, 338, 157, -3, -411, -362, -108, 256, 410, -62, -259, -301, -38, 87, -633, -296, -217, -15, -68, -253, 179, -46, -191, -334, -360, -70, 222, -143, -151, -183, -132, -198, -99, 12, 272, 143, 191, 135, -429, -233, -133, -79, 107, -178, 55, 213, -135, -275, -229, -236, -309, -193, -380, 3, 39, 463, 123, -298, -713, 73, -138, -286, 98, -168, -86, 87, -14, -44, -155, 99, 134, 43, -126, 33, 142, 68, -167, 170, 110, 216, 214, 107, 164, 29, -209, -220, -140, 343, 343, 41, -224, 190, 638, 265, 308, -125, 88, 307, 246, -74, 137, 342, 185, -384, 45, 324, 399, 104, -47, 232, 135, -79, 362, 30, 63, 206, -136, 67, -108, -298, 380, 226, -75, -105, 189, 292, 32, 41, -286, -177, 182, -20, -86, 116, 67, 42, -420, -471, 104, 162, -139, -231, -278, -215, 79, 165, -131, -36, 116, -170, -279]
3897b79K7L93k03J27l54k59L52K11k47J86k60K77K23n73M19m4n5R0m71O9J24L69
3919A22k57J5j07Q0L31j91k7j33P1J13r4k47L72k42K78l65o0J48N64j09k42q4
3941f4m7K34j25J4o0K13J05o5l06j2K48J33l20J9L01l21k4L8K51j18J23J13j05
3964B25j44O9l0j65J34m7J0L14l99j64L40K98l10N9p0R0k09j34J51J85lN4k01
3987E3j00L69q8j79k24Q8J27L55n20m2k31N73j63l65L11j10M34k38q3j98M66k92
4009e7j53p4L17K45l80m5k1n4K55l63N2k68M27j38M06k84k9j09L03j50k46K79
4031h7J52J06o81K62J05J24J58r4m11L00J43r2k8o2J94j92j3k11K74q9M74n56
4053b24j17k42P28j08j04q1J61M03q43K28J66K62o3Lj66J42l34J48Q4j36R2lj47
$$ y = [-279, -252, 141, -62, 65, -289, -548, -196, 15, -232, -46, -306, -29, 194, -379, 40, -4, -59, 31, -440, -371, -247, 122, -135, -120, -227, -147, 184, -7, -34, -167, -96, 17, -77, -324, 48, -194, 84, -281, -341, -193, 371, 262, 20, -64, -111, 123, -2, 12, -48, 165, 270, 205, -101, -113, 135, 268, -52, -33, 268, -53, -77, -39, 212, 94, 217, 330, 225, 81, 150, 120, -45, 89, 42, 52, 366, -33, -197, 143, 441, 131, 190, 120, 210, 1, -133, 18, 203, 200, 254, 53, -47, 322, 234, 55, -169, -81, 46, 401, -119, -161, -392, 181, 18, -347, -36, -146, 288, 50, -33, -231, 235, -57, -210, -284, 33, 278, -102, -147, -168, -222, 33, -330, -278, -546, -119, -257, 149, -135, -164, -273, 30, -120, -366, -87, 65, 171, -510, -248, -143, -19, 139, 45, -366, -66, 77, -15, -43, -105, 89, -103, -116, -327, -53, -142, 332, -224, -341, -583, 145, 37, -67, -148, 13, 416, -427, -199, -33, 229, 166, 169, 3, 145, -189, -41, 43, -93, -1, -4, -151]
4076a51K32J24L0R3n8m68J82L07j3k97l06M58J09j96m83N08M34l34J21l26O6r6
4098f4J85q1P3k69L66J57n90K71J64n2j52j58J84L10j3m30Q6L71j0k29k31K4J36
4121D8K64j77lj25J75l17J89r5R8k52L03P6l85J29L17m1m19R9M4K99k82Q9j61
4144a27L26jl39k99L99J1P9j99J24k0J45k71j78j37L04O0k77K39J69k47K94N0
4166A05l73J71J75k56J46J26j89R1j22J22K42j46m01J6L11L9n8r7n2O9Q9J0L04
4189C22l54Q8J2L7R8n42L40J41J5k84o5K88n7L8j40P7K88m36J17J25L7J27n86
4212c14M25j20Q0K58K82m80j84qK44P3j80n2n0N05l61m47N55o0kl47o6M30l56
4235a75J00L07j43J23q7j36K1J37j02M1j35J09m1R4r8nj9m2K70k64k3pO7M0j73
$$ y = [-151, 81, 205, 235, 328, 270, -198, -16, 291, 278, -19, -325, 133, 242, 46, -437, 71, 505, 171, 292, -34, 32, -64, 121, 40, 113, -156, 210, 367, -223, 48, 212, 160, 8, -150, 34, 344, 331, -99, -13, 358, 348, 119, -112, -88, 48, 312, 135, 132, 7, 182, -135, 54, -41, 57, -195, 108, 184, -201, -72, 245, 204, -215, -116, -72, 227, -55, 34, -127, 199, 198, -141, -440, -41, -30, 49, -150, -26, -46, 99, -172, -350, -487, -183, -123, -400, -161, 8, -239, 55, 105, -268, -97, 78, -178, -32, 94, -95, -4, -126, -4, 238, 92, -309, -293, 18, 57, -1, -98, -150, -81, 8, 18, 322, -32, 56, 68, 105, 203, -339, 1, 142, 157, -127, -192, 96, 39, 77, -63, 14, 302, -134, -17, 108, 145, 272, -314, 111, -9, 71, 329, 611, 131, -53, -61, 183, 256, 76, 24, -26, 479, 118, -329, 226, 166, 164, -183, -249, 181, -175, -75, 232, 89, 212, 125, -11, 10, 147, 45, 86, -49, 60, 19, 113, 15, 10, -9, -51, 219, -45, -68, -75, -8, 32, -141]
4260a41l3L55k64N4M8k85j22N47r2l59K02k80L40J41l70L41O6k97J92j89J24K98
4282B76l89j32j33K37K68k71J56j00K27m33j55J43r7P14k83n7m16J66N37j40k92
4303a74l38R9M15J45k47K60J71n54J28j16L96j18J08j75j98J46J39K87j85j89
4323@QJ12j93K34l44L10n4j98l45P70k98O6k9P1J6L27n14j21K04j66K54r0j2J58
4347A66K06j25m27j1K40J55j92J34K61l62N5r3k7J77R1o8k20j59K06R6K07l54
4369d4L53m0k7k36M08m40J51j26k10J57L45j00j16j49j7K2J35j12J37j67J81L0
4391A35l0j00q9J86j07j90K54k3OJ1j22k90O27m36L17k43q2J36N0m17K48L0L17
4414A88mo12M12nk3j04K94k66P0N7R3j92j69K70j21J20k23R3K35j98p6J06q4K10
$$ y = [-141, -174, 181, -83, -29, 19, -266, -388, 159, 67, -292, -90, -370, -30, 111, -259, 82, 148, -149, 43, -146, -22, 276, -113, -245, -378, -141, 127, -144, 12, -88, 139, -294, -449, -306, -403, 311, 28, -29, -445, -279, 258, 118, -174, -512, -413, 2, 147, -100, 160, 331, -223, -95, -211, 185, 67, 175, 0, -198, -52, 87, 374, 189, 0, 8, 120, -73, 161, -183, 127, 73, -125, -470, 300, 2, 68, 39, 110, 126, 453, -61, -182, 22, -144, 110, 20, 8, 166, 372, 247, -180, -191, 49, 204, 12, 146, 407, 45, 100, 7, -20, 157, 248, 180, -40, -199, 7, 103, 310, -44, 309, 269, 242, 6, 414, -26, 125, -1, -211, -54, 291, 191, 75, -74, -91, -69, 66, -46, 91, -76, 105, 135, 105, 5, -84, 102, -5, -195, 59, 36, 42, 53, -69, -359, 268, -168, 149, -94, -176, -40, 10, -407, -159, -129, 188, 184, -428, -16, -21, -44, -148, 146, -120, -50, 7, 100, -92, -261, 9, -112, 8, -215, -122, 113, -85, -161, -55, -139, 71]
4438G1j87J41N7l77N59k01M3j22n0L75m25K51k92L57k27J01k69K74k27Q5J48J30
4460B15k92J21l07K30j75M12j80q2J5j02L15j41p8J75J09l32K08Q1Pp5k25J9k23
4483c05M49M8j9L19o83O85k20k52p0O8j63K66p7J7j91L60j83k6J46k1l50L11j29
4506b0R5P1l28K28N4k92N55k30j05k82k73O87R7k09j46m2L95j65o12L43L91Q0
4528B92m21K67l93j6j04O05m79L34m6j49n3l16L54K70j18k51r4N09k99j10P2j2
4550a58MK02l71M05j61J92l98%%O0Q8q7K61l84K9J03K7m1J79K3K08l68L99j23
4574H9p2j28j28K3L87n68L16Q4K76l19J34k08l1K74m3p0j37N53n42K02j50O9j27
4597a16L96k4l16k2R1K17j53J21k96J46Q6J01j20O1J71r3m02J97p8k8M80o89K80
$$ y = [71, -116, 25, 82, -295, 264, 63, 106, -16, -66, 309, -116, 135, -157, 200, -27, 74, -195, 79, -148, -63, 85, 215, -77, 44, -263, -33, -208, 204, 24, -58, -43, -145, 170, 29, -49, 126, 235, -97, 111, 192, 199, 124, -101, -82, -305, 144, 192, 173, 492, -191, 494, 274, 22, -48, 20, -143, 123, 46, 63, -128, 232, 49, 23, 169, 148, -202, 109, -20, 75, 146, -182, 46, 100, -192, 363, 133, 28, -254, -527, 160, 257, 48, -98, -140, 255, 90, -522, -179, 212, 292, -129, 138, -255, -271, -375, 230, -249, 85, 39, -110, -163, -479, -125, 145, 27, -224, -318, 191, -108, -218, -146, -158, -154, 48, -323, 82, -79, 113, -285, -285, -285, -225, -137, -224, 37, -347, -318, -215, -188, -229, -50, -27, 181, -187, 212, 89, 17, -111, -239, -216, 171, -397, -81, 3, 279, -40, 94, -114, -145, 129, 86, 16, -121, 432, -110, 92, -58, 11, -116, 280, 256, -60, -82, 9, 226, 73, 194, -102, 44, 130, 231, 111, 172, 343, 250, -152, 45, -33, -61, 419, -270, 10]
4620A0L12k9l29j31N6L90k93Q0k22N6J02K30m2k7r9J0k00j76J63N01k98m94O18
4643A88m31K13N1R7j15j05n2L91m50L45j39J78k36K3M0J9J91l76K21JM9P4l68
4666a91j11J74M24j92k25j28K70o9J00j18j92K00K07j93m2L7rK31j58k50K93L3
4688I1j95N3k77L56P2m07L9J82J51Q1l02J54J22m6j79l04N55j01P8j32P9J36k6
4711A80j69m1l78L76J92j85M7k54Q7K85L2j60j59K95J16m23J47O0L38m22ML18
4733B86N0l50J15j38J78o7j88L23j76j88J75M44k47l31r7M48l4j49J17j10J60
4754B21Q8q2j25L12k86j23l53N15k89K84j00P7J04k09n9N0O8l84M51q4j63J85
4776I8M4J37k38l59K64O2j61j1L11q5q9j08j63K65R9P8q9j67M05l00j22K30l12
$$ y = [10, 322, 293, -36, -167, -111, 279, -14, 66, -156, -100, 2, 232, 190, 163, 64, 74, -126, -302, -139, 362, 64, -430, 188, -243, -30, 21, 118, 3, -102, -154, 237, -213, 132, -7, 171, -65, -42, -2, 17, 208, -168, 53, 54, 103, 177, -191, -302, -128, 296, 104, -121, -249, 21, -48, 52, -66, -258, -58, 149, -44, -86, -49, -58, 173, 15, -235, 58, 91, -104, -51, -328, 28, 100, -307, -268, -86, 65, 146, -156, -2, 120, 74, -105, -409, 146, 45, 123, -9, 70, 206, 180, 11, -30, -408, -32, 160, -25, 22, -232, -145, 140, 172, 12, -147, 148, 264, -159, -12, 48, 386, -36, -32, 286, 336, -14, 101, -37, 141, 74, -114, 209, 33, -155, 20, 464, 217, -114, -211, 237, 203, 54, 171, 61, 221, 309, 227, 102, 414, 128, 5, -348, 167, -122, 162, 62, 139, 243, 34, -25, 25, 93, -291, 160, 76, -87, 98, 142, 279, 41, -318, -54, 8, -153, -164, 147, 62, -27, -135, -298, -33, 66, 144, 55, -112, 293, -7, -129, 101, -211]
4799b11J28m0L0j12p0N63j26l24r1O0K8M8K06k29L35r9r6j25m7K19J23m10J98
4822d2J45r5j6M0J02l99N09l00J20j0J6J58j67k41J61K05P1k38p5L15j92Qj01
4845b6j38K68L49m45K98l36Q8j65M11rj16k28K18l4l05J86J14K2k61J91l04M02
4867A80k4p9l03K51J47j4k56M38l69r9J18J50M0j53k0O0l13J06L34N2k43o0J94
4890A37j24k4l40K64N26l70N0O8k04P0j19k18KL68m31L44r4J26J15n3J8l15J09
4913i5lL08k33K43l48K89k03k14J43j36M77n90K25J05o9L8j65L2m0m3L03l72M69
4936A21l12K76j80j62R5K4M25%k52K07k30k37k5K56K08l07p6O3k1J68r1M7M6o7
4960b4J20k11J28j75J97jJ37l24K76J55KJ79m37j55K53m7P0j23K0N3K84n50L16
$$ y = [-211, -83, -123, -93, -205, -275, 288, 162, -162, -253, -193, -165, -117, 89, -140, 195, 96, 0, -125, -172, 47, 170, -240, -42, 103, 8, -8, 32, 134, -265, 244, -56, 64, 54, 70, 228, 61, -180, -19, 186, 257, 19, -56, 259, 67, 75, -26, -164, 104, 453, 8, 306, -30, 58, -107, 304, 295, 179, -49, 169, 135, -170, 16, 130, 152, -109, 82, -222, 180, 156, 77, -226, 25, 172, 158, -98, 340, -29, -128, -10, 140, 180, 27, 7, 67, -246, -140, 194, 246, 3, -57, 137, 13, -11, -351, -87, 439, 69, 119, 187, -17, 53, -66, -284, -282, 86, -345, -1, -95, 31, 146, 93, 111, -204, -95, -98, 210, -23, 220, -128, 161, -42, -256, -113, -249, 228, -362, -137, -32, -101, -63, -228, -196, -236, -279, 24, -348, 121, -191, 85, -95, -257, -162, -138, 287, 287, 35, 242, 12, -225, -250, 6, 214, -93, -169, -106, -127, 41, -50, -3, 43, -24, 96, -115, 13, -162, 35, 34, 171, -153, 123, 278, 280, 459, 22, -133, 120, 73, 143, 20, 40, 93, 377, -173, 143]
4983A43o0pl29L05P9L6j65K73J95l83j37j7K27j82J76m3l4j63K17N8k04k39J69
5006h5P1J81J66l76l0L64p2n0k80K25l24L52m62L42J18j85N22l08k45j15J67K51
5028B27l67j4J86J94m00J97j17J19j6k14OJ63K7k6k6K18k56K53j43L63k23Nn1
5051A05k4j31l88M07j49K71m51L98k7k4N8k35M16k19j20rJ87j19mj06j49J96L79
5074B62k65J0j89L40k19J83j23k32M32p0j29j60lQ4O8O6Rq9N8J09l2j15K7K24
5098B46k86M4K3m9J74j74l18J97K90l13J65M5l0oj8p9j9M47q1l57K2L87k79K65
5122B96j40L3o3J02j80l18K19j34J01K33N4k37J63P9k11j56J57L68l51j06J4j0
5144h7K42L8l04J93J00j59J9k17K62J7r0J35m10L56p0n4k08K54Ml73L25k50J47
$$ y = [143, 83, 76, -253, 52, 131, 167, 2, 275, 470, 87, -50, -67, 160, -22, 154, 111, 77, -86, 131, 189, -15, -254, -85, -14, 167, 333, -43, -73, 291, 219, 169, -111, 114, -210, 142, -320, 22, 140, -45, 477, 169, -76, -191, -24, 227, -140, -154, 32, 226, -174, 23, -94, 25, 9, -205, -199, -36, -9, -35, -61, 157, -99, 154, 11, 374, 151, 156, 105, 81, -50, -438, -31, -180, 91, -360, 38, 11, -13, 45, -190, 226, 7, -113, -122, 65, -54, -58, -164, -313, -117, 262, -3, 7, -182, 158, -61, 122, -1, -233, 199, 129, 0, -160, -163, -79, -11, 55, 64, -25, 33, 142, 110, -5, 22, 246, -40, 4, 27, -22, 152, -22, -340, -143, 147, -166, -1, 44, 14, 8, -10, -89, -108, 339, 258, -99, -77, 310, 31, 296, 156, 189, 126, 228, 48, -270, -51, -185, -84, 149, 203, -34, 129, 208, -3, -159, -2, 366, 15, -91, -77, -87, 155, 193, -111, 82, 182, 23, 42, -175, 87, 104, 14, 149, -261, 95, 25, -29, -237, 17, 21, -352, -27, -277, -130]
5167a30J50L9m7N4m1N1L85p80L02j86J43J93n15J53O0L98j04j98j63J85j66m0
5189b57K03l11N63J23n43L13k10j29J09K34j40K27j74j1j01K63k79K74j38k80
5209b64M4L42j27j37J35j29J59k90K02J16O1r6n9j77J51j89L88j08L74j96k95
5230i5o9K23j04j6K0K45l20J18J39j2j60k3r3J99K81k62k97N16n9j52p5L32j12
5253B24j01l87K98J68j52J22l8j60K68j70p4K24l06M94m28Q4j48J47k6l9J10j39
5275b9K63r6j07J74l07L16k02o8r9J14j74L3L13m73J75J18l1nQ0O4j68L7K55k00
5299a7K6n9l74J08K28m0K33m90K13P6K61p6j43lJ15N3j21k49K00K42j67j8J93
5322A91k79j76M11k27J43m8p7J43k47K48n5k16o1J26J05K22j91n9L8N8k9j64j0
$$ y = [-130, 20, 59, 12, 66, 25, 76, 461, -319, -17, -203, -60, 133, -382, -229, -169, 229, 125, -73, -236, -51, -217, -257, -54, -365, 198, 321, -222, 91, -119, -248, -139, 95, -45, 182, 8, -3, -104, 159, -120, 154, 16, -264, -220, 122, -5, -142, -7, -136, 23, -267, -65, 51, 112, 16, -43, -220, -69, -258, 130, 22, 396, 200, -95, -164, 59, -45, -61, -41, 204, -116, 2, 141, 129, -31, -54, -147, 52, 333, 71, -226, 290, 231, 79, 4, 336, 224, 123, -264, 34, 202, 50, 172, 134, -26, 242, 72, -2, 222, -84, 410, -18, 66, -82, 65, 39, 0, 110, -29, 234, 138, 31, 205, -102, 214, 12, -56, -155, -41, -215, -182, 131, -342, -167, -49, -80, -85, -5, 59, -109, -72, 183, -17, 9, -50, -424, -316, -88, -128, 105, -385, -172, -96, 165, 89, -54, -57, 58, 111, -10, -259, -59, 183, 16, -2, 191, -88, -264, 147, -80, 63, 15, -62, 81, -166, 82, 27, -189, -250, -124, -19, 203, 12, -47, -9, 49, 20, -144, -154]
5345a54K42j24N5p5P2K09l40l1p2M0J14pm4j28J20J2J08J81k21J44o3J97l73L6
5369a02O2O5K04j59q6J15J2j33l2J3l3J16L7k01J47M5K6j49k7O8J76m40L18L25
5393C67k03j56j29N4k07M47r2j59k4L17j36N8l28L94p3P3m32Q2NJ21J64k64o1
5416a82k3P3q0J97J65nj20Q7K8J03l77M51l13k15K49l12K86j83J76q1J65J70l14
5439e5j76J78j42M44k31j96L64m9m65J74M9j55OK27l12J27J84J43LN8l16P8J5
5462d7nn8Q1O7Q2j29r6K04J10o8k06J46L6k29R5m2j51J19O0rk5K36O8j36j97J49
5488E5J4p4n7J00K11N5l52N9l0K43l90M18j71J99j31r8j2j75K62L48k40k83K42
5511A93J38j48k61j4j0j45K95P5j7J74j91R2pm29N3L14k90O8j82N82k72Lj58j57
$$ y = [-154, 88, -36, 19, -56, 16, 225, -115, -146, -218, -178, -64, -71, -115, -243, -123, -111, -3, 178, -43, 101, 38, 235, -138, -102, -40, 25, 229, 70, -16, 99, 111, -22, -54, -41, -74, 42, 79, -122, 25, 70, 96, -53, -80, -12, 164, -276, 42, 367, 164, 8, -121, -67, -274, 173, 81, -78, -102, 215, 79, 137, -191, 203, 130, 203, -229, -147, -142, -21, 143, -121, -182, -205, -132, -212, -15, 150, 145, 25, 112, 140, 243, -134, 317, 4, -211, 38, -274, 12, -171, 5, -76, 89, 259, -55, -231, -53, -195, 249, 18, -178, 186, 137, -328, -154, -105, -260, -254, -27, -339, -212, -28, 115, 118, 176, -140, -62, -47, -52, -110, -29, 38, 120, -9, -105, 99, 209, 141, -65, 81, 117, -112, -17, -59, -210, -91, -31, -40, -65, 171, 239, 103, -94, 55, 69, -5, -62, 38, 249, 304, -48, 11, -19, 224, -166, 252, 81, 280, 149, 51, 39, -136, 126, 474, 234, -49, 193, 331, 183, -78, -92, -102, -247, 48, 123, 106, 280, 89, 181, 174, -255, -202, 112, -178, -110, -292, 290, 18, 21, -137, -294]
5535b94L36l0k22K5K46k5O9j28L15l45O6k00J79j12M41Pl76l9mR7L17m75j16N01
5559B33j29K01n24J90rJ17m37K83j47j26M55k19K73m47L47l05J30j0j77K41R1
5580C1j39n7K25l03R6j02L34k57J9J44Q8k35J74J9M4j74m5kl6J56L7j02J13r0
5604f2K8J46M3k78J52k33K59k76Q9L11l51L22j72Q3l5J66j29P1k34J07J10O3n
5627A75m35K24l3L04k29rr5L57k71j96K66k6M52k88q7k55J52j54J26k43K76R9
5649A10k13J25K45P2o64K62K79l16J41K1N0q8l77N72l72Q5J26K4j67K99k24j41
5671a51J66n8n8J3K48K15m30J2%m0K86k84K4J0j94K36K48j73q3J02l66J79j45
5694b43l3M80j86j39n9K83J4k23o8j74L61l07J34p7N30n53K62J77k42K77k82J27
$$ y = [-294, 42, 12, -210, -185, 61, 36, 105, -23, 292, -53, 13, -187, -8, -120, 321, 328, -48, -87, -91, 6, 323, -152, -268, 233, 104, 305, -219, -29, -38, 79, -358, -75, -222, -348, 107, -112, 161, -286, 61, -244, -114, -124, -301, -60, 31, -108, -165, 60, -243, -147, -249, 85, -172, -153, -9, 79, -156, 18, 37, 81, -93, -138, -140, -176, -20, 17, -85, 28, -62, -34, 112, 155, -123, 29, -204, 55, -221, -132, 179, -172, 150, -22, 61, 26, 192, 63, 134, -100, 7, 117, 180, 175, -260, -36, -69, 235, 6, -3, -98, 259, -12, -208, 58, 32, 484, 196, 109, -146, 6, -148, -22, -265, 11, 110, -103, 22, 267, 339, -325, -63, 216, -100, 41, 62, 112, 24, -353, 219, -153, -68, 58, 82, -85, 214, -10, -151, 15, -43, -101, -88, 160, 375, -55, -43, -43, -83, 203, -81, -57, -47, -241, -5, 243, 70, -13, 89, -277, -98, -243, -276, 204, 18, -121, -180, 103, 117, -106, -174, -348, 13, -294, -160, -237, 293, -260, 2, 179, -63, 214, -68, 59]
5716E9j59n9m6N6J48K7q9R2k80L18q6J16K6l13J06j17N68l12l00K68k58K01j21
5739a55L38l02J19N8J38q1p7J9M8k16j0J9J76j04J27j46k88K40L57m31k3J62J28
5762I6J24m11K53K12j42j21J01j70J55P4Q9j07k17r3m6J98K11l53J00L00k92J65
5784A26j6n7k67j35N33k33L71k00k51J38KJ0l6p5L6K12k80n6K56L28o31L74l78
5807b29O5K2L43l04LK4K26n47J54Q8k34L20L14k98l8J9Q1m0k34M5K83j37J98j97
5831g3k37J59J20R4L9J54l80K58l91O8L54J43o85K24L61p9L04o54L82O8l22P8
5853a5l3J89j84K13k19L0Kn0J26j30N2k60O32o35K93J36j49M4p1K43l18K44jk39
5877a00L41k36o8L24j59k96j1L42O1k30j03j24J28J76o9L47k52R3P3l65K44J97
$$ y = [59, -100, -159, -205, -149, -1, 26, -63, 29, -251, 67, -19, 97, 123, -190, -84, -201, 367, 55, -245, 23, -235, -34, -155, 183, -119, 0, 58, 196, 115, 38, 57, 105, -111, -121, -102, 74, -30, 97, -49, -337, -97, 260, -171, -194, -32, 96, 220, -191, 62, 274, 132, 11, 112, -58, 97, 171, 260, 153, -64, -157, -203, -5, 206, -147, -47, 253, -39, 126, 110, 53, -214, -349, 184, -49, 322, 122, -129, 9, 11, 21, -15, -90, -54, 158, -122, -178, 78, 406, -225, 149, -229, -164, -142, 201, -103, -100, -76, 150, -397, -243, -155, -389, -69, 245, -53, -91, -72, 9, -31, -265, -220, 63, -74, 124, -73, -310, -151, -31, 63, 102, 256, -124, 134, -257, -189, 165, 308, -377, -153, 208, 129, 433, -221, 161, 229, -93, -15, -48, 141, -43, 170, -49, -19, -17, -67, 59, -71, -19, -279, 353, -282, 11, 147, -2, 42, -29, 214, -104, 140, 139, -100, 241, 5, -63, 261, 102, -194, -205, 137, 198, -32, -135, -259, -131, 45, -24, 323, 71, 164, 237, -128, 116, 313]
5899C13k17j07J5K56l39J35n6r0k95M24J77k3j44J11j76k18L89k65J36q2J1K17
5921A72m8n47J04K07M6J07j61J66P3k48K39J71j95l16K53L5k0j09K16k45Q1qj70
5944a97L61j37j9N4m64J90M54l76N8Q6n9m6k08K0L97m14L01K86l82j13N4K43k0
5967F9k00K72k66L83m60J51m5J22O7q4l0j25J45J56m35J23K54j1L3JK06l41k8
5990d3N3j79J56K31m88M76k26p9J45N3j20J5J25l37N09m10J89J81k68J42km2q
6013G3N1j20L5No4RK00P9j32j41j11L9l6K09r7l5J16QJ14p4j48O0J92j96k08K66
6039I4j78J28Q2q1K77k04J16j65O3j37j11J30M1j66K23j92jn6J0K0p1K18k02K45
6063H3l7j43j95L02J12N2l65Q1J45j07l7K17l23p4M59k65L8k4J32O8j46Q2k66
$$ y = [313, 96, -11, 4, 260, -79, 56, 0, -90, -385, 39, 216, 193, 49, 160, -16, -234, 155, -110, 26, -56, -45, 172, 124, -423, -319, -112, -66, 41, -120, 46, 119, -129, 110, 281, 86, -230, 23, 58, 38, -71, 145, -100, -19, -27, -197, 164, 27, 8, 62, -402, -212, 242, -134, -76, 10, -49, -95, -303, -283, 114, -300, 1, 287, -95, -208, -154, 89, 69, -131, 141, -125, 258, -202, -51, -96, 26, 93, 9, -21, -146, -1, 155, -280, -157, 97, 86, 119, 120, 326, -15, -43, 10, -169, -13, 218, -270, 206, -20, -99, 46, 99, -21, -6, 119, -218, 291, -119, 70, 251, -17, 125, 123, 81, 73, 124, 4, 39, 44, -20, -11, 189, 268, 136, -5, -116, -77, -113, 96, -1, -36, 80, 88, 202, 128, -20, 40, 232, 36, -172, 94, -84, 44, 126, 45, 322, 118, 234, 69, 132, -5, -116, 14, 55, -111, 112, -80, -81, -137, -127, -107, -178, 40, -162, 83, 46, -97, -292, 10, 122, 174, -191, -110, 35, -72, -109, 108, -215, -289, 170, -95, -57, -81, 51, 119, -27, 55, -211]
6086b11L93j2m06L31l6J66k16o5J2k5N3j7R0l16J66K18l13L66qk55J7Q1l8QK38
6111B21j40m0r5J46l07O4K8K81r8J00j21j36J3Q0K89k25j18J29j21K10r8P6J15
6134B53l20j85J96J09L1R8j99l6J68K22Rl28OJ0j41K38n2j76L95k79L3n97J59
6157c86K58l9K24M6j52L51l31j98K70q5kJ35j28R0k1J3k58J33J41N3l16J44j40
6180a98L80m87J32J17k21K72K99j80j31M54o21J2J44N8n3J14k04j98K77l82L31
6201h5R5n9k87M77k2j00n6J04j33O8J01j84Q6J78k77L4k3qK33q1m7o6o9K07l56
6226b70J62K26nl8k86J49O2L6J13l30M2J66l04M75j32j49k9K2j87L92j45J53n2
6249G1j24Q3m5Q3p2K1k06K70n1j03j25L84j09j6q6L04m27p1R8k07N9J99J28J89
$$ y = [-211, 182, 170, -236, 95, 59, 225, 9, -56, -44, -69, -16, -33, 57, -259, -93, 125, -188, 178, 170, -85, -68, 13, -25, -17, 221, 81, 41, -54, 92, -215, -151, -123, 158, 60, 160, 39, -97, -84, -4, 285, 60, -58, 71, -50, 160, 62, 138, 253, -67, -252, -56, 53, 84, 182, -17, -53, 115, 337, 346, 18, 24, 34, -107, 131, 79, -97, 298, 19, 52, -545, -386, -128, -167, 57, 103, -49, 302, -29, -227, 43, -42, -44, 91, -37, 53, 32, 45, -213, -80, 61, 114, -202, -58, -198, 182, -305, -173, -56, -277, -5, 294, 114, -17, 437, -184, -172, -28, 30, -23, 91, -113, -311, -34, -416, -85, 10, -49, -336, 141, 119, 19, -37, 67, -66, 2, 103, -81, 5, 183, -94, -60, -83, -91, 142, 61, 14, -52, -121, 86, -270, -108, 118, 113, 75, -211, -62, 0, 36, 149, -181, -139, 27, -277, 198, 66, -83, -112, -90, -277, 115, -30, 123, 71, -53, 30, -15, 68, -4, 17, -189, 81, 30, -73, -198, 186, 77, 61, -25, 279, -148, -219, -121, -328, -269, -70, 58, 247]
6273B47l8p0J3r5K98m77j69K64m8N0j1k41K70j4L53k91M2j73j0J99j38L3r5J9
6297h2J26m39J31L67m21L79q3L11l10k99J98R0L1l0k70K87j76L16k23N22r5l29
6319AM9j79J52L03k21K3m0J11j39r0k20K73J1L8j50PJ94j42n0j38K80j06k58M3
6343b48L13p8L1r1N8J38m27L82N9k39j85P6L09qo9j18K10l64P9Q0N4J10q4nLj03
6369a17o5L25j88L14m7k74N1K74o63L63l9J69j89J74K05j39k81J47j05Q4N2KK02
6392B55q4J3j13R8j62K3n7Kj95L88L3l85J39K9K12L7m87K62r1J78j71j93K43l55
6416c81N23l5j14J18n6J11o1j94K57j72K23k33K8M2pM6l9q5J59N7J41k98J26j07
6440D9L27l04j79L60l29o8K42J38l11K15l17N7m7K71j95k8J62j06j10n7L58m98
$$ y = [247, 209, 139, 152, 57, 355, -122, -291, -27, -75, -25, -36, -277, -7, -21, 332, 41, 83, -90, -100, 99, -39, -6, -101, -82, 44, -395, -264, 103, -318, 61, -22, 289, -21, -320, -122, -32, -1, -31, -301, -14, -190, 126, -97, 425, 330, 1, 50, -129, 23, 326, 105, 128, 88, 199, 60, -30, -250, 23, 34, 72, -78, -71, 123, -19, -69, -207, 73, -33, -291, -248, 65, -13, 18, -73, -15, 123, -304, 78, 137, -102, -287, -211, 98, 90, 21, -97, 113, -251, -172, -92, -38, 72, -12, -17, -14, -117, -182, 143, -45, 269, 222, -52, -1, 273, -390, -27, -66, 103, -86, 88, 293, 154, -127, 20, -85, -1, 51, 53, 255, 171, 184, 71, 169, 7, 30, -27, -25, -220, 168, 201, -184, -45, -16, 196, 233, -254, 8, -83, 95, -76, -269, -26, -381, 142, 107, -7, 111, 55, 166, 105, -89, 168, -4, 219, -14, 14, 56, 49, 95, 56, -29, 130, 187, 328, 30, 156, 49, 376, 72, -107, 253, -76, -144, 98, 236, -75, 140, -177, -120, -167, 104, -91, -119, 43, -63, -173, -230, 128, -370]
6462c70L29j15J7J00k8P4r9J0K59m8K5k21K12j67j10J69J04M3l52L02j04k34J33
6485g1P6j27O8J92k01kO2j81R2K2n1j21L54j8j52J40M14j35j84j66M1l15K90o6
6509c9K24k79J5j14J77jj01n7K26J71j44j20j49J91j79J79m0J51k42J09J37J03
6531B18j10j01J13j78K22l46N7K23o0%j56J8K24n3p1lPl7j43L81r9l1k54L55p6
6556A00j64j34K95j7R3k1j19j27K47K7m29M0K43O5N8j03J30J1l52J21k34J05K18
6579E3k06K12j74K54l23K08k46L45k81K21m44J12N06m80J16J26j44J60J89n01
6599b97K18p4J86j79k01L32K26j00k11j09M34n94M27r7L0MLr4J81j76p0K24m32
6622c69L07P3K06K4k41k15L00q9J36l55K58j61K25k7L6l34M17k41J76K7K7j07
$$ y = [-370, -41, -156, -139, -39, -67, 7, -92, -82, 177, 129, 154, -67, 145, -22, -132, 37, 141, 184, -168, 134, 30, -204, -71, 5, -122, -54, 138, -63, -65, -3, -184, -92, -70, -121, -242, 112, 94, -58, 82, 496, 361, 177, 11, 52, -263, 27, -39, 185, -94, -79, -193, -16, -17, -118, -175, 51, 222, 78, -42, -191, 0, -179, 0, -40, 111, -131, -22, 115, 218, 108, 7, 120, -58, 164, -182, -125, 98, 38, 38, -118, -100, 124, 71, 0, -3, 4, -33, -176, 205, 106, 75, -179, 176, 100, -64, -198, 97, 80, 173, 152, 33, -94, 153, 180, -249, -209, 34, 99, 157, 54, 184, 195, -157, -36, -270, -165, 53, -153, 59, -115, 139, -184, 24, -222, 123, -158, 63, -381, -269, 237, -243, -127, -1, -145, 15, 204, -297, -79, -153, 33, -146, -347, -15, 211, 111, -100, -209, 225, -369, 58, -39, -9, -5, -2, -96, 85, -91, -161, 63, -369, -62, 11, 217, 241, 0, -215, 85, -4, 132, -223, 35, -126, 99, 72, 108, -226, 191, -50, 126, 153, 180, 73]
6644G3m3p1j50o0K92M9j31P8j22Om4J47M07j55m61q6M74k71J19j76L06N1l22J76
6668H6o0K00k49r3K99k27M9N1j6L74o73J99k7M5j46K40k65K05L46l03l8J27L6
6691A60J16j95j75k5Q6M7k5j1K54j46k84J90O2p0j47p6K48Qj64L01j95Q7nk47
6715b06n7l3K4K07l0j89L22r3J7N4l20L53j40l0J41Pk42K2K19k69J71M62k03K15
6739D02m94j00K84j90j16L40j07mj70L60j23j16M9J05j60K65L4j05q4m3M6k02
6761a29J95j39J31N8J56k38p6j1L29k46J57j24j83L1O0K03k90P0J02k96K70j32
6783a02O9j29J94j22j61L87J01q7j4l25R6J32pk41P2K0O5j60L10n3K05j18j66
6806c4j90J80J88K9j0K2k68K72m00J91J07m1Ok47J27J20j08J60j50l1J89K5O3
$$ y = [73, 30, -41, -191, -251, 41, 90, -41, 37, -85, -79, -123, 24, 431, 276, -185, -271, 203, -68, 51, -125, 181, 232, -90, 86, 26, 226, -23, -116, 183, -44, 5, 56, 40, 414, -259, -60, -87, -42, -188, 52, -213, -8, 338, 35, -3, 124, 160, 276, 81, -94, -119, -33, 14, -11, -22, 232, 86, -198, -8, 54, -16, -163, -239, 9, 17, -147, 154, -41, 46, 41, -206, -263, -296, -272, -65, -95, -284, 38, -55, -38, 16, -304, 49, -91, -121, 20, 27, -215, -193, 26, -243, -72, 390, 187, 402, -92, -192, 92, -98, -214, 126, 19, 15, -155, 205, 82, -34, 15, 120, -40, 225, 259, 154, 70, 27, 73, -129, 66, -73, 58, 116, 272, 34, -42, -53, 276, 30, 187, 63, -120, -89, -29, 174, -116, -46, 56, -240, 30, -102, -33, -162, 32, -90, -251, 136, 237, 150, 136, -189, -93, 39, 32, -209, -137, -117, -52, -212, 98, 45, 250, 132, -34, -224, -44, 144, 173, 163, 185, -83, 189, -211, -20, 87, 46, 52, -195, -68, 52, -56, 104, -46, -77, 112, 137, 200]
6829B00l98K88l20J0L45l79K47n5r2K34j92J15j18J64j34m8lj7J46j32J9L41l28
6852a07q7Q3m2M70k76k44R3O7J14q8k8J6rL3j46j18L65j8j91L49j0l74K87L5m6
6877A28j66j50q7L17L0M4o0O9k09L57j87j07l7l0J53J32k16R6L8J9Qj05J33q6
6901H4K36r7M4m00N8j41K03M69o66j8L19j58N2j41Q1K93j79m8l7o2K76j86J60
6924A42n3l0M5r6o1o5N9l0j96J78J89n1j21K25M6j33N0j67q2K55k66K94J13n5
6948A90m18M00n0K3l10K82k93J57m0o0J48j25j01K25J1m9Q7m05M6K23J15L0k14
6971a28K21k85L19q3j29j20L88m09j34J77J16L69j96mO2ol82J86Q6l16M3K82j12
6994e5l3L5K94j59j02J7J70j76k2k99M72K5j08p0p7J03j80L54k47N6j79j4J04
$$ y = [200, -198, 90, -230, -220, 125, -254, -7, -62, -154, 80, -112, 3, -115, 49, -85, -133, -136, -153, -7, -139, -120, 221, -107, -194, -111, -153, 317, 41, -203, -110, -43, 71, -17, -45, -29, -38, -5, -151, -269, 96, 78, -113, 236, 226, -148, 139, 174, 128, -38, -188, -275, 42, 72, 116, 56, 125, -84, 273, 86, -21, -58, -88, 65, 197, -19, 77, 115, 134, 142, 37, 170, 84, 320, 223, 267, -133, -75, -216, -13, 456, -210, -228, 91, -67, -15, -156, -75, 218, 39, -9, -46, -108, 168, -18, 142, 89, 59, 104, 8, -53, -118, -59, -89, -285, -107, 82, 31, -90, 135, 181, 48, 98, -69, -151, 104, -162, 132, 245, 190, -228, 172, 122, 145, -165, 117, -176, -19, -59, -119, 29, -96, -197, 28, 39, -10, 77, -328, -282, -59, 56, 86, -128, 93, -192, 127, 44, -85, -205, 183, -226, -360, -183, -67, 302, 106, 102, 164, 158, -224, -38, 48, -268, -225, 57, -55, -88, -53, 241, 82, -20, -3, 167, -9, -31, -330, 142, 167, 59, -11, -88, 15, -165, 189, -58, -2, -181, -195, -91]
7017i1K66j27K24j48j84j04K06j77K19J98l81M16j21l19K3L9L20ll84q7R9K15
7039I9J27k65m3j86L93P1j65J76l40M8L00k53J90k43K81j41j31J41k96K99r8j66
7061b02L85j45J8O6k98K55j70J55k93p8K40J98k07K31k26K01j65J9J01jj86K28
7083A26o0J10pk82j64J29j28L90r9q1j9Q1j64K10j17K85k78J91l89J53J47R6L0
7106A60Lk58j71K66k37M07k13L78m18J24m9K07k38q5J32k46J89J39q4P1K25l45
7128d3j7k77L87l8j61L42j32o9k37M96l33M5j43M42j3l60L20k44J7l7K3j24K10
7151E4j40L2q2J01J42j09L84m12k22J0K13k55L40j23M38o33K51K8M2J1o1K1k01
7174a71p1K62M3m56M96m55N24k23P0J49j74N1P7j1j69l4J16j08J19lj5k66J08
$$ y = [-91, 175, 48, 272, 124, -60, -164, 42, -135, 84, 282, -99, 317, 196, -123, -100, -61, 259, 256, -128, -215, -116, 99, 226, -39, -82, -268, 125, 196, 31, 207, -133, -85, 215, -38, 152, -91, 190, 49, -82, 59, -237, 62, -36, -202, 183, 38, 56, 122, -176, 79, -91, 64, -229, -307, -67, 131, -76, 155, -71, 130, -35, -16, 85, 84, -102, 126, 66, 176, 169, -113, -277, -148, -276, 114, 15, -66, -85, -4, -168, 42, -75, 210, -68, 123, -266, -113, 34, 130, 160, 163, -95, -266, 0, -237, 170, -43, 335, -83, 41, -8, 199, -39, -124, 8, -238, -49, 90, 6, 77, 302, -43, -60, -337, 50, 12, -149, 193, 61, -8, -245, 251, -82, -37, -180, 262, 249, -111, 209, -35, -18, -55, -32, -156, 54, -86, -54, -136, -35, 107, -2, 382, -30, -252, -242, -29, -284, 56, -67, 371, -262, -11, 17, 59, 70, 9, 30, -171, -242, 20, 63, -393, 103, -352, 172, -51, 19, 168, -6, 45, 122, 111, -58, -92, 24, -84, 35, 32, 17, -249, -141]
7197a41n4J93J34n4p7j23J58L51k34l22J1J80k31J48j77L12l81o6L42l4J00J61
7219A96j31l02M16j01m8k74rM95l26j17M2K08R0l36P7j02J95or1J78j69L5L56
7242B76m51r0J53o4Q9l1L12N2l30O7k95J67J05k20L25j83O7K73Qj5k43J41j18
7265eJ37l23R7l5P5O9k24K89j82J34J78l02M0qJ99j05j3j18KJ47J38j69k76K05
7289e0j3m4L47l18J17k39J97Jk95L20j22p6L51j27J35l04J89pj39K94k35m7n4
7312a19j16L18j16p1J49J69j32j31L2J43J79l58%L45k81Lo1J55j3pj29l0K7qj40
7337a92J07lj48O4j32J80r7J52J16n6K3j16pL06k24K03l62k6J21L2P1j23L54m03
7361a60Q8j9K26J26k26l02N12m32J67J94l60J76l35J48J83K1j58K30k09M07m77
$$ y = [-141, -195, -2, 132, 78, 1, -122, 36, 387, 153, -169, -158, 22, -209, -61, -238, 74, -307, -373, -31, -65, 35, 196, 65, -237, 179, 78, 30, -244, -253, 242, -84, -201, -159, 49, 139, -197, -120, -222, -27, -33, -124, 54, -115, -80, 276, -175, -265, -112, -176, -87, -118, 194, 246, -84, -17, -312, -145, -40, -260, 65, -118, -51, 222, 230, 215, -28, 113, -5, 132, -191, -94, -129, -54, 15, -209, 80, -102, 32, 210, -92, -52, -60, 139, 34, 21, -97, -95, 52, 190, 21, -255, -50, -63, -107, 240, -78, 39, -200, -3, -2, -297, 23, -99, -175, 176, 49, 184, -120, 69, 62, -77, 217, -18, -65, -119, -235, 83, -33, -104, 45, 214, 82, -49, -17, 126, 305, -53, -53, 292, 11, 14, -47, 108, 95, 88, -41, -71, -44, -52, -192, -85, -88, -236, -172, -304, -124, -221, -69, 47, -9, 14, -102, -109, 197, -27, 176, -186, -212, -91, -59, 12, -111, 243, -160, -72, -91, 135, 261, 35, -267, 245, -187, -20, 174, -186, -10, -345, -197, -14, 7, -151, 79, -130, 277, -200]
7382b00J76M0K51k20J09r4j20J99r4l27L34o8p8K28j25K30l52K84j70K45k88J2
7404b8k80J62K81J2J28o12K45K99j80M4L2j8j20L39n21J83J0k44L27k3P2m4j12
7427d8K60p2m22L59R0j45J1J76l39J14L89l76J66l21J52j27L9Q6J78k0j91L2L09
7450C00m86N1L88k64J63m3J37j79r2K10l97M60l50K21j58k58K36Oj36L37k48J78
7472G6n0LR2J0J06m1l02j29J71oK61j2m78Q7J22K25Qk08J72r6j69M41k95l3J61
7497A16j45r9J38n4qL5J11j69O0K57j56l42M15j42j59N2K0J64k02m4LJ75j89K41
7521G8n0kJ94m68L79k08l4J89K1K4j26j50K90J12m15J89M4j55N6J04n4K25j71
7544G2k09J59Q9J84n85L75R1L3n20M10k2K23l08Q3j65J14m6n0J04P9m75K69O4
$$ y = [-200, -24, 16, 267, 47, 156, 62, -58, 141, 47, -280, 54, -14, -92, 136, 11, 241, -111, 173, 3, 248, -40, -28, -308, -146, 135, 147, 275, -337, -92, 207, 27, 71, 103, 85, -35, 304, -217, -34, -24, -268, 59, 36, 108, 64, -48, 212, 140, -282, 77, 167, 22, 33, 209, -130, -16, 373, -3, 163, -158, -6, -133, -94, -8, 170, 150, -41, -9, 300, -186, -135, 253, -11, 152, 109, 246, 67, -25, 185, -212, 248, -102, 119, -39, -297, -61, -55, -191, 146, -102, 76, 26, 29, 121, 131, 237, 196, -106, -235, -64, -70, 191, 179, -299, -212, -90, 135, 143, -65, 107, 11, -158, 283, -12, -45, 116, -29, -128, 10, -44, -52, -17, 94, -75, -15, 242, 86, -256, 159, 17, -142, -90, -70, 94, -108, -152, -149, 26, -163, 78, 28, 26, 220, -248, 131, -77, -111, 78, 99, 123, -3, -153, 137, 249, -166, 23, 67, -88, -32, 72, 18, 243, 72, -137, 22, 111, 295, -290, 85, 176, 209, -311, 99, 77, 300, -8, 75, -90, 24, -22, -72, 32, 111, -364, -95, -31]
7567c1r3K69j44k30L38q4p0J30Rl6j3R4j86M23l96K63l32J53j16k35N8M5k08M00
7591Hk10P1K29M3k33jJ99j33J92L2n1m60J38L02k72O8L53k39P2l28j5J31J74j53
7615h3K3o8L58k35o0l50N36j73J66l6l12L04M8M5j41n1J14l09K10K20ql39M9K6
7639f6L3l5o3J36K15n49J99P6N7J35j88l6K60j64K26m74M35M9n8k23J7J0J6R4
7663A02j99J1j27M94k89k44K63j0k42L2l0J35L7R5l33K43K88l02J07k12M8J80
7685D7R2j48n7J40k86J85j01j11J43j25L99k44N8J9J75l7m8P0j63O9o3J8MJ68
7709B04k82j08K03N0K9j11l2l5Rk15K75J35l16K93k12N4J26N2l13j02K53n8J74
7732G3J9l32J41k23J06M2K70k33K61j77qJ24k13P4k7l14N10j55J29j4J44pL4l31
$$ y = [-31, -124, 145, 1, -229, 109, 25, -45, 85, 94, 58, 45, 139, -47, 376, -20, 243, -89, 64, -52, -287, -229, -184, -392, 8, -202, -131, 98, 141, -92, -93, 106, -27, 165, 197, 146, -314, -176, 126, -146, -78, 275, 36, 108, -220, -235, -104, 70, -83, -60, -128, 230, -5, -65, -415, 121, -52, 114, 78, -234, 70, 118, 163, 22, -29, 85, -224, -14, 206, 198, -141, -92, -66, -33, -68, -131, 5, 220, -329, -130, -54, 3, 138, -50, -86, 174, 10, 236, -238, 197, 246, 188, -35, -18, -8, 8, 102, -97, -86, -213, 281, -8, -252, 11, 1, -241, -209, -239, -104, -67, 28, -305, -62, 226, -76, 31, -181, -133, 47, 139, -9, -66, 74, -212, -27, -128, -239, -96, -221, 178, -66, -8, 11, 186, 149, 101, 171, 8, 77, 14, 32, 36, 204, -78, -186, 17, 67, 96, -15, -47, -82, -73, -288, -13, 122, -194, 99, -113, -59, 67, 119, -194, -296, -43, -101, 73, 92, -240, -99, -322, -216, -174, 96, -137, 124, -53, -61, 63, -150, -76, -103, -417, 93, -62, 67, 53, 197, 190, 224, -107]
7756a07M41n53L43k6M3k87Q2R5L0nM5r6J76%k82K04r9J13j00L47l06Qj58Ko0K86
7782A36j59k73L83k47J66J02n5L5j31j73M52k10N7K59k12j39R7l43K82lm04K15
7804a65R3k73K64Mk9k9q5J60J44k81j7K01J50k59l2M4J58k2J28k35M6L48j95k45
7828a27J18q6J12o4j14M01j96qJ7J0N0l24j4N4K56k24L38j12j2k18J64O4m3N9
7852A01K1L5P4l42J36j84J58J27m38L24j74K29Q5k91j00J33M14p73J87L93l75
7873b60K94k27J83Q8p8k3m2l9J09r3N8o4j1K45o0l56M55j73k91L40q2j16J71n4
7897b6rJ01j10j2J18j68J00K03l64M18n01K79P1j46M85o13L85j55J44k39q2J36
7919A5R5n0K11l39j08K91k17L9J33l04K50p9R2j73J35J96k39K81k69R1k07K93
$$ y = [-107, 334, -219, 124, 98, 141, -146, -64, 31, 61, 56, 101, 5, 181, 181, -101, 103, 4, 117, 17, 364, 58, 66, -92, -90, -150, 136, -23, -296, 87, -160, 6, 108, 53, 88, -43, -216, 236, 26, 83, 342, 130, -9, 88, -255, 27, 24, -380, -165, -72, -345, -81, -77, -106, -135, -220, -60, 84, -197, -214, -13, 137, -122, -154, -110, 48, 26, 154, -81, -35, 313, 118, -127, -9, -95, 17, -47, -161, 240, 44, 36, 53, 63, 113, -211, -225, -171, 85, -139, 199, 87, 75, -143, 21, 85, 42, 101, 122, 157, 231, -111, 25, -159, -1, 126, -312, 12, -162, 67, 152, -139, -239, -106, 308, -465, -278, 115, -260, 34, -193, -10, 78, 0, -23, -65, -104, 5, -88, -30, -94, -105, 140, 80, -276, 179, 6, -285, 55, -27, -143, 28, -26, -35, 66, -44, -56, 62, -106, -6, 197, -167, 251, -250, 29, 100, -46, 439, -174, 211, 56, 200, -39, -121, 15, 110, 60, 271, -68, -176, 115, -102, -63, 70, -234, 16, -63, 29, -144, -9, 187, -52, 229, -40, 51, -156, 137]
7941A37j19J08j53m5k54M47k61J94r5J55m0J81p7k16j15L33l3K1k35j26Q4K31
7963A22K46n28J43O5M0j26K24l46K46j81k2j18K35M39o62MM73l23L0j5Np3J11
7986a1k56K41J37k69J97l3J06l97J72LN6j59J50J02p5K74k39j50L09j39p8L9J30
8009A10J43l12j15L42j34J91j19j77J00qO3n4k16j7J09j57K4q7M53m7r0K36j99
8032C9J7L73o17L60l20K19K60l49J7kJ14k29P0p8J59J77m54M88l15M41k50J34
8054B54k12K2j37K06p9j24J28p2N5j07K14k10K54m73K45J4j0n2J08J27n3l9k11
8077a52M40k9m82K44K86l89P6J16K9j23K00m02J03O0k63N50m88J68N48m86j93
8098a87J01j36J04L09k39j43K58j22m5k32L30j94L27j31R5M0l86M31m51K00J17
$$ y = [137, 18, 126, -27, -72, -326, 121, -140, 54, -41, 114, 74, 255, 178, -38, -153, 180, 147, 168, -67, -193, -109, 122, 368, -160, -17, 48, 88, -38, 186, -160, 86, -95, -117, -235, 0, 439, -223, -219, 254, -69, -39, -54, -49, -122, -11, -267, -26, 111, -158, 39, 6, 112, -285, -113, -110, -54, -213, -63, 39, -36, 238, -1, -151, 158, 19, -59, -20, 110, 253, -59, -174, 168, 34, 225, 106, -71, 29, 21, 84, 30, -186, -203, -94, -251, -227, -314, 139, 92, 2, 238, 39, 56, 429, -188, 172, -148, 71, 331, -18, -1, -3, 111, -118, -48, -126, 33, 210, -244, 244, -71, 370, 120, 254, 42, 64, -73, 133, 54, -70, 58, -14, 41, -66, 148, -62, 192, -281, -36, -22, -32, -84, 24, 151, 98, 59, -152, 288, 259, -223, 21, 307, -82, -6, 110, 139, 16, 216, -186, -83, -23, -286, 264, -224, -56, 492, 6, -187, -86, -222, -118, 191, -48, -191, 67, -55, -100, -332, -2, -196, 131, 0, 95, 135, -251, 180, -271, -71, 46]
8119D6J62k9k36O1ql91M69j76j18J50K18r3N7k35J8J16p0K4N66o48j62K70L5j20
8143i4J22PJ32L6l10K28j92K12j40J69m80m8K80K43k65KK68j21j99K05l3J6O7
8166A05l05K65J45L7k80jJ31l1j55J33L5m13K49K95l97J81L4p5L59k16j66J90
8188A20n2j11Q3
$$ y = [46, 208, 179, -57, 4, -4, -395, 74, -102, -220, -70, 148, 55, 112, -123, -105, 11, -59, -35, 531, -117, -279, -9, 26, -94, 28, 35, 167, 203, -107, 121, -71, 141, 1, 170, -310, -358, -78, 165, -100, -98, 170, 49, -150, 55, 22, 38, 105, -200, 65, 210, 247, -33, -34, 97, 66, -89, 44, 79, -334, -85, 210, -187, -6, 28, -47, 312, 96, -70, 120, 68, -43, 40]
8191D0
$$ Imaginary data points
##PAGE= N=2
##DATA TABLE= (X++(I..I)), XYDATA
0@%%%%%%%%Qj6J6j6K4l2L2m0M8n6P2q3R3j09J28j49J71j95K24k56K90l25L66m14
32b19M64n19N80o46P19p98Q85r83J090j206J334j479J638j814K016k244K505k809
50a486L166l589M106m758N598o733Q363j0917J5522k6406R7171Q6288j77737m8470
64e9882N4005J2293p6348K6143R6561J0891q5190K957P3283j3513j00485m709
76f3994Q8377K3572n9499O640O1793k2151q6990R066Q5503O95q4362l673Q5004
89C9981K1169p5063l4405M2701J5657l2511J8039O9064J733q0112l8370M0374
101a1743K1403l1672l306M2477J0953l3142l882L3771n341n0418j1830M6971K6359
114C0600k7869j7121K6119J2687l0884k2851J7376J4301j5191n392K6777J8044
$$ y = [0, 0, 0, 0, 0, 0, 0, 0, 0, 8, -8, 8, -8, 16, -16, 16, -24, 24, -32, 40, -43, 50, -59, 69, -80, 91, -104, 120, -136, 154, -171, 195, -219, 245, -274, 306, -340, 379, -419, 466, -517, 573, -633, 701, -778, 860, -954, 1062, -1182, 1323, -1486, 1680, -1909, 2197, -2561, 3037, -3696, 4667, -6250, 9272, -17134, 80037, 166325, -11412, -59882, -5877, 6416, -69932, -43789, 52772, 63663, -21527, -18570, 54713, 41200, -59285, -63994, 24383, 47955, -11544, -4904, 56889, 34738, -52252, -43186, 42317, 43012, -41350, -45023, 39981, 61150, -13913, -48318, -5617, 10040, -22471, -4432, 64632, 66365, -13747, -52117, -11743, 9660, -22012, -25318, 17159, 28112, -5030, -8912, 24859, 19518, -30900, -42730, 4241, 30600, 2731, -14390, 11729, 24416, -6468, -29319, -11943, 2358, -12833, -18225, 8552, 26596]
126B6596k0287k6227L94J5194O090L760J0060K51k2415k1253N419J8389L251n407
140f185O114R774p840j6424K763K0126N834j6056r605R970L649j5341o182K0587
154A184J6215j2399j4722O941N890j3748q763J5689J4860o742l866J3831M046
167A8416k1434j5082J1595O013j8188k049L4234K0620k4921k4850J2566J4011
179A0931j5693q352K3778J3974k3889j8766J6448J4883j6114r772K1263J2938
191B1629k1672j3020J9767P823k6617p466L4740J8092k9690j9698K4844J5104
203B3836k8655k0597K3562J7271k2592j1322L3400K3729k7386k7210J4242J2703
215A0981k1912j0006L1046J8567k6131j7176K2208R566l0935j4993L4919K4798
$$ y = [26596, 6309, -19918, -19524, -4330, 1760, 5520, 15580, 15831, -6584, -27837, -22418, -4029, -778, -6185, -71, 9703, 1863, -14561, -11798, 8328, 14162, -1894, -11499, -1529, 2120, -13221, -19403, 1184, 17399, 5000, -9722, -2781, 3109, -10639, -19402, -3713, 11147, 4405, 539, 14370, 18416, -3018, -18100, -6505, -492, -18680, -20729, 13505, 34125, 9204, -15646, -3080, 10931, -4762, -13114, 10664, 24638, 749, -18017, -1569, 13314, -2800, -12572, 8691, 21629, -43, -13063, 6704, 14527, -12090, -19556, 15184, 33276, 3586, -16112, 8732, 23836, -4819, -25416, -1854, 15417, -7175, -18497, 14903, 38632, 11246, -15964, -1722, 10981, -10931, -20937, 10109, 28676, 2545, -14631, 7577, 17143, -13792, -28785, 6134, 30932]
227C0932k6394k5127K1467K0835k3070k1407K4056K3206k2301k3719J8797K1064
239A8339j8775k1343J4987J7934j2948j1059K1019J6300k3080k4409J3755J9709
251A0429j3901j6264J8999K2353j7499k6206J0588K2862q170j9168Q601J9887
263A2511p110k0388M502K0297j965j7784k20J3045k101j2740O004J5497n874j7028
277a3354L370J6582k316j4389M787J8645k047k1949o691J6074O303j1841k498
290i324J6656P271j5639j1013R276P376p419l706R103N506p714m215P806K376
304F340j0457n740J0082Q016q147m734J1046O856j3219j2245R419J2962m846p906
318b573O556P768r117j4192L404J3918L238n972J63M434m187p784L478O804l370
$$ y = [30932, 4538, -20589, 878, 21713, -1357, -22764, 1292, 24498, 2197, -21522, -2725, 18339, -436, -21779, -6792, 11142, -1806, -12865, 8154, 24454, 1374, -23035, -9280, 10429, -3472, -19736, -737, 21616, 4117, -22089, -11501, 11361, 3191, -15977, -7376, 12511, 5401, -14987, -10485, 9812, 7847, -9937, -10157, 2888, 787, -11953, -5949, 9548, 3674, -13354, -9984, 6598, 4282, -10107, -5320, 13325, 11278, -10671, -17362, -1288, 5015, -6826, -9324, 7332, 14603, -1036, -12049, -2773, 4603, -2816, -6522, 2581, 8087, 373, -3842, 3964, 6340, -4117, -9857, 225, 8241, 94, -4640, 6406, 13262, 43, -12202, -2783, 10179, 5333, -2573, 3983, 11751, 2634, -11558, -8154, 5764, 9002, 3030, 3193, 7627, 3440, -4344, -866, 5938, 2568]
333B568n683N546O502n011p052N727O378p646j1260M250J4372J781r279j883O792
348F102k093r938q03J0353L890m579k269J511k235m844K272O122k25m026J584
363H22L851l713p341J325P997K57p173J94Q475j8r449l207O776M063m233l054
379d428L704L383k817m209P56J939r40L09K351k7k829j82K959k563n053K208Q188
396B749K477o341m688J850J900k667j690M656P050r43p147k963J715J287k1J326
412a450J882K55j11o12j725j244J34J046R19M2R41L101J801m455n925K89M216
429h96J704n01J441L162l89n236m729J050N446L130j206q65J784J65l455l434
445b829j75L059K892J424j442p56R89n90j934j765L63L014L042k79l537q37K846
$$ y = [2568, -3115, 2431, 8933, 3922, -3130, 2597, 8975, 1329, -9931, -5681, 8691, 10472, 1193, -690, 6102, 4009, -5929, -6732, 3621, 7511, 2932, 663, 2174, -61, -4905, -2633, 3489, 3264, -762, 822, 4673, 960, -6381, -5056, 2941, 3198, -3975, -3781, 4694, 4676, -4773, -7980, -1204, 2859, -1374, -4428, -724, 2659, -158, -4367, -3611, -1672, -2612, -2303, 48, 21, -2808, -2990, -31, -2594, -7647, -5439, 2749, 5226, -1115, -5803, -3953, -2053, -4720, -6410, -1754, 5296, 4353, -2794, -5757, -4042, -2755, -2776, -1450, 432, 687, 576, -36, -1761, -3005, -2871, -1825, -906, -864, 77, 3178, 4979, 524, -5401, -5112, -896, 808, 307, 1748, 4910, 4521, -715, -5444, -4394, 1052, 4182, 2976, 2111, 3895, 4060, 605, -2829, -3004, 55, 2947, 4371, 2929, 2173, 3162, 2572, 638, -1127, -764, 2250, 5292, 5013, 1476, 639, 3485]
462C485m23m292j706L419M173m47k221L87J929j769m426j108M111L936r54j881
478B213k76j383j453m7L65P31R37J777o23j933j110J954J948l334m058J538N548
495B794J202m430k358K819N94l822j576L689M174n21l519j107N59P09j24l68K2
512a263j604L07K499n8l034L75L391o20n286J3N935L551m666m342J790L269k395
529b138l797K941M442j320m014J322L045j194k651J254J864j844P9L801J160n467
545b517l240M289L559m406l062O383N874n816q600L787Q798j468o786J754N698
560D247j847o074J508N224j439m062J665M417k036l870L865M563m472o371N182
575E00Q286m573r820L663R562k853r335J448R399n64p996J51Q337M26q483j201
$$ y = [3485, 3062, -1230, -2936, 483, 4656, 4209, 1988, 2375, 4304, 2535, -1891, -2999, 1112, 5048, 4094, 2213, 1937, 554, -899, -946, -581, 150, 1087, 2864, 2241, 308, -802, 1152, 3100, -234, -4292, -2754, 2794, 3996, -434, -2792, 27, 621, -3201, -4777, -1088, 3086, 2565, -954, -2061, -1502, -793, -917, -1285, -1263, -2867, -2560, -61, -119, -3153, -2778, 613, -7, -5293, -5280, 655, 4206, -460, -4802, -3012, 257, -2138, -5935, -2994, 1448, 128, -3886, -2564, 481, -713, -3364, -2110, -246, -2090, -2011, 1790, 2950, -2517, -5757, -1468, 2091, -2315, -5377, 1006, 6880, 1064, -7536, -3749, 5049, 3581, -3205, -1451, 4247, 2400, -3674, -2166, 3058, 1619, -2443, -778, 3639, 1603, -2267, 1598, 6161, 1689, -4682, 500, 8786, 4213, -5607, -1944, 7618, 4765, -4570, -3122, 6277, 5713, -2283, -2132, 6205, 6631, -1852, -3053]
591c053P520J825o436q81N352j353o411J824P825j801p767J210Q795n41r209q71
607c972R104J995q739l685Q031M051p800n066O412N053m528n922L078N755p78
622B989l237P54L37l822k194N556N316m000p068J628M737j815m000M127N590l708
638A190p770J301R432J242r319m035P324M819o927m178O298M115o561m229O463
653h35M426m910m796N872M601n599n395M995M076n556l803Q466M863j0915p923
668a2433J0985J1013p637j1684N930J0634m792q441N240P854p035j0302O575J1348
682G255k904r656K543P613m630o160O805O772p698q709Q858J0941o793j2030M105
697c688R759l954q093N244R688n196j0401M152J1136l420r315J854P810j934n358
$$ y = [-3053, 4467, 6292, -144, -1025, 4327, 2974, -3437, -1613, 6212, 4411, -3356, -2146, 6649, 6108, -3101, -3972, 5132, 7127, -1612, -5297, 2734, 6785, -1015, -6081, 331, 5384, 856, -5066, -1988, 3767, 2989, -248, 506, 843, -2979, -5173, 383, 5699, 1699, -5369, -3741, 996, -819, -4819, -692, 4898, 1190, -6580, -5279, 4153, 5395, -3924, -7959, -635, 4184, -2743, -6921, -623, 3492, -3069, -7298, -835, 3591, -1319, -6115, -243, 4358, -1241, -6636, -1641, 2435, -3121, -6924, 1542, 6405, -4510, -12433, -1448, 9565, 1928, -9756, -3826, 6808, 2016, -6425, -1185, 6669, -366, -10668, -4093, 7255, 4351, -5305, -2762, 4851, 221, -5939, 866, 7638, -60, -8769, 89, 11030, 4237, -7793, -3688, 6071, 2117, -5976, -732, 8956, 3760, -6641, -2489, 8647, 5227, -4088, -2234, 5576, 3642, -1716]
712a716L414L161n941m066P620O530o721p312N126O871m901o077N095O215n034
727B264n676M522N939n788o586K918N547j069j298L365r8n877j509N867J815o441
743b105k337O611L757n528l439M603J465o543k916P215N334m606m568K791J726
758A460k417j781L267P83l246j417L907O78m117p46M019R46m214r06N608J662
774C486n896m007L608M618j215l018J231K496j340m058j905L116K509L09J35J153
790A222q4k319k279L69R90K9M55J959J523k186k270K262J693m821l782M737Q126
807E624j744o568J093M497l073n849K554Q884p46r038o15Q192J589p426l17P032
823D089J13o916Q82P890k583r359K053J0312p51r891J448J0672j457j3029p42
$$ y = [-1716, 1698, 4859, -1082, -5148, 2472, 9002, 2281, -5031, 95, 6966, 2065, -4012, 1083, 7298, 2264, -3412, 1110, 7049, 1261, -5325, -2407, 3140, 2071, 773, 4138, 4040, -1837, -3346, 2521, 4336, -2105, -4442, 2169, 5926, 398, -3041, 1562, 3027, -3516, -6432, 783, 6117, 1511, -3057, -266, 1460, -957, -2738, 529, 1312, -1934, -3351, 556, 1234, -2883, -3629, 390, 1336, -2878, -3784, 1824, 3486, -2410, -6417, -2809, 1809, 594, -2424, -1193, 1303, -37, -4095, -6000, -2884, -375, -66, 69, 1222, 1138, -1181, -3460, -3091, -2101, -2072, -1617, 342, 1865, -321, -2591, -329, 1364, -3457, -7239, -2502, 5624, 3880, -2688, -1595, 2902, -171, -6020, -3466, 5418, 4672, -4366, -4981, 3211, 4800, -2626, -2943, 4089, 4202, -2714, -1832, 6058, 3475, -5884, -3831, 6481, 5730, -4161, -2713, 7959, 6502, -6527, -7269]
838g269J3218K369j1663j289J2946J823j3439m457J0941L401r368k011J0319K256
852G777r403k212R657O40j1370j337J1923K788j1133k660J0940K299j1878l425
866g394J1683L981j1079m804J0199N593q609n583Q175N081p502n701N886L896
880C822o202k345P267L100p252l082O718K214q545l602P791N897n640m479N634
895A296L630o625o736M640O774k391m717L242M362k522m101O90J333j972n94M010
911C19K940k929l866J017K598j665j967L090L668l118m955J453M676p61m087J097
927b490M577Q13l875k200J973J112k293r18K437K025J47M29Q53j926m548p57L139
944a502J945m54J946L075j748n731j939M410K156k426k478L683L292j751k781
$$ y = [-7269, 5949, 8318, -3345, -4634, 8312, 10135, -3304, -7761, 3180, 6581, -2787, -4798, 5521, 7777, -1626, -3838, 5819, 6459, -4911, -6248, 5675, 8463, -2670, -5330, 5610, 7909, -3969, -7394, 4289, 8270, -2809, -7613, 2586, 8179, -430, -6013, 2162, 7243, -259, -5960, -74, 3822, -2380, -4725, 2542, 5642, -1610, -4692, 2026, 4240, -4305, -7907, -116, 5781, 141, -4338, 1296, 4926, -1699, -8435, -3795, 2979, 588, -4129, -887, 3475, 953, -3148, -2458, -1125, -3097, -3691, 319, 3259, 330, -3536, -2519, 79, -1586, -3553, -463, 3205, 87, -4868, -3415, 1261, 500, -3587, -2490, 2087, 2900, -975, -3175, -1202, -90, -2383, -3301, -864, 1161, 1308, 1737, 2590, 664, -3884, -4641, -1502, 443, -11, 1935, 5010, 3262, -2469, -4408, 2, 2158, -268, -2746, 937, 4229, 2478, -303]
959c03J325J201l042j739K762K664n19p13P34o95l128r28L751K318j792j299K539
976C136M24m950k281M210M250k808k823K693K528k959l452J398L023j875j739
991a225K310K233j628j786J496N37l208j348L904K063l305k271L762K573m409
1006c02l672L192L916j472l975J643K694j761l932J572L485l79j896J181J004
1021A298k262k197K024J898k137k107L075K594j811k980J923K524l012m633J758
1036d045N540J96l276K5K604o70l233l0K529N70j693q75J341j16m97J509J770
1053A649j635k728P42K506r98k571R72L391k18l146N9L499Q62k986k144J722J613
1070E89j078r43J573J507p76p38P37k71j375j14J106k25o19J630J892m52k532
$$ y = [-303, 1022, 2223, -819, -2558, 204, 2868, 2349, 1636, 2370, 1675, -1453, -2381, 1370, 3688, 1896, 597, 3136, 3560, -1390, -3671, 539, 4789, 1981, -842, 1851, 4379, 1420, -2032, -634, 2389, 514, -1225, 1085, 3318, 1690, -96, 1400, 1937, -1271, -2619, 1285, 3348, 43, -2228, 1534, 4107, -302, -3974, -782, 3134, 1662, -2313, -670, 2024, 263, -3669, -2097, 1388, 1009, -887, 294, 1298, -964, -3161, -1137, 761, -1376, -3483, -408, 2186, 375, -2605, -682, 1842, -1170, -5803, -4045, 1495, 1691, -1585, -1560, 1044, 374, -2859, -2889, -360, 210, -1483, -2358, -1017, -1133, -1630, -121, 1649, 14, -2714, -1972, 534, -464, -3035, -2063, 1328, 1110, -2036, -1977, 1522, 2384, -602, -2746, -1024, 589, -489, -1432, 141, 1648, 872, 134, 871, 600, -775, -889, 217, -8, -627, 1003, 2895, 2443, -89]
1087h9p69J844R67k061j294K313J487j359j719J797J966q44k293j84R88O37k6
1104A361m89l53j84L17P64P24o70k88Q25q87k275n81K623K294j017j914M05J360
1122B015p61j443j15J197k92j376k29J561J554l28l13j200j314k1J184P2r38O95
1140e2J038n04j680J29J151R06j057j720J23J460N81q45m64K82N76l18p34p8O28
1159e78O03l98j424q04J111J476q4q61J79J266l82k052j015R26J197L62p42M48
1177g72J287j71r97m43q46K42O60Nn96N27J759R58j236j902k82O84J59o78J215
1196d27K470R8k724j957J470J428P8o72N85J47p7j88m63k66j3O10P74J06k50J242
1216A971O24j608l112l40K716J744m47O66R56l25k721k487L26K585J363k8l24
$$ y = [-89, -858, 986, 1953, -108, -1402, 911, 2398, 1039, -680, 1117, 3083, 2239, -54, -238, 750, 1387, 1361, 872, 519, 335, 652, 1416, 2140, 1470, 1182, 2007, 1120, -1155, -1736, 887, 3181, 2164, 250, 655, 2015, 1254, -189, -304, 893, 601, -775, -1004, 557, 2111, 1783, 1470, 270, -1044, -1065, 119, 191, -747, -52, 986, 482, -1198, -1069, 82, 988, -69, -1789, -1666, -206, 375, -470, -934, -652, -76, -394, -1128, -1206, -578, 25, -373, -1797, -2601, -1490, -14, -98, -959, -780, 486, 104, -1948, -2963, -2037, -840, -478, -1220, -772, 515, 344, -653, -1096, -1942, -1700, -1040, -1035, -1631, -1104, 655, 1613, 377, -1525, -1807, -1123, -964, -1642, -427, 2043, 2141, -583, -2540, -1070, 358, 436, -236, 349, 496, 419, 231, -232, -498, -511, 99, 873, 979, 729, 1971, 2595, 987, -2125, -2465, 251, 1995, 1548, 2214, 3170, 2845, 124, -2363, -2037, 548, 1911, 1883, 1559]
1233A559M30l66q18j88j76q69M25R19N14N0L41K63q61k244j59J390J663q5j069
1252G19J53R16p25k165m44J241J476j82k30oN09o17j885q13J225J246N46J96j04
1271A056m29p61m97n26j025P85J663Q18r67q36L82O13p52k419K49K179J779j528
1289b16n65J356l52j960j017J062J261k94J24j4q2N08m77l30k98q39P22M48P29
1308b34k98N96O80j472k369j08K225J990j96k12l56k56q12j429l18J577J310N77
1326H95k42j27P5l29j538j390Q88K842J053r13q56L75k52j081n09M48L39P68J696
1345B142K50j246j264M30J34j354k20K484K098j664k149J231J102k146k306J805
1361f73L412J88j983k45Q52r86j345R57R97n32j176K027J821j440k270J52O17
$$ y = [1559, 1989, 1623, 805, 617, 441, -428, -3, 916, 1430, 1480, 1821, 2084, 1223, -1021, -1180, 210, 1873, 1788, 719, 872, 1788, 1063, -1102, -1546, -305, 1171, 989, 759, 753, 1262, 645, -1240, -2053, -828, 418, 964, 1160, 1056, 627, -134, -631, -1157, -2182, -1397, 266, 1084, 117, -719, -337, 276, -476, -2895, -2646, -467, 1312, -216, -781, 575, 223, -1737, -2754, -1692, -431, -725, -601, -615, -697, -189, -666, -996, -1294, -2133, -1411, -963, -234, -532, 64, 744, -728, -3097, -3205, -980, 1010, 814, 602, 246, -10, -822, -2251, -2569, -992, 318, 895, 653, 526, 601, 272, -1266, -2656, -1768, 1074, 2127, 1214, 358, 733, 481, -600, -1109, -661, -322, 446, 2142, 2392, 1146, -118, 312, 446, -908, -1128, 1356, 3454, 1790, -359, 872, 1974, -172, -2478, -673, 2739, 2927, 944, 699, 1551, 565, -780, 177, 1174, 642, -534, 1493, 3314, 1874, -396, -244, 373]
1378C73j447p35L765K892k521l908K34K175m60j991J191K627J56k117p54Q99o62
1395b83j377J069J113k28p63J272M68j466j647J214J046j648m20K052J314j434
1411B82k115N9J528Q4q98L5M24M60q7J40m15p59M1J25o16j41K255J193j475k206
1431b086M71J231k47j036N64J752j29j575k34L71l99k53J377O43j201p92K070
1448E27R80l120j321K428J681j337j327K149J641k611k404J487L027j008k003
1463a211J157J953j263j741R75J220j277o48J648J476j748j595J558J235j474
1478B65j709J989J995j606k221J760K799j277l054Q9K171N7j005R8J607k82j176
1495E00p88N31O07k60N60J161m63k039n35J381J30r78N76J423j32j845j119J870
$$ y = [373, -1074, -1809, 1956, 4848, 2327, -1581, -1347, 828, 368, -1623, -432, 2195, 2351, 234, -520, 379, -283, -1660, -591, 522, 294, -469, 803, 1271, -195, -1842, -628, 418, -1230, -1650, 402, 1716, 282, -1833, -1774, -246, -162, -1060, -1025, -601, -141, -228, -88, -503, -1262, -1221, -1096, -1712, -1853, 402, 1595, 120, -2086, -1615, -384, -631, -1667, -1103, 649, 520, -1055, -1289, -918, -1317, -1570, -193, 450, -751, -1543, 527, 1507, -1613, -2934, -506, 1175, -162, -1489, 660, 2301, -310, -2714, -1227, 1800, 792, -1211, -54, 1899, 636, -1105, -130, 1090, -187, -835, 813, 2289, 541, -1054, 504, 1739, 265, -1444, 545, 2540, 934, -1287, 473, 3272, 1995, -1059, -970, 1201, 1258, 253, 351, 1958, 1676, 500, -288, 243, 850, 590, 1150, 2311, 1848, -191, -726, 655, 785, -193, 383, 1806, 1674, -171, -1290, 580]
1513E80J297j000k320M37K502M80k274P6J252q83k093J33K735J283j310j426K42
1530b89k35p98m9J922N38k115r8K122j27k570nK370J31k964p87L594J574k643
1548d29j920K124Q20k471j507K503K611j372k098R92J307k197q19K008J392k371
1564a427q29K875R85k781j644K298J809k468j367L129J899l113k505K295K643
1579A799k086j336J407J904k099j354J493J165j700r02K041J408j403j780K157
1594G14Q30k640j570L243K488k389k391K296K195k101k142J344J728r85j478J602
1610G44J304q82j142Q20P37j849j134K053J422j602j094K203J237k366j839J976
1626E88J747j827j846J358K143l96k162O15J677j187k040P84J994n77r72J145
$$ y = [580, 1877, 877, -1443, -1006, 1496, 1976, -298, -222, 1030, 147, -1946, -1813, 922, 2205, 895, -531, -289, -524, -1322, -1371, 551, 1089, -1026, -1124, 998, 871, -1699, -1704, 666, 797, -2167, -2954, 640, 2214, -429, -2349, -225, 595, -1876, -3383, -880, 1731, 359, -1739, -747, 560, -1637, -2456, -448, 944, -1427, -2256, 619, 1604, -1177, -2821, -523, 1286, -1182, -2549, 580, 2479, -634, -3139, -844, 1799, -287, -1623, -216, 1688, -411, -1765, -272, 893, -807, -1709, 332, 1740, 337, -1443, 714, 1544, -1096, -2666, 577, 3065, 676, -1715, 581, 2776, 675, -1467, -123, 1605, 620, -858, 744, 2048, 1166, 24, 844, 1581, -268, -1402, 651, 2073, 471, -623, 1580, 2817, 451, -1388, 588, 2335, 508, -1338, 20, 2163, 1767, -395, 220, 1897, 710, -1330, -546, 1448, 871, -101, 1044]
1642A044N45j111j253R17Q50j637r47J795K189j103k642M05K290j155k230P05
1658a338K864J06k571n99J919M80j952p4J447M70j570r1J125k98j574L00J362
1675FL87j802L81K275p04l163n64K893J226j838m22K267J85k823j729J882K260
1692G17j094j201J669Q68j566q37J011O73j966o63K207J179j127n54J784j98k634
1709a732j727K691L088j810k208J609J732j730k484J814K500o00j962O6J871p47
1725C71j625J198K067j608j608J339J815j541k005J593K249j373k271J633K747
1740B981j659k699L39K632j49k288O08K509L0k409q17K032m20j504R36J688o3
1757A747j928K88J257o10j908P34K741m31k729j92K369N23k661l77K830O15k719
$$ y = [1044, 1589, 478, -775, 142, 992, -645, -1592, 203, 2392, 1289, -1353, -948, 1342, 187, -2043, -1338, 1526, 1632, -939, -1538, 381, 861, -1091, -1165, 282, 752, -818, -909, 216, -82, -1656, -1356, 6, 393, -1409, -1028, 1247, 543, -2620, -3184, -291, 935, -903, -1325, 942, 1127, -1696, -3425, -1543, 717, -377, -1578, 91, 959, -607, -1444, -433, 240, -1726, -2389, -182, 997, -130, -684, 1100, 902, -1732, -3459, -768, 2320, 510, -1698, -89, 1643, -87, -2571, -757, 1743, 1143, -819, -753, 1118, 371, -1254, -56, 2011, 403, -1205, 134, 1949, 408, -1597, -4, 2245, 872, -1399, 234, 2981, 1322, -1377, -1038, 1594, 1445, -843, -235, 2274, 2304, -105, -922, 1110, 690, -814, 122, 1810, 1747, -181, 107, 1364, 754, -1154, -420, 2321, 1890, -839, -1031, 1338, 1861, -800, -1177, 1653, 2268, -451]
1774d51j219K207J112j800q82J058Q69j208k69J523J55j820r00J235Q70r16j60
1791e96J925J62l018r90J869K023j933o02J272J415k004j479R05J477p11j078
1807a363P31R64m49j138P28N05q84j039J785O76j273m63J269L88j286j200J231
1824h18J870o21k358O23K100p01j712L06J675l7r04j4R03k85q54K90N79l07k80
1843e45N02J481j592j084M66J863n25r22J05J360k08j763L19J572j20j316l25
1860g32J273P20q42l70M83J31q56R5O40O35r50P4J006j160j105J086J804l37j332
1879B63o11J351P1j097k71J419J033j726j042Q16P13m12m90M80N11r77J9P93k16
1898F27p72l5O77J72p29j39J028L52j759n90J335J061j366o31J035J122j366j140
$$ y = [-451, -1670, 537, 1649, -151, -1033, 25, 894, -314, -583, 940, 1095, -725, -1625, -390, 480, -436, -596, 1329, 1491, -1527, -2517, -648, 1375, -558, -1160, 112, 1527, -477, -1956, -1051, 426, -285, -1363, -632, 332, -117, -1255, -527, -22, -906, -1945, -160, 516, -757, -1220, 49, 437, -849, -2049, -818, 1052, 431, -1927, -1304, 796, 95, -1617, -1311, 364, 327, -577, -591, 312, 27, -827, -537, 42, -265, -545, -43, 1438, -154, -1238, -772, 1091, 566, -356, -251, 1109, 901, -862, -543, 1029, 909, -407, -732, 541, 1261, 419, 49, 532, 663, -193, -98, 542, 1177, 227, 301, 1307, 147, -958, 128, 1932, 1595, 263, -348, 1003, 1074, -23, -294, 1125, 2158, 432, -610, 206, 919, 507, 17, 497, 1008, 31, 50, 843, 627, -145, -180, 497, 669, -60, -199, 829, 1181, -578, -1168, 167, 1228, -138, -769, 266, 1388, 22, -1118]
1916a118P35O56j3q30M6P61j8p22j80N22o1l26Q02P2j222m08R09P37o47j122J100
1937c27O30n78j333K64J903M16j618p88O20Q35r85N77N93p4o40q89M87N89K1K22
1957g5J06l37p19L29Q75l1o49n83R93P10j170l78J242R87j541j264P71J379K08
1976H53r29M3M74k77q89L91J195j15q79K55M43m02m64J030M77j052j007R44J249
1995A340j69j096K0J182p05j148L7J938P8r72n80N81L78p85k3L68O61n28p4MK80
2016G87p36KQ08m07o25L54J512q00q72k67L82O40p42k58M63O96m37r95P0Q15L01
2037F91q20l81M75N69j58o95j05K23o6L34j28L08l78k46K4p6J27j25K09K51p75
2058g42l34R21M74n70p95K36J305j69j371r9J464o8j252n06J117R88j015l46M57
$$ y = [-1118, -383, 273, 260, -570, -524, 237, 219, -503, -683, -161, -222, -548, 254, 326, -896, -1304, -395, 342, -305, -1427, -327, 303, -275, -1608, -1344, 559, 975, -643, -1431, -811, 24, -961, -384, 209, 135, -505, -1394, -907, -318, -297, -75, 31, -306, -1025, -696, 179, 148, -501, -1084, -91, 619, -551, -929, 313, 1300, -241, -1505, -734, 645, 853, -76, -33, 441, 164, -725, -334, 861, 746, -133, 122, 565, 163, -301, 729, 1206, 154, -853, 91, 1340, 1171, 75, 95, 1277, 572, -576, -539, 1399, 1477, 505, -75, 506, 884, 99, 76, 444, 1105, 577, 503, 507, 787, 51, 53, 861, 454, -171, 183, 1695, 895, 23, -244, 138, 778, 36, -222, 241, 937, 500, -495, -425, 390, 691, -129, -510, -35, 534, 376, -319, -424, -201, -267, 67, -61, 247, -131, -377, -353, -429, -302, -427, -218, 33, -742, -1076, -155, 319, -251, -1046, -810, 495, 326, -1045, -1144, 320, 252, -1000, -1506, -389, 599, -416, -762, -305]
2077c05J81q68J18R59J86j071J07M68R4m80o1R35K80j529j94J689K45j192r85
2096a423P50J212p81m36R06O02j022n55M17M60k7O1M31K03q77j90O97Q6o80K8
2116a38R11J17j277j76J138Q44j069j261O56P97Q5l09K26J02j58n17l7M45O54
2135A033j50N4q88j06M62L66j45o02N7M75M53m88k16R1K90Nr76P6Q20Qp1m38r5
2158A5L69J28o03k1L55N53o11l66J12L39j5j53m33k12M23L39j95q5l97K93L78
2179B13p07m62N03R49o14q31J96P54J3r78j26R85j26k86j11N36r6m26K84l11q1
2200g22P3O14L14o80q00Q39O49p78j042J064R17j22j019J09P05j03j248K29R19
2219h2O59j034o3P38o55l71O67Q78r33j058Q31J611r98j161O56J420p55j634Q22
$$ y = [-305, -124, -992, -874, 85, 271, -800, -693, -225, -131, -611, -672, 263, 543, -986, -1180, 509, 754, -438, -1423, -673, 539, -242, -678, 228, 830, -192, -747, -330, 130, 103, 164, 595, 798, -79, -269, 428, 514, -166, -138, 773, 890, -387, -563, 575, 1419, 350, -911, -255, 542, 627, 318, 544, 646, 488, -29, -66, 379, 1033, 883, 937, 49, -57, 405, 771, 626, 24, 81, 556, 1009, 521, 305, 396, 686, 691, -285, -209, 611, 619, 548, 110, 15, 384, 512, -91, -112, 243, 796, 185, -181, -69, 270, 255, 102, -331, -543, -120, 219, 24, -61, -458, -165, 213, -494, -956, -453, 496, -118, -949, -753, 1, 14, -964, -1090, -105, -231, -517, -628, -92, -188, -614, -330, -641, -722, -649, -35, 279, -401, -1201, -362, 287, -491, -1533, -469, 448, 326, -693, -584, 121, 18, -1230, -1001, -82, 577, -457, -520, 218, -437, -808, -141, 737, -196, -1254, -423, 1188, 190, -971, -315, 1105, 350, -1284, -462]
2238d62J731J23j964J48J039J88j380K54J383Qj188m04J199k92q26P84J026r76
2256C91j127K62K087o7k033P8J371L3j631K43K059J06k184n73J609N86q64l74
2274b8Q65K31r78p12J060P27j234k25J110L59j519k45J566M64k026n87J442J183
2292A453j363j106J550P17j417j264J328J107l02j632N86Q98o40o45L82R05m05
2309A52j041O62J135j140j125P41J431j068j683J353J766r44j638L93J706n50
2325A50j568K0J996K9j717J29J041M39j571l63J392M0j016J83J345j30j686j27
2343a414K023k95j788N14J883L69k429n56J938P64k141l63J972R51j425r57J172
2360B18Q91j502j047J505Q95o12r43J361L92j575m43J387N65j563o45J722J361
$$ y = [-462, 1269, 1392, -572, -424, 615, 803, -577, -323, 1060, 1068, -120, -524, 675, 383, -443, 341, 1367, 391, -736, -474, 1613, 1546, -487, -409, 962, 995, -636, -393, 1666, 1772, -412, -985, 624, 1210, 346, -28, 837, 1068, 90, -622, 438, 1165, -69, -294, 816, 1175, -344, -589, 977, 1441, -585, -1172, 270, 1453, 90, -1016, 534, 1251, -166, -1430, -102, 1005, 703, -929, -343, 555, -85, -730, -348, 557, 152, -889, -227, 908, -232, -1357, -616, 815, -253, -1936, -583, 1183, 239, -1399, -1006, 700, 150, -1418, -1398, 598, 627, -1090, -961, 80, 519, -1052, -1415, -23, 17, -999, -816, 529, 399, -1287, -1414, 609, 314, -1474, -960, 923, 1292, -1137, -1693, 245, 1009, -1132, -1495, 477, 1428, 3, -954, 218, 1109, -393, -1440, 65, 960, 348, -595, 766, 1158, -417, -860, 527, 1092, -471, -1116, 606, 1967]
2377A967j692j296J162J062j227j426J663J977j299j377N84O18n95r01J308J066
2393A594r60j101J075O94j424q24J543Q35j177j010J203J590j486j762Q92J558
2409A240j109r01J303J478q49j837n62J839k6j194O10J196l48j743P63J376j051
2426A85j440O33J210k03j469Q77K125j014k372J1J843L88j965J7J775J52j721
2443i68j97J779k62j224j31J097P5r58J0J407j98j842O6J687K69j821mK014j75
2462F24k308R0J894N85j491j029J741Q64j482q65J109J190j739m97J356Q12r86
2479a32q19J162J62j260q50K072N86j194q06J912N39j449j498J178J539j056j019
2496i33J236J646j483j537P62J021o05r82R14J317p91j017O86R75j081j358J297
$$ y = [1967, 275, -1021, 141, 1203, -24, -1450, 213, 2190, 891, -486, 98, 716, 121, -780, 528, 1594, 634, -467, 608, 1302, -122, -946, 597, 1432, 255, -755, 448, 2038, 552, -1210, -318, 1240, 131, -770, 533, 2011, 1162, -675, -1237, 602, 576, -618, -8, 1188, 840, -903, -140, 1236, 185, -1255, -622, 588, 385, -1084, -207, 1918, 904, -1468, -1457, 386, 774, -1191, -1174, 601, 753, -968, -1165, 614, 352, -872, -1003, 94, 169, -789, -779, 628, 430, -1412, -1346, 341, 610, -1211, -1215, 799, 624, -1684, -1594, 300, 885, -606, -1635, 106, 970, -512, -1377, -268, 922, -817, -1314, 42, 854, -132, -951, 211, 373, -887, -1737, 335, 921, -273, -1079, 833, 1372, -77, -1575, -397, 1142, 86, -933, 303, 1949, 466, -1071, -309, 712, 107, -875, 39, 1356, 565, -452, 234, 1209, 128, -1230, 67]
2513F7J295o72j441J409J532j573k045J001J603l26j136K45J872o70j714o5J500
2530H82m8j000J45J409l30j478M37J010p56j489R31J528o7j725K60J706p00j838
2548a123Q0K006M44j663o22J164O54j474l40J362M69j463J89R49j35r70l4Q27
2566C20N6j342n1J606O03j896n34J522K83j272n19J268R10j301j023J168J190
2583I88r61q83K51N92o99n73J060J022p77q90M79P13j353k81J024Q58j002r98
2601a430J356J125p96j209N14R99p32j026O21J262k71j117N26K37k86m89N56N70
2619D10l03n93N45K49k55p87N37N68O5p56K8J263n73j038K41J084J72j026J68
2638aR40Oj264m74Q64J40m23K05P23O3m58r9O50o01q75O82R50q4q84j40Q74j42
$$ y = [67, 1362, 690, -751, 658, 2190, 617, -1428, -427, 1176, 850, -286, -41, 1831, 1161, -553, -618, 882, 834, -166, -21, 1388, 1058, -420, 17, 1027, 271, -1218, -287, 1241, 1174, -551, -291, 1415, 715, -1123, -1043, 963, 1407, -256, -878, 286, 940, -534, -874, 488, 957, -506, -317, 632, 497, -473, -507, 320, 376, -966, -1017, 589, 1192, -704, -1238, 284, 567, -705, -1224, 44, 954, -347, -1370, -202, 988, 27, -856, -605, -13, -712, -1285, -225, 797, 20, -870, -391, 322, -1031, -1312, -288, 570, -432, -1430, -74, 1051, 255, -954, -440, 559, -173, -1199, -578, 684, 413, -704, -178, 59, -227, -716, -160, 410, 107, -486, 59, 308, 53, -734, -197, 371, 436, -320, -292, 971, 398, -640, -399, 685, 857, -169, -1, 939, 945, -319, -793, 71, 211, -212, -7, 716, 779, 321, 222, 872, 271, -604, 78, 1028, 944, 60, -80, 794, 652]
2660F52q67k04J433J3j132m30P87N02q40l90Q06L01o28p2Q16j06q32qJ96j55m82
2681f40K26J229M2j404r3P08L25q11k49R29M17p93p02O36N05n32l85N45Q1j02
2701f8j15Q5r5n37J61M76L47r64M23N16j8j138o34J285Q12q27j60J67Q43l92r70
2722h03l2M63m0q6K05L35J16n60J20l97J02l41R14M73p32k79L89N80o14l37J96
2743c28J125l85q79k08Q47J55p48k38O01N88k35K09m25L3k53j75l06N90M91J84
2763F43K44l72o64j54M54J44m01j19Q60N28n55o05J40N20m04o64K67R71K7n41
2783C19m05N33j25o40J82O14L49j22m55J61k15m16M80j00j67L11N9M26q74n29
2803f14K34Q52K09o69k4M04N5n11k29L5L86J40j90k40J07j20j12K77m52M48q2
$$ y = [652, -215, -419, 1014, 1027, -105, -535, 252, 754, -86, -476, 330, 631, 3, -69, 747, 641, -191, -199, -3, -158, -640, -414, 815, 857, -547, -640, 68, 393, -418, -667, 262, 679, -114, -816, -180, 325, -207, -592, -47, 34, -68, -183, -98, -193, -730, -569, -93, 254, -710, -287, 229, 211, -927, -1561, -276, 536, -291, -451, -284, 559, 167, -803, -835, -372, -412, -498, -293, 42, 158, -402, -282, -679, -577, -918, -4, 469, -263, -542, -153, 427, -187, -524, -328, 797, 412, -467, -675, 172, 327, -421, -659, -58, 530, 295, 504, 79, 112, -141, -316, -622, -32, 459, 643, 887, 515, -149, -303, 151, 295, -106, -225, 635, 1163, 608, 3, 143, 663, 259, -405, -138, 833, 860, 319, -86, 447, 322, -318, -136, 478, 827, 705, 250, 411, 196, -220, 260, 160, -7, 304, 363, 789, -85, -614, -380, 472, 681, 12, -12, 392, 447, -64, -293, -258, 128, 268, 78, -162, -55, -175, -287, -10, -462, -14, -96]
2824i6l8K72o29N15j53k48n7J72L20pJ72p11n45N01N24j99o0M93k24l35o36j46
2846a115N75Q19l86l31O9M46k39p45N68M5J38l25L82j66N26l62l72j28r3L50J027
2867F83q3n63%j52o2o36o1J123N61n05m99J00l9J47m80J35O29L74j89r9M5k15
2889B14n00K18L44j89k19J040Q1r84o35O71L22m08j18O98M27l09q12l53Q45J94
2909E27p27K55N23j58m1m01J20j16j34O89L49m84m69P14j36m77n39N16L26R2l94
2930C5k28Q12j70q08J83J96J80j1k54L97q3o7m51k63L99K42J42m0p06K58M7J86
2952dj68l66O57K73o1q38O3K02M27m94r7K62Q2L91n52Kk61Q1J54L8J46l30K78
2975a15r9k35k36N07L30l96l11m5O87r1m03j74N83Q0nn59O47L60m41l63o05M72
$$ y = [-96, -134, 138, -491, 24, -129, -377, -434, -262, 58, 51, 223, -488, -1033, -532, -8, -207, -267, 226, 2, -333, -969, -1115, -540, 279, -107, -438, -369, 77, -162, -907, -339, -294, -156, -481, -99, -265, 261, -101, -473, -601, -694, -344, 683, 600, 37, 37, -115, -177, -813, -874, 249, 810, 305, -194, -94, -133, 14, -466, -331, 298, 672, 483, 384, 429, 214, -286, -68, 276, 87, -132, 908, 989, 5, -630, 41, 363, -45, -163, 535, 962, 653, -159, -512, 333, 527, -200, 55, 578, 420, 379, -22, 98, -18, -152, 537, 886, 402, -67, 647, 511, 34, -505, 11, 337, 429, 35, -193, 619, 449, -359, -176, 20, 200, 189, -65, 332, 249, 182, -269, -532, -133, 109, 251, 211, -495, -237, -190, -4, -172, -538, 119, 392, 331, -507, -444, -242, 185, -309, -406, -144, -62, 329, -223, -221, -482, -401, -247, -209, -63, -393, -115, -214, -449, -685, -178, 152, -244, -555, -600, 87, -4, -407, -581, 2, 82, 77, -482, 165, 525, 84, -279, -884, -412]
2997d12M12L51l67J45n26j41L40j7n0K47N85l09m35k70M24M38m45k88J57P68j89
3018D18n26j51M69j85k9j85O21j2K55n26K4k37J45J36N46m00l26L08L5k47m00
3039b67N30N33k96n47k22P08K60p23p8M02N5l47j02M93j3l23J05k30pL64k6j54
3061A15J40l32j21O78rq32J10L68P7j85j22J41N13n11m27K89K82rj59m47M79J
3083C9k33J06k9l71J34N53j73q4n4J25J55o06Q5J12N30m63q29M76M35j68K2q8
3105c26O04j02m34k23K29J90P8k11k08N4L0N89j79l03k84L58l9j45j81L12L88
3126A97j64j61k00L02K80m95j77K70lJ40qJ07J06p8l97L50M9n9qO24m37o04K98
3149f8P60k47l54j00N41l12k41l02P65L20n19k63j51M38q9k68J79J83R3j47k00
$$ y = [-412, 0, 351, -16, 129, -397, -538, -198, -215, -265, -18, 567, 258, -177, -447, -23, 415, -30, -318, -161, 607, 418, -108, -259, 210, 25, -4, -189, 432, 420, 675, 149, 173, -64, 81, 217, 763, 363, 37, 345, 380, 133, -267, 263, 796, 500, -47, -269, 439, 699, -24, -102, 300, 355, 8, -94, 399, 386, 63, 168, -62, -69, 295, 269, 115, 255, -77, -198, 480, 471, -361, -251, 117, 194, 9, -113, 28, 541, 30, -397, -108, 174, 165, 6, -441, 38, 39, -194, -88, -117, -488, -354, 199, 26, -58, -112, 13, 168, -438, -353, -241, 289, -174, -1003, -527, -92, -260, -238, -326, 278, 176, -258, -481, -252, -62, 16, -195, -403, -349, -319, 270, 91, -212, -496, -138, -177, -322, -503, -191, 197, 33, -128, -328, -26, 254, -241, -418, -148, -151, -11, -19, 88, 194, 116, -281, 69, 118, 59, 51, 675, 238, -366, -68, 692, 445, 91, -9, 532, 220, -21, -323, 442, 762, 243, -20, -171, 267, 178, -90, 89, 272, 365, 218, 18]
3170A8R4n2K88k89M3k08P7O00n3l74j55K09M53m00m33L51N79l30l90l62Q02q8
3192C80k13r5j73L16o2j38J19k76o9L01o0k26L2K13L70n26n13M09M62k09k71k45
3214d74P05k40m83j56L59L37j34k67L96q1k24J14n7p1k00J04M36k40j11J43K37
3235I3j11n46J88M61Oo01J07M11J42m67l05K35O32j23o61M63l6k08L02j24J69
3256B7l66J69K32j69r7J13K87Qo87L20L6O69m23m09N45Q8m1p83J61Q58Q2p56K2
3279a14J77j27K43j43K77j28l7O5J83l71N6K28L1m31j93L88R70m52p23J23K99
3300C21k18k58j03O26K55o41N6K06K30q5l84J78K0k84K13K21K0p53N82N4k13o29
3322e86J068K21l51o60m9N55J20k29l08M61j50o01N0O05jnm20P6L26k13k22M90
$$ y = [18, 112, 60, 348, 59, 102, -106, -29, 571, 518, 144, -11, 198, 651, 251, -182, 169, 748, 418, 28, -334, 468, 380, 167, 72, -101, 215, 153, 15, 134, -142, -211, 90, 30, -196, -164, 49, 419, -107, -620, -211, 251, 42, -229, -474, 231, -9, -492, -648, -289, 48, -86, -353, 43, -38, -262, -148, -205, -276, -476, -372, 64, -176, -287, -144, 93, -18, -564, -376, 85, 91, -510, -403, 8, 150, -317, -622, -387, 245, 122, -539, -76, -112, -320, -18, -142, 27, -339, -170, 62, -107, -204, -91, 196, 204, -483, -163, -127, 542, 119, -290, 255, 343, 302, -481, -320, 538, 620, -136, -114, 63, -64, 179, 36, 313, 185, 148, 213, 396, 25, 81, 309, 340, -91, -284, 104, 1074, 622, -101, 22, 321, 103, -155, -258, 368, 623, -18, 38, 244, 474, 389, 5, 183, 203, -81, 132, 353, 373, -380, 202, 256, 43, -586, 482, 703, 352, -308, -357, 198, 318, 89, -219, 242, 92, -509, -459, 146, 145, 140, -280, -204, 122, -91, -313, 177]
3344A77k36q9K57J72j92k60k27M61j59m42j00Q58m2l49n13M36M3J36n75L53K49
3365d2k09K6O0N7l09J68J67k70l3K76J24J11o82J69J46O95m37l33J26M25j57n45
3387d67J22M57K65o46L86l42L23q9J72k54k27M42J99J87l67j33r8m2j32P3N43
3408C72m1j6m23j45O01Q3k18l28N4L83n0m3J5P5K21j36l94j16N01n3j8m46M4K36
3432A58j04O0j99R2M03o1l42l12K92N08l49k10K82R9N2l42MK85l34M8O7k93J31
3455f5L54k13k06k23K72K99k39n16L44O31k60p33J04K53N99k48k88J15K11l29
3475a38j6J44q9k90J47J30j59J05J78j06l37J80N7N48j97m37l1J88Jl86j43P11
3497F0l8j15j83L26p5m40L19nk0p0L22k24M12l32m70O31q3m65L22L37J10m35m37
$$ y = [177, -59, -148, 109, 281, 89, -171, -398, 63, -96, -538, -638, 220, 178, -171, -684, -248, -205, -69, -644, -291, -42, -251, -225, -165, -108, -417, -249, -82, -352, -385, -109, 15, 126, -556, -387, -241, 454, 17, -316, -190, 235, 78, -467, -345, 112, 377, -269, 117, -225, 98, 9, 181, -73, -300, 142, 341, 528, 161, 28, -70, -112, -244, -171, 372, 331, 315, -108, -253, 348, 431, 213, -115, -61, 322, 272, 229, 244, 319, 540, 404, 10, -106, 395, 342, 324, -122, -78, 158, 54, 114, -85, 7, 410, 349, 7, -305, -13, 495, 146, -64, 218, 317, 369, 27, 31, 316, -18, 30, 97, -196, -65, 289, 76, -130, -353, -81, 218, -21, -537, -193, 438, 178, -555, -451, -198, 401, 153, -135, -20, 191, -138, -154, -10, -99, -389, -242, -112, -271, -166, 12, -94, -431, -251, -194, 354, 157, -280, -311, -123, -122, -508, -651, 60, 22, -93, -276, 50, -25, -465, -146, -151, -171, -241, 81, -143, 269, -63, -533, 98, 15, -450, -128, 209, 319, -116, -553]
3520e53M72K15J03m03J04O70J2q56M08n33M76M5J2k90R2J81j48O3l58N11K49n64
3542i2j09K29J45K63j63q8k98Q4J02l57J95K36K65k03k85o6K71N1k13K43l61K64
3564A13P4k67J45J95j97R0j08j75K02K02j72J54k99L65r7j71k48J05O16m69j36
3585g8L19j57j0L64q72M9P8N14j98Jl77K51j40m18N85O9K30r5k73l4P0j4J6l75
3609d95m3N35j93J59M69k23l31J37o67M88n9K87J53k74k28L4j0k48J79J18K11
3630an4K04m40K12J22l36O0P3K07J18jJ1q4k41J20n9j15K18K69J61l46l81J06
3653a77M61k60l61L68N71k62m6k31K37n8m19o3L38J89M1k82J32l02M45jk54L02
3675C68l23P17j60n43j84J84K80M0k67K85R9K13n99l87J79L11O0j48L56l53KL70
$$ y = [-553, -81, 134, 237, -166, -62, 608, 620, -236, 172, -361, 115, 160, 172, -118, -26, 155, 7, 70, -288, 223, 472, -92, -201, 28, 173, 436, 273, 185, -113, -29, 73, -284, -89, 147, 412, 209, -76, -142, 129, 180, -33, 210, -151, 113, 187, -80, 65, 260, 63, 153, 45, -130, 72, 274, 102, 256, -43, 322, 225, 54, -194, -89, 527, 58, -78, 241, 84, 74, 438, -434, -385, -307, 207, 9, 10, -367, -116, -256, -674, -89, -20, 210, 115, -158, -192, -122, -136, -120, -495, -538, -3, -196, -37, 432, 209, -122, 15, -652, -164, -223, 64, 217, -57, -285, -251, -261, -509, -330, -212, -1, -55, 149, -291, -79, 43, -293, -233, -160, 47, 165, 164, 175, 91, -150, -30, -89, -204, 14, 283, 444, 98, -283, -177, 284, 24, -337, 31, 602, 340, 294, 63, 300, 242, -177, -240, 98, 287, 328, 46, 178, -124, 321, 320, 66, 368, 45, 762, 602, 59, -125, 59, 339, 379, 112, 397, 496, 709, 110, -277, -98, 213, 273, 125, 481, 128, 130, 500]
3697E00k69j42l23M18M6k21J08k12L68j72n1l64N09J06j34l81J95J63j40j69J78
3718A3L80j59j77l05k89N65J48J44k68r1NK46l81k65N00J91k08n52Q0K53K24k23
3740a69j89N4P8m8L13o02L87J40j79m07K93K59L78r3l14k42L3J55kj3L5O6n9J97
3764G1j88J44j38J15k11k50K50L67J1k95k51K24L24j01j32L09P5l25j02k06L93
3785H4R0k39r0r6N53K24k46o38M75K20k6j78j59N64j81k05k08P4J05K87p5m6n0
3808B39o7R7k42j38K11J33j87J04m8K08K86o26K65j05N3L03k16r5n01N41rl56
3830a50K80J44l1k91J10L1j92M16k61n36K88j22N36j18P1j91Q9k93r5J71L12k6
3852A42j07k20K5M6K95j61l15M3J01P2k9k48J27L80k01k09K22n8J60j06l29J29
$$ y = [500, 231, 89, -234, 184, 230, 9, 117, -95, 273, 101, 50, -314, 195, 301, 167, -214, -19, 144, 4, -165, 13, 393, 234, 57, -248, -537, 28, 176, 320, 52, -39, -34, 212, -169, -434, 66, 257, 49, -503, -423, -170, 54, -169, -358, -304, -226, -274, 39, -563, -176, -36, -215, -622, -329, -70, 308, 215, -99, -341, -308, -153, -155, -168, -133, -67, -126, 71, -117, 27, -111, 4, -207, -457, -207, 160, 171, -124, -375, -151, 173, 72, -60, 249, 324, -1, -103, -309, 84, 174, -65, -155, -251, 302, 526, 280, -358, 117, 337, 311, 133, -26, 538, 357, 152, -56, 18, 123, 410, 335, 289, 239, 172, 269, 27, -111, 100, 233, 46, 150, 102, 310, 596, -30, 235, 130, 183, 486, 270, 175, -326, 215, 206, -150, 130, 274, 243, -48, 62, 93, -99, 317, 56, -480, -192, -314, 222, 104, 175, -16, 73, -220, -315, -144, 168, 142, 35, -185, -160, -114, 181, 20, -295, -252, -151, -79, -108, -356, -229, 151, -50, -259, -37, -95, 65, -41, -370, -241]
3874b41qK62m2n1j73J27J34l75k03M90J62j30j15k28K48K03m2j17j62J74L9j28
3896a76n5K02j0J43l15J59J6J51J44n26J59J19j00j53K64J42N79p27k08OK28K00
3918B42m3k43p2K03K03j65j10M10j53J7l31N6K88j20l3m6J04jQ3j25k98L54J04
3941C24k1J02k35K6p9k5o2j32L7L61o1k28J31K81m15R8J4j76K78Q0k79L9j19K02
3965A41n8k24J71q5K18k27q4j64N27q3j47j94L0K39l34J21P8J61L58m44j46l40
3987d86K33J98k32J82L2k15L07Qj69k24N40K7l62k51O01o6k17k37K03r1J93l97
4009d23J66N15l13l03Q7K80L14l31o7N9l30L80K88j48m06n2J64K31l11J40P0J65
4031A75j68o78L73N31n5o8L6q1n7K34j99k01K85K72j91L7k95q2K52J72j04n38
$$ y = [-241, -249, 13, -29, -80, -253, -126, 8, -367, -570, -80, 82, -48, -163, -391, -143, 60, 18, -99, -261, -87, -48, -176, -231, -29, -39, 104, -211, -52, -36, 115, 259, -267, -108, 11, -89, -242, 22, 164, 743, 16, -192, -186, 42, 242, 199, -44, -116, 87, 290, 125, 15, 425, 272, 289, -42, 14, 302, 182, 149, 103, 207, 206, 289, 164, -134, 220, 324, 303, 405, 170, 196, 117, 92, 30, -102, -65, 296, 235, 7, 138, 419, 4, 102, 116, -60, 218, 298, 19, 58, -61, 141, 83, -141, 30, -55, 163, -64, -148, -312, 215, 132, -15, -209, -179, 60, -274, -153, -75, 86, 444, 0, -146, -486, -253, -55, -287, -105, -73, -288, 19, 27, -142, -366, 174, 201, -161, -412, 189, 123, -94, -331, -128, -219, -26, -423, -257, 258, -55, -358, -271, 9, 323, -8, -75, -16, -346, 34, 322, 174, -232, -284, -120, 111, -200, -60, 10, 175, 7, -671, -298, 233, 178, 110, 146, 65, 8, 242, 43, -158, 127, 399, 208, 245, -50, -132, 120, 292, 188, -350]
4053c50N84L56j64l37j71K55Q4l77J0J29J70o2P1k15K45k13K07m13K76Jj90J45
4075D1J88R3l33J72k28q4K58q5n4j18j05M26Q2k48J61l36N33r9m55J38J87M2j0
4098A66k08mL6k61K48k65K42k88L35j44o8M8K65L3k5j38L3j19J47j48j4K41o9
4121D3j41R3l16K51R2j94R8r3jJ83l1l34n6M84J79o36K2L02L21n91J46K38r9J77
4145A37m07k77O15o1Jr4K40q8p7m4J63j93q9P0n5J23M2j0j75L3J31J82Q5o4m22
4170b34M72o1k13J07l3K44j77Rm60K73K64rm2pOl76L49K62k21j94N8L13k83k76
4194b29N18J38j96m2k89N2O24k15n64K30K07O2j3k24K7R0l47K68nJ98k78l4l7
4217e9L12k73m6K04k8j07J36L19o82J87J42J05k24k15k4N0L57o8o6k37J58J33
$$ y = [-350, 234, 590, 426, 89, -82, 173, 257, -120, -110, 19, 189, 127, 198, -17, 228, 15, 222, -191, 85, 86, -104, 41, 229, 322, -11, 161, -67, -151, 107, 22, -32, -150, -255, 171, 253, 5, 166, -170, 363, 264, -191, -53, 134, 176, 166, -42, -46, -10, -271, -23, -288, -46, -334, 1, -143, -211, -163, 102, 135, 110, -28, 5, -114, 33, -115, -129, 112, 43, -98, -5, -321, -70, 22, -172, -74, -167, -168, 15, -16, -350, -406, 78, 257, -379, -357, -55, 266, -325, -179, 59, -40, 137, -270, -547, 68, 7, 8, -86, 154, 66, -11, -55, 108, -85, -174, -104, -159, -36, 6, -4, -179, -146, -15, 167, 252, 188, -234, 238, 177, -36, 71, 38, 282, 105, 114, -346, -73, 191, 182, 140, 133, 139, -237, 112, 374, 153, -41, 17, 330, 47, -229, 289, 427, 231, 189, -100, -48, 576, 361, -203, 27, 234, 296, 283, 59, 86, 176, -171, 97, 92, 290, 12, -22, -59, 253, -20, -66, 138, 110, 3, 139, 458, -224, -37, 105, 210, -14, -229, -253, -203, 154, 86, 20, -217, -59, 74]
4239G4J6m0l12L85k43K34j32k12N59k20j98k14J53R3j06K18n62L17J71j18L9J42
4261D4L4k63k14K51K74l53P12r04L22N1o2K20j60r2R9j29J21q0n3K71l21o3j4
4284c09M32K62k14j22k99M25J30j6k86K16OJ15o96L33m8K59k57R4m2%O9O2P7j87
4308DK56O9m06m7L96k58J05k62o7L89L12m12n1M4o3K17j94J51l88K51K1n5r6J87
4332A03L72l23j59Q8L36j08j22l14J94K68m4m09k49L22L27k20Jj93L20J47q3m83
4354b29J16P2K96l32P5J57K50k48k86q9J26K63k24j4M4Q5l79RJ31K66l80L50q5
4377b6j9pM1o4j65q7K14J89K4m2j63j01j49L67l25L25K19n09Q9K5J00J52l58J81
4401h9k94L60l2M5O2j42L42m19K08Q7k94J50J55PM7j81l11N01o9l57M57K31k29
$$ y = [74, 90, 50, -262, 123, -120, 114, -18, -230, 329, 109, -89, -303, -150, -57, -163, 55, -507, -190, -19, -137, -98, 44, 78, -185, -399, -148, 126, -227, 485, -419, -97, -46, -108, 112, -48, -140, -41, -170, -49, -129, -182, 89, -232, -295, -309, 123, 385, 171, 49, -250, 175, 305, 289, 3, 219, 225, 340, -356, -23, -71, 188, -69, 25, -17, -17, 52, 114, 191, 4, 260, 329, -77, -124, 272, 14, 119, -143, -210, 179, 491, 79, 28, 72, 9, 226, 32, 183, -205, 46, 67, 12, -84, 103, 475, 152, -7, 81, 417, 309, 187, -127, 67, 335, 291, -118, -367, -45, 282, 62, 63, -130, 190, 337, 254, -229, -113, -41, 255, -77, -2, 155, 405, 157, -129, -218, -92, 171, -53, -67, -23, 62, -317, -308, -177, 89, -291, 59, -26, -45, -52, -11, -75, -240, -327, -113, 76, 100, 58, -105, -206, -355, 12, -313, 12, 231, -278, -189, -164, -64, 88, -270, -89, -383, -23, -55, -10, 52, -90, 252, -167, 41, 128, -166, -16, 139, 146, 193, 12, -299, 202, 133, -224, 233, 464, 235]
4424B35m54M52J87m35j48j26N02j70q2j62O9O3K65q3J95j28K27j17j34q9j05m6
4446h4K62j36K63j47J31j36j13j02K33K34j14j01R6j54L7k34L0K23R1k18M1J77
4468B79m0l94L59j35L6k3l0K1j67J81K62j15l61M5M9K07j20j94M6j99K81k84k7
4491c23L90J15l5m55o3K83J98k50J7n9L61l39K37l92K07K03q0j4m42K97RK10k04
4514a29j41K56L07m46j58M04l25L19j96j12J4K89k99J02j28K8l0J57M1p1J04j14
4536a28N7M27m38K81p1j07j12M09k29k23j5J24j69M69k99r5J58K29k84Kj27K04
4558F3j44K49j39l7K50R7m20J21j55l28M41l0M2j18M02j33j66j98KJ82L86m52
4580h5J51j37N38l84l6j25J87k01j30L5M17K5m60J78J40q1P5K39m94R8q5M01k0
$$ y = [235, -219, 233, 420, -15, -163, -289, 213, 43, -39, -201, -132, -69, 196, 113, 308, 180, 407, 290, 156, 67, -38, -84, 178, 42, 305, 158, 289, 153, 40, -62, 171, 405, 291, 190, 286, 132, 169, -65, -35, 188, 279, 61, 102, 279, 239, -155, 204, 69, 105, 82, 52, 73, -94, 87, 349, 234, -127, -82, -33, 174, 54, -140, -94, -293, -12, -296, -323, 67, 182, 147, -308, -371, -88, 110, -140, -123, -182, 179, -160, 77, -315, -108, 95, 15, 1, -441, -144, -135, 75, -129, -270, -14, 293, -153, -311, 93, -232, 87, -109, -221, -207, 82, -217, -115, -243, -215, -245, -88, -47, -118, -14, -128, -71, 356, -82, 199, 128, 21, -91, 318, 89, -134, -149, -25, -194, 275, -24, -119, 39, 268, -16, -14, -141, 63, -81, 168, 29, -8, 242, 339, -81, 40, -115, -443, -2, -32, 10, -108, 294, 161, -5, -203, -201, -19, 367, -85, 66, -71, 467, 83, 47, -78, 109, -92, -222, -187, 230, 255, -205, -27, 113, 32, 107, 346, -148, -50, -135, 266, 246]
4603B46l16J96P7j99J58j12J44J56j86m33J38L97l77k5k4N3jk2j4l0K20j05R7
4626C8j42j60M80R8L8l89k85K01r8L55l56L67L3j84k9k01K07R5l26K8O9j20K00
4649h1k27L78j9j59K6q5k1j6J88l5j70O8J28L05P5l90J8J15k16J53k2n5n4J28
4673C2k46k26L57P3L04l12QQ3j7O1n2j6K56k3l77j03L46j7j70Q1j82L46kj70r1
4698e7R0K1k20L57l25J64K8J83m95L12O1J77n6o8j79jj0J74o1m21K56k6J70o9
4722EK13r0J47l60J80M88n23R2l47L11j76J07j80K7M59n92N18%m19R0J86j11j54
4745a29K3J31Q6m10J89J97o6j58l4K5J60K00n47j40L91M8J00k05k8Q7J12j89R3
4768f4J06O2k94L47m19O9J73J99j91j42k02M18j76O3K7j95K75n7l39RM35j22j20
$$ y = [246, -70, 126, 203, 4, 162, 50, 194, 350, 164, -269, -131, 266, -111, -136, -160, -107, -108, -130, -144, -174, 46, -59, 38, -104, -264, 216, 314, 352, -37, -322, -121, -219, 136, -220, 147, 180, -4, -33, -234, -27, 68, -258, -230, -161, -281, -81, -308, 70, 51, -108, -82, -167, -188, -204, -16, -51, -221, -153, -25, 280, 355, -35, -17, 98, -118, 35, 13, -42, -96, 32, -214, -440, -83, -10, 294, -18, -10, 73, 56, 117, 65, 49, 305, 282, -95, -198, 148, 131, -39, 42, -140, 206, 204, 34, -57, 33, 54, -166, 191, -134, 30, 58, 241, -254, 58, 119, 296, 240, 172, -7, -8, -18, 156, 95, -326, -70, -96, 74, 5, 218, 128, 275, -85, 95, 583, 60, 152, -195, 116, -60, 47, -133, -106, 353, -239, 279, 279, -140, -50, 136, 25, -129, -106, 25, 111, -299, -110, 87, 21, -137, -171, -146, 14, 214, -333, -473, -82, -34, 66, -139, -167, -80, 32, -157, -64, 42, 104, -190, 157, -262, -193, -20, 179, -12, -154, -356, 62, -114, -51, -24, -219, 56, -1, -340, -331, 104, -18, -138]
4791a38J46P1j02j77L98k24k39K67j58J24m4Q5L77l93k23r7L56M40m15K19k00
4812G3J56k75j34l5K8J86O3P4j90J6Q6k71K80j72L09K51k56k71J06l4M55j9l02
4835A24m9m7K90n43J54K95Q9l72Q0q6K88o3r3p5P9k98L14j0pm0M8Q6j90j63L46
4860A57j03J64k41n2K75Q4l24k5k27L42j63r3K50K16k57L08l77n5k9j8P1M7N9
4883Il15K94k01L75j67j55L89n84L1K64J82j59m48O05J31k46J2j84K44M3m31J11
4905b00j54N14k70M8K15l82L27J8O7Q8k85j42K87k50Q3J17m9K77j95l1j10j6J05
4928F2l14L55j40J93m57P30q3l78P3m6LK9J96R6l06n3K25l23K43K35m0j86P9k75
4952h2J11J9O5J16k52k30N46j15j48j7k4K90j47j51P1m2n9L2l6K77o5R9k8k00
$$ y = [-138, 8, 79, -23, -200, 198, -26, -265, 2, -156, -32, -76, 9, 386, -7, -230, -327, 29, 469, 54, 273, 73, 229, -46, -180, -215, -187, -1, 62, 136, -54, -38, 48, -223, 57, -115, 194, 445, 189, -82, 24, -10, 445, 426, 124, 75, 28, 318, -225, -71, 224, 313, -59, 21, -65, 223, 160, 67, -8, 71, -227, 87, 77, 70, 30, 78, 164, -26, -189, 157, 54, 218, -23, -75, 200, 284, -40, -65, -292, 50, -113, -206, 44, 260, 3, 311, -66, -121, -150, -168, -97, -50, 9, -306, -12, -213, 162, -5, -160, 229, -355, -324, -60, 122, -37, -485, 120, 251, 5, 17, -167, 77, 120, -311, -200, -354, 160, -110, -62, 153, -229, 98, 116, 183, 271, -14, -156, 131, -119, -36, 81, 32, 309, 114, 83, -27, -43, 62, -252, 103, -37, 156, -301, 429, 346, -32, 41, -5, -2, 27, 223, 319, 13, -40, 185, -138, 105, 340, 300, 114, 193, -82, 29, 48, 113, 229, -23, -253, 293, 178, 30, 13, -11, 279, 132, -19, 52, 10, -49, -17, -53, 224, 159, 258, 230, 30]
4976C0k00K10L24l60ML1L9J3j70q7N17m2k93j03j9J95k91K96J24l00J57N1k27
4999a01j19j46L07l5N1k7r9L42J42l18Rn1P7Q3m01O43l51j86j12J27J89j65o7
5022b08N7j89J37L30j57k02J14L06j5j9r7o2j6jj93p8J07L08j85k9Mq3K80J90
5046B99l96K38l40K78r8k54M0J96j56M5M4J2J23j72K8q0L79j63N3j56K46k71J4
5069i1Q6j76L67k03K56k26k5j9K01k68J05j4R2%r9j92K05J67j65k42K22L47o3
5092B65k4j44MP9l6l03N2J23k9j88M16k29K1J0J38jl08L26J20k03l56L44J31j28
5116H0k23J44r1K05q6o0J1P0m5n5j51K87O0l85J85R2k19L03k6l94K55j4L09k22
5140C0l53M34j79M0M1k11P0K22l16J39k57N82k56j65K9mQ1N0j67J08k51K05K1
$$ y = [30, -170, 40, 364, 4, 8, 39, 78, 91, -79, -166, 351, 309, 16, -87, -106, 89, -202, 94, 218, -82, 75, 126, -101, -220, -366, -59, -94, -43, -70, -169, 173, 315, -3, 6, -45, 32, 115, -286, 357, 6, -180, -292, -165, 24, -141, -208, -151, -340, -203, 127, -30, -232, -118, 188, 173, 154, 57, -5, -21, -22, -215, -293, -186, 122, -63, -92, -88, -171, 109, 299, -97, 141, -199, 79, -19, -273, -233, -37, -193, -148, -104, -92, 31, -141, -113, -193, 186, 23, 76, -80, 166, -105, -91, -5, -181, 186, -17, 239, 13, -12, -31, 170, -98, 7, -7, 85, 85, -14, -206, -1, 166, 1, -241, -19, 328, 265, 241, 97, 101, 180, 144, -159, -107, 16, -13, -201, 215, -14, 7, 17, 155, 154, -154, 172, 292, 89, -267, 77, 208, 80, -143, 1, -90, 115, 29, -31, -20, 50, 5, -50, -201, 86, 146, -239, -54, 38, -181, 122, 96, -298, -43, -57, 252, 30, -323, 111, -68, -28, 13, -198, -128, 94, -222, -83, -340, 242, -14, -179, -150, -154, -73, -23, -190, -82, -333, -128, -107]
5163a07K9J19l6N1j21m1J01L33m27J39m84M67L22k45J03l9m33K93J16l00J14K90
5185B44k37k32j91R7K67l9N6J84l16J05N8p4j57N94l27K8m7n0J38k08K69j43J29
5208A48P9j98o6K96j83PP8j24J70J39P7k86m29L59J7J45L08o58J70j77M60j98
5230A34K90k89k21K99l97L56r9L9l68J28M5q8m5R0p8K24R6J18k29j70J50K83m7
5253B21j53J08k50L01l29J58j52n5p4R9r5J66j2L80l60qp0k29M76m14L0N29j34
5276A33j67l4KN3J2j30J09J90k80K26r9k02R8J56j44l4J77P8N8l49K18K27k71
5299B7k1k1J52r4q6R9k94o2K96j2l57K11L39k58L35k60m7K4O0M2m08M11K09L5
5323C20j86k49J81j98K43j66L9Q9J12m88m8M06R3p8N2j52j85P4L22k47L27j55
$$ y = [-107, -78, 41, 5, 56, -65, -106, -5, 328, -99, 40, -444, 23, 345, 100, 203, 164, -269, 24, 140, -160, -46, 244, 7, -225, -416, -319, -52, -91, -35, 149, -167, -62, -4, -78, -235, 359, 32, 60, 13, -37, 101, -107, 162, 19, 148, 227, 29, -37, 259, 76, 83, 161, 37, 207, 346, 423, 137, -292, 67, 84, 229, 537, -121, 49, -128, 332, 134, 424, 135, -86, 213, -184, 172, 73, 112, -256, -128, -83, -171, -216, -126, -204, 20, 116, 234, 5, -165, -15, 268, 221, 68, 176, -74, 227, -102, 56, -96, -151, -225, -126, -221, -55, -67, 313, -47, -55, -125, -354, 122, -292, -262, 267, 133, -34, -68, -66, -13, -1, -131, -22, 168, -112, 114, 15, -187, -89, 67, -77, -111, 66, 144, 202, -147, 71, 298, 27, 6, -15, 137, 43, -43, 56, -238, -300, -4, -16, -373, -162, 177, -81, 254, -6, -53, -29, 31, 73, -335, 76, 285, 320, 134, -115, 66, -132, 111, -55, -16, 73, 185, -303, -351, 55, 148, 70, 122, -30, -215, -141, 181, -66, 261, 106]
5345A06l1L7k23K96q3N1k35J12j02L71q4j02j45L8j27k5R7o6j2K04j82J25J12
5368A32k25K39j38O6l38J65N2R4J33m33L24o7J09m05L38j30k63M74j47K1P2n6
5390A7j07j55J47L42j72k98L65j55J48k36J46m74K12K95J31m54J77K22l23Q1Q0
5411a1n4N9j80o5N8L70j42q1L03j99k11j18M22l77j19M00k34N4L07l53J52R6j28
5434e1j78M80l39j6m9K6j9K25k38J66q2K54J32m45K31o1j3j18r3M0j21K99o0R6
5458F6j54M2k12N8K64Lk0K10k33J2J56lk82P2l5L28L3k33q4m5L17j65m1K32k22
5483F4J82j76j48j68Q1K64k01O2K9K5J47j2o9L1j72M5J48J29j89J4k66K31M1J6
5507A08k72O1m7L12l24M2K59O0J13k94K07o8m9k44J54p8L1K42l52o7K43J71j54
$$ y = [106, 75, 112, -111, 185, 102, 153, -82, 30, -72, 299, 215, 113, -32, 6, -121, -146, -49, -115, -127, 77, -105, 20, 132, -93, 146, 8, 74, -264, -99, -47, 47, 180, -253, 71, 4, 113, -292, 46, -84, -347, 127, -20, 1, 73, 17, -90, -245, -98, 244, 72, -226, 139, -16, 132, -104, 42, -432, -220, 75, 206, -248, -71, 151, -172, -91, -11, -65, -6, -186, -251, -193, 177, 35, -46, 257, 58, -153, -271, 151, -226, -345, 55, -179, -125, 182, -171, -19, 77, -51, -229, 251, -88, -104, -153, -127, -146, 79, -159, 7, -75, 179, 311, -134, 97, 36, 23, -95, -188, -148, -269, 30, -30, 66, -88, -46, -258, -200, 64, 67, 47, 257, 24, 36, 192, 189, -93, -21, -56, 272, 305, 72, -12, -57, 260, 95, 54, 286, 64, 246, 70, -78, -246, -165, 99, -102, -40, -11, 14, 161, 149, 80, 111, -61, -16, 132, 261, 72, 86, -180, 51, 92, 108, -164, -103, -150, 162, -162, -120, 139, 199, 312, 18, 225, 157, 108, -136, 18, -60, -29, 213, -139, -206, 37, 208, 54]
5530E4Q1k57J6J61l82N69l79K0J16Lk32P2L20k41q2m7l0L17n0J71l13J89j60%
5554h4J53K4n8L31k85j20k26K88r4J96k93J08PJ60l11l2K65k6K48m76L53P2lj41
$$ y = [54, 135, -122, -106, 55, -327, 242, -137, -117, -1, 2, -230, -158, 162, -79, -161, -208, -238, 79, 29, 200, -113, 76, -84, -84, 69, 93, 35, 366, 81, -39, -265, 23, -71, 125, -168, -60, -53, 107, -204, -236, 29, 3, 251, -225, 128, 200, 197, 56]
$$ [...]
8191b33
##END NTUPLES=NMR FID
##END=
