##TITLE=1H_Ser-Am-2
 CDCl3, 8 sc, 
 1.10.2020
##JCAMPDX= 6.0         $$ Bruker NMR JCAMP-DX V2.0
##DATA TYPE= NMR FID
##DATA CLASS= NTUPLES
##ORIGIN= UXNMR, Bruker Analytische Messtechnik GmbH
##OWNER= root
$$ XWIN-NMR		Version 3.5
$$ Thu Oct  1 12:54:21 2020 Russian Standard Time (UT+4h)  she@DPX200
##.OBSERVE FREQUENCY= 200.1315066352
##.OBSERVE NUCLEUS= ^1H
##.DELAY= (6, 6)
##.ACQUISITION MODE= SIMULTANEOUS
##.ACQUISITION SCHEME= undefined
##.AVERAGES= 8
##.DIGITISER RES= 18
##SPECTROMETER/DATA SYSTEM= spect
##.PULSE SEQUENCE= zg30
##.SOLVENT NAME= CDCl3
##.SHIFT REFERENCE= (INTERNAL, CDCl3, 0, 15.7039)
##AUDIT TRAIL= $$ (NUMBER, WHEN, WHO, WHERE, WHAT)
$$ ##TITLE= Audit trail, XWIN-NMR		Version 3.5
$$ ##JCAMPDX= 5.01
$$ ##ORIGIN= Bruker BioSpin GmbH
$$ ##OWNER= she
$$ F:/spectra/data/she/nmr/H-F/1/audita.txt
$$ ##AUDIT TRAIL=  $$ (NUMBER, WHEN, WHO, WHERE, WHAT)
(   1,<2020-10-01 12:53:08.96 +0400>,<she>,<DPX200>,
      <created by zg, POWCHK disabled, PULCHK disabled
       configuration hash MD5:
       00 E9 B6 7A A2 85 ED C7 34 08 36 98 17 FE 4E 26
       data hash MD5: 16K
       F9 C5 8B 6B F8 47 39 91 C7 49 ED 71 0B E6 33 05>)
$$ ##END=
$$ 
$$ hash MD5
$$ 99 7D DC 74 69 B7 0D A1 82 87 DE B0 4D 67 6A 5A
##$RELAX= 
##$RELAX= 
##$RELAX= 
##$RELAX= 
##$RELAX= 
##$RELAX= 
$$ Bruker specific parameters
$$ --------------------------
##$DU= <F:/spectra>
##$EXPNO= 1
##$NAME= <H-F>
##$PROCNO= 1
##$TYPE= <nmr>
##$USER= <she>
##$AMP= (0..31)
100 100 100 100 100 100 100 100 100 100 100 100 100 100 100 100 100 100 
100 100 100 100 100 100 100 100 100 100 100 100 100 100 
##$AQSEQ= 0
##$AQ_mod= 1
##$AUNM= <au_zg>
##$AUTOPOS= <>
##$BF1= 200.13
##$BF2= 200.13
##$BF3= 200.13
##$BF4= 200.13
##$BF5= 200.13
##$BF6= 200.13
##$BF7= 200.13
##$BF8= 200.13
##$BYTORDA= 1
##$CFDGTYP= 0
##$CFRGTYP= 5
##$CHEMSTR= <none>
##$CNST= (0..31)
1 1 145 1 1 1 1 1 1 1 1 1 1 1 1 1 1 1 1 1 1 1 1 1 1 1 1 1 1 1 1 1 
##$CPDPRG= <>
##$CPDPRG1= <>
##$CPDPRG2= <>
##$CPDPRG3= <>
##$CPDPRG4= <mlev>
##$CPDPRG5= <mlev>
##$CPDPRG6= <mlev>
##$CPDPRG7= <mlev>
##$CPDPRG8= <mlev>
##$CPDPRGB= <>
##$CPDPRGT= <>
##$D= (0..31)
0 1.2 0 0 0 0 0 0 0 0.06 0 0.03 0 0 0 0 0.0002 0 0 0 0 0 0 0 0 0 0 0 0 
0 0 0 
##$DATE= 1601542388
##$DBL= (0..7)
120 120 120 120 120 120 120 120 
##$DBP= (0..7)
150 150 150 150 150 150 150 150 
##$DBP07= 0
##$DBPNAM0= <>
##$DBPNAM1= <>
##$DBPNAM2= <>
##$DBPNAM3= <>
##$DBPNAM4= <>
##$DBPNAM5= <>
##$DBPNAM6= <>
##$DBPNAM7= <>
##$DBPOAL= (0..7)
0.5 0.5 0.5 0.5 0.5 0.5 0.5 0.5 
##$DBPOFFS= (0..7)
0 0 0 0 0 0 0 0 
##$DE= 6
##$DECBNUC= <off>
##$DECIM= 32
##$DECNUC= <off>
##$DECSTAT= 4
##$DIGMOD= 1
##$DIGTYP= 9
##$DL= (0..7)
0 120 120 120 120 120 120 120 
##$DP= (0..7)
150 150 150 150 150 150 150 150 
##$DP07= 0
##$DPNAME0= <>
##$DPNAME1= <>
##$DPNAME2= <>
##$DPNAME3= <>
##$DPNAME4= <>
##$DPNAME5= <>
##$DPNAME6= <>
##$DPNAME7= <>
##$DPOAL= (0..7)
0.5 0.5 0.5 0.5 0.5 0.5 0.5 0.5 
##$DPOFFS= (0..7)
0 0 0 0 0 0 0 0 
##$DQDMODE= 0
##$DR= 18
##$DS= 0
##$DSLIST= <SSSSSSSSSSSSSSS>
$$ [...]
##$SUBNAM2= <"">
##$SUBNAM3= <"">
##$SUBNAM4= <"">
##$SUBNAM5= <"">
##$SUBNAM6= <"">
##$SUBNAM7= <"">
##$SUBNAM8= <"">
##$SUBNAM9= <"">
##$SW= 16.880792210976
##$SWIBOX= (0..15)
0 0 2 0 0 0 0 0 0 0 0 0 0 0 0 0 
##$SW_h= 3378.37837837838
##$TD= 16384
##$TD0= 1
##$TE= 0
##$TE2= 300
##$TE3= 300
##$TEG= 300
##$TL= (0..7)
0 120 120 120 120 120 120 120 
##$TP= (0..7)
150 150 150 150 150 150 150 150 
##$TP07= 0
##$TPNAME0= <>
##$TPNAME1= <>
##$TPNAME2= <>
##$TPNAME3= <>
##$TPNAME4= <>
##$TPNAME5= <>
##$TPNAME6= <>
##$TPNAME7= <>
##$TPOAL= (0..7)
0.5 0.5 0.5 0.5 0.5 0.5 0.5 0.5 
##$TPOFFS= (0..7)
0 0 0 0 0 0 0 0 
##$TUNHIN= 0
##$TUNHOUT= 0
##$TUNXOUT= 0
##$USERA1= <user>
##$USERA2= <user>
##$USERA3= <user>
##$USERA4= <user>
##$USERA5= <user>
##$V9= 5
##$VALIST= <valist>
##$VCLIST= <CCCCCCCCCCCCCCC>
##$VD= 0
##$VDLIST= <DDDDDDDDDDDDDDD>
##$VPLIST= <PPPPPPPPPPPPPPP>
##$VTLIST= <TTTTTTTTTTTTTTT>
##$WBST= 1024
##$WBSW= 4
##$XGAIN= (0..3)
0 0 0 0 
##$XL= 0
##$YL= 0
##$YMAX_a= 271425
##$YMIN_a= -189173
##$ZGOPTNS= <>
##$ZL1= 120
##$ZL2= 120
##$ZL3= 120
##$ZL4= 120
##$ABSF1= 10
##$ABSF2= 0
##$ABSG= 5
##$ABSL= 3
##$ALPHA= 0
##$AQORDER= 0
##$ASSFAC= 0
##$ASSFACI= 0
##$ASSFACX= 0
##$ASSWID= 0
##$AUNMP= <proc_1d>
##$AZFE= 0.1
##$AZFW= 0.1
##$BCFW= 1
##$BC_mod= 2
##$BYTORDP= 1
##$COROFFS= 0
##$CY= 11.3945322036743
##$DATMOD= 1
##$DC= 2
##$DFILT= <>
##$DTYPP= 0
##$F1P= 16.9975609425685
##$F2P= -3.02152046262296
##$FCOR= 0.5
##$FTSIZE= 0
##$FT_mod= 4
##$GAMMA= 1
##$GB= 0.15
##$INTBC= 1
##$INTSCL= 1
##$ISEN= 128
##$LB= 0.24
##$LEV0= 0
##$LPBIN= 0
##$MAXI= 10000
##$MC2= 0
##$MEAN= 0
##$ME_mod= 0
##$MI= 1.114404
##$NCOEF= 0
##$NC_proc= 0
##$NLEV= 6
##$NOISF1= 3.799351
##$NOISF2= 2.8
##$NSP= 1
##$NTH_PI= 0
##$NZP= 0
##$OFFSET= 15.70392
##$PC= 1
##$PHC0= -10122.33
##$PHC1= 5.400889
##$PH_mod= 1
##$PKNL= yes
##$PPARMOD= 0
##$PSCAL= 0
##$PSIGN= 0
##$REVERSE= no
##$SF= 200.130013532006
##$SI= 16384
##$SIGF1= 3
##$SIGF2= 2
##$SINO= 400
##$SIOLD= 16384
##$SREGLST= <1H.CDCl3>
##$SSB= 0
##$STSI= 0
##$STSR= 0
##$SW_p= 3612.71676300578
##$SYMM= 0
##$S_DEV= 0
##$TDeff= 0
##$TDoff= 0
##$TI= <>
##$TILT= no
##$TM1= 0
##$TM2= 0
##$TOPLEV= 0
##$USERP1= <user>
##$USERP2= <user>
##$USERP3= <user>
##$USERP4= <user>
##$USERP5= <user>
##$WDW= 1
##$XDIM= 8192
##$YMAX_p= 0
##$YMIN_p= 0
$$ End of Bruker specific parameters
$$ ---------------------------------
##NTUPLES= NMR FID
##VAR_NAME=  TIME,          FID/REAL,        FID/IMAG
##SYMBOL=    X,             R,               I
##VAR_TYPE=  INDEPENDENT,   DEPENDENT,       DEPENDENT
##VAR_FORM=  AFFN,          ASDF,            ASDF
##VAR_DIM=   8192,          8192,            8192
##UNITS=     SECONDS,       ARBITRARY UNITS, ARBITRARY UNITS
##FACTOR=    0.000296,      1,               1
##FIRST=     0,             0,               0
##LAST=      2.424536,      0,               0
##MIN=       0,             -189173,         0
##MAX=       2.424536,      271425,          0
$$ Real data points
##PAGE= N=1
##DATA TABLE= (X++(R..R)), XYDATA
0@%%%%%%%%%%%Qj6J6j6K4l2M0m8N6p2Q8j04J20j44J74k02K34k70L11l58M08m64
33b47N28n99O76p62Q56r59J072j196J332j480J642j819K012k222K452k706K983
50A563l285L619l985M389m843N351n919O565p307Q169r181J0389j1866J3715j6110
65h736J9353k4024L1432m5571J17306k78933J51926K27042l35651J32689J1249
76a918O2150m6906j63008K65501k5985k23470K01816k7506o2891m5432L8618J50772
88A21741k28025K7734K27386k24608M7658R0837o9242M8137j53858J24762J00394
99A12916k87649J97700O4590k12963J57251q111j4793J8964j27514J84231n8308
110B6314j64289K19291o8757j02556J10563L658p4p2520O6494O1335j63271J04241
$$ plain form
0 0 0 0 0 0 0 0 0 0 0 0 0 8 -8 8 -8 16 -16 24 -24 32 -40 48 -56 64 -80 94 -108 126 -144 167 -191 217 -247
33 -247 281 -318 358 -404 452 -507 565 -631 701 -779 863 -956 1056 -1166 1286 -1420 1563
50 1563 -1722 1897 -2088 2301 -2542 2809 -3110 3455 -3852 4317 -4864 5525 -6341 7374 -8736
65 -8736 10617 -13407 18025 -27546 89760 -189173 -37247 189795 -145856 -13167 -1918
76 -1918 60232 13326 -149682 115819 89834 -133636 68180 40674 -22217 -67649 -29031 121741
88 121741 -106284 -78550 148836 -75772 -28114 62723 -6519 41618 -112240 12522 112916
99 112916 -174733 22967 87557 -125406 31845 23734 8941 27905 -99609 84622 26314
110 26314 -137975 81316 12559 -89997 20566 24224 24150 -48370 18124 79459 -83812 20429
122B0429K8579j18617J01333o1812K9691O0151j46257J48085J315j53640J57846
133F7103m4970o4574P1546o3086O6839l7105n2612J42087r0278l3573R8955n8653
145A679k113j1865K1096K3234j04084R0382K9633j05622Q4203j1452j7992K7190
157B4289o4352Q3601l8552q2108J32952o5440l8993Q7332o4697M1254k601n3494
169d0809R1082o1262l3481P5766m6433m146M104J5710K3965p0952N8910K9107
181D1561q5040N2607K561k8907J6500l1671N4658k1784n1152R5902m0214l5248
193c0227O5413m2332P533M793k9029M8324l8845q386N4530m0222P229J6856j2052
206C585J3977k8189J5681J3310m1093K7523L830j4980J4686j3552K7759j2504
$$ plain form
122 20429 49008 -69609 31724 -30088 -397 59754 -86503 61582 62897 -90743 67103
133 67103 22133 -42441 29105 -33981 32858 -4247 -56859 85228 -5050 -38623 60332 1679
145 1679 -434 -12299 8797 32031 -72053 18329 47962 -57660 26543 15091 -2901 24289
157 24289 -40063 43538 4986 -77122 55830 -9610 -48603 38729 -25968 15286 12685 -40809
169 -40809 50273 -10989 -44470 31296 -15137 -19283 -15179 531 24496 -46456 12454 41561
181 41561 -43479 9128 11689 -17218 -718 -32389 22269 485 -50667 45235 5021 -30227
193 -30227 35186 -7146 387 5180 -23849 24475 -14370 -22756 31774 -8448 -1219 15637 3585
206 3585 17562 -10627 5054 18364 -22729 4794 8624 -6356 8330 -5222 22537 10033
218A0033k7622M9933l0968k2477M4440l0873k366J8814j5832J9402j3726l86K2974
231B1346k9422P226J1733k1973P657n00j358N316q279J3536l032o281J0404j0851
245d478M193l945r244J6232j3250l404K2344j5817J891J3335j2217N106l614l345
259f213O377j1485M051R522j0853N451R195o686P87L668j256n974K298J166n267
274e219M550P86q42N677j321p0M539n996J333O67n884L789j557j304N637j476
290C309o11O738m316k084M577n181l329L050j759k747M430m3N2K129o49L71j341
307B596l043N70j104m599M238k45k728N418k63k228L351k147k968J811l684LM38
324d584r54J965L98J255O87L28J28j864M69p67l407L779j858r99N614l599M108
$$ plain form
218 10033 -17589 32344 1376 -21101 23339 -7534 -9900 8914 -6918 12484 -1242 -1628 21346
231 21346 -8076 -850 10883 -11090 -3433 -3933 -5291 25 -8254 5282 2250 -4031 6373 -4478
245 -4478 -285 -4230 -13474 2758 -10492 -13896 8448 -7369 -5478 7857 -4360 746 -2868 -6213
259 -6213 164 -11321 -7270 2252 -8601 -3150 6045 -641 146 3814 2558 -3416 -1118 48 -5219
274 -5219 -669 117 -725 4952 3631 3561 8100 2104 3437 4104 -1780 2009 452 -852 4785 3309
290 3309 2698 9436 5120 3036 7613 2432 -897 2153 394 -2353 2077 2034 2086 4215 3566 3937 2596
307 2596 -447 123 -981 -5580 -1342 -1587 -4315 1103 840 -1388 1963 -184 -3152 -1341 -5025 -5022 -4584
324 -4584 -5538 -3573 -3175 -1920 -1233 -905 -777 -2641 -2172 -2939 -6346 -2567 -4425 -5424 190 -3409 699
341F99J316n134P577m567n160R116p229n62O073m791O117k821Q07P933j1102M246
357B518N069j0780N437j532q7M040q596J2532j980j0555J5614q436l911P566j0892
372c993R515n278o710J8939j5833J695J3871j6323R276l115o041J2636j8769R413
386g17Q516k1481J8789k921q593J3609j4552J0979j763j6668K4712j6611o054
399a2755K2077k0186J0601J109j0045K0849k3238O877J7778l2434K0023L081j7562
412a3825K0506j7042J1949P801k8276L1745r436j9029K7412j8631P045J589j6154
425a4346L4905k7878n012L8488l7001J0528J1166j8861K2155k6831J2300K4721
437B4334m8459L1611J0817l1596K6475j7583J2564M328l7829M9348j6813l4415
$$ plain form
341 699 2015 -3119 4458 -109 -5269 3847 -3382 -3944 2129 -2662 3455 634 1441 9374 -1728 2518
357 2518 7587 -3193 2244 712 625 4665 -3931 8601 6621 -3934 11680 3244 -667 6899 -3993
372 -3993 5522 244 -6466 12473 -3360 -1665 12206 -4117 5159 2044 -3997 8639 -10130 -717
386 -717 7799 -13682 5107 2186 -6407 7202 -7350 3629 1866 -14802 9910 -6701 -12755
399 -12755 9322 -10864 -263 846 -9199 11650 -11588 -4711 13067 -19367 656 3737 -13825
412 -13825 6681 -10361 1588 9389 -18887 12858 3422 -15607 11805 -6826 219 1808 -14346
425 -14346 20559 -7319 -12331 26157 -10844 -316 10850 -8011 14144 -12687 -387 24334
437 24334 -24125 7486 18303 -13293 13182 -4401 8163 12491 -25338 24010 7197 -27218
449b7218N0688k3611l671J1826j9603L7118l4397q421N0666n0130P271K4879k5847
462a0450K0747k6470J6347K9498o5445M1494J9292n4773L7171p437m359Q962l1559
475b6982M9521j8988l9144O2067k9694j1038K3636k5489L3013l1511o631N8685
487C7445o3453J0233M4719m6583K0431n898J02K1958n1483M5047Q518n8780N4289
500A6545q837j8556K1994k7775L8934j9765l3411O9767m5592j7180N1711l5073
512g238J0831n561j950L4259n6038K7477L3621o5584L7014P552k3895K2359l1666
525a8819L4845M38n1425O2584j7291l6121M3199j9784Q192j0522j2998N2046n2664
538a8320n74N5299n5358J1623J8361j7222J8621l8136K8612K3944o5034M4724
$$ plain form
449 -27218 23470 -141 -3812 8014 -11589 25529 -8868 -17289 33377 -16753 -9482 15397 -10450
462 -10450 10297 -16173 174 29672 -35773 5721 25013 -29760 7411 -26 -4385 4577 -26982
475 -26982 22539 3551 -35593 26474 -3220 -14258 9378 -16111 16902 -14609 -21240 37445
487 37445 -26008 -15775 28944 -17639 2792 -3106 -3004 18954 -32529 12518 21036 -37744 16545
500 16545 7708 -10848 11146 -16629 22305 2540 -30871 38896 -6696 -23876 27835 -7238
512 -7238 3593 -1968 -3918 30341 -25697 1780 35401 -30183 6831 14383 -9512 12847 -18819
525 -18819 16026 16464 -34961 27623 10332 -25789 17410 -2374 5818 -4704 -17702 34344 -18320
538 -18320 -18894 36405 -18953 -7330 11031 -6191 12430 -25706 2906 26850 -38184 6540
550F540J1242m0866K8488r911J2036q098k8881N7289k8950l0116N2783k7147k267
563g858J0452j1178K7716l8156Q253M2908n3406J2938K2581k2843J4977j8613
575a2229J8524R353m4718M5708l52m0282L5188q956j041K782j8421L5874k4296
588b866j3603M3506l2695m47J6803j4574J7620k4518Q004K6124m2801K3464J2415
601A6432l0437K3236j0932M085Q770l0564L2695n419k7803L4579j6059m435J2510
614F658j6312K2342j7510q712L3292l0659K795J9338k1962J3661p248R1J5392
627A1166k8221J9953O822k7129K3772p557o196J3283j8514J8470l019j9551K9073
640A2352j4385p262J7425j5204R953l932p052J9823j9595L033J6673j9454R598
$$ plain form
550 6540 17782 -23084 5404 -4507 7529 -569 -29450 27839 -1111 -31227 21556 -5591 -7858
563 -7858 2594 -8584 19132 -19024 -10771 32137 -21269 -8331 14250 -8593 6384 -12229
575 -12229 6295 15648 -29070 16638 16286 -23996 11192 2236 1195 3977 -14444 21430 -2866
588 -2866 -16469 27037 -5658 -6105 10698 -3876 13744 -10774 -2770 23354 -19447 4017 16432
601 16432 -14005 9231 -1701 2384 11154 -19410 13285 7866 -19937 14642 -1417 -5852 6658
614 6658 -9654 12688 -4822 -13534 19758 -10901 -8106 11232 -10730 2931 -4317 -4226 11166
627 11166 -17055 2898 9720 -17409 6363 -1194 -7390 5893 -12621 5849 2830 -16721 12352
640 12352 -2033 -9295 8130 -7074 2879 -1053 -8105 11718 -7877 -4844 11829 -7625 1973
653A973N20n062R990j4841J1009M185j8358J7409k599q875J1352q987O888l76
667D228j0448J6096r891m319J3209j1088L433K394n732Q986q299N16Q279j1112
681c748N257J043m594M908n786M408J540q372Q740k411n038O991n667K285N07
696F3m546P066n478p89O619o757K199K327m665M291k806l14L197m424L348k15
712h84k032L325k500J046J494l309L125j002j429L137k791J891M58k019L369j802
728G7q30L023k557O51J382k242K189o75l89J654j317O95L15q13P58n81j99Q64
746B005j163P27j4l12M83o93P72l96j010J178o73j067J292q06l87P77p98M62l41
765C6l02L51p34k13L92o74K4J19j92J84l54M28l88o8L25o91L04P3p12J048l93
$$ plain form
653 1973 2493 -2569 7421 -7420 3589 7774 -10584 6825 4226 -4649 6703 -2284 4604 4228
667 4228 -6220 9876 -15 -4334 8875 -2213 1220 3614 -2118 6868 -1431 -915 7364 -3748
681 -3748 1509 2552 -2042 2866 -2920 1488 3028 -5344 3396 985 -4053 2938 -2729 -444 63
696 63 -4483 2583 -2895 -3684 2935 -3822 -1623 704 -3961 330 -2476 -2790 407 -4017 -669 -884
712 -884 -2916 409 -2091 -1045 449 -2860 265 -737 -2166 971 -1820 71 529 -1490 1879 77
728 77 -753 2270 -287 364 1746 -496 1693 1018 629 2283 966 1661 1976 1163 1921 1340 1141 2005
746 2005 842 1569 1555 1243 1726 1033 1805 1409 399 1577 904 -163 1129 323 -64 713 -85 377 36
765 36 -266 85 -649 -862 -470 -1144 -1120 -1001 -1193 -1009 -1363 -935 -1323 -1391 -1066 -1757 -1453 -1380 -2092 -1044 -1437
786a437n13J426r40K02O00p86R22o54r6J426j588Q79R46j396J541n62J36R77j734
805f51J684p4j480K245j356M46J099k210L020j416j561L606k763J08J604k175
821A26K410j937l93L745m730J862K157l935K538j359P3J786m690M226K50n229
837c100N488k128j299K232l536M395k928k893P093n512n73M575m738L350k301
852a875n38N604q458L842M041p751N010q99j219L415o338O801n01p949J0205m033
868f43l011N517n056N151k972l072J0144r334O83Q215r106M985j251j637O807
883E420j0478O889M359j2324R958p48n196O348p037P244j678r036J4923q500m363
898d219J1429q972M012q49m387J1726j3215K225J1959j6092P325K692o406P224
$$ plain form
786 -1437 -1950 -524 -1464 -1262 -662 -1448 -526 -1180 -1276 150 -1438 -559 387 -1009 532 -30 106 1083 -651
805 -651 1033 959 -521 1724 368 814 1913 -297 2723 1307 -254 3352 589 697 2301 126
821 126 2536 599 206 3951 -779 1083 3240 -695 1843 484 557 2343 -2347 1879 2129 -3100
837 -3100 2388 260 -1039 1193 -2343 2052 -876 -3769 3324 -2188 -2761 1814 -2924 426 -1875
852 -1875 -2413 3191 -5267 -1425 2616 -5135 -125 -1024 -2243 1172 -5166 1635 1134 -6815 3390 -643
868 -643 -3654 1863 -3193 1958 -1014 -4086 6058 -3276 -2593 5622 -3484 1501 250 -1387 5420
883 5420 -5058 1831 6190 -6134 3824 3076 -2120 4228 -2809 4435 2757 -6279 8644 144 -4219
898 -4219 7210 -1762 2250 1401 -2986 8740 -4475 -2250 9709 -6383 942 3634 -2772 4452
912D452r983Q161L531j6904J6195k144j1394J2905p843L854n1r321J7508j1707
926b741o588J8377j3396R42N190o333R723j2705M590J3091k1745J0583P520j3495
940f987Q590n117M310L117j5475J8389l357j5221J8383o079k665L035n893J4235
954I265j2825l911K0422j8206J184J1739j0203N986p323N021R480k1080J3276
967B825O559j7277J1686j835q37J613j0088J7935q189j3228K1530r979m777Q445
981D383o627P910r808P59J6212k1210N122J2618j4475O259k799J875M955j6089
995a0915J6120Q42j8961J7619k597o197N328p074J1846q282p331K0293j5364k707
1009g380J3687j0133M895m940J039J1599j9331R748R887j9334J1180J320m611
$$ plain form
912 4452 -5531 2630 6161 -10743 5452 3308 -8086 4819 -3024 830 779 -8542 8966 -2741
926 -2741 -9329 9048 -4348 -3406 1784 -4549 5174 -7531 -2941 10150 -11595 -1012 6508 -6987
940 -6987 1603 -3514 796 3913 -11562 6827 3470 -11751 6632 553 -2112 923 -4970 9265
954 9265 -3560 -7471 12951 -5255 -4071 7668 -2535 3451 -3872 1149 10629 -10451 2825
967 2825 9384 -7893 3793 1958 1121 2734 -7354 10581 2392 -10836 10694 715 -4062 4383
981 4383 -2244 5666 -4142 -3383 12829 -8381 -3259 9359 -5116 1143 -1656 219 5174 -10915
995 -10915 5205 6047 -12914 4705 2108 -4089 1239 -5835 6011 -2271 -9602 10691 -4673 -7380
1009 -7380 6307 -3826 1069 -3871 -2832 8767 -10564 -816 9071 -10263 917 2237 -2374
1022b374N165j0582J3334j813j4975J9388o810p909J1465o812N610m882m166J6600
1036A1239j5562N0J4421j4478M753J965k767O476j2977R444O413j7658J2571P46
1050D636q558Q050o303O226j967r766J6534p896p512J2993q033J866P04l990R596
1065F580j1815K492J1307j4714N098L736n817N950p236M873L373j2429J2126j100
1079B424r364R364m389J880M78o305J0563o566l919J1477q770L83M319m307N529
1094B797o480J735P025j0352N311L295p312N599k348R52K257p282Q089j214o368
1109d296Q091l677q62K978l717M940l597k070P606o647O85M095m583L131j996
1124H1K99L179n962L894J740n593M321j169q76J825l399L888j445l208N163l049
$$ plain form
1022 -2374 2791 -7791 5543 3730 -11245 8143 1333 -6576 4889 -1923 3687 -1195 -5361 11239
1036 11239 -4323 -4273 10148 -4330 423 2388 -379 6097 -6880 2564 8977 -8681 3890 4636
1050 4636 -3922 4128 -2175 4051 2084 -7682 8852 956 -6556 6437 -1596 270 974 -3016 6580
1065 6580 -5235 -2743 8564 -6150 -1052 2684 -3133 2817 -4419 454 3827 -8602 3524 2424
1079 2424 -6940 2424 -1965 -85 393 -5912 4651 -1915 -5834 5643 -3127 -2744 1575 -2732 2797
1094 2797 -3683 -1948 5077 -5275 36 3331 -3981 1618 -730 222 2479 -4803 3286 2072 -4296
1109 -4296 3795 118 -744 2234 -1483 3457 -140 -2210 5396 -1251 -566 3529 -1054 2077 81
1124 81 380 3559 -2403 1491 3231 -2362 1959 790 -86 1739 -1660 2228 783 -2425 2738 -311
1140c11r55K718k704K005j331r61L488m016J194K184l484K031m45p47J747k656
1156b243J896N11k777K904j077p41J571j760J639o22j154K565j922rJ885k037
1172a371J285Oq83J795j743O68J235j905J375J0q66J340r94N92M80j245J433n57
1190F55m92J123r55M53K70p81J029p13j38R35j033M47K48p69O77m56j16N50q66
1209F8M28J48o94O06l66k85M04n15J61k7l39L22l15j30K13l73K13o3k29L29m37
1230h81J58J07l91M36k36j88N30m60J88J83k71L12j09p4M06l33K17J68k40M24
1250e4l49L01K27m38N47j34j22M48k70K87J28m81Q88n85j32Q49q61M84L7l26O66
1271A110o45J40P17j139P39K6p21Q86r42O25o8r35J319o86o57J209j154M73N8
$$ plain form
1140 -311 -1266 1452 -1252 753 -578 -1539 1949 -2067 -873 1311 -2173 -142 -587 -1334 413 -2243
1156 -2243 -347 164 -2613 291 -786 -1527 44 -1716 -77 -699 -1853 712 -1210 -1219 666 -1371
1172 -1371 -86 -80 -963 832 -911 -243 992 -913 462 472 -394 946 -48 544 1024 -221 1212 655
1190 655 163 1286 331 784 1054 273 1302 589 451 1386 353 800 1048 279 956 500 384 934 68
1209 68 496 644 -50 556 190 -95 309 -206 -45 -72 -411 -89 -404 -534 -321 -694 -481 -544 -773 -444 -881
1230 -881 -723 -616 -1007 -571 -807 -995 -465 -925 -737 -554 -825 -513 -622 -696 -290 -623 -406 -238 -478 -54
1250 -54 -403 -102 125 -313 234 100 -22 426 156 443 571 90 978 393 261 1110 249 733 770 444 1110
1271 1110 465 605 1322 183 922 948 227 1113 171 796 728 -207 1112 426 -231 978 -176 297 355
1290C55j023J613j471p9J528j975Q37L43j048J178j391O60R64k525K059n7j748
1307a780J914j223N64K56j649K496j347j234K960k132L34Q58j380K273k249M07
1323i32K617l625J724J375k472K094j399Q30J285l613L642l46l022L684j627j32
1339H3J076k097L465k441j534M849l928L75K236k580K240k177O67K978n442L029
1355G99J955m591L282j160j79J516l922M585j265m241N852k599j529K641k573
1370a429L049k662j232N729o027Q66M162m792K249q02m8K739n684M213J838o623
1386d454N338n35k283K442l081M233j902l885P549m290k133N233l620J838j358
1401i08m93N045o685K091M914o744K973J041j621K183m412M744M81o684P015j159
$$ plain form
1290 355 -668 945 -526 -605 923 -1052 -215 128 -920 258 -1133 -473 491 -2034 25 -32 -1780
1307 -1780 134 -1089 -525 -269 -1918 578 -769 -2003 957 -1175 -841 17 -1363 910 -1339 -932
1323 -932 1685 -1940 -216 1159 -1313 781 -618 212 1497 -2116 1526 1180 -1842 1842 215 83
1339 83 1159 -938 2527 86 -1448 3401 -527 -152 2084 -496 1744 -433 234 3212 -2230 799
1355 799 2754 -1837 1445 285 106 1622 -2300 2285 1020 -3221 2631 32 -1497 1144 -1429
1370 -1429 1620 -1042 -2274 3455 -2572 -1706 2456 -2336 -87 -889 -937 1802 -3882 331 2169 -4454
1386 -4454 884 349 -1934 508 -2573 1660 -242 -4127 3422 -868 -3001 2232 -1388 450 -908
1401 -908 -1401 3644 -3041 -950 3964 -2780 193 1234 -387 1796 -2616 2128 2609 -4075 2940 1781
1417A781l851M035k220K252j855k250P062n937j225O499n091J048M36p72L277
1432C189o184L689L550q240N036J188l692K613k985L763r13n388Q011l384m080
1447c827O356l369P38o80j514O084o795N10O605p535K318K355k905K738m491L807
1463C95K450q342O768M53n462N025k285J138nl911P665m306l895Q119m797j17
1479a107K349k691L973m626J199N753q344L237L737n371L346j969J200J925o101
1494c490O449m97o293O627j766j479J847k990M747l139k543P043n622m18M358
1509B834l629J828j796K99L677o157L027K884n918L569oj200J333l266M083p61
1525H01m378N581k047k250L240k084J687j638r48M501m524L52L617l844J409L02
$$ plain form
1417 1781 -2070 1965 -255 1997 142 -2108 4954 -983 -2208 4291 -800 248 684 -88 3189
1432 3189 -2995 694 4244 -3996 1040 2228 -1464 1149 -1836 1927 1014 -4374 3637 253 -3827
1447 -3827 2529 -840 -102 -782 -2296 3788 -3007 -2497 4108 -3427 -1109 1246 -1659 1079 -3412 395
1463 395 2845 -5497 1271 1724 -3738 1287 -998 140 135 -3776 3889 -417 -4312 3807 -990 -1107
1479 -1107 1242 -1449 2524 -2102 -903 4850 -3494 -257 3480 -1891 1455 -514 686 2611 -3490
1494 -3490 2959 2462 -3831 2796 1030 -449 1398 -1592 3155 16 -2527 4516 -1106 -1524 2834
1509 2834 -795 1033 -763 -464 3213 -2944 83 2967 -2951 618 612 -588 745 -2521 1562 801
1525 801 -3577 2004 -43 -2293 947 -1137 550 -1088 -2036 2465 -2059 -1707 1910 -1934 -525 -223
1541b23m99J705l625K901J275m363L468j69j764J840j586J995q45k169M362k415
1557a12j354L137k133R41k05o32K379l169J124K556l606J564O19j200J437j950
1573f04J571L55k661L037p48j837K176j211O10j40j328K510j892o00K481k311
1589e92M17P98j030J239j649N17J373k415J444L90j634J389q26L57L12j613J893
1606C70n26j315J827j028l0N96q54J105q68k86J524j492M11Q02j055P60l31p5
1624d65Q00j211Q72L23j088J052k19k09N19o77P37j29n83J072o23j30O42n91M62
1643E54j13k87P24o64J67M09o87M39r5j83M38n18K82J16n69M94j83k84M75m61
1663E4J34N7l49L88k99j08K89l95R5J09l34K97k90J2K18l97K28l9j96K82j65o5
$$ plain form
1541 -223 -722 983 -2642 259 1534 -2829 639 470 -1294 546 -1040 955 110 -2059 2303 -112
1557 -112 -1466 1671 -462 479 274 -358 2021 -1148 -24 2532 -1074 490 1109 -91 1346 -604
1573 -604 967 1322 -1339 1698 950 -887 1289 78 688 548 -780 1730 -162 -762 1719 -592
1589 -592 -175 623 -407 832 -817 -300 1073 -1342 102 492 -1142 247 -579 -222 90 -1523 370
1606 370 -156 -1471 356 -672 -702 -106 -960 145 -723 -1009 515 -977 -566 236 -819 -59 -390 -465
1624 -465 335 -876 -4 319 -769 283 64 -145 374 -303 434 305 -278 794 171 41 683 92 554
1643 554 441 154 878 214 381 790 103 542 447 264 702 184 466 582 13 507 324 40 515 54
1663 54 188 245 -104 284 -15 -123 166 -229 -134 -25 -359 -62 -352 -340 -122 -519 -291 -330 -526 -244 -409 -474
1685d74J36k09K22o2j35K42j84O6J51k01J55k7k8J80j48J39J74k86L45j87O5K18
1707A52k36K58p5k9K27j48P0K64l11K46j03J6K00l30K54M0k44K57n4j77K68k77
1729B68K52j35k74M75l66m5K59l30J71j34j73L91n20J00L66o39M03j66j60K91
1749C4n16M21n1n93O54k27k83M50m77M30j99l80Q54o99o7P17p78M15j1k24O66
1770A36q72M96M82j051Q45l7m58O07n61N95L6q79J375o31n14J092o41K46l2l42
1790a08J018j077J62J155j346N17L09n33P11r40O39N05j613J355Kj100J003o16
1808D3L94j05q64J644j110o08J626j199J15K68m65R43j362M26J197k013R49N79
1826D58j190P52p13P21J17j643J878l15j447J721p49j8J43o48J702j527m41K187
$$ plain form
1685 -474 -338 -547 -325 -387 -522 -280 -464 -398 -247 -448 -293 -320 -348 -168 -316 -177 -3 -289 56 -131 -66 152
1707 152 -84 174 99 70 297 149 219 483 172 418 315 331 531 201 455 495 251 508 454 277 545 268
1729 268 520 385 111 586 220 175 434 104 275 141 -32 359 -161 -61 305 -334 69 -97 -257 34
1749 34 -482 -61 -112 -705 -51 -278 -561 -111 -588 -158 -357 -737 117 -582 -649 68 -710 -295 -306 -530 136
1770 136 -736 -240 242 -809 36 -1 -459 148 -413 182 218 -661 714 83 -431 661 20 266 234 -108
1790 -108 910 -167 -5 1150 -196 321 630 97 808 -132 507 1012 -601 754 756 -344 659 43
1808 43 437 332 -532 1112 2 -606 1020 -179 -64 204 -261 682 -680 -254 943 -1070 -121 458
1826 458 -732 20 -693 28 145 -1498 380 65 -1382 339 -410 -428 -285 -933 769 -758 -1199 988
1844I88j772J05R53q66Q46j141Q24J091k561J679P27j884J299l05K11K13j458
1861a051K332r03j618K648j208m65Q72p34J296j489%K293k719O37J619j807P90
1878D93m83M50P43k367J997M51k619K107j57q28O16j062J847j142j442K989j817
1895b24q08J891j276N63o77jJ866k852R41J860k609J009L56n38O65j604J863m
1913D21k453K718m82j489J453p60Q17o85p03K568k162n26K512j824K87K83k44
1930b69J206k040J169J353k769J575P52j377Q20p27J057r2j782K479p63j577K085
1947A100p54j07l4m03J654j771j49K107k077L08J048r71N05r75R23O31k178J562
1965D19M17j704J190k11p2l9q43J798j048j111J959r98l21O24m42O00j048L97
$$ plain form
1844 988 -784 -679 274 -592 254 -887 -63 1028 -1533 146 873 -1011 288 -17 194 407 -1051
1861 -1051 1281 378 -1240 1408 200 -265 607 -127 1169 -320 -320 1973 -746 -109 1510 -297 493
1878 493 10 460 1203 -1164 833 1284 -1335 772 615 -213 403 -659 1188 46 -1396 1593 -224
1895 -224 -1032 859 -417 146 -531 -532 1334 -1518 -577 1283 -1326 -317 39 -499 166 -1438 425 421
1913 421 -2032 686 204 -1285 168 -592 225 -460 -1163 1405 -757 -1283 1229 -595 -308 -25 -269
1930 -269 937 -1103 66 1419 -1350 225 977 -400 420 -307 750 658 -1124 1355 592 -985 1100
1947 1100 346 239 205 -198 1456 -315 -464 1643 -434 -126 922 -49 456 -519 404 1035 -1143 419
1965 419 836 -868 322 111 39 0 -843 955 -93 -1204 755 -243 -564 60 -382 218 -830 -433
1983d33J224j914O34R13j088M25j86L31J77j216J468j64j310J355j51m23K42l65
2001d81R54p83k91J437j180p5R39o07L36m21K98O70j363Q81M51j182P78Rj10J35
2021C95o64J032l59q25J267n80l99O67m80M57m37o9Q91j111J41P68q72L34m9p5
2041C2L32q20O46K04r64P79j32m43M58l55K58j30m34Q06m83l10O15m00J37j9j66
2062c89M09n25J21M98o32K80J13j97K55k78K03J43m60M60k6l34L99j47P1P5j65
2083a26L60j83j37M48l34J8J67r7J71j29N2J62k71J25J83k74J33J6o8P3r0P0J2
2106B81j50J48j07n1J18p4jn9m5J33k08N8L1j22M8m9n8O3p5M5Lj17O2l5p6Q2j28
2133b83J24j01r7J87p1m1O4r0J06q7O1J14r6l6J40n0J9L9j05J36k1QJ12j10J36
$$ plain form
1983 -433 791 -1123 -489 424 -664 -239 -425 -94 83 -1133 335 171 -1139 216 65 -358 -116 -481
2001 -481 473 -310 -601 836 -344 -419 520 -87 249 -172 126 796 -567 314 765 -417 361 370 260 395
2021 395 -269 763 404 -421 846 266 -133 534 54 511 74 5 896 -215 -74 694 -178 156 107 32
2041 32 364 -456 190 394 -570 209 77 -366 92 -263 -5 -135 -569 237 -246 -556 59 -341 -204 -223 -389
2062 -389 20 -505 -384 114 -518 -238 -125 -322 -67 -345 -142 1 -459 1 -25 -359 40 -107 -36 39 -126
2083 -126 234 51 -86 362 28 46 213 116 287 158 210 372 101 226 409 135 268 284 216 289 199 269 281
2106 281 131 279 172 121 239 165 164 105 60 193 -15 43 74 -48 0 -49 -107 -44 -119 -74 -71 -188 -126 -161 -237 -155 -283
2133 -283 -159 -260 -357 -170 -241 -282 -218 -308 -202 -289 -228 -114 -210 -246 -106 -156 -137 -98 -203 -67 -88 -80 32 -78 58
2158E8l5N4L2k5L8M8mNL3p0J06o6N0M5o0M9qJ8l1n8J35j35m9J57j36N0On4rp7
2188F7j9P1r2M5j0j03O2k6p0K2o2P2j5j72J68r4k6M9q6M3p3K7Q3j85N7J23j13
2215b57J0P5k7J3j00J50P3j74J40Q9j06O1n7J45q2l7J59r0o6J58J1kq9N2J50j88
2241A1N0K37k27J11M7l8N9j99K53rk37K50k0j96J24k2M3j35o2K49k07q8K59j61
2265I2j06Q3qQ8l07J44J76l77J54L7n9p6m7J66q7k59M11j48k66K79m0l7q4J7K27
2290b7k72l0M17l84jK29n2l5j11K30J00m15K86K15m03K08L6P1j33p5M31j94k83
2313a92N17j43k44J89O1Q9k60Q7L54m57N3L81k59p0L6J83n1l21L31J07n09K91
2335A73J11k11l4K1K14k92k05N12k54k57L59j19j18l6J16J13m23J43L52m08q0
$$ plain form
2158 58 23 77 109 84 122 170 166 171 204 134 240 174 224 269 209 258 250 268 237 179 314 179 130 287 151 201 207 153 144 67
2188 67 48 119 27 72 62 -41 21 -5 -75 -53 -115 -43 -58 -230 -62 -156 -182 -133 -219 -176 -249 -222 -139 -324 -267 -144 -257
2215 -257 -247 -172 -199 -186 -286 -136 -63 -237 -97 -8 -114 -53 -110 35 -47 -84 75 -15 -81 77 88 86 -3 49 199 11
2241 11 61 298 71 182 229 191 250 51 304 295 58 308 288 92 216 194 237 102 40 289 82 -6 253 92
2265 92 -14 69 61 149 -158 -14 162 -215 -61 -24 -83 -159 -206 -40 -127 -386 25 -123 -389 -110 -150 -187 -271 -254 -27
2290 -27 -299 -329 88 -296 -297 -68 -120 -155 -266 -36 64 -351 -65 150 -253 -45 -9 62 -71 -146 285 91 -192
2313 -192 325 182 -62 127 188 277 17 104 458 1 54 435 176 106 142 325 274 -47 284 391 -118 173
2335 173 284 73 39 60 274 -18 -223 289 35 -222 137 18 -100 -136 -20 93 -330 -187 165 -243 -323
2356c23K68l1j63k1K16pl95L23J15l14J16J67q6k10J14L23l05j01M11k11r3J32
2378g5J09j9k56K55K03l93K08J66j64j18J67J99j94j61L92n5l18K93N3j81j01
2399A0J94J20k76O3K73k90r6K32n3j71O4J19N3l64K96P5l37O7J69j36q3rK40j64
2423dk09L40q9k64Q9J28j09q8J02J29k81m5K79j20j68K47r3k6r5K64l2k62O8K05
2447c4j35j23K53l1r4Q2Q1j14n9K44O5j08m9K8l6m2J10J08o8o9K08k3j35L6J9
2472A14K9J5K4P1j84Q8J42j27j30J55N2k96L4K39j69p3K25j69L0j1l2J32j91N2
2496B0L3j07j0R0j19r1o1J02M2j47M3L22j17j38J43k03%K8L15k29p2L0j1q0n6
2521b73K99p7k42K72j38m0j61M14k56J51K9lK1M2j9N9q7L3J02p0N5KrjL1L2k3
$$ plain form
2356 -323 -55 -86 -249 -270 -54 -61 -456 -133 -18 -332 -216 -49 -135 -345 -231 92 -213 -314 97 -114 -207 -75
2378 -75 34 15 -241 14 217 -176 32 198 34 -84 83 282 88 -73 319 264 -54 239 292 111 10
2399 10 204 324 48 111 384 94 -2 230 177 6 70 189 242 -122 174 249 -88 -21 148 12 -71 -80 160 -4
2423 -4 -213 127 38 -226 -137 -9 -118 -206 -104 25 -256 -301 -22 -142 -310 -63 -156 -182 -277 -13 -45 -307 -239 -34
2447 -34 -169 -292 -39 -70 -164 -82 -1 -115 -174 70 135 27 -22 6 -30 -72 38 146 78 9 217 194 59 95 114
2472 114 143 158 182 253 69 157 299 172 42 197 249 -47 -13 226 57 -16 209 40 70 59 27 159 -32 20
2496 20 53 -54 -64 26 -93 -184 -245 -143 -101 -248 -205 117 0 -138 5 -198 -198 -170 145 -84 -156 -126 -137 -217 -273
2521 -273 26 -51 -293 -21 -159 -199 -360 54 -202 -51 -22 -25 -4 38 19 78 -9 24 126 56 111 113 104 103 134 166 143
2548A43KRj3j6j4kO7n6nL6q1j6L7Ml5Lk4J4KM2Lj57J02k0m9l6J4N4q6m9J03n2
2580g6n4M3m5J3%o9J11j07O1M4p3M7On2L1m8P2k5j9R1l9k1R9j16N4Lj1Q8k2KR1
2611G9j8k5P4j03P7m9O2L1o6O1J5n2M9J0JN0q2K0M2j00N1n7O4j5n7L3j2Qk5k7
2641C9N8o8n7Q5n6l7L8k5J1l5k5N1k3l2nk4K9J0j44J75r1J3L0p8P6l4l5O4JLJ
2672h5j0P3p3L1L0o0P0K5l2M0k6RM1j30J75q0L4N0k4MM4o6J15l9j23K13j77Q5
2700A14J08j41J07j22LQ1n5M4rj07J48j11jP0j41N9J1r7Q9o1K3L9j48J70j20o3
2726a10J44j32j0R6j88J48l8o0J71j55O1Q2j89J22l3j6Q0k30K10k4j67K20l7p0
2750a25J49j53J86o1j37K15j32MJ21j61J44l2r3K28k14J22J47l08K46j5j16J86
$$ plain form
2548 143 145 154 141 125 111 109 176 120 115 151 70 54 91 95 60 63 39 53 55 97 100 -57 45 25 -24 -60 -46 8 -78 -127 -24 -76
2580 -76 -130 -87 -132 -119 -119 -188 -77 -184 -123 -79 -152 -105 -99 -151 -120 -168 -96 -121 -140 -49 -88 -109 -10 -126 -72 -69 -80 8 -14 -12 79
2611 79 61 36 110 7 84 35 97 128 62 123 138 86 135 145 146 196 114 134 176 76 127 70 134 119 62 95 83 91 66 39
2641 39 97 29 -28 57 1 -36 2 -23 -12 -47 -72 -21 -44 -76 -81 -105 -76 -66 -210 -35 -126 -113 -83 -161 -85 -119 -154 -90 -89 -86 -85
2672 -85 -95 -22 -95 -64 -34 -94 -24 1 -31 9 -17 -8 33 -97 78 -2 32 82 58 62 106 40 155 116 -7 206 29 114
2700 114 222 81 188 66 69 150 95 139 130 23 171 60 59 129 -12 47 58 -39 50 -11 12 51 -97 73 -47 -110
2726 -110 34 -98 -108 -12 -200 -52 -90 -150 21 -134 -73 9 -180 -58 -91 -107 -27 -257 -47 -71 -238 -18 -55 -125
2750 -125 24 -129 57 -4 -141 74 -58 -54 67 -94 50 18 -75 153 -61 61 208 -100 146 131 15 201
2772B01k11J79M0k55K97j47q2J96k48J82k6j76K97k72L5K26k79J97o4j87L17k69
2794d9M8J36l03K63j05j36K36k48J16R6k87K89j84j01L31k98J78K0k25K82j91
2815a32k9K17l15J92M4k06K79k72J15J52k27K28j25r8K95k02N0J35k51L03j83
2836c0o9K64k85K38L6k14K26j50L0J61k60J75Nj85L26k29L2J11j99K71j75j16
2858c7L27l44J90P0l43L40j83n5K66l78K22M2k32K52k71O6K04l13K63p1k58L53
2880A10k56L5K00l96L71j30j98M34m08J12J89l35K60p4j26L96m09J59J44l93M57
2901A42k34q4L44l47K08J32l80L87j76p5L44m20K35K5k32L78k96J6L22l86K70
2922A73Pk40L50k80N4J86l76K71m3j82K98k31M3K08l17K60q8j94K98l06J35J17
$$ plain form
2772 201 -10 169 209 -46 251 104 22 218 -30 152 126 -50 247 -25 10 236 -43 154 90 -97 220 -49
2794 -49 -1 135 -168 95 -10 -146 90 -158 -42 54 -233 56 -128 -229 102 -196 -18 2 -223 59 -132
2815 -132 -161 56 -259 -67 -23 -229 50 -222 -107 45 -182 46 -79 -177 118 -84 -34 101 -150 153 -30
2836 -30 -99 165 -120 118 154 -60 166 16 46 207 -53 122 127 -58 268 39 71 182 -17 254 79 -37
2858 -37 290 -54 136 206 -137 203 20 -35 231 -147 75 117 -115 137 -134 -68 136 -177 86 15 -243 110
2880 110 -146 -111 89 -307 64 -66 -264 170 -238 -126 63 -272 -12 -86 -212 184 -225 -66 78 -315 142
2901 142 -92 -176 168 -179 29 161 -219 168 -8 -83 261 -159 76 101 -131 247 -49 -33 289 -97 173
2922 173 180 -60 290 10 64 250 -126 145 102 -80 218 -13 30 238 -79 181 93 -101 197 -109 26 143
2944A43l26L13j41j1J52k64J20M7j87K64k06l9J78k93K32rj50J97j51qJ01j93
2966b31K78j48m8J77j95J06P7j68J18o5QJ24j85J65k1j31K87k28L6J30j32J82
2988A36p0j34K30k18R7J53k22J59m3q3J87k06L5J82k58J97n6l2O8j56J44l9j06
3011c5J79j15m0J81j55L4oj03J70j71O1J42j68R1J45k55J09j26J04k54M6J13k9
3034h2J09J08k85J0J59j56J64j10m6L61o14K46K60l91K14j45N30m58J3l8J89j40
3056a02J25m3j19K08j24R5N4r2N5j0qO8l3O5l1k9N2n9L3J1j08J10k0r3J17n5l9
3083B8J13p6%k8m1J15p0kK9r9J10q7j8L4m6K4Mj4j2j3M8j1m2M8Nk3Ml3k9K2k2
3114h2M6p0L4R1j08M0jn6Q3n4J7L6p9P8ok5N8k5K4Lm0Q2j1lN5r1N2L6q6P1k2q
$$ plain form
2944 143 -183 130 -11 -22 130 -134 -14 33 -154 110 -96 -135 43 -250 -18 -27 -177 20 -131 -139 -38 -231
2966 -231 47 -101 -149 28 -167 -61 16 -152 -34 -99 -91 33 -152 13 -8 -139 148 -80 -44 86 -46 136
2988 136 66 -68 162 -56 41 194 -28 131 88 5 192 -14 21 203 -55 142 86 54 122 -34 110 71 -35
3011 -35 144 29 -11 170 15 49 43 -60 110 -61 0 142 -26 65 210 -45 64 -62 42 -212 -166 -53 -82
3034 -82 27 135 -150 -140 19 -137 27 -83 -129 232 -382 -136 124 -267 -53 -198 332 -126 -113 -151 38 -102
3056 -102 23 -20 -139 69 -55 40 94 2 57 47 39 107 74 139 108 79 131 72 105 116 8 118 98 5 122 67 28
3083 28 141 65 65 37 -4 111 41 39 68 -31 79 -8 -26 8 -38 -14 -10 -24 -36 -49 -1 -12 -54 -6 -1 -24 -20 -53 -82 -60 -82
3114 -82 -36 -106 -72 19 -89 -49 -50 -106 -23 -77 -60 -24 -103 -25 -31 -56 2 -23 1 4 -36 46 35 32 87 -4 48 84 -2 69 47 39
3146C9J02j66J51pq3Q8p8PJ04j52M9M9j16R9n2k5J22j88K09j18j00J77j44K2O0
3171D9j70J17rq1J94k11J04rq1J21j23j2J38j92J69m1j41J59j8o7J83k73J90q6
3195i0n4K08j82J2J09j22J53m9n7J24k24K46J0k19K11q7l7J21j19J11J8j44K58
3218A97j55p0J83k03J80p0p8K17k25J27L4k01J71Qj12J60k00J77M8k53K06r9o4
3241b2J82k22J15K9j69K15j72m2J69j97J48m3r8J72j77O8J33k97J98k6q7J62k21
3264a82R8L5j44K84j99p1K74k35J64k6j66L05k65N4J80k96K17K8j52K45k82J69
3286C5J58m04L85j44j46K89k35Q8M4k12L44j64j32L41k90J00J23k02K26k30K1
3307eK33l65K56M4k92L35k91Q8J67l49L34m4k02K75k92J00J17k78K94j71r5L62
$$ plain form
3146 39 141 -25 126 119 36 124 46 53 157 5 54 103 -13 86 34 9 131 -57 152 34 -66 111 -33 -11 49
3171 49 -121 -4 -13 -94 100 -111 -7 -16 -97 24 -99 -111 27 -165 4 -37 -178 -19 -37 -104 79 -194 -4 -90
3195 -90 -144 64 -118 -106 3 -119 34 -15 -72 52 -172 74 84 -135 76 -11 -48 73 -46 65 83 -61 197
3218 197 42 -28 155 -48 132 62 -16 201 -24 103 137 -64 107 115 3 163 -37 140 188 -65 141 42 -22
3241 -22 160 -62 53 82 -87 128 -44 -86 83 -114 34 -9 -107 65 -112 -44 89 -208 -10 -36 -123 39 -182
3264 -182 -84 -49 -193 91 -108 -179 95 -140 24 -2 -168 137 -128 -74 106 -190 27 55 -97 148 -134 35
3286 35 193 -211 174 30 -116 173 -62 26 70 -142 202 38 -94 247 -43 57 180 -22 204 -26 -5
3307 -5 228 -137 119 163 -129 206 -85 3 170 -179 155 111 -91 184 -108 -8 109 -169 125 -46 -141 221
3329B21l85J30R5k49L33k05n8K58l77K45N8l40L58k04L8J41l15K37M3k98M51k89
3351a12q6L18k58K54j74j33L56l19J03J77l45K90m6q1K55l57J85J68l64K85k1
3372I5j62K81k66J41L8k19L18k11n5K05j58P7K6j47K06j95J2K61l11J39k8j39
3394i2J95j46M3O6j99K26r1j16J45q0P0k4j20J27k7o2J08j28P1j5p3J35j09N0
3418d6Q0j70J50%j44J43q3O9J3r6J03n8J3J01j91J17J7K6J14j95M0P9j07O7J4
3443E6j81K06j16R5Q8j94J30l8j06J16kRN9j33J31j15p9J77p9j1M8r0R0k9m7J54
3469A39k24J09P8j78R5j0q4J70j47j6R9j14J06k4p6J12q8K3K1n7P2k2n8J01p6
3494d9j7J5l5J21m9o1J34j14j2Q5q5Q1k6j7J4l9RR0m9%j2J8O3r6L5O0n3O9r8J6
$$ plain form
3329 221 -164 -34 61 -188 145 -60 -118 140 -237 8 66 -274 84 -120 -82 59 -256 -19 24 -274 177 -112
3351 -112 -198 120 -138 116 -58 -191 165 -154 -51 126 -219 71 25 -56 199 -158 27 195 -169 116 95
3372 95 -67 214 -52 89 127 -92 226 15 -40 165 7 84 110 -37 169 -26 -14 247 -64 75 47 -92
3394 -92 103 -43 0 66 -133 93 2 -114 31 -49 21 -3 -123 4 -23 -85 23 -105 -34 -49 -122 13 -96 -46
3418 -46 34 -136 14 14 -130 13 -70 -1 12 -84 19 -39 -26 75 -116 1 18 44 158 -37 3 82 -25 42 56
3443 56 -125 81 -35 60 148 -46 84 46 -60 56 54 63 122 -11 120 5 -74 103 24 13 61 -29 61 32 -15 139
3469 139 -85 24 102 -76 19 9 -75 95 -52 -68 31 -83 23 -1 -77 35 -53 -30 -9 -66 6 -16 -74 27 -49
3494 -49 -66 -51 -86 35 -14 -75 59 -55 -67 18 -67 14 -12 -29 -15 -54 -45 45 -4 -4 -16 2 65 -31 4 64 11 80 -18 -2
3524bM4l1P6J2n7L1r7R3M5q9j7J14N7k0j19k05J91j56K25m01K13o4Q3J82r4j83
3550a69J60ln6J54m9o0J43j18Q6m04J58R8%J48O3l58N8J75j36M3K6p3J45j21J19
3575B9j31J27q8Q2n4m6J41L7k13M4L0K21j62Pl5J91j37N2m7j27kM8K15k15J42
3600A09j15P4n6N6O9P1j16j40K06j97J10nq9J00r2J32j15J1J2l6j0N1J45k12J74
3625A37k01J04k03RO9l8m6P7p1L36l62j16K99J26j58j91K01q0l5K82j15j00J07
3648C1P5m2l7J23l77K19m28O70r8k13k16O12m14J38k8j99K68l05K37l88O58k79
3670GK6m1J79j17L9k7K0p5J08j93J57l0j82J01J94m7k55J77QM5N6j96J02l2j68
3695a44K33j47J2J15j03J26r3K9jj68J95L0k30j06j35O70k62J20J43l42m64N27
$$ plain form
3524 -2 42 11 87 99 42 73 -24 69 114 25 8 122 179 159 40 -165 26 -130 95 -306 -93 -157 -74 108 14 -169
3550 -169 -9 -12 -68 86 37 -23 120 2 88 -316 -158 -60 -60 88 151 -207 -149 26 -110 -67 -41 -114 31 -90 29
3575 29 -102 25 -63 19 -35 -81 60 97 -116 -72 -42 179 17 24 -11 180 43 95 48 -79 -81 -33 182 -33 109
3600 109 -6 68 12 68 137 208 92 -48 158 -39 71 66 -23 77 -15 117 2 13 25 -11 -21 30 175 -37 137
3625 137 -64 40 -163 -154 -85 -123 -169 -92 -163 173 -189 -305 -6 120 -38 -229 -28 -108 -143 139 24 -76 31
3648 31 106 64 27 150 -227 -8 -436 234 136 -77 -293 319 -95 43 15 -184 84 -221 16 -372 286 7
3670 7 33 -8 171 54 93 66 86 11 119 -74 83 53 -129 -28 166 119 -136 41 49 94 150 -46 56 24 -144
3695 -144 89 -58 -46 69 -34 92 -1 28 27 -141 54 84 -146 -252 -387 283 21 141 284 -58 -522 5
3717Ej06J4M14k42q9r4J10j03N6P4k6p7j4J52j11J6j54L32k18k35M23l06K59o5
3741A5j68K80j83r8M53k86R8j0k09L91j18l05L21j49O9Ok26L34k88J9K18l11K20
3764G3o3o1J73j24m9K09k73J21K4j42K12j49J5J36k12P1N6q6R0j22N9O4j51J47
3788A8l9q2J21r3O3lp9J48j28K3J29j49P1J6r6J31j50P5O0j17O7L4q0J15q6K7
3814dO8j42J44o1l8J38j74J18j8n8J02p2M0P9j42R9lp2P3l0k0J9o0J28p8m8Q5
3841G3q3K4N1j34J31q6K2O6j65Q6M5j25J73j42k7J36j20J01m8o9J07q5L7Qp4J24
3867B6mq2J08j41O0P9j07R0j08j1J88j86O5J5r7J66p5j3N1o1J27r4l3J33pj00
3893a1R6k31K07j05N7rLJ49m5j27J63l5l56M76l18J52N3j80N9O3j64K06m9m7J87
$$ plain form
3717 5 -101 -87 327 85 -4 -98 12 -91 -35 39 13 -64 -78 74 -37 -21 -175 157 -61 -296 127 -179 80 15
3741 15 -153 127 -56 -154 299 13 111 101 -108 283 165 -140 181 32 101 107 -119 215 -73 -54 164 -147 73
3764 73 10 -51 122 -2 -51 158 -115 6 30 -112 100 -49 -34 102 -110 -39 17 -69 21 -101 -42 22 -129 18
3788 18 -21 -103 18 -75 -12 -15 -94 54 -74 -51 78 -71 0 16 -80 51 -99 -24 36 -81 -14 20 -60 55 -31 -4
3814 -4 64 -78 66 5 -33 105 -69 49 31 -27 75 3 43 122 -20 79 76 4 77 47 27 46 -14 114 36 -12 73
3841 73 -10 14 65 -69 62 -24 -2 64 -101 -15 30 -95 78 -64 -91 45 -75 26 -22 -91 16 -69 -32 -24 -98 26
3867 26 22 -60 48 -93 -33 46 -61 29 -79 -90 98 -88 -23 -8 -105 61 -14 -27 24 -37 90 -4 -37 96 89 -11
3893 -11 85 -146 61 -44 13 4 7 156 111 -16 147 112 -244 232 -86 66 119 -61 -2 61 -103 103 54 7 194
3918A94j38Ko4K0N0l5l6m7j9K25J1j65J32q4j64LQ0J19m3j67L86k68m72N09o5
3943c6k47K37o0J13o5K5j2p7J82j64R5Pl9L6qk3O5k8J4J6k6M8qk4rM4m1k0nN2
3973D2J4Jl0l1J4%J3O0p8K7K7j9O3r4J6K0k9N4q9K4L4m0J0N1n2j3Jk0L6m3L1J6
4005A6r0N8l1j6L9j3nL2j2J6po6J07p1Q3j23O0LJl6N6m4N7k4m8P7k6m2R0k0k0
4036AJ3L4L5j48Q5j7PL9o7M9Ql2%L5n8N1n3J1Q7r4L8L7l4N2p1mP5r5O6J0p9P7
4068E8l2j1L5o0O6n7j5O9rm1jk5J9l7K3Pl4M7%n3N0k8KL7q9P6pm8O6k9K4J9r5
4101g3O2k7K7Jl9N8m2MK3K7lO7j42M6JRN2l4J9N2j24J39m8j46K02j11M4rn2Q7
4131G0jp7N5n9PL8p6R5l2l0N1n6L9Mm7J17j25QO0q6M5K3p2R0j07K4Q2p8O5n2m0
$$ plain form
3918 194 56 58 -6 14 64 29 -7 -54 -73 152 163 -2 130 46 -118 -115 -35 84 41 -126 260 -8 -480 29 -36
3943 -36 -283 -46 -106 7 -58 -33 -45 -122 60 -104 -9 -2 -41 -5 -13 -36 29 1 15 31 5 53 45 21 12 56 15 -5 -10 42
3973 42 56 57 27 -4 10 10 23 83 5 32 59 40 103 9 25 45 16 70 -19 5 39 -1 9 60 8 -5 -4 -24 12 -31 0 16
4005 16 -74 -16 -47 -63 -24 -37 -42 -10 -22 -6 -13 -79 28 -43 40 -83 -23 -20 -19 -55 1 -43 14 -10 -58 19 -7 -49 41 21 1
4036 1 14 48 83 -65 20 3 10 49 -18 31 39 7 7 42 -16 35 -18 -7 80 -14 24 61 27 79 8 4 79 -16 50 60 -19 58
4068 58 26 15 50 -10 56 -1 -16 53 44 3 2 -23 -4 -41 -18 -11 -45 2 2 -51 -1 -29 -27 10 -79 -3 -10 -58 8 -21 3 22 -73
4101 -73 -11 -38 -11 -10 -49 9 -33 -29 -6 21 18 85 -57 -11 -10 -1 51 17 36 88 -36 103 55 -91 111 0 44 35 -17 70
4131 70 69 -8 47 -12 -5 33 -43 52 20 -10 41 -15 24 28 -19 98 -27 -19 41 -45 0 23 -49 41 -66 -42 40 -38 27 -25 -65
4162f5J3p2J16j1j04J37l6m9J33j17R3q0k2J17j28J1N4p6Q4k9j8J14j08NJ39j42
4188d1M1M5j07J29o7l8J41j38J47n5n3J1o0J28j4p2J03p0n0J26o9P4r6j6J12p4
4214C7Ok1n0P0k4n7R2m4n4J12j16R0n5j4J02j26N1Lm1M3l5m0R7j07M7K0p0O5n8
4243g7O3K5j13R4Km0L8rK6l0o5Q3o5K2N5n1J03o9o2Q8l8L2M6q6J02k9k1K9n0M4
4273D7n2ON0oq3J45j11K6Oo9J54j17K0N0q7O7L4r4N3m8L0L6j15R2o3m9J27q7K1
4302a7P0n2K7j9j24J54j29Q8Q5j72R7m4J8N2q0L1M9j28R0r0L0J10j08L1L8p8R1
4329B0m9L0Qp9O7M2q7Q0r0P0L7o5N2Ro9N1k3J7N2j26R6k0L6ol4K5j3J8NnnK8n1
4362B1M0l6n0O5pJ5m1l2Q2jp1N3l2o0Q2r0P9m7K0J4n7N7J9l0k2k9j3L5j6L2mk8
$$ plain form
4162 -65 -52 -124 -8 -19 -123 14 -22 -71 62 -55 38 -42 -64 53 -75 -64 -10 -86 -2 -31 -49 65 -43 -38 101 -41
4188 -41 0 45 -62 67 0 -38 103 -35 112 57 4 15 -45 83 69 -3 100 30 -20 106 37 111 15 -1 111 37
4214 37 43 22 -28 42 18 -39 53 9 -45 67 -49 41 -14 -28 74 -52 -1 2 -39 4 -31 -71 26 -81 -34 -14 -84 -19 -77
4243 -77 -14 11 -102 -8 -6 -46 -8 -17 9 -21 -86 -3 -68 -46 9 -42 61 -8 -70 18 -20 12 58 -28 74 45 24 53 3 47
4273 47 -5 1 51 45 -38 107 -4 22 28 -41 113 -4 16 66 -21 46 80 -14 39 -9 21 57 -58 34 -29 -78 49 -38 -17
4302 -17 53 1 28 9 -115 39 -90 -2 83 -89 8 -36 -18 34 -46 -15 34 -94 -4 -94 -64 46 -62 -31 7 -71 20
4329 20 -29 1 9 -70 -3 39 -48 32 -58 12 49 -16 36 45 -24 27 4 21 73 -53 43 23 59 53 19 44 31 49 54 49 44 72 21
4362 21 61 25 -25 40 33 48 7 -25 57 56 -15 38 6 -54 28 -62 17 -30 -10 4 -53 4 23 -7 -29 -58 -71 -36 -52 -20 -24 -52
4394e2M8k0o6J63j49R8o4K7J3m3j7K7lO6jj16Q5J0%K5p3O9m7LO9p5J3K4l6N9l6
4425AJ6j3k5J26n6k7L5k0j6J2l1N1Qm7P0k6l5K5n2K8%l9Q5q7K3J4o9P1l3n3J03
4456C9q7K3M3o0O8m0qK3m5k1M7k3J0nMJ6r0O6lm1N7j5NO4j01L6P5o2Rn8K7O8k
4489A9k9J9J0L7p2M9Mo8K4M6l7O8o4J0K5QMk8J8l2JK8L0j05Q2qk2L4Np2O6n1J9
4522A8m7P4l8lPJ7pj3m2J2j5k8P1j1j9K8l8k0M1k0K6k9k6O7J4j29J14l4j6J9m3
4553g0O8o3R0qo1L5l8O6m3rK9l8Q5Or3M1J8K1J3l3J8j6J7Jrq0P3l0J2kJ6K6k8
4586A4N0J1o5M4M0j03Q8m5l4P4o6M3K5o9J8m4K6Qq6J03j01N4K0q1P0k2j7P8p9
4615d6j8J02r1k2L7k4N2p7l5J09q2K9P9q5O9RoJp9L7o1J9O5JJN0l0P1j20M6J19
$$ plain form
4394 -52 -4 -24 -90 73 -76 22 -42 -15 -2 -45 -62 -35 -38 28 27 -89 -4 6 6 31 -42 27 -20 -17 52 -23 -10 14 -22 37 1
4425 1 17 4 -21 105 49 22 57 37 21 33 2 53 61 14 84 58 23 48 -4 24 24 -15 70 -17 6 20 -49 22 -11 -64 39
4456 39 -48 -25 18 -42 26 -14 -22 1 -44 -65 -18 -41 -31 -36 -32 -16 -106 -40 -43 -84 -27 -42 -37 27 -74 -38 37 -25 -16 -74 -47 21 19
4489 19 -10 9 19 56 -16 33 37 -31 -7 39 2 70 6 16 41 49 53 25 43 11 12 40 70 -35 47 39 17 51 56 -16 50 -1 18
4522 18 -29 45 7 4 11 28 21 8 -34 -22 -37 -65 6 -5 -24 4 -34 -54 -13 -33 -7 -36 -62 5 19 -110 4 -30 -46 -27 -70
4553 -70 -2 -65 25 17 -44 -9 -47 19 -24 -33 -4 -42 43 49 -44 -3 15 36 49 16 34 18 35 36 27 -53 20 -10 2 0 16 42 14
4586 14 64 75 10 54 94 -9 79 34 0 74 8 51 76 7 25 -19 7 15 -71 32 -69 -15 5 -76 -6 -28 -45 33 -46
4615 -46 -64 38 -53 -75 -38 -62 -10 -87 -122 -13 -95 -66 13 -72 -3 6 0 1 -78 -41 -102 -83 -18 -17 -16 34 4 75 -45 1 120
4646A20j38K7N8r4Q3n5J4J09r7O9%r6N8n2N0nq7J02l3m2O9q4Q3n9mN9l9k1N5n5
4676eoP0p7M7l6j6K8m6O4o4j7P4p0Q5m7j3L2Kn7O3o0J3J0k3Q9r5J3M4r8Q8K5p0
4708e3J37j00K0nm2J1KK0M4n9O2m9l4M7KL5l8QO9j2o3N4n9l2J21j04R2o6rP5o4
4739A0rN6m2M4l4q1J59j01j1N7p3N5k2n7R9q7M0O5j66J58n7m0O1o1L0J6n9K9J6
4768eo9J23j00PoJ2M4o6J1Q9p4RL9r6Q8l5k8Q2r4M9M8r9R0l6kJ05j11L7J2o0O2
4799B6jk3Nk1N0n0K0N0l1m0N3o3Q4k3k6L6l9O1j7r0J17l6k1J0Lm8M5k3L0m5k5
4830c2%L0j4rKL0o1L5rJ4Klk8M8n6j6L9o4QM5POl0N0l3k1P2n0k3M7mqRj9L7l9
4866c8M1l8MM8Rk2L3l4M7n1m9P2l4NL4k9M9k9m5R4p0Q3j6rk2N7r7M8n7L2L3m1
$$ plain form
4646 120 -18 9 67 -27 56 1 15 124 27 96 96 0 58 6 56 51 -36 66 33 -9 60 -24 59 0 -4 55 16 -5 50 -5
4676 -5 -11 59 -18 29 -7 -23 5 -41 23 -41 -58 16 -54 31 -16 -29 3 5 -52 11 -49 -36 -26 -49 40 -55 -42 2 -96 -8 17 -53
4708 -53 84 -16 4 -1 -43 -32 -30 -10 34 -25 37 -12 -46 1 3 38 0 8 77 65 2 56 -3 -35 86 -18 74 8 -1 74 10
4739 10 1 57 15 59 25 -56 103 2 -9 48 -25 30 8 -49 50 -37 3 68 -98 60 3 -37 24 -37 -7 9 -50 -21 -5
4768 -5 -74 49 -51 -44 -50 -38 6 -60 -49 40 -34 -25 14 -82 6 -29 -57 25 -69 -20 28 -71 19 -17 -19 86 -25 12 24 -36 26
4799 26 25 2 7 -14 36 -14 6 56 25 -15 38 -25 59 36 10 46 7 68 51 -39 78 42 21 31 34 -14 31 8 38 -7 -32
4830 -32 -32 -2 -16 -25 -23 7 -54 -19 -28 -14 -12 -15 -43 5 -51 -67 -28 -92 -84 -39 -32 -26 -56 -6 -39 -60 12 -38 -61 -14 -18 -26 -17 -36 1 -38
4866 -38 3 -35 -31 17 26 4 37 3 50 -1 -50 22 -12 -7 27 -2 47 18 -27 67 -3 80 64 55 33 90 -7 41 -16 16 49 8
4898HL6n1j4R0n4j8N7o0P6l4m6L6p3J7P1q6P4o2qO3o5j4jPL2l3m2R4n9L8kl8L0
4931c1J8p5O7k0j5N6m0O6o9L1j0QkM1pm4L3MJ5m1M0Rr9N5pJ10m7n8P0k6j2M9j8
4964E1n7P9l6J4l7K5L0K1l1o7J6mK6k3J7RJ3j6l6Nl0L5m9J2N8k3pQJ3m4kj3k6
4997f9P2j01R7n5Q2p8L1p%K0m8nP3o9J1O4k8m6J7N1j9j1k2Q8o2L3k0k4J8K3j7
5028aK1n1M6j6J0l2J3L2O1n7M3j9k8j5K6J4l2J9k2J6k0N2kl7k6J3M4m1m0L7j3
5059eP1o5j5j4n5J17j2o0K3l6P1l3m9O6K9j09Q1p1k3J00q2O9n3j0N8o8M1M7l3
5088b0m0KL3L7m2J7j6l8L4O8l6J6k7J8N7q5P8m3POj9O0n9qP4p2L1N0q0J8N1np
5121F0n7N0pl7j1N2q0P9q8J01m9L8L8j01l0R0o1QMm2P3q2N8J5j45O5M9m4O8r9
$$ plain form
4898 8 44 -7 -21 69 15 -3 54 -6 70 36 -10 26 -47 -30 41 -45 29 -33 -41 22 -43 -57 -58 -51 -19 -52 -94 0 -59 -21 -23 -61 -31
4931 -31 -13 -88 -21 -41 -56 0 -40 26 -43 -12 -22 -14 -16 25 18 -26 7 11 26 -15 25 34 -65 -10 -17 93 46 -12 58 32 20 69 51
4964 51 -6 73 37 51 14 39 69 90 59 -8 8 4 30 7 24 33 46 30 -6 -1 -31 4 -45 -33 25 2 -5 3 16 -28 -30 -43 -69
4997 -69 3 -98 -1 -56 26 -52 -21 -28 -28 -8 -56 -61 12 -57 -46 18 -10 -56 -39 12 -7 -18 -40 48 -14 19 -1 -25 -7 16 -1
5028 -1 20 -31 15 -1 9 -23 -10 22 83 26 69 50 22 7 33 47 15 34 12 28 8 60 58 21 -5 8 52 11 -29 8 -5
5059 -5 66 1 -14 -28 -83 34 22 -38 -15 -51 20 -13 -62 4 33 -76 5 -66 -89 11 -71 -2 -55 -65 -7 -75 -34 13 -20
5088 -20 -60 -58 -25 12 -30 -13 -29 -67 -33 35 -1 15 -12 6 63 -22 56 13 20 26 7 67 8 0 74 2 33 83 3 21 72 67 60
5121 60 3 53 46 9 -2 50 -30 49 -39 62 13 51 89 -12 -42 48 -13 -5 -1 -43 30 -52 6 21 -124 -59 -10 -54 14 -85
5151h5L9N7l3J5j7k9N8p9J10p3q4K06j19m3Q6o4K0J1m3J05n6k9Q1n1J6M3o6K8
5179Dk8K2M9o0O4j0n8K3O1j01J00l7pk6L2M7n4N7o6nJ0L6l3J9o2M3L7q1J13p7
5209A2KJ1n7J11r9m3M9L2p2J9J2M9n1M2k9m8LM4l2m8P9q2P2k6N7j8n3R4j3n1%
5240c4lM3j01kJ03j6JJm0M9K0k7L3m4J4J2J4J9j9l6Q5r8L5N1n3O9q2K4M3r5R1
5271E7M1j19O8k4J6J1rl2j5J7JJ2m7O6q0N5n6L8K4o2R2p3l4P0j0j4Q9q3k8km6
5302g7J13q2J4k3J0M1K1o6O3r0M8j7n3Q5l6K0J4j0Pk4j0P0o8K9P6r6N7J4p1QN0
5333A7j4%nK6j1j9R5j08KO7l5J4J4k1NkN0jm4NL2m5qJ4m2M5m8N5k1l7L1m7L8J6
5367A8L3o2RrN7m4k7K4j8L6K7o6J1n2L2j0K2l8J6J5j4j9N2Lk8k4P7l7Mk7J5K1
$$ plain form
5151 -85 -46 11 -22 -7 -24 -53 5 -74 36 -37 -121 85 -34 -77 9 -55 -35 -24 -67 38 -18 -47 34 -17 -1 42 -24 4
5179 4 -24 -2 47 -13 51 41 -17 6 67 -34 66 29 22 -4 28 75 21 78 12 7 17 53 20 39 -23 20 57 -24 89 12
5209 12 14 25 -32 79 -20 -63 -14 18 -54 -35 -23 26 -25 17 -12 -60 -57 -13 -45 -93 -14 -96 -24 -50 7 -11 -64 30 17 -34 -34
5240 -34 -37 6 -95 -97 6 -10 -9 -8 -48 1 21 -6 27 -17 -3 9 23 42 23 -13 72 -26 9 60 7 76 -6 18 61 -34 57
5271 57 98 -21 47 23 39 50 41 9 -6 11 12 24 -23 43 -37 18 -38 0 24 -38 54 -19 -53 17 7 -7 82 -1 -29 -31 -77
5302 -77 36 -46 -32 -55 -45 -4 17 -49 14 -76 -28 -45 -98 -13 -49 -29 -15 -25 -18 -42 -52 18 -50 -21 55 -41 16 30 -41 -33 17
5333 17 3 3 -2 24 13 -6 89 -19 -17 50 15 29 43 22 27 25 75 74 30 35 67 22 14 28 -14 31 -17 38 17 -20 11 -36 2 18
5367 18 51 -11 -2 -11 46 2 -25 -1 -19 17 44 -22 -11 -63 -31 -41 -19 -57 -41 -26 -40 -59 -7 -4 -32 -56 21 -16 -12 -39 -24 -3
5399cJ6rp1Q9k9K4OKK6l9l9N0KmP6o8lN1q7O5r4N5K4J4mL2k6o4L1Qj6%M1k2JM5
5435H0k5k3l0m5L7mK9p2N2M0k7l1M3r7j2R2j0o6J03k4j4pL3p4K4L0J9p8k9M6l4
5466g4P2j5n3Q2n4K3ln0J17l7k6K8J5J7o0NpnM8l1j5L8K2j8j9OP0p3L7J4J6q0
5498a0K1K0M6p5M2Rk0M2k8n1rM2K0l4lK5p1L3Lj4j4K3k7J5OnN6m4l7L5o6L6P0
5531C6n0j5k2L2lj0Nm0O1N7j51R7p0N7JJ9Pn4J3R1j08N8l1J9j0K5o3L9K3l6Q6
5562F3j8k7j0mK2k3L5ol5N6nl2J0k3P9k8j6j5l8N4k7j62K51r1L1rk5k1N6m3mK
5594cMK9o1L4mKM8o9l8Q0l5j4KJ2L1kq2O0k2L9n8J3Qk9K3k7k6O3K0m3M9rm9N0
5628dMM3m5k1L3j4k9J7M5L3r0j6J01n0j3Q0q1M4rk8J4J0k4n6P7L8n8J3rM5m1j5
$$ plain form
5399 -3 13 4 -67 22 -7 17 23 25 51 12 -27 23 25 21 97 29 26 77 -10 55 -39 16 40 54 50 82 56 -8 23 31 15 15 56 34 35 80
5435 80 55 32 2 -43 -6 -10 19 -53 -1 39 12 -19 24 -73 -85 7 -3 -69 34 10 -4 -11 22 -52 -28 2 21 -57 -86 -40 -74
5466 -74 -2 -17 -70 12 -42 -19 -22 -72 45 8 -18 10 25 42 -18 -13 -20 -25 23 -8 -23 15 37 19 0 6 76 3 40 54 70 -10
5498 -10 11 31 77 2 44 53 33 75 47 -4 -13 29 49 15 12 37 -34 -1 2 -12 -26 -3 -30 -15 -9 -14 42 -2 -39 -4 -70 -34 36
5531 36 -14 -29 -51 -19 -22 -32 -27 -67 -6 51 -100 -3 -73 -16 -15 4 11 -43 -30 61 -47 11 -20 -1 -11 14 -49 -10 13 -23 63
5562 63 45 18 8 4 26 3 38 32 -3 53 48 16 26 3 82 54 38 23 -15 39 12 -150 101 10 41 32 7 -14 42 -1 -5 -3
5594 -3 1 30 -31 3 -1 1 49 -20 -58 22 -13 -27 -25 -13 18 16 -66 -6 -28 11 -47 -34 -26 -55 -32 -59 -85 -22 -2 -45 4 -5 -54 -4
5628 -4 0 43 -2 -23 10 -4 -33 -16 29 62 -28 -44 57 7 -6 74 -7 37 28 0 14 24 0 -56 21 59 1 14 5 50 9 -6
5660fL2K9j4k6j9oL3J0n0L0k3L0J6j01P3l2k4N7j0j6r2M9O7K0m7J1j7qpL3J1j6
5692a3j2Qp0N6j6M9j6o0P9l9OM4l9k7K7K5N9n9%K9l6L0Q2j31L5J4K6pl4N1o5%
5724dM7K0r8R2k4MK8n1j8J5K2Pl5QJ0MNl3j7M8p1P8J4n3O3n1J8o1J6j3L2k4L2
5757A0o3OJ2qK7J6l8J8K2q8Q3k4J5K6n4K2L1o2K9K2j3J6k7K3J7m0M1l4M9l6p5
5788g7R1K4m5O1n6OLL1n8N3j0J4m3N7q2K5O4j1mJ0k0Om5j6OJ1M1K7o9N0o0P3p6
5821a9K9L9J6m4K4p0kJ7o1P5l6NK2l9M9m2k3O2Lk5L7Ol1n5J5J18j10M2Pl1L3K7
5853C8o2K7qJ8k6jN4k5k2Ql4Q0n3QM6o0K2L7j05O4M9p5Q3m3L8Qm2ql2J6J8k0M7
5886D5K2o2J7j9nL4o5L6M2o9Q3l2j4k8N8m2m6N7m7L0q0N7k4N5m6M8rl8N3l5Rn
$$ plain form
5660 -6 26 55 41 15 -4 -10 23 33 -17 13 -10 20 36 -65 8 -24 -48 9 -1 -17 -109 -60 7 27 -20 -9 -26 -34 -41 -8 3 -13
5692 -13 -25 -17 -87 -31 -47 2 -14 -74 5 -34 -28 16 -23 -50 -23 2 61 2 2 31 -5 25 107 -24 11 25 51 44 10 61 -4 -4
5724 -4 43 63 -35 57 33 37 65 14 -4 11 33 40 5 13 23 27 32 -1 -18 30 -41 37 51 -2 61 10 28 -33 -17 -30 2 -22 10
5757 10 -53 -47 -35 -43 -16 0 -38 -20 2 -86 -3 -27 -12 14 -40 -18 13 -49 -20 2 -11 5 -22 1 18 -22 19 -15 34 -2 -77
5788 -77 14 38 -7 54 -2 4 7 38 -20 33 23 37 -6 51 -31 -6 58 47 43 53 33 39 -6 -22 -16 -5 36 63 -6 44 -16 57 -19
5821 -19 10 49 65 21 45 -25 -27 -10 -71 4 -32 -27 -5 -44 5 -37 -60 2 5 -20 17 23 -8 -63 -48 70 -40 2 9 -22 11 38
5853 38 -24 3 -5 13 -13 -14 40 15 -7 1 -33 47 -6 2 48 -12 10 47 -58 6 55 -20 63 20 58 66 24 16 -16 0 18 -2 45
5886 45 67 5 22 3 -2 32 -33 3 45 -24 59 27 13 -15 43 1 -45 12 -35 -5 -85 -28 -52 3 -43 5 -4 -42 11 -24 -15 -20
5918b0j9j0J1jK1nK7K3p8K8J6L3n9M0m4J1j8J3L8k1O0k5k0M2m2PJ0j4N7J8p4K5
5950C0K6n9l0K4N0Kk1J7mK5kk0m4L0QK2l3M8j08M6k9K2M6p1R4Oo6K0k6n6M7ol0
5983d2M6k1mj7J0K2j1j5J2L7k1L5p6O6q3L2j2qL7K4j1l3L9P5j08K7N0n8l3J00
6013E9l3j4j3j7N4pm1M7l3oL1N5k5j8m6N6m1J0M6r6Q3l2l3O7l2l1J04o5L3o3l
6044dj9K4N3q7O1Qo9Nj0L7K7J6k4rl1J6L2Nn1QMn2K8J3%m2M3nk6N7m6N1n1K0K3
6079Em0qN2j7LL7n0J1k1L0L1m2j4L9j0NJ3l6K3L7k7pK7m9P1m8jN1j7k9j5N8n3
6112Ik4K0Rm3L5L2m4K5m7k1N3j0L2l4M0j8mKl5M3l1oJ3rO0o4k0Rj4M7j4L9p3K9
6146a4mk6J1QKK9j8J4l7N2r3M5K7qJ5m4j9P1Pj7j5j4N7jj1j2K2K1lk4N9o9N3q4
$$ plain form
5918 -20 -39 -49 -38 -39 -18 -23 4 27 -51 -23 -7 26 -33 7 -37 -26 -44 -31 7 -14 46 21 1 43 1 8 18 4 61 79 5 30
5950 30 56 -3 -33 -9 41 43 22 39 35 60 58 38 -6 24 32 54 21 69 -39 7 -22 0 46 -25 69 75 9 29 3 -53 -6 -12 -42
5983 -42 4 -17 -21 -38 -28 -6 -17 -32 -20 17 -4 31 -45 21 -62 -30 -42 -50 -13 11 0 -33 6 81 -27 0 50 -8 -41 59
6013 59 26 12 -1 -18 36 29 -12 35 2 -4 27 82 57 39 -7 49 8 18 64 -32 51 19 -14 53 21 -10 94 29 62 -1 -4
6044 -4 -23 1 54 -33 28 36 -33 -28 -38 -1 26 42 18 9 -22 -6 26 31 -20 -12 -8 -60 -32 -19 -19 -61 -18 -23 -49 8 -38 13 -38 -18 5
6079 5 -35 -43 9 -8 -5 32 -18 -7 -28 2 33 -9 -23 16 6 11 24 -12 11 48 21 14 41 -8 63 15 14 65 48 19 4 62 9
6112 9 -15 5 14 -29 6 38 -6 19 -28 -49 4 -6 26 -8 32 14 10 12 -23 20 -11 -17 -4 -13 47 -17 -37 -28 -42 5 -9 30 -43 -14
6146 -14 -18 -44 -33 -25 -23 6 -12 2 -35 17 -76 -31 -4 -12 3 -41 -60 11 18 1 -14 -28 29 28 17 5 27 48 45 21 80 11 64 -20
6180b0P2j2n8N2K0k0L3k8j8J5q0J8N9k7K6L9p6j9pN7L2p8N7n4J1NK1ml9J7Rk7
6212b4JK6Pk2J2n4O4l4l1M6n1qM6l4M6K5o2K2j8PK5k5oR6m2k8Nk0L0L6o0M1K7
6245D3p9J9J2PlK6l2J1k0J1OM4q1O6PRj4JJ1m3Q7q5j9K9%K9n3j5L1l8Q0m4lm5
6279d5L0L3m0j2M2krJ0rJ5LK3m7L3k9qNp7O9Kj6L4m7J1J9k9P1n9J3L8m6pN0n4
6313c5K5K8j1K3Nk0Rn2Q7k3Om7pM1k9RL9l3k5N0J7N9j16LJ1J3l5R2m5k0kk1M0
6346C6rj8J1J0L2n9%Q2n8r1Q7K9r0M9k9k3J6K2mm1K4k2L5l0jL3Mk0j3K6J1l7%
6379c8M7m1J9npM8Pn2J9Qk8L5Ql2%%k8M2pN5m4KK8p1r3J34N1J76l51N04m5l33
6411HM8q9Q9n4j0M0K1p4K4J7Km0J3L5n1L0qPkk6L6J3m9M2%j6K3n1L2j9%Mj3J4
$$ plain form
6180 -20 52 40 -18 34 54 34 67 39 21 36 -44 -26 33 6 32 71 -5 -24 -31 26 58 -20 37 -17 -6 -1 20 16 -23 -6 3 -24
6212 -24 -23 3 10 -12 0 -54 10 -24 -55 -9 -60 -68 -22 -56 -10 15 -47 -25 -43 -36 -11 -36 -42 54 12 -16 -11 -31 -1 35 -25 16 43
6245 43 -36 -17 -5 2 -1 25 -7 4 -16 -5 1 45 -36 30 37 46 32 33 44 1 88 3 -16 13 13 42 -11 -26 5 -33 47 3 0 -45
6279 -45 -15 18 -22 -34 8 6 -3 7 -2 13 16 39 -8 25 -4 -12 -7 -84 -15 -13 -29 5 -42 -31 -12 -41 30 -29 -16 22 -24 -31 19 -35
6313 -35 -10 18 7 30 35 15 24 -28 59 36 42 -5 -12 29 0 9 48 15 -10 40 57 116 0 3 14 27 -8 84 39 19 17 -4 36
6346 36 27 9 20 30 62 3 3 85 27 -64 23 52 -38 11 -18 -41 -25 -3 -7 -48 -24 -46 -11 -41 -42 -9 -5 -25 -38 -12 -1 -38 -38
6379 -38 9 -32 -13 -18 -25 23 30 -22 -3 5 -23 12 20 -12 -12 -12 -40 2 -5 50 6 8 36 -35 -128 6 57 233 -118 386 341 8
6411 8 56 -33 56 2 -8 32 53 -21 3 20 22 -18 -5 30 -21 9 1 8 6 -20 16 29 -20 22 22 6 29 -22 10 -9 -9 -5 -18 -4
6445dKl3nL6l0L1l0JP3l2l0pJ7J0mJ5n2K9L6m8K3j7Rl6mK3K1L2%j4l7J2N1k4L4
6480D8kn7J0k9nQ3n6noN8Nn0J8P4j07J5Nj4M4o7K6M8Qn1N9l8Kn5Oj7L6jQQk3m3
6516f5O3J3n4P8Nn7K3l4J9l9K5L1K5o3L0K4j3qJ6Mp2M5m4O3o2K2pL3M5Qk9OK1
6549E2q4L1k6O6ln2P1j2n5J1KKL6Qk8k1kj1O3j5nn7N0l3k0J3J6M3J4p7M1j3NN5
6583F5j02jL3n6P5l0L2rj2L9m4mk0K9QJJm4K8l9J09k9n6j6K6J7Nn1O0m4Q1l6m6
6616c0K7N5p0L7l7P4q2K3M0L1m6K2k8K7m5J8Q8o9n0N3o3MK9mL4p0QN0l2J0J5o8
6648d9J19m4j6MK6Mj4k9J6j5K%L5l6l8k7Q3J8q2J1L2Rk9l0K5j2P0o3Qj4J2lK4
6681ck8J7pJK2%j8rMP2p1jK4J3j6K%J0j5QrJ8K9Jk5l1K7mN4o1Ookj9M2k9j6P8
$$ plain form
6445 -4 -2 -35 -40 -4 -34 -3 -33 -32 41 9 -21 -28 -11 -1 -5 10 -42 -13 23 -25 -2 -19 -10 -46 -50 -27 -6 26 26 12 -25 -13 38 14 48
6480 48 46 -11 -1 -30 -35 48 -8 -13 -19 39 44 -6 12 86 -21 -6 -1 -15 29 -38 -12 36 44 -7 52 14 16 -39 -33 -50 -14 -15 -7 1 -22 -65
6516 -65 -2 11 -43 35 40 -17 6 -28 -9 -48 -23 8 33 -30 0 24 11 3 19 23 -49 -4 -48 15 -47 -25 -32 1 46 54 25 31 52
6549 52 -32 -1 -27 39 36 -16 55 43 -12 -1 1 3 39 47 19 -2 -4 -15 48 33 28 -29 21 -12 -32 -19 -3 40 54 -23 18 5 10 65
6583 65 -37 -38 -5 -61 14 -16 16 7 -5 34 -10 -14 -34 -5 3 4 5 -39 -11 -50 59 30 -26 -42 -16 1 6 -45 15 -29 52 16 -30
6616 -30 -3 52 -18 19 -18 56 -26 -3 37 68 22 44 16 43 -2 16 104 35 -15 38 -25 -21 8 4 38 -32 -24 26 -6 4 19 -49
6648 -49 70 26 10 14 40 44 30 1 17 2 4 4 39 3 -35 -62 21 39 -43 -32 0 9 -20 -50 -25 -37 33 -30 -22 -36 -24 -27 -3
6681 -3 -31 -14 -21 -20 2 2 -16 -25 -21 51 -20 -21 3 16 0 2 2 12 -3 5 -4 14 43 44 19 -12 15 11 65 4 10 4 2 -17 25 -4 -20 58
6719E8m9k3RRK7J2o1J3L1M5p4k3M2j3K6n7O0qJ0J5m5J2qm9M3Ok8Qj1K2j1jk3%
6753c6L3No7N1M5o5K4m6Q6m3l6K2M3n4O0k6J3nl2mP6n6N5l0QMk0L2m4j7M4rNM3
6787E9j17M6J1J4Kok1M4m1M7p9R0k4o8O9K0o1K9l1N4l7n3k1pL8LL8l3j7N2K8o2
6819c4L0j0K1jm2PQ7o3pk5N7Jq3K5P5r0P2p2K7N4n0%J6j5nN0p4O4n7Q0k7k8N1
6852C4l9L3l8K9K3p8O2P5j17N3l6K7Mlj4Rk9m1L9N2j0J2k4J4n4j3O7o8Mj6O0p6
6884e9J9K7L8q6K1K0K6J5j8l2K5Rj0K4k9M3n0M2l5k3j3L4Nk4J1L1k1j4K9n4J6
6915c3N7m5L3l8NL9j9J1jm2R1r4L5rl0L2KK9J7j7%J4o8M2RM7l0m8J0qk9O1j8Q
6949A3K9n2L3l3M3M8q8N4n3m5N7k8M0J0o8O8m6K1lL0m6Pj2L4n4L3NK7l3j2L9m1
$$ plain form
6719 58 9 -14 -5 4 31 43 -18 -5 26 71 -3 -26 16 3 29 -28 32 24 34 49 4 16 8 -41 2 8 -20 -12 -23 -1 -12 -13 -36 -36
6753 -36 -3 2 -65 -14 31 -34 -10 -56 30 -13 -49 -27 16 -38 22 -4 9 4 -28 -32 44 -12 43 13 21 25 5 37 -7 -24 20 11 16 59
6787 59 -58 -12 -1 13 15 9 -12 32 -9 38 -41 49 25 -43 26 46 -15 14 -17 37 0 -53 -74 -81 -43 -40 -2 -35 -52 0 28 -34
6819 -34 -4 -14 7 6 -36 -29 58 -5 -12 -37 20 21 -62 -37 38 -52 20 -52 -25 29 -21 -21 -5 -20 -25 25 -49 15 -42 38 11 -17 34
6852 34 -5 28 -10 19 42 -36 26 101 -16 37 1 28 32 29 15 24 -5 -46 -7 45 35 47 23 37 -17 -30 37 -31 -27 -43 17 -59
6884 -59 -40 -13 25 -61 -40 -20 6 21 3 -29 -4 5 -5 19 -10 33 -17 25 -10 -33 -46 -12 -7 -31 -20 11 -10 -24 5 -49 -33
6915 -33 24 -21 12 -26 -21 18 -1 10 9 -33 58 -36 -1 -10 -40 -8 -6 23 40 23 23 37 -31 11 20 67 37 -11 -1 -9 -38 23 5 13
6949 13 42 -10 23 -10 33 81 -7 47 -6 -51 6 -22 18 28 -40 28 -18 3 0 30 -16 -9 -21 13 -41 -8 -3 24 -9 -21 18 -23
6981b3L9m8O0n8J8m5N1j7K2N2k4k2j7K1n4M3k5K3M6qo0O4m5M9m1K2On4nQ2p3L7
7013A6j9J6J1q%MMm0j7N8l2L5Nk5m3K2%m0P2k3k2M1J0RJ6p0K3k7M9l0rk0K0j5
7047b9N6k8L0n4%K9o6J5L2J9J4m9k0K2j9L3JM9m0jk1m1R0Jj8RQJ7m2Lm1P8m1J1
7081Gmk6K7L7q1R8Km1l2M0%rl2jN8n9rL0j8j6P9n3L4rL2j05P5m6J8Jm9Q4k7j3
7115hl4J8L0J6m1J5j6JPk1j8Q7m7Nl6PQ7j18N2J0m0R3p1L4k3%M4J8k2lk5K3j2
7148A2m9P2l5N7m1K7n9N0k5%l4j6O8K7k3n7K8JK8l8M7k5o3O3j7J7j6l2J9L4m3
7179b3M1j9K7QJ3p0mL8K0m4K2L5p6L6L7j7j05Q3l3L9J9p2K3J1j8M1l4J9l1P9m8
7210cPm4l4Q8K6j3k5L9k8k0PJ6k3J2J1k5L6Jj5J6l4k1M9k0k2L7o4P0M1l7k7j1
$$ plain form
6981 -23 16 -32 28 -30 -12 -57 -6 -23 -1 51 27 5 -12 9 -45 -2 -27 -4 42 34 -26 38 -7 42 1 23 29 -25 -30 52 -21 16
7013 16 -3 13 24 16 16 20 24 -16 -33 25 -7 28 33 8 -35 -13 -13 -53 19 -4 -26 15 25 34 50 -20 3 -24 25 -5 -14 -34 -14 -29
7047 -29 27 -1 29 -25 -25 4 -62 -47 -15 4 18 -31 -51 -29 -48 -15 -14 35 -5 -6 -27 -68 22 23 5 14 22 39 -3 0 -41 37 -4 7
7081 7 3 -23 4 41 -40 58 60 19 -13 27 27 18 -14 -15 43 -16 -25 5 -13 -29 50 -3 31 22 54 -51 24 -22 -4 -3 -52 32 5 -8
7115 -8 -42 -24 6 22 -19 -4 -20 -19 -12 -33 -51 36 -11 -6 -42 -35 52 -66 -14 -4 -44 49 -22 12 -11 -11 33 51 29 26 1 24 12
7148 12 -37 35 0 57 16 43 -16 34 9 9 -25 -41 27 54 31 -26 2 3 31 -7 40 15 -48 15 -2 15 -1 -33 -14 20 -23
7179 -23 18 -1 26 34 47 -23 -27 11 31 -13 9 44 -32 4 41 24 -81 2 -31 8 27 -45 -22 -11 -29 12 -22 -3 -34 45 -3
7210 -3 4 -40 -74 14 40 27 2 41 13 -7 0 16 -7 5 16 -9 27 28 13 29 -5 -26 23 3 -19 18 -46 24 65 28 1 -10
7242a0M4j9n5M6jkn4M0L6m4Jj3M4pl1Q3ro2k5kP2j2N3o1K7q4k2O7L9m5J3j5l6
7275d4O0LRo0K5J2K3o6K8K4n9J6M7k9LM5j9j1nQj8L8J2l7K%L0k0KL6p2P7m2lK6
7310D1k0kjJ3K3m7Kj5l4N6J8m4L3L1J1k5n3ON7j8k6k0Nj9M1j7j1L9mql7L0Qj2
7344Ak8P1Jp9R8k6r2M9l3K3qK9%q0J06l1O0k0o0M7m1J3j1J2J2J1l1J4M1q9N1j6
7376fqJ8r1O0N5k6L8p8O1l9L2kNPpl4Kj8RN1NKK8n9J1L3n1M1lJkn2NMK0J4n3K5
7414bK7m9J3J5Qrj9j8K9j8JKN6m6K1k7J9l6M0k8K5K2l5J1M4n5N3o3l1O5l1J3p
7447a0J4k4M2l1N4Kk0q8J13l1%Mm8K3k2Q1k1Jm3KJ8j9PJk3kM9lJ8j5j2k2K3jm
7482A3K4m8o1P3K7m8P5m3m4L0mJ7KJ0m7N0kl4pK4Rl9K7Lm9L3Qnk0O9m4l0K8qj3
$$ plain form
7242 -10 34 15 -40 6 5 3 -51 -11 25 -19 -18 -31 13 6 -25 58 49 -13 -38 -40 32 20 73 12 39 -45 -67 0 39 -6 7 -8 -44
7275 -44 16 19 28 -32 -7 5 28 -38 -10 14 -45 -29 18 -11 -8 37 18 7 2 10 -8 30 42 5 7 7 37 17 19 55 -17 60 18 15 41
7310 41 21 19 18 31 54 7 9 -6 -40 16 34 -10 23 54 65 40 -13 -7 50 32 6 -14 -9 -28 13 -4 -15 24 20 12 -25 5 13 1
7344 1 -27 44 45 -34 64 38 -54 -5 -38 -15 -23 6 6 -74 32 1 61 41 -19 28 -13 0 -11 1 13 24 -7 7 48 -41 10 -6
7376 -6 -14 4 -87 -27 28 2 40 -38 23 -16 16 14 19 26 19 -15 -13 -31 -22 29 34 36 64 5 16 49 -2 39 36 37 35 -17 -12 -8 12 26 -27 -2
7414 -2 25 -24 -11 4 12 3 -16 -34 -5 -23 -22 -20 36 -10 11 -16 3 -33 7 -21 4 26 -9 2 46 -9 44 -19 -50 15 -16 -3 -10
7447 -10 4 -20 22 -9 45 47 27 -61 52 21 21 25 -23 0 -22 59 38 39 -4 -2 16 -3 4 5 -18 -20 29 26 44 29 17 -5 18 17 13
7482 13 37 -11 -72 1 28 -20 55 12 -32 -2 -6 11 13 23 -24 26 24 -10 -17 7 16 -23 4 7 -42 -9 -1 -6 -26 43 -1 -31 -3 -11 -24
7517b4O5k8%J5k7K3J6k9pk6JN5k8ql1PK5J2N6p0L9M0j33P0K2K6Mj19P7mj1K2P
7550C7o6M1J4l4K8l3L0k4OK2k7k1M9k4Oj0mm4J6k1M9oj2lM6l8K5Ok6j8L6K0m8
7583b8O3p1Q5n9pK7k7L6j0n3J4K8J3%L4k4l4K6K0k0Rk2k7j7L2J1P4n9QK7n4L1
7615B6l9M9%L6j14M8k3M5j4oj8l4R8j1j01P9K2k6J8p7M7J7qpk1K5J9k1l7P7r6
7646d7K6k0j0J0M8n0K3P1n4QrPk0k6M8J9n5pjm2N2L3kM4k4m0M4K8o0nL5N9o7Q
7680B4L5p5O7k3l9L4PLmJ7k9k1K7K3n6pJ5j3N3j7p0LQ6p2M3rk4M4m1Nj3pK1L9
7714B6l0O5j25R2j8o2NL7l7K4J2ol9M4kRJ4l8oQ1m5l0LJM3j1l4M5k9j0KlP4m9
7748Cl7O9k1m2L4K3J2kk6l1j1J2M9p9K0M1l4rOL8L7r0K6nkN5m9K1ll8nM0p2J06
$$ plain form
7517 -24 41 13 13 28 1 24 40 11 4 -22 -21 34 6 -2 -33 -26 -1 11 67 -3 36 76 -57 13 35 61 65 -54 23 19 8 30 37
7550 37 -29 12 26 -8 20 -13 17 -7 -1 21 -6 -27 22 -2 4 -6 -10 -54 -38 -59 -10 -16 -28 -31 15 -23 2 8 -18 -36 0 20 -28
7583 -28 35 -36 49 -10 -17 10 -17 19 9 -44 -30 -2 11 11 45 21 -13 13 33 13 22 0 -27 -44 -12 -1 73 14 22 49 -5 26
7615 26 -13 36 36 72 -42 6 -17 28 14 8 -10 -44 54 43 -58 21 43 17 35 -42 5 22 14 7 -14 11 30 9 -28 49 -47
7646 -47 -21 -41 -51 -41 7 -43 -20 51 -3 5 -4 3 -17 -43 5 24 -31 -38 -39 -81 -29 4 2 46 22 -18 26 54 -6 -11 24 83 16 24
7680 24 59 -16 51 28 -11 23 30 33 29 46 17 -4 23 46 -10 -17 -2 -15 38 21 -49 -46 40 -32 11 2 -22 22 -19 -14 -27 -34 -13 26
7714 26 -4 61 -64 28 10 -52 -47 -10 -47 -23 -11 -17 -56 -12 -14 -5 9 -29 -35 46 1 -29 -26 -25 18 7 -27 18 -11 -21 -19 -22 52 3
7748 3 -34 35 14 -28 6 29 41 39 13 -18 -29 -17 32 -47 -27 14 -20 -29 -23 15 52 -38 -12 -17 -19 36 -13 8 5 -33 -38 2 -70 36
7782C6k9P5o7lk7J6J6l3N8on0k5J7J6jk1j2M2l0K7k3ON2m7k0P0o5K5Q9p8LK6J2
7815D9m4k5lj2K8pK9N0p9L1L8k1j1J8ml8K1k9L7jl1N7j1n4L4kK0p5RL4k9K8j2
7848eRJj9Pnj6M0j2m0M2j5jL0q6Q8K9l0Mj4qLm1P6k0m1kJ0j7J1L5J5m9oL8qJ4
7884A7QJ9j2m9m2N0j3J0L5n2M4k7j9N5M2j09O0J5o5K7O1k6n8K7J7j9L2n3J4%p
7915a8N4l4J6j7J4kJ5j2l2M4Mm1K2j3RL4o0LP7p7rL0m5pK7k0M3jJ2j6j1lK6j1
7949Arq5Q0LLj7O2j5l2N0n7M0Mj1k7JoK1q8J23n4O4m0lL8r9R4m5J7qJ8j6M3pl7
7984FOm1O3n8R3n8J1J9j4jk5J0J6J9j02Q7J4r5L6K1l2J4J2%m3M4J2m9M0m4N6l9
8016b2M0k3NM2n6K4pN9p5j1l3K3J5J2k0M6k3oLK3j4NJ4j3l3K9MK0n6N7Oo1K0r
$$ plain form
7782 36 7 82 15 12 -15 1 17 -16 42 36 -14 -39 -22 -6 -7 -28 -40 2 -28 -1 -24 -18 34 -13 -33 37 -28 -3 86 8 11 37 49
7815 49 5 -20 -23 -35 -7 -14 15 65 -14 17 55 34 23 41 37 -1 20 -9 28 27 -4 53 42 -12 22 20 40 -35 -26 8 -21 7 -5
7848 -5 4 5 -14 -7 -12 -28 12 0 -40 2 -13 -14 16 -70 18 47 17 21 7 -1 2 -39 37 17 -24 -26 -16 -33 -22 13 28 -21 -27 11 3 17
7884 17 25 44 32 -17 -59 -9 -22 -12 23 -29 15 -12 -31 24 66 -43 17 32 -33 -6 55 29 -29 -2 15 -4 28 -25 -11 -11 -18
7915 -18 36 2 18 1 15 13 28 16 -16 28 32 -9 13 0 9 43 -17 -14 63 -14 -23 7 -38 -45 -18 -38 5 4 16 0 -11 -14 12 1
7949 1 -8 -93 -13 -10 -7 -24 38 23 -9 41 -16 24 28 17 -10 -9 -15 6 -82 41 -13 51 11 8 46 -53 41 -4 13 5 23 7 50 43 6
7984 6 12 -29 34 -24 69 11 22 41 27 26 1 11 27 46 -56 31 45 -50 -14 7 -25 -11 1 1 -42 2 14 -35 5 -39 17 -22
8016 -22 18 -5 0 42 -14 10 3 62 -13 -24 -57 -34 -19 -7 -27 19 -4 -10 -7 16 2 7 21 8 -25 4 8 28 -28 29 35 -26 -6 -15
8050a5Ll7M7L3J7l5K0l1N0l9j3K4K0k1rk3oM3K7j6k2ol1M5n3P7l6k2L4j3j7k3
8082b8olMR2j15M3l8J9K1m4N0M0J0n6k1P1j6j3k8M6o2O3n4L3Kj7M2l6j6k2L0K1
8114A2n1J1M8qJ9j6ll9M5o6O3o1L8JrL2nJ1k9K4m8L3j8J9M9l3l0jQ1J5o7l6K0
8147Am0M5j3L8k3l2K5j2lmJ6Om9L9L6p5N8%j3k3OK3K2m2M5k3l2L7L7mo0J2o9P0
8181aj9l1j9J8M8j7l1J3M8N
$$ plain form
8050 -15 -12 -49 -2 31 48 13 33 2 52 13 0 24 44 23 14 -9 -15 28 55 39 17 11 -20 25 -28 49 13 -9 25 12 -5 -28
8082 -28 -34 -37 -33 59 -56 -13 -51 -32 -11 -55 -5 35 45 -11 -32 39 23 10 -18 28 -34 29 -25 8 10 -7 35 -1 -17 -39 -9 12
8114 12 -39 -28 20 12 31 15 12 -27 18 -48 15 -46 -8 -7 -16 16 11 22 -7 17 -31 2 -16 3 52 19 -11 -12 69 84 17 -19 1
8147 1 -39 6 -7 31 8 -24 1 -11 -14 -18 -2 4 -45 -6 30 -45 13 13 0 -23 -17 6 28 -14 31 8 -24 13 50 46 -14 -2 -71 -1
8181 -1 -20 -51 -70 -52 -4 -21 -52 -39 9 14
8191A4
$$ Imaginary data points
##PAGE= N=2
##DATA TABLE= (X++(I..I)), XYDATA
0@%%%%%%%%%%%qJ6j6J6k4L2l7M5n6O4p2Q8j04J25j49J70j94K24k56K93l35L80
33B02m31M87n48O14o86P67q55R50j054J169j294J429j576J736j914K110k324K558
51A340k817L107l429L788m195M660n193N817o558P446q537R916j1718J4174j7727
66i926K3316l3322N6231j89857k4262M49245l69416n317J44181m0648M9444j35772
78h6103J33596P5509l06653J81022J00778j48983M245m014J27088j02069q1184
89a06768K73420j79711j02036J99463r1983J6874n3062j2883J78283k36674O8745
100d6332K18353k64977P4235J02785j14343O6863r3741P5089N7896k17638J80390
111C8580N3741j85768J21849K4947m6776k3440R598R0734j40675J5456J24076
$$ plain form
0 0 0 0 0 0 0 0 0 0 0 0 0 -8 8 -8 8 -16 16 -21 24 -32 32 -40 48 -56 69 -80 90 -104 120 -136 157 -178 202
33 202 -229 258 -290 324 -362 405 -450 500 -554 615 -679 750 -826 910 -1004 1106 -1218 1340
51 1340 -1477 1630 -1799 1989 -2206 2454 -2739 3078 -3480 3966 -4571 5345 -6373 7801 -9926
66 -9926 13390 -19932 36299 -153558 -177820 271425 -97991 -103308 40873 225 49669 -86103
78 -86103 47493 123002 -183651 -2629 98149 -50834 -46589 -50603 76485 -25584 -106768
89 -106768 166652 -13059 -115095 84368 -7615 9259 -43803 -56686 121597 -115077 -46332
100 -46332 172021 -92956 -18721 84064 -30279 36584 -57157 17932 75828 -141810 38580
111 38580 92321 -93447 28402 53349 6573 -16867 -7269 83465 -57210 -41754 82322
122H2322j43396O6076K9580o5031J00286j15111M5658J01653j94494R9892N4564
133F1999j38844R5911k0133l286L5279r0729J13785j9246j07006J18371l6118
144I983m9075L4791q053L9075p3337K8155Q8974j20698M3977N0559p4034M1500
156A1817m1833K6711L2770j09751J04879J0570j04625J06874k8822k5771M8557
167C1376p3853O0806k072p8662Q8492j8824l7934L8555l517K5115m9436J0262
179i692O4494q9314J9066M8402n6015K3820r004J8039K0516o9763P0391P372q0886
192d2574O9483j4257l3201L6137l3255L0508j183l8382O0950k3475k4819L6346
204B2278k1270M442j0415n874K8988l5897J0214K7696k8741J4586l629L796P392
$$ plain form
122 82322 -61074 5002 34582 -30449 69837 -45274 384 102037 -92457 7435 61999
133 61999 -76845 19066 -1067 -4353 30926 -59803 53982 34736 -72270 46101 9983
144 9983 -39092 -4301 -12354 26721 -46616 -18461 70513 -50185 -6208 44351 -29683 11817
156 11817 -30016 -3305 29465 -80286 24593 35163 -69462 37412 8590 -17181 31376
167 31376 -42477 18329 16257 -62405 26087 7263 -30671 7884 4367 29482 -19954 -9692
179 -9692 54802 -34512 -15446 32956 -23059 761 -8243 9796 30312 -39451 30940 38312 -42574
192 -42574 26909 12652 -20549 15588 -17667 12841 11658 -26724 34226 10751 -14068 22278
204 22278 1008 5450 -4965 -10839 18149 -17748 -7534 20162 -8579 6007 2378 6174 13566
217A3566l9004L5789j325m5624M7412q014k5640L4422j4192L966L319j7398K4567
230A1844j9637j0310K4950j9986J478J2912p082P799n465M445M950j4477R758
243A179m979m402O900j0175J3312k19j2338K2566p001j1974J8718j1478l423N390
257B076p550Q081m667j345J3601p863j432J2039p991l801M307k245m896Q22M717
272C853m335L081M126k914L430m20m506K907m386l116M328n352K748K883k811
287d84M756k3m067M060k677o376M869k893m293M423J173k740L841J694k838J590
303A5j478j327q83k314M47J619k852L338L326l873M009J270m394J890k48m209
319e664K425o35q23L406m24K176J149N6M19q96m42j519l70J047k162K865K352
$$ plain form
217 13566 -25438 10351 9026 -36598 10814 2800 -22840 11582 -2610 1356 4675 -12723 11844
230 11844 -7793 -18103 6847 -13139 -11661 1251 -5831 1968 -3497 948 5898 -8579 1179
243 1179 -3800 -8202 -1302 -11477 1835 1616 -10722 11844 4843 -7131 11587 109 -3314 2076
257 2076 -5474 2607 -2060 -3405 10196 2333 901 12940 4949 1148 5455 3210 -1686 -864 3853
272 3853 -482 2599 6725 3811 7241 6821 2315 5222 836 -2280 2048 -3304 -556 2327 -484
287 -484 4272 4249 182 4242 1565 -4811 58 -2835 -7128 -2705 -1532 -4272 -431 1263 -1575 15
303 15 -1463 -2790 -3673 -5987 -5540 -3921 -6773 -3435 -109 -3982 27 1297 -3097 -1207 -1455 -5664
319 -5664 -3239 -3874 -4697 -1291 -1715 461 1610 1666 2085 1189 747 -772 -1142 -95 -2257 608 2960
336B960k948N682j499j223L722o599L222P06q475Q623r74n756R482l781J002J956
352F100n259P240p645l255J0007j0193J253N567m992N896n886L755N620j5581
366g373J0778N58j3098J1454o554J058N892j2396J5875m909j1739J9553j3468
379d369j950Q949j3058J2138p634m034J9389k0164P481J1952j9153J3590n978
392b841l234J1364j9924J6950J752k0443K6733j0715o116J6055j7434J4937p096
405a2j2003K7987k5306K101K3333k6206J5477o55q618K0567k7593J4387J3016
418A6475l3574K6125k906j3117J8300j9772K1248l239k8565M3043k2056j6060
430a4098L1824k5105J1849l384j2475L6512l7775L318L7529m3233J5939N320j4209
$$ plain form
336 2960 12 5694 4195 2972 6694 95 3317 4023 -4452 4171 3197 -2559 6923 3142 4144 6100
352 6100 841 8081 436 -2819 7188 -3005 -1752 3815 -1177 4719 -1167 2588 8208 -7373
366 -7373 3405 3963 -9135 2319 -4235 -3177 2715 -9681 6194 1285 -10454 9099 -4369
379 -4369 -6319 2630 -10428 1710 -5924 -9958 9431 -10733 -3252 8700 -10453 3137 -2841
392 -2841 -6075 5289 -14635 2315 4067 -16376 10357 -358 -6474 9581 -7853 7084 -12
405 -12 -12015 15972 -9334 -7233 16100 -10106 5371 4716 -3902 16665 -10928 3459 16475
418 16475 -17099 9026 6120 -6997 11303 -8469 12779 9540 -19025 24018 1962 -14098
430 -14098 17726 -7379 4470 1086 -11389 25123 -12652 -9334 28195 -15038 901 6221 -7988
443g988K1856l5360K5180J6692n3509M4240K600l3411K9193j9110J6621l094l4672
456c0762N4474k6696k5311M8653k8298M520K565j2680M0903m9195L897N3518o2226
469b6638J7795K4982l0272K1428k2437K1281J5111n7741N1226L307m5157M0508
481A3393j8896Q302M247l3230N8438l2903l0401O8113m1054p710K5987k3042K7071
494A8315l2524Q082M2459o6096L1515K7529m7795K9087j3556P210J4428n1081
506c2427N4941o061n4157O3643j9422j9569K3191j9753L0729l0316j0989N8196
518C8006n9199N268M3575m4119K0012q855J074K8623n6623L7033K1224o1898M2984
531G105J799k0803J5473k3491L9860j8677l6721O7990l6867k2351M6419k7521
$$ plain form
443 -7988 13868 -21492 3688 20380 -33129 11111 13711 -19700 9493 -9617 7004 3910 -30762
456 -30762 23712 -2984 -28295 20358 -7940 -3420 -855 -13535 27368 -21827 -17930 35588 -26638
469 -26638 -8843 16139 -14133 7295 -15142 6139 21250 -36491 14735 18042 -27115 13393
481 13393 -5503 2799 7046 -26184 32254 -649 -31050 37063 -3991 -11701 14286 -8756 18315
494 18315 -14209 -6127 36332 -29764 1751 29280 -18515 10572 -2984 4226 18654 -32427
506 -32427 22514 16453 -37704 25939 6517 -13052 10139 -9614 21115 -9201 -20190 38006
518 38006 -21193 -15925 27650 -16469 3543 -5312 -4238 24385 -32238 4795 26019 -35879 7105
531 7105 8904 -11899 3574 -19917 19943 1266 -35455 32535 -4332 -26683 19736 -7785
543g785R489j1295k962M4353n7273J2575M6179n5360J9251J2675j3971J1974l1100
556b3250L7399M608n4707N2583l169l1118K9123j5271J4621j1552j8714N1745
568C2298l7853j6266M6699k8305L385K209n200K4450m0029J9625K8405n3935K6212
581A695J3967k3723J5402j7211J9445J228l4029M2955j3791k5570L3068j6190
593b754M908l225j2539L4650l1309k428L5045l6760J1605R837j6200J8693k4277
606a4754J2567J8423l9234K7098M808k4728K2835j3083O897L300k3495L2859j3615
619a22j8651L2622j9292J49J0364j3253J8528j7970O50K3849l0930J2983J1086
632A0013k0518J7488j0055J976J3257k5915K0848K958k3189K2605q548l344R545
$$ plain form
543 -7785 1704 -9591 -12553 31800 -25473 -12898 33281 -22079 -2828 9847 -4124 7850 -23250
556 -23250 14149 18757 -35950 16633 13464 -17654 11469 -3802 10819 -733 -19447 32298
568 32298 -5555 -21821 24878 -3427 -42 2167 -3033 21417 -18612 1013 29418 -24517 1695
581 1695 15662 -8061 7341 -9870 9575 10803 -23226 19729 5938 -19632 13436 -2754
593 -2754 2154 -1071 -13610 21040 -10269 -12697 22348 -14412 -2807 7030 -9170 9523 -14754
606 -14754 -2187 16236 -22998 4100 8908 -15820 7015 -6068 829 4129 -19366 13493 -122
619 -122 -18773 13849 -5443 -5294 5070 -8183 10345 -7625 -6975 16874 -14056 -1073 10013
632 10013 -10505 6983 -3072 -1096 12161 -13754 7094 10052 -13137 9468 920 -2424 7121
645G121j4112J6520o965j1736K3774j5752k655J2771j2506R197o769j361J3849
658A1376j9079Q610R320j7274J1046k204l628P878j3109J0482O89j3436J5310
671E981n772n213R218p879N114j135o742J1213q209j346P787p677M262j404j156
686b958N713q445M421L909r120O820j312l001N195n512M762j78n337Q142m053
701i54k437O015m928J971J247l437M751l072N81K958l758K915n55j470K931k919
717a61J040J728l187L218j118q12K609l029K090J10k732K961j238j421K567k209
733D16O94R55j844J618q49o07Q97j201K10N2q40Q67p38j14P69r71M60n94M9K20
753e51j270Q62J24j358J143O6j018J157n30n8J85m93M52k68k89O70k56o4N80j53
$$ plain form
645 7121 -6991 9529 2564 -9172 14602 -1150 -3805 8966 -3540 5657 -1112 -2473 11376
658 11376 -7703 907 10227 -7047 3999 1795 -1833 6045 -7064 3418 4107 -9329 5981
671 5981 209 -5004 4214 -3665 1449 314 -6428 4785 -3424 -4770 3017 -4660 -398 -1802 -2958
686 -2958 2755 -5690 -1269 2640 -6480 340 -972 -3973 1222 -4290 472 294 -5043 3099 -954
701 -954 -3391 2624 -2304 -333 914 -2523 2228 -844 -263 2695 -1063 1852 1297 -173 2758 -161
717 -161 879 2607 -580 2638 1520 708 3317 288 2378 2488 -244 2717 1479 58 2625 416
733 416 1110 2065 221 1839 990 383 1280 79 289 341 -499 368 -370 -484 285 -686 -226 -820 -771 -551
753 -551 -1821 -959 -835 -2193 -1050 -984 -2002 -845 -1375 -1433 -1248 -1741 -1289 -1557 -1846 -1176 -1432 -1496 -916 -1069
773a069L10j10J41J54l16N37k27K8P42o68P19N42j052J288j57p09J151p78L58
792H84K40p59J484p95k66J692j588N79N02j152J307j315K82J105k104J487J22
809A705j461J893j989R63P10l211L181r38k305K948k041N66N58k529L860k796
825h86j491M467m230P64J478k328K677l092R52L534o099L522J614m673L782k242
841b251J252J268n245O372j386m787O862l509k20K343l845N878m645j555Q235
856D767p635J509M197m814M224l568J287M939r733O938K335q489P438k754%K735
872C376o554Q516l315o469J1491p120j190N482o138O615n486j176J0156j2326
886d138L760O934j0551O314k281o77N552j1707J0232Q05j2561J3393m617m199
$$ plain form
773 -1069 -759 -869 -728 -574 -890 -353 -580 -552 190 -478 241 783 -269 1019 862 153 1304 526 884
792 884 1124 365 1849 1054 788 2480 892 1471 1973 821 2128 813 1095 2200 96 1583 1705
809 1705 244 2137 148 1111 1821 -1390 1791 853 -1452 1496 -545 21 579 -1950 1910 -886
825 -886 -2377 2090 -2140 -1376 102 -2226 451 -2641 -1689 1845 -4254 -732 882 -3791 -9 -2251
841 -2251 -999 269 -4976 1396 10 -4777 2085 -1424 -1644 699 -3146 2732 -1913 -3468 4767
856 4767 -2868 -1359 2838 -1976 2248 -1320 -33 4906 -4827 2111 4446 -4043 3395 641 641 3376
872 3376 -3178 5338 2023 -4446 7045 -75 -1265 4217 -1921 4694 -792 -1968 8188 -4138
886 -4138 -378 6556 -3995 2319 38 -639 4913 -6794 3438 4243 -8318 5075 458 -3741
900c741O730p884Q685m423p652J6559j2227k039J1920j0770N417k635j654J0622
914F908j6081P383R564j7959J1410M54o312P968j0582J0772K04j5911J9274n342
928A750r826J2998p656M783k334o101J7549j6116j393J8104j6409L529M230m935
942a827Q454j3184Q147Q993k1386J4710L714j2886Q759n409O993j617j3287K0775
956A0949q850j1466J9168r951r23K564m293J2729j5837J236J7293j9701N228P970
970F116r570O020p921Q447L623k0208J8500P88j5701J3381m701R17K94p749J7089
985I325j2702p312K1074j3955j333P057n846Q024j1399N013J2096k2055J1228
998g85Q780j5309Q335l328L467K257j3799J7782m495j4049J8916p192l409M806
$$ plain form
900 -3741 2989 -4895 3790 -633 -8285 8274 -3953 -5992 5928 -4842 575 -2060 -3714 6908
914 6908 -9173 -1790 7774 -10185 1225 1679 -4633 3335 -7247 3525 3729 -12182 7092 1750
928 1750 -8076 4922 -2734 2049 -285 -6386 11163 -4953 -6346 11758 -4651 -1122 3108 -1827
942 -1827 6627 -6557 1590 10583 -10803 3907 7621 -5265 3494 -1915 5078 3461 -9826 10949
956 10949 2099 -9367 9801 -150 -1073 1491 -2802 9927 -5910 -4674 12619 -7082 -1854 6116
970 6116 -3454 2566 -5355 3092 6715 -13493 5007 5795 -9906 3475 -1226 -309 -15 -7764 9325
985 9325 -3377 -10689 10385 -3570 -4903 2154 -3692 4332 -7067 -2054 10042 -12013 -785
998 -785 7995 -7314 1021 -2307 1160 3417 -10382 7400 2905 -11144 7772 580 -2829 1977
1012A977o025J2331j1704k611J8805j8624K474J1953j1716N954n091L220Q021
1025H964j8469J3205M717j7104J3299k046l185L755q842J3696n978j1140J9091
1038I963j0435m458J0499p617N389o111l60J3241j7006M092J0928j4318P057l37
1052E27k281N279j1560J1129J762j5181J3860k073o314P045o284O524l694o011
1066g272J5027j1156k902J1476q545L481j078k327Q427j1162M980P440j3741Q032
1080F80J646m910N162o656O304Q45r654J1685l552o410R082m894K094o27l902
1095c107R361p630r37Q595q565K550K680l944M543n704L039M361r428O398R66
1110C178n651N137l030J403Q73n345P162k909m315P075m347J88J712k956L952
$$ plain form
1012 1977 -4048 8283 -3421 -6032 12773 -5851 -3377 8576 -3140 2814 -2277 943 8964
1025 8964 -9505 3700 8417 -8687 4612 2566 -619 3136 -5706 7990 2012 -9128 9963
1038 9963 -472 -4930 5569 -2048 3341 -2770 -3130 10111 -6895 -2803 8125 -6193 864 527
1052 527 -1754 3525 -8035 3094 4856 -10325 3535 1462 -4852 2193 -4091 2433 -1261 -7272
1066 -7272 7755 -3401 -6303 5173 -3372 109 -969 -3296 5131 -6031 -1051 6389 -7352 680
1080 680 2326 -2584 2578 -4078 2226 3071 -6583 5102 1550 -4860 4222 -672 1422 795 -3107
1095 -3107 6254 -1376 -2313 6282 -2283 267 2947 -997 3546 -2158 881 5242 -4186 2212 3178
1110 3178 -2473 2664 -366 1037 1910 -3435 3727 818 -3497 3578 -769 -581 1131 -1825 2127
1125B127l893L9M926o235K155K324l793K923k334J087J856m942M356j81l787M062
1141F90j769k18J347k543L413j888j502M047l192M00J812k114J935j255o2K388
1157A489l139J767J046k391K111r12J15J061k021K146l40j739K675j444k36J431
1173A619j720J522o12q00J903j722L00J176j596J015j76o68J091j344P04L01j274
1190b81J100l98m93P76r14M84P9r03J015p56k97Q26r43M04J35p22O39m12j68O37
1210a92q74L41K08n90N42k73r7L96m26K95O2l07M67k69O7K48l54M23j33NM34l96
1232d23K52L31n06N47j11j61N41m23L05J38k96M36o9j95M40l03K42L3j75M16n71
1253D48L60O4m34M89k79j03L68n94M57J3q42R61n76k26N71p36M74j87n73Q74q37
$$ plain form
1125 2127 -1766 -1727 3199 -3036 -881 1443 -2350 573 -1761 -674 1182 -3760 596 415 -3372 690
1141 690 -1079 -1297 50 -2493 920 -968 -2470 1577 -1615 -1215 597 -1517 418 -837 -899 1489
1157 1489 -1650 117 1163 -1228 883 -29 86 1147 -874 1272 932 -807 1868 424 188 1619
1173 1619 -101 1421 809 9 1912 190 490 1666 70 1085 909 241 1332 -12 692 993 -281
1190 -281 819 421 -72 704 -210 274 353 -550 465 -291 -588 238 -705 -301 -166 -888 -249 -661 -829 -192
1210 -192 -1066 -725 -517 -1107 -565 -838 -935 -539 -965 -670 -608 -915 -448 -717 -650 -402 -756 -333 -466 -461 -27 -423
1232 -423 -171 160 -346 201 90 -71 470 47 352 490 194 630 561 366 806 503 745 778 603 1019 448
1253 448 808 872 438 927 648 545 913 319 776 789 -53 908 332 106 677 -59 415 228 -345 529 -308
1274c08m1P53j105O09k46k11N86j139Q01K17j349J298l84o29J052j239J010j31
1292d56j208K050j320l36J451j359P81j29o32J802j949O13J705k554J562K52r16
1309f43J440j758J423N25k478K829o43j588K317j627J141k46j575L333k533n28
1325f11L218k944Q19P57j333K245k914J170K371m458K834N28k571K274j797J413
1341A001L07l615M629j626k850M176k678N06N42j960L666l651l48M747n128J368
1357i14J933k792K577k821J496K339n796M536P74m646L980j524L05Q67l549N456
1373B221k730l176O564m101m98K722k507L155l334K56N233o901K609L394n051
1388b144L045j258P32J791n538N795m7n954O341j824j619K196k700M404l350k322
$$ plain form
1274 -308 -349 404 -701 -92 -338 -549 37 -1102 -301 -84 -1433 -135 -519 -1148 -96 -1335 -325 -456
1292 -456 -1664 386 -934 -1270 181 -1178 -397 -526 -1158 644 -1305 -692 1013 -1541 21 273 -643
1309 -643 797 -961 462 987 -1491 1338 695 -893 1424 -203 938 692 -883 2450 -83 -611
1325 -611 2607 -337 482 1239 -94 2151 -763 407 2778 -1680 1154 1682 -889 1385 -412 1001
1341 1001 1308 -2307 2322 696 -2154 2022 -656 -150 392 -1568 2098 -1553 -1901 2846 -2282 -914
1357 -914 1019 -1773 804 -2017 -521 1818 -3978 558 1332 -3314 666 -858 -553 314 -3235 2221
1373 2221 -509 -3685 2879 -1222 -1720 1002 -1505 1650 -1684 -1428 3805 -3096 -487 2907 -2144
1388 -2144 901 -357 375 2166 -3372 2423 2376 -3578 2763 939 -680 1516 -1184 3220 -130 -2452
1404b452P360n750o89M759l844K019j951O19L850p353M077L239o948M049l7j267
1420c19J443l857N471j787n426P881l237k791L838k420K596k995p78O512p475
1435c344J145N594o077K202k16j8K456o169N334J482p621O648m91l165K711k851
1451b380M636k517m083Q495n164k145O181m292J455q10n78N299p496K549N486
1466D636p895L850J222k769K756m002M490M92p423P943j221m700N221l029J716
1481A287n31k823O812n767j677P582o093P82J943k470L647m916K274L939q067
1496d078M761K124n227L475k120J616Q22n245O418k034m535O476k934q03J415
1511A31k078M068l848q54N825n859J019L380l567J994j771J270K195n443M014
$$ plain form
1404 -2452 4908 -842 -1531 3228 -616 1403 -548 71 3921 -3432 645 3884 -3064 985 948 -319
1420 -319 1124 -2733 2738 951 -4475 3406 169 -2622 1216 -1204 1392 -1603 -2381 4131 -3344
1435 -3344 -2199 3395 -2682 -480 -696 -714 1742 -4427 907 2389 -5232 1416 925 -2240 471 -2380
1451 -2380 2256 -261 -4344 4151 -1013 -3158 3023 -1269 186 -624 -1202 4097 -3399 -850 4636
1466 4636 -3259 591 1813 -956 1800 -2202 2288 2780 -4643 3300 2079 -2621 2600 -429 1287
1481 1287 756 -2067 4745 -1022 -2699 4883 -1210 -428 1515 -955 2692 -2224 50 3989 -4078
1496 -4078 683 2807 -2420 1055 -1065 551 1373 -3872 2546 512 -4023 2453 -481 -1284 131
1511 131 -1947 2121 -1727 -2581 3244 -2615 -1596 1784 -1783 211 -1560 -290 1905 -3538 476
1526D76J236m848L977p06p73J045k404L989j931k684N264k985q69K641j948J698
1542A178j868K32L404m677J651K404l418K033m94p8J116k969L207k1l616L718
1558A802j023j103J544j687J950j372j170L615l059l72K587k269J078o04l72J853
1574A398k861J549J265l170K087K7j059J162j692J611j36k171K875j297j145J992
1590D35j324O65k74q09K064j832K9J832k116R44L89q49J157j350Q41Q82k042J636
1608B78N2j115J307q79M93K10j029J578o86p15J500r81K11M45p73J015p96M5R72
1627A132j220N40M57q50O54l40M0M45r95P79q1o29P37m04j22L38n88N25k20m43
1647b45P33o45QM22n83L25k00r9L56n85K43K11n64L93j76j58L13l57K27O2l37
$$ plain form
1526 476 1712 -3136 841 135 -638 407 -1997 1992 61 -2623 2641 -344 -1213 1428 -520 1178
1542 1178 -690 -458 2946 -1731 -80 2324 -1094 939 445 367 1483 -1486 1721 1700 -1916 1802
1558 1802 779 -324 1220 -467 1483 111 -1059 2556 -503 -875 1712 -557 521 -83 -455 1398
1574 1398 -1463 86 1351 -1819 268 295 -764 398 -1294 317 181 -1990 885 -412 -1557 435
1590 435 -889 -224 -498 -1307 757 -1075 -1046 786 -1330 -386 3 -846 311 -1039 -198 684 -1358 278
1608 278 330 -785 522 -357 136 346 -683 895 209 -506 994 13 224 669 -104 911 115 160 1132
1627 1132 -88 452 909 59 713 373 413 858 -137 642 561 -68 669 265 143 481 -107 418 198 -245
1647 -245 488 -157 -149 273 -310 15 -185 -284 72 -513 -270 -59 -623 -230 -406 -564 -251 -608 -381 -319 -656
1668f56L37j25j37L62l32J73N0j87M23k92J2K47k18K14O4j69K03nk6J76j71K79
1690B22m7j13K30j29J15J07j45J61l8r9K70k46K18l9j61K10j00j8Q4j58J06Ok16
1713B20K89l12O7J07k77K24k15l4J73l07R3Q1k91K07j24n9J23l89L41p2l42L55
1735a42k09l1J42l17L11j88k12O10n80J71K92l60K60k01RL58n78L83L29o56N74
1756c5j54n0L51n76P67k32n51R30m54j25N81m96M75k73k16R52j010K98O45q60
1776c3N26j21q6M93r47P66K68j222J105l11l56N44o74P40m65o61J468j031l48
1795c45J042r18M67l01k36J007j504N86R03j548P54P8l91M86j010R96P2j575J824
1814C87m87r05J031o01N16l55o27J745j474j88J647j470M27J41k04Q56j497R65
$$ plain form
1668 -656 -319 -444 -581 -219 -551 -378 -328 -515 -92 -384 -372 -125 -343 -129 -65 -234 -31 -36 -62 114 -57 222
1690 222 175 62 292 163 278 385 240 401 363 264 534 288 506 467 306 516 416 398 482 324 430 436 220
1713 220 509 197 264 371 94 318 103 69 242 -65 28 109 -182 25 -99 -158 -35 -424 -83 -155 -497 -142
1735 -142 -351 -382 -240 -557 -246 -434 -646 -36 -616 -445 -153 -513 -253 -454 -445 -87 -665 -282 47 -609 -35
1756 -35 -189 -239 112 -464 303 71 -480 450 -4 -129 452 -44 431 158 -58 894 -116 182 827 -33
1776 -33 493 372 286 779 -168 598 866 -356 749 438 82 626 -48 692 227 -434 1034 3 -345
1795 -345 697 -221 246 -55 -291 716 -788 -202 701 -847 -93 -15 -406 80 -930 66 138 -1437 387
1814 387 -100 -1005 26 -575 -59 -414 -1041 704 -770 -958 689 -781 -354 -213 -417 439 -1058 -93
1832i3R88k186J502K77j094Q75o68J007k71j435K332r06j154J814r72K10N4m36
1850a56J660k045K33K117k314O46Q18r41Q20j274J090O27k554K212J11j943J559
1867F66n49L48j82j243K431j675j066K730j817k55Q92o96J202j853N51J873k899
1884a542J198J214j908J011n88N83L92k196K451k16k266K400o05o84O97q46J775
1901H70j580o88K871k272j74J734j266O95p89N30J255k730J665J266k628J605
1917C64Ql64M95j306J997o75j922K909j035j152J477p71Q47r46l14K263k484K75
1935c34J986k010M55L33k35P32j870J450P21k491J867J85j381Q15n81R95o08j327
1953a298K417j206j070J978j156k3J0o2J162j902M80J637k089O73P01q14M03o63
$$ plain form
1832 -93 895 -1291 211 488 -606 269 -399 608 337 -1098 1234 328 -826 988 16 226 280 -156
1850 -156 1504 -541 -308 1809 -505 141 959 18 838 -436 654 1281 -1273 939 1050 -893 666
1867 666 117 465 283 -960 1471 -204 -1270 1460 -357 -612 280 -416 786 -1067 -516 1357 -1542
1884 -1542 -344 870 -1038 -27 -615 -32 360 -1836 615 399 -1867 533 -72 -756 -59 -905 870
1901 870 -710 -1398 1473 -799 -973 761 -505 190 -599 -69 1186 -1544 121 1387 -1241 364
1917 364 372 8 503 -803 1194 519 -1403 1506 471 -681 796 25 872 -74 -388 1875 -609 -334
1935 -334 1652 -358 97 430 195 927 -943 507 1228 -1263 604 789 -592 223 -358 637 29 -1298
1953 -1298 1119 -87 -1157 821 -335 -358 -348 -410 752 -1150 -670 967 -1122 -449 252 -562 -159 -822
1971h22J074M5j816J861o2j267J109l77J09n0m79J542j389k65J736j225k1M32
1989A35k44N84r45O28P55j668R58O23j032N10k95N28r1r30J465n83q59J308m73
2008C74k38J58k69Q54j062J20J074j272L11N79o86L39n01M86K88j242R32J04r96
2027f47Q76l02q7J41n30Q63m68o15J175p87j34M82m41M21m40R7O54r64L32N14
2047A40o94L71k3m4K19n53O04J08p43P29j30l00L70k46L10j46k79P12m17j35N38
2068C91l55J53k3o2K97m11K27K98n72L13J44k94J71j34J47M8k92L85j37k30K84
2089C48j65J2j7n7J37k68N9K15l41J23P2j88J27j32L3P0k26J25Rj64J24o8n8N3
2113a77r4J08m8j44K02j25m9J21n7M9p7L3J20j11M6P4k3L0%j3J23j10P1M6n7J00
$$ plain form
1971 -822 252 297 -1519 342 280 -987 122 -255 -146 -196 -675 867 -522 -787 949 -276 -297 135
1989 135 -109 475 -470 158 913 -755 203 826 -206 304 9 537 446 -484 981 398 -461 847 374
2008 374 136 294 25 879 -183 -63 1011 -261 50 629 -57 282 -219 267 555 -687 245 349 -647
2027 -647 229 -73 -160 -19 -549 314 -154 -769 406 -381 -515 -33 -474 -53 -493 -396 258 -706 -374 140
2047 140 -554 -183 -206 -250 -31 -584 20 128 -615 114 -16 -316 54 -192 118 -28 -307 405 -12 -147 391
2068 391 36 189 166 104 401 -10 217 515 -57 256 400 106 277 143 290 338 46 431 294 64 348
2089 348 183 195 178 121 258 -10 49 264 -77 46 118 -70 57 -75 -42 28 -198 -73 -64 -228 -104 -172 -230 -177
2113 -177 -271 -163 -211 -355 -153 -278 -327 -206 -263 -214 -291 -258 -138 -249 -203 -129 -152 -122 -122 -135 -12 -122 -51 -5 -62 38
2139C8j0k6J09p7J25l0lL2l8P3P2j10P6J4m0Q8j09N8k5o5J05m6m3O2j03L9lj8
2167A45K4m1k2K8j23N9Mn6L7j39O4J0q7L8j9q7M4j2q2N6n7M1n2j4P4j34O3P0p4
2196b42K8m3Q7m1q2J16L5q1J00Ol9N5o1J34n0k2J91q0m2R0l3J23n4j3J53j83P1
2223A23J24r3R1nm3P1j57J92n3j88K39p9m8no4J67j01j04K27k20q3K21j52L8j01
2248cK0J48l07J56P4k69Q5O9j00P9j41J43j20j92L12j15r7J17n6L1j44LL23l79
2272c63Q6K35j83NJ01m2R8k71K14J84m17L20R9j89P6m8K10j19j40M28k01k49L80
2295B14l4n2p3P1J86l13R7L80m39N3K47j31p4n3K59l3m27M13Q0m14K23L2mj81
2319B7o1L10l00j89M64j97k49J94Q1l9k41J89J84n42K00K51k83KP1R1j17k42M04
$$ plain form
2139 38 28 2 111 34 159 129 126 158 120 193 265 155 231 245 205 293 184 242 217 152 257 211 168 230 127 166 163 145
2167 145 169 128 106 134 11 70 74 18 55 -84 -20 -10 -97 -59 -78 -165 -121 -133 -215 -159 -216 -175 -227 -241 -167 -301 -238 -168 -242
2196 -242 -214 -257 -170 -211 -293 -177 -142 -223 -123 -117 -156 -101 -162 -28 -78 -100 91 11 -31 59 26 149 95 82 235 52 123
2223 123 247 154 245 240 197 268 111 303 250 62 301 222 174 169 105 272 171 67 294 74 -9 212 60 98 -3
2248 -3 17 165 -142 14 88 -181 -96 -27 -127 -48 -189 -46 -166 -358 -46 -161 -258 -141 -197 -166 -310 -307 16 -363
2272 -363 -277 -42 -225 -220 -119 -161 -63 -334 -120 64 -353 -33 66 -123 -47 -95 115 -4 -144 284 83 -166 214
2295 214 180 128 55 126 312 -1 96 476 37 90 337 206 132 79 338 305 -122 291 371 -43 180 212 208 27
2319 27 -34 276 -24 -213 251 54 -195 -1 80 41 -200 -11 173 -369 -169 82 -201 -199 -128 -37 -154 -396 8
2342Hp2m32M47N8l20O1J12J52l28K0M32l55r8L74j16j46J9J98O8l89L28J97m13
2365a95J30K14k7k11J22K51j79k09M39j06l12K70J02o5k59J41K95m30P3L22k26
2386A40r4J23J31j38k09K80K3l96K41J47k57j2J04R0j79j91L65k00k28K88k9j81
2408a82R3Q7l6l05J79K76l56j7K44j40p7m4K12o3k19K57J11l06J69J29j22o6J0
2431a66J99j60q5K85n6k20K45J8j20k2J48P7k30K1M08k89n2K28k3j35J43N1oj88
2455G1N8J40o1Pl0P1m7j1m0J01l01L27p3k24Q4R8o1j20N8R6k52L6K06j51p6Q5
2481ik0j62o5K42L3l35L51N1l16R1J02p1n0j35K02p2j19L24j34r5J0J31q0m4P4
2506i6P4q1k6J25m9L1O8q1Q4j32K05J21l59K28k60J17N48k37j76J33n32N31J07
$$ plain form
2342 8 -64 -496 -49 9 -311 -250 -138 14 -314 -294 138 -217 -315 59 -57 -203 -184 14 82 -307 21 218 -195
2365 -195 -65 149 122 -89 33 284 105 -104 335 229 -83 187 289 224 -35 106 401 -29 44 366 140
2386 140 46 169 300 162 -47 233 256 -140 101 248 -9 -21 83 173 -6 -197 168 -32 -260 28 -1 -182
2408 -182 -89 -2 -38 -343 -164 112 -244 -261 -17 -157 -234 -278 -66 -129 -348 -91 20 -286 -117 12 -110 -176 -166
2431 -166 33 -127 -212 73 17 -203 42 60 -60 -82 66 143 -87 -66 342 53 1 229 206 71 214 265 259 71
2455 71 129 269 208 215 185 256 209 198 158 259 -42 285 212 -12 72 170 109 -11 47 143 -109 -73 133 -18 -94 -9
2481 -9 -29 -191 -256 -14 19 -316 35 86 -230 -139 -37 -108 -158 -293 -91 -163 -282 42 -92 -187 -177 -46 -126 -170 -96
2506 -96 -22 -103 -129 -4 -53 -22 46 -35 49 -83 122 243 -116 112 -148 -31 517 280 104 237 -295 236 343
2529C43k11J0j1lO3p1j3k6Q2L2r8M8Rn4k5K2L2n6o3M5lj51J08p8Q6n4m5Q5r6l7
2559a30R1n5m9O0n3Q0k4m1Oo1Q8n6j8N1p2O4qj5QJmN7J3k6O3j07J47l6mL3k3J7
2591cO1n1J9K7J4J3k7M0Mk1jM6nk2J11l5k7o3Q3rp3J00r8N0j0n5O3l1j3J6r0L7
2623E0K0j03N5%m6P1j46O2L4p5%J5j0K4j10L5J3l5N7n6qM4k3N5l7k6N0pMJ7p0
2654a46P5pn2R9o0K4L2l9P8J2j0M5r3P1j0jJ00j18R1K9p3O3j7m5J37r8j1P9n1
2683A04M9l3m0P3j34O9K9p3J07o4L5k5q3J21p5J1l1j01R2L6j86J36k9m0L4n0M0
2710b8o3m9J91j56m1J43k04J35J5j03J19j06M6Q7j70J05Mj51K45k13J11L5q6J58
2734B4r5o5K30j35j0P5r1J51j31j2J91j60J44N2j44J46j34O7M9j61J63l9j24K07
$$ plain form
2529 343 132 142 131 128 191 120 107 81 163 195 97 145 154 100 75 97 129 73 10 55 52 -99 9 -69 17 -37 -82 3 -93 -130
2559 -130 -39 -94 -143 -83 -136 -56 -80 -121 -115 -176 -88 -144 -162 -111 -183 -119 -127 -142 -134 -133 -137 -80 -67 -93 -30 -137 10 -26 -30 3 -20 -3
2591 -3 58 7 26 53 67 80 53 93 97 76 75 121 116 94 205 170 143 80 163 154 81 181 83 133 123 68 131 100 87 103 13 50
2623 50 70 -33 22 22 -24 47 -99 -37 -3 -78 -78 -63 -73 -49 -159 -124 -111 -146 -89 -145 -153 -109 -132 -77 -114 -140 -90 -97 -93 -76 -146
2654 -146 -71 -78 -130 -31 -91 -67 -35 -74 4 16 6 51 -42 29 19 18 118 0 91 120 47 110 93 48 185 87 76 155 104
2683 104 153 120 80 153 19 88 117 44 151 87 122 97 14 135 60 71 40 -61 31 67 -119 17 -12 -52 -18 -68 -28
2710 -28 -91 -140 51 -105 -146 -3 -207 -72 -57 -160 -41 -147 -101 -14 -184 -79 -75 -226 19 -194 -83 -48 -134 24
2734 24 -71 -136 94 -41 -51 24 -67 84 -47 -59 132 -28 116 168 24 170 36 103 152 -9 154 115 -9 198
2758A98j33N5J26k16J86j23p2K51k63Q8O2k51K15r0p0J97k45J26M8j96K50k03
2780f0m3J60k28K51p8k67L18j83pJ81l05K51q4j41K58j97K3J70j94J65q7l5K06
2803G4k60J44R1l61M12j58j01K55k39J96K1k18L06k46LK82k65J71j4j23K68k56
2825a8J13J32k97K74j02j41K40j71R9M3k19K55j44m2K48l08J47Pj76K70k33RK23
2848B09k98K37j58j05K55k26J26K4l15L21j48j13L22l40J53N8j94L18k89qK62
2869I1l57K72o4j76L36k81O3K40m11L53j08k34L65k48R7J80l98L98j57j00L78
2890B39m01J12K05l32L94j92j60L95m05K46J17m01L75j28o0L76m63K21J13l51
2910a00M19k66p5L62m09K09Nk76L79k17p0K88m31K35J1k07L00k84O4K58l65K53
$$ plain form
2758 198 65 120 246 30 216 93 21 272 9 97 159 -92 123 33 -37 160 -85 41 89 -107 143 -60
2780 -60 -103 57 -171 80 2 -265 53 -130 -137 44 -261 -10 -94 -235 23 -174 -151 19 -175 -10 -97 -132 74
2803 74 -186 -42 49 -312 100 -58 -159 96 -143 53 74 -144 162 -84 -81 201 -64 107 93 -30 238 -18
2825 -18 95 227 -70 204 102 -39 201 30 129 172 -47 208 64 22 270 -38 109 116 -60 210 -23 -14 209
2848 209 -89 148 -10 -115 140 -86 40 64 -251 70 -78 -191 131 -209 -56 2 -192 126 -163 -171 91
2869 91 -266 6 -58 -234 102 -179 -116 124 -287 66 -42 -276 89 -159 -62 118 -280 118 -39 -139 239
2890 239 -162 -50 155 -177 217 25 -135 260 -145 101 218 -183 192 64 4 380 -83 138 251 -100
2910 -100 319 53 -22 340 -69 140 145 -131 248 31 -39 249 -182 53 64 -143 157 -127 -63 195 -170 83
2932H3o7k25L25k50P7J01l22L27r5j69L24l31J69O5k19K82j72j34L07k40J21j8
2954f1j27K52j55J9J42j90J69k3j65J93j44P0R6j99K22j41nK15k18P4N1j21J91
2977A45r4o0J68j53J54mj53J50r3rJ33k32J56m1q7K07k36M6J47k08J59q0j10J87
3001I2j34N6j3j34K13j40j4J34k13J11N3j99J52o5RJ50k63J98j1j65J31r8MJ77
3025C1j86J78j11n2K11j69j8K14j80K68j84j55J55j61O9J65j69J90j34k82J58
3046a62J11l95J41P5K83o9j53M62k06k8Kj23J34J2n4J26j01R2q2m1Q3n5QQ6j68
3071b2R7k9Npk4j3Ok6K2m7m4Q8r2P6L0j69J12j3l7M5k2rj9j6N9l3j2L2n1Q0k9
3102f2j9Rk5k6J19j05P1O0k8P5q4K5nPJ3J2l9M4l8j8P0l5M5k0n0R4r1R0m3KN0
$$ plain form
2932 83 16 -209 116 -134 -57 44 -278 49 -46 -215 109 -222 -53 12 -207 75 -97 -231 76 -164 -43 -61
2954 -61 -188 64 -91 -72 70 -120 49 26 -139 54 -90 -20 76 -123 99 -42 -47 168 -50 24 75 -46 145
2977 145 51 -9 159 6 160 156 3 153 60 51 184 -48 108 67 -20 187 -49 -3 144 -64 95 15 -95 92
3001 92 -42 14 1 -133 80 -60 -74 60 -153 -42 11 -188 -36 -101 -92 58 -205 -7 -18 -183 -52 -150 -146 31
3025 31 -155 23 -88 -140 71 -98 -116 98 -82 186 2 -153 2 -159 -90 75 -94 96 -38 -320 -162
3046 -162 -51 -446 -305 -230 53 -16 -169 293 87 59 61 -62 72 84 30 156 55 147 65 24 107 52 60 146 -22
3071 -22 75 46 51 44 20 7 13 -13 9 -38 -82 6 -86 -10 20 -149 -37 -50 -87 -42 -64 -73 -92 -108 -49 -82 -94 -62 -113 -33 -62
3102 -62 -81 -72 -97 -123 -4 -109 -38 22 -6 69 -15 10 5 12 25 37 -2 42 4 -14 56 21 66 46 -4 90 -1 89 46 48 98
3133I8o2M5Q2j72J27l0q5J10j37R3O0j33J09o7j15J69j50J10no0P3r6J7J2m1O1
3159A3lj58K17j13PM4j82J57p8kO0n7L1N4j21J25p4j0J64k24J84m2j52J91j26
3184i5L3R9j47J19K7j16J74j36L3O6j22J55l5p1J75j27K2J06j91J88r0j5R7k21
3208g2J50P2j92J40n0j0J74k42J39K2k22K79j68jJ33k48K32q9j95K92k37J13P1
3231I1j92J27r4NJ79k70J32J07k58K72k16J0J70k37J58j2k04L21k05J4Q6j20K12
3254G6j50n1K98l33O2K16k76K37o5p5J55k25K14M8k95K85j04l1J79k44K33r8j54
3277i8K94k62Q1J60k16K00j15j18L45l44J12J21k56K38l8j66K27k73J84P5l19
3298a68L53j84j45L02l07K41l5k83M51l32k6K75l75K19L5j67K88l23J42J65l96
$$ plain form
3133 98 36 81 163 -9 118 88 3 113 -24 69 129 -4 105 38 -77 92 -58 52 47 -13 60 -36 -19 -7 -48 13
3159 13 10 -148 69 -44 -37 7 -175 -18 -96 -98 -38 -95 -64 -10 -131 -6 -80 -90 74 -150 34 -8 -160 31 -95
3184 -95 -62 37 -110 9 36 -80 94 -42 -9 57 -65 90 55 -16 159 32 54 160 -31 157 67 52 149 -72
3208 -72 78 150 -42 98 48 38 212 -30 109 131 -91 188 20 19 152 -96 136 47 -148 144 -93 20 91
3231 91 -101 26 -68 -63 116 -154 -22 85 -173 99 -117 -107 63 -174 -16 -28 -232 89 -116 -102 -16 -136 76
3254 76 -74 -125 173 -160 -98 118 -158 79 14 -61 94 -131 83 131 -164 121 17 -14 165 -79 154 56 -98
3277 -98 196 -66 15 175 -41 159 44 -74 271 -73 39 160 -96 142 104 -62 165 -108 76 151 -168
3298 -168 185 1 -144 158 -149 92 57 -226 225 -107 -133 142 -233 -14 21 -146 142 -181 -39 126 -270
3319b70L14r9j16L18l02R6J14k84L95j97j95L51l08J27J06k32L30k34m3L41m09
3340a97K17J29k39K61k19J7K37l40K41N0l12L59k07L1J41l26L46j13j93L70k89
3361c6O1J62k36K40k28l7K97l07J14J42k86K39j04j68K65k25J57K9k82K81j03
3382b5J1J54k28P7l4j46L04k02o3K19j77Q0l6k5J11j58O5J16k35J88j4p6J16j33
3406a11J14O6k03K09j65OJ36j20J01k5j11J93j60R3J41k10M8P7j36J58j54J09
3428E6R1j98J48j24N1J09j03J55p6r8J76j73M8Q3j55M2O8j00P0j19N5O8j76J50
3452D8nj13J47j36K6M7r4J20m0j40J61q7lR9j48J09qn6J24j40K9P6j47J77j38
3477i2K4R7j51O2Q1j74J81r6J7J12j05J7Q0j12P9j1m9Q6n5K6J1p4J84j55N1O9
$$ plain form
3319 -270 44 -55 -171 147 -155 -59 55 -229 166 -31 -226 125 -183 -56 50 -182 148 -86 -129 212 -197
3340 -197 20 149 -90 171 -48 -31 206 -134 107 157 -155 204 -3 28 169 -157 189 76 -117 253 -36
3361 -36 25 187 -49 191 -37 -74 223 -84 30 172 -114 125 21 -147 118 -107 50 79 -203 78 -25
3382 -25 -14 140 -88 -11 -45 -191 113 -89 -152 67 -110 -30 -66 -91 20 -138 -73 43 -192 -4 -18 -94 22 -111
3406 -111 3 69 -134 75 -90 -84 52 -68 33 8 -103 90 -70 23 164 -46 2 79 -57 101 -53 56
3428 56 147 -51 97 -27 24 133 30 185 109 11 187 14 62 145 -10 32 100 0 70 -49 6 74 -102 48
3452 48 43 -70 77 -59 -33 14 -80 40 0 -140 21 -66 -69 30 -118 -9 -17 -73 51 -89 -60 16 -131 46 -92
3477 -92 -68 29 -122 -60 21 -153 28 -68 -51 61 -44 -27 53 -59 20 9 -40 46 -9 17 28 -46 138 -17 34 103
3503A03j01LN4l8J1k4l5J35j00M9K9m0P3q0JO7n0K5l2l5Q9j05M0M9j17M6M3o9
3531iJ2o4M2N0p4n7O2o9M8j49K57J07l49K11k37J29p9O2J34K6J32j85QO3J42k20
3557gJ3j41j33R6J53N4j58J63L5J83j87m6k8P6l3n2J07j18L8P5k10J56M1N8k7
3582A08m5OnL6Mj51J28K1j51J89j03N6r5Q5J9%j74R8%k1J0JL0m7M5L4j36J7P7
3611C6k21K36n3j27J27l1O5n2j1Q2k9j26J50k42K35N8j52L8k2m4M0o4J56P8k38
3636a11Q3L37j37k87L9j7L5K69n28J48m9J74J88k82j08J17L13j44P5Q6l25K34
3658A10k30r5L38l3j03K7R4m93O06n8j7j23R0p2M7N1j15r6P5j5r5n8K61q7K1n2
3684b2J48k33K87j75j55J00J5K2L9j18K33k24j4J69j49K8K7q5J04r4N8J60l10
$$ plain form
3503 103 2 5 59 21 32 8 -27 108 8 57 86 46 119 39 40 107 57 82 50 15 104 -1 39 88 -29 17 60 -9
3531 -9 3 -61 -19 31 -43 -100 -38 -107 -59 -208 49 156 -193 18 -219 -90 -169 -107 27 53 185 0 8 71 213 -7
3557 -7 6 -135 -268 -172 -19 35 -123 40 75 258 71 25 -3 73 40 -12 95 -23 15 90 -120 36 77 135 108
3582 108 63 69 64 100 104 -47 81 102 -49 140 37 93 -2 83 102 102 -72 26 26 5 15 16 46 -1 44 78 -58 -41 36
3611 36 -185 51 -2 -129 -2 -33 32 -20 -31 51 22 -104 46 -196 39 97 -55 -17 -39 -83 -43 -107 49 127 -111
3636 -111 -28 309 172 -115 -76 -93 -58 211 -317 -169 -218 -44 144 -138 -246 -129 184 40 115 201 -124 110
3658 110 -120 -215 123 90 -13 14 108 -385 221 163 146 23 113 41 88 139 24 -72 3 -12 -107 -165 96 9 30 -22
3684 -22 126 -107 180 5 -150 -50 -35 -13 26 -92 141 -83 -97 72 -77 -49 -22 -107 -3 -97 -39 121 -189
3707a89L11j02j20J35j27L9L89l22jk01J80J12q7j26j14J00K89k83k7J63j9O9
3729F9j97J91Q9o5m5Q5m48M34j16K4J58j82j34L92l12J64j89q8M11p3p4Q2l53
3752a77L11k25J53M8j92R4N4j37Q7j21P9O9j79J55j3j15J79j63M1J35j85J29Q
3775C5j50K19k10L3J30j67R6m0j8J10k45J30J46k03J97m7p9J06p5K7K6r8J02j3
3799A2l5J32j23O8p7L4R1j38L8O6q2O9J7p0R5j36O0O3j45J41m2o5P9j16J12Ln9
3826hQ7j12l3J03j47J42k1n9R8j02Q1j9j11J25k5r1J26j09K6N4j02J07l2q4J52
3851D6j32P0Rr2K27j71m7J22j18O6k2oJ09j78J13M2q9P5N1n0O5o0PL2j13J50j15
3878ilJ93k07J09q7OM0r3oJ21j41J19J09j60J11p6o3M1j75K88oj55R6r8j21L08
$$ plain form
3707 -189 122 20 -100 35 -92 -53 336 14 13 -188 -8 104 17 -109 -223 -123 166 -117 -144 19 0 69
3729 69 -128 63 152 87 42 127 -321 113 -3 21 179 -3 -137 255 -57 107 -82 -170 241 168 94 176 -177
3752 -177 134 -91 62 110 -82 12 66 -71 16 -105 -26 43 -136 19 6 -109 70 -93 -52 83 -102 27 35
3775 35 -115 104 -106 -73 57 -110 -14 -54 -72 38 -207 -77 69 -134 63 16 -63 43 -32 -5 21 -77 25 12
3799 12 -23 109 -14 54 -23 11 102 -36 2 68 -14 55 72 2 97 -39 21 84 -61 80 38 -27 52 -64 48 51 -8
3826 -8 79 -33 -66 37 -110 32 11 -48 50 -52 29 10 -101 24 -1 -92 34 -75 -49 5 -97 10 -22 -106 46
3851 46 -86 -16 -7 -99 128 -43 -90 32 -86 -20 -42 -48 61 -117 -4 38 -51 24 75 25 90 30 37 69 -44 106 -9
3878 -9 -12 181 -26 83 -4 2 42 -51 -57 64 -77 42 151 -9 102 26 -37 4 -171 117 111 -44 52 -46 -167 141
3904A41k88L69r7j29R5k26J80j96M11m48K15j41K15j82NJ75j50q0p1R1K90j83
3926dJJ28j69K6J22P8j50j94L00k88M3P4L4j26k2L56k11j77J72q5J86n3N5l4m3
3951A9p7j5P0L7K2j1o0J22p7KjK2L7k8p4P1Jqj5j4J8m1K2j0Nk4L8o0JM7p7Q1r
3984A4m8M7m9L6o6K3N9m3K9l2ok6J7K0K5l3L4l4%K6j4oJJ7K9n9J7J9m8J9N0l1
4016a3L8l8J7L9q1N1J9q7K3J4j6O0l8L4L4o2J50r5k5J5l6P1lj19P2j3N5j8o1M7
4046C4Jo2Q4n7K6l3m0O7j8l5P9q7L1j8k4K9j8l2N0m1L2K2r2J05p2M5L7o1QJ3m1
4077f8MJ8K0N3j16J23q2jJ0k9K6M2o1R2m8j1J8mK5M8r9R5l3J0M3r6Q9n3m2J03
4107G6j09R3jn1L7j3p3R0l5J5N4j25J10m4J9j7o9J08n4l3Q3j46Q9O2o4M5j20M3
$$ plain form
3904 141 -147 222 125 -4 91 -135 45 -151 260 -188 27 -114 101 -81 -76 99 -51 -131 -202 -111 179 -4
3926 -4 -3 125 -44 -18 104 182 32 -162 138 -150 -107 -33 1 -125 -147 209 -2 -179 -7 -92 94 41 96 62 19
3951 19 -58 -73 -3 34 56 45 -15 107 30 32 31 53 90 62 -12 59 60 52 37 23 41 0 22 12 17 -7 31 -29 -28 19 -58 23 14
3984 14 -34 13 -36 0 -66 -43 16 -27 2 -30 -36 -62 -45 -25 0 -33 1 -33 -33 -7 -21 -27 -26 -9 20 -39 -22 -3 -51 -32 18 -13
4016 -13 25 -13 4 43 -38 13 32 -55 -32 -18 -34 26 -12 22 56 -6 144 49 24 39 3 74 71 -48 24 11 66 48 -13 34
4046 34 35 -27 57 0 26 -7 -47 20 2 -33 46 -41 -10 -28 -52 -23 -41 -73 -23 -64 -32 -10 -102 3 -69 -24 13 -48 -40 -27 -68
4077 -68 -64 -46 -26 27 -89 34 -48 -49 -39 -68 -42 0 -61 31 -17 -28 -10 -14 11 59 -40 55 22 32 75 -21 68 15 -27 76
4107 76 -33 60 59 8 45 32 -41 49 14 29 83 -42 68 24 43 26 -43 65 11 -22 61 -85 4 66 2 47 -73 -30
4135c0O7r6K9R2j02R8n7j9O1j11N3L1p0K6rm0J19j39J25j0j14J41o0l8O8j22J85
4162G8r0j1R8j33L5R1j17P1n5J6J58j31K6L6o2N6r3K0P1m8P2q8n6J87j05oJ8r8
4190f0J22o4mJ14p5L4%q6Q6p8N8M4r9O6n2p0J40n5o7J00r1J1Qp4P4k6nQ1j07P2
4220ck3K6l2j1K3L0j15J66j31QJ13q9J3N3r3RO5pN7j14M3LJ9L6p3L3L9o0L0Qm9
$$ plain form
4135 -30 37 -59 -30 62 -40 58 1 -18 43 -68 -15 16 -54 -28 -37 -77 42 -97 28 18 -96 45 -15 -53 15 -107 78
4162 78 -12 -23 75 -58 -23 68 -49 22 -33 -17 141 10 36 72 10 66 -27 -7 64 16 88 0 -56 131 26 20 38 -60
4190 -60 62 -2 -6 108 33 67 67 -19 67 -11 47 91 -8 58 6 -64 76 21 -46 54 -37 -26 -18 -92 -18 -44 -49 32 -75 -3
4220 -3 -26 0 -32 -43 -20 10 -105 61 -70 -62 51 -38 -25 28 -65 -56 9 2 59 -55 -12 -9 10 46 -27 6 45 -15 15 23 -26
$$ [...]
8191E
##END NTUPLES=NMR FID
##END=
