##TITLE=1H_Ser-7-2-4
 CDCl3, 8 sc, 
 1.10.2020
##JCAMPDX= 6.0         $$ Bruker NMR JCAMP-DX V2.0
##DATA TYPE= NMR FID
##DATA CLASS= NTUPLES
##ORIGIN= UXNMR, Bruker Analytische Messtechnik GmbH
##OWNER= root
$$ XWIN-NMR		Version 3.5
$$ Thu Oct  1 12:44:36 2020 Russian Standard Time (UT+4h)  she@DPX200
##.OBSERVE FREQUENCY= 200.1315066352
##.OBSERVE NUCLEUS= ^1H
##.DELAY= (6, 6)
##.ACQUISITION MODE= SIMULTANEOUS
##.ACQUISITION SCHEME= undefined
##.AVERAGES= 8
##.DIGITISER RES= 18
##SPECTROMETER/DATA SYSTEM= spect
##.PULSE SEQUENCE= zg30
##.SOLVENT NAME= CDCl3
##.SHIFT REFERENCE= (INTERNAL, CDCl3, 0, 15.7039)
##AUDIT TRAIL= $$ (NUMBER, WHEN, WHO, WHERE, WHAT)
$$ ##TITLE= Audit trail, XWIN-NMR		Version 3.5
$$ ##JCAMPDX= 5.01
$$ ##ORIGIN= Bruker BioSpin GmbH
$$ ##OWNER= she
$$ F:/spectra/data/she/nmr/H-F/1/audita.txt
$$ ##AUDIT TRAIL=  $$ (NUMBER, WHEN, WHO, WHERE, WHAT)
(   1,<2020-10-01 12:43:39.18 +0400>,<she>,<DPX200>,
      <created by zg, POWCHK disabled, PULCHK disabled
       configuration hash MD5:
       00 E9 B6 7A A2 85 ED C7 34 08 36 98 17 FE 4E 26
       data hash MD5: 16K
       6A 6C 41 E3 DC F4 02 91 DE AC EA 77 5B C5 DC E9>)
$$ ##END=
$$ 
$$ hash MD5
$$ E6 D6 5B 90 73 95 F6 57 66 DD E3 F2 93 8A 29 F3
##$RELAX= 
##$RELAX= 
##$RELAX= 
##$RELAX= 
##$RELAX= 
##$RELAX= 
$$ Bruker specific parameters
$$ --------------------------
##$DU= <F:/spectra>
##$EXPNO= 1
##$NAME= <H-F>
##$PROCNO= 1
##$TYPE= <nmr>
##$USER= <she>
##$AMP= (0..31)
100 100 100 100 100 100 100 100 100 100 100 100 100 100 100 100 100 100 
100 100 100 100 100 100 100 100 100 100 100 100 100 100 
##$AQSEQ= 0
##$AQ_mod= 1
##$AUNM= <au_zg>
##$AUTOPOS= <>
##$BF1= 200.13
##$BF2= 200.13
##$BF3= 200.13
##$BF4= 200.13
##$BF5= 200.13
##$BF6= 200.13
##$BF7= 200.13
##$BF8= 200.13
##$BYTORDA= 1
##$CFDGTYP= 0
##$CFRGTYP= 5
##$CHEMSTR= <none>
##$CNST= (0..31)
1 1 145 1 1 1 1 1 1 1 1 1 1 1 1 1 1 1 1 1 1 1 1 1 1 1 1 1 1 1 1 1 
##$CPDPRG= <>
##$CPDPRG1= <>
##$CPDPRG2= <>
##$CPDPRG3= <>
##$CPDPRG4= <mlev>
##$CPDPRG5= <mlev>
##$CPDPRG6= <mlev>
##$CPDPRG7= <mlev>
##$CPDPRG8= <mlev>
##$CPDPRGB= <>
##$CPDPRGT= <>
##$D= (0..31)
0 1.2 0 0 0 0 0 0 0 0.06 0 0.03 0 0 0 0 0.0002 0 0 0 0 0 0 0 0 0 0 0 0 
0 0 0 
##$DATE= 1601541818
##$DBL= (0..7)
120 120 120 120 120 120 120 120 
##$DBP= (0..7)
150 150 150 150 150 150 150 150 
##$DBP07= 0
##$DBPNAM0= <>
##$DBPNAM1= <>
##$DBPNAM2= <>
##$DBPNAM3= <>
##$DBPNAM4= <>
##$DBPNAM5= <>
##$DBPNAM6= <>
##$DBPNAM7= <>
##$DBPOAL= (0..7)
0.5 0.5 0.5 0.5 0.5 0.5 0.5 0.5 
##$DBPOFFS= (0..7)
0 0 0 0 0 0 0 0 
##$DE= 6
##$DECBNUC= <off>
##$DECIM= 32
##$DECNUC= <off>
##$DECSTAT= 4
##$DIGMOD= 1
##$DIGTYP= 9
##$DL= (0..7)
0 120 120 120 120 120 120 120 
##$DP= (0..7)
150 150 150 150 150 150 150 150 
##$DP07= 0
##$DPNAME0= <>
##$DPNAME1= <>
##$DPNAME2= <>
##$DPNAME3= <>
##$DPNAME4= <>
##$DPNAME5= <>
##$DPNAME6= <>
##$DPNAME7= <>
##$DPOAL= (0..7)
0.5 0.5 0.5 0.5 0.5 0.5 0.5 0.5 
##$DPOFFS= (0..7)
0 0 0 0 0 0 0 0 
##$DQDMODE= 0
##$DR= 18
##$DS= 0
##$DSLIST= <SSSSSSSSSSSSSSS>
$$ [...]
##$SUBNAM2= <"">
##$SUBNAM3= <"">
##$SUBNAM4= <"">
##$SUBNAM5= <"">
##$SUBNAM6= <"">
##$SUBNAM7= <"">
##$SUBNAM8= <"">
##$SUBNAM9= <"">
##$SW= 16.880792210976
##$SWIBOX= (0..15)
0 0 2 0 0 0 0 0 0 0 0 0 0 0 0 0 
##$SW_h= 3378.37837837838
##$TD= 16384
##$TD0= 1
##$TE= 0
##$TE2= 300
##$TE3= 300
##$TEG= 300
##$TL= (0..7)
0 120 120 120 120 120 120 120 
##$TP= (0..7)
150 150 150 150 150 150 150 150 
##$TP07= 0
##$TPNAME0= <>
##$TPNAME1= <>
##$TPNAME2= <>
##$TPNAME3= <>
##$TPNAME4= <>
##$TPNAME5= <>
##$TPNAME6= <>
##$TPNAME7= <>
##$TPOAL= (0..7)
0.5 0.5 0.5 0.5 0.5 0.5 0.5 0.5 
##$TPOFFS= (0..7)
0 0 0 0 0 0 0 0 
##$TUNHIN= 0
##$TUNHOUT= 0
##$TUNXOUT= 0
##$USERA1= <user>
##$USERA2= <user>
##$USERA3= <user>
##$USERA4= <user>
##$USERA5= <user>
##$V9= 5
##$VALIST= <valist>
##$VCLIST= <CCCCCCCCCCCCCCC>
##$VD= 0
##$VDLIST= <DDDDDDDDDDDDDDD>
##$VPLIST= <PPPPPPPPPPPPPPP>
##$VTLIST= <TTTTTTTTTTTTTTT>
##$WBST= 1024
##$WBSW= 4
##$XGAIN= (0..3)
0 0 0 0 
##$XL= 0
##$YL= 0
##$YMAX_a= 143338
##$YMIN_a= -127849
##$ZGOPTNS= <>
##$ZL1= 120
##$ZL2= 120
##$ZL3= 120
##$ZL4= 120
##$ABSF1= 10
##$ABSF2= 0
##$ABSG= 5
##$ABSL= 3
##$ALPHA= 0
##$AQORDER= 0
##$ASSFAC= 0
##$ASSFACI= 0
##$ASSFACX= 0
##$ASSWID= 0
##$AUNMP= <proc_1d>
##$AZFE= 0.1
##$AZFW= 0.1
##$BCFW= 1
##$BC_mod= 2
##$BYTORDP= 1
##$COROFFS= 0
##$CY= 11.3945322036743
##$DATMOD= 1
##$DC= 2
##$DFILT= <>
##$DTYPP= 0
##$F1P= 16.9975609425685
##$F2P= -3.02152046262296
##$FCOR= 0.5
##$FTSIZE= 0
##$FT_mod= 4
##$GAMMA= 1
##$GB= 0.15
##$INTBC= 1
##$INTSCL= 1
##$ISEN= 128
##$LB= 0.24
##$LEV0= 0
##$LPBIN= 0
##$MAXI= 10000
##$MC2= 0
##$MEAN= 0
##$ME_mod= 0
##$MI= 1.114404
##$NCOEF= 0
##$NC_proc= 0
##$NLEV= 6
##$NOISF1= 3.799351
##$NOISF2= 2.8
##$NSP= 1
##$NTH_PI= 0
##$NZP= 0
##$OFFSET= 15.70392
##$PC= 1
##$PHC0= -9963.925
##$PHC1= 10.00089
##$PH_mod= 1
##$PKNL= yes
##$PPARMOD= 0
##$PSCAL= 0
##$PSIGN= 0
##$REVERSE= no
##$SF= 200.130013532006
##$SI= 16384
##$SIGF1= 3
##$SIGF2= 2
##$SINO= 400
##$SIOLD= 16384
##$SREGLST= <1H.CDCl3>
##$SSB= 0
##$STSI= 0
##$STSR= 0
##$SW_p= 3612.71676300578
##$SYMM= 0
##$S_DEV= 0
##$TDeff= 0
##$TDoff= 0
##$TI= <>
##$TILT= no
##$TM1= 0
##$TM2= 0
##$TOPLEV= 0
##$USERP1= <user>
##$USERP2= <user>
##$USERP3= <user>
##$USERP4= <user>
##$USERP5= <user>
##$WDW= 1
##$XDIM= 8192
##$YMAX_p= 0
##$YMIN_p= 0
$$ End of Bruker specific parameters
$$ ---------------------------------
##NTUPLES= NMR FID
##VAR_NAME=  TIME,          FID/REAL,        FID/IMAG
##SYMBOL=    X,             R,               I
##VAR_TYPE=  INDEPENDENT,   DEPENDENT,       DEPENDENT
##VAR_FORM=  AFFN,          ASDF,            ASDF
##VAR_DIM=   8192,          8192,            8192
##UNITS=     SECONDS,       ARBITRARY UNITS, ARBITRARY UNITS
##FACTOR=    0.000296,      1,               1
##FIRST=     0,             0,               0
##LAST=      2.424536,      0,               0
##MIN=       0,             -127849,         0
##MAX=       2.424536,      143338,          0
$$ Real data points
##PAGE= N=1
##DATA TABLE= (X++(R..R)), XYDATA
0@%%%%%%%%%%%%%%Qj6J6j6J6k4L2l4M2n4O2p2Q7j01J16j33J53j76K01k28K58k91
36a54L30l72M16m67N21n79O44p17P96q82R76j076J187j307J440j588J748j926
54a010K121k339K586k864L179l540L962m460N057n790O712p912R546j1909J5691
69I030l5774J70082j88042m0925J61234j52621J12353k6214j14512J80892o3959
80A1544q7139J46015j05068K4975P1114j10788N7712L5011o7752L8742k7693O570
92f757O1296q5069K2266N9720q2975L7196Q010n5893P5091j5795o2653Q5396m6159
105f326k0477P7600j00187M4737P0231j29320O6156M2104r9415R3137l2574o1396
117e5730J25688r4782j7703R0415r0726N6247J1921r1403J11643l1166q2443J06724
$$ y = [0, 0, 0, 0, 0, 0, 0, 0, 0, 0, 0, 0, 0, 0, 0, 8, -8, 8, -8, 8, -16, 16, -18, 24, -30, 32, -40, 47, -54, 62, -71, 82, -94, 107, -121, 137, -154, 176, -196, 220, -247, 274, -305, 339, -378, 418, -464, 512, -564, 623, -684, 756, -832, 916, -1010, 1111, -1228, 1358, -1506, 1673, -1867, 2095, -2365, 2692, -3098, 3614, -4298, 5248, -6661, 9030, -26744, 143338, -44704, -85629, 75605, -77016, 35337, 9123, -105389, 75503, 11544, -75595, 70420, -34648, -9673, 61441, -49347, 8365, 43376, -24376, 14366, -13327, -6757, 54539, -30530, -8264, 51456, -31519, 5677, 13687, -42206, 32885, 17090, -45563, 39833, -6326, -26803, 50797, -49390, -4653, 65578, -63742, 2414, 44518, -54897, 38240, 5666, -55730, 69958, -24824, -42527, 47888, -42838, 13409, 25330, -66073, 45570, 14404, -68039, 38685]
129C8685n3753p267N4629p8770O4889K067p6909Q9544k4313n4059Q6255m9522
141h524k0497O5795n8741K5919K2918n7043N3631k928o1369O4510j0679m3218
153c0226O5509m3107j0359N5359n9408J3976L0242m9744M4876j0163m8446Q0011
165C8520m3663k8354P2312n7851J8713K4212o2627O2823o477n5045P8083m0966
177c20j8272O6351p5883K9338L7644o9240N1938n188m4446O4160l9247k2716O2061
190C6180n5428J4024K6453n6661M8181o22m9299M9180q435k7234L6716l5745J1918
203a0772L3906n5804L0078K1594m1815L0187n340k4384M5688k8313j3394M5638
215B7269m0272J3852J6563m1251M0359k626l9808M3943j5988j9814L9216l9967
$$ y = [38685, -15068, -22335, 32294, -46476, 18413, 20480, -56429, 33115, 8802, -45257, 40998, -8524, -29021, 36774, -21967, 3952, 26870, -30173, 23458, 20530, -40839, 23671, 12992, -30226, 35283, -7824, -18183, 37176, -22232, -8256, 21986, -27758, 17118, 6955, -41491, 38520, -5143, -33497, 38815, -19036, -323, 23889, -38738, 24085, 17608, -37437, 40646, -320, -18592, 47759, -28124, 1214, 38858, -30382, 21556, 16368, -28078, 36082, -3165, -25881, 36180, -19248, -5224, 21229, -35432, 12749, 12127, -37172, 12008, 3573, -23661, 13055, -22690, -10772, 23134, -32670, -2592, 19002, -22813, 7374, 2034, -22350, 23338, -4975, -18369, 27269, -13003, 849, 17412, -23839, 16520, 13894, -25914, 18029, 2041, -17773, 21443, -18524]
227a8524J6658K4431m9328L4128j10l2424M2363j9541j7654M4143l4700L867K5205
240A8514l9471L4494K38l3742L8896j1227j9238L2767k4976L953K7219m2436K2774
253G765J0409l3333L0157j0254j7051L2839k4909q450L0699l3330J3373J3876
265A1791l5558L2064n436k4761L1436j6642o980K9865l3210J0720K2600l6977
277b1088K6823j787k0264L3651k1073j0391L1874k6001L966J8813l2035K8310
289A0798k097k9299L3549j4663j0161K5206k5674O439K1902l5786J9497Q164k5072
302a7197K9361j6764r578L0756k4287j339K3688k4231J5722N842k8957L3288r444
315F860j7523K8292j8446J311J8032k9424J3715J5110l0452K2959n955j5409K8647
$$ y = [-18524, -1866, 22565, -26763, 7365, 7255, -25169, 17194, -2347, -20001, 24142, -10558, -6691, 18514, -20957, 13537, 13775, -19967, 18929, 7702, -11536, 21231, -3745, 208, 27427, -15009, 7765, 18174, -15159, 14998, 4744, -12307, 20532, -4377, -12827, 17872, -15458, -2085, 11791, -23767, 8297, 2861, -21900, 9536, -7106, -14086, 15779, -17431, -6711, 15889, -21088, 5735, 3948, -16316, 17335, -3738, -14129, 17745, -8256, -4290, 14523, -17512, 10798, 8701, -20598, 12951, -1712, -11873, 13333, -12341, -5902, 16000, -19786, -289, 7875, -17197, 12164, -4600, -14178, 16578, -7709, -9048, 14640, -9591, 6131, 11973, -16984, 16304, 6860, -10663, 17629, -817, 494, 18526, -10898, 2817, 17927, -12525, 10434, 4479, -10930, 17717]
328A7717k5731k145K6337k5836O396J2320k6834K5554m660k4531L5571j7645p286
341a0773K3556k6082J1330J6352l0968K0980N211k3948K8858j8847o390L0355
353A9634k8557M014J7007k3763J5812M98k3853L1958j3079j6912K7869k1333M331
366f374J3504k5258J8014P686k7199K4297m800j5886K9967k2712p13K5465k5605
379i614Q479J2653k4093K3843j676k5377L5390j6573j1506K8618k7448R300J7231
392A9227l2312K0631M675k7584L1619j7956j1311L5675l4836N930K1100k9899
404a5041K0275L38k4050L3792j6157j5319L3560k7353Q083J6773l0740K2607M726
417A1494k6080K4492n899j4125K5994k2019P05K0896k7285J1940R651k3555J8757
$$ y = [17717, -8014, -10159, 16178, -9658, -3262, 9058, -17776, 7778, 3118, -21413, 14158, -3487, -10773, 12783, -13299, -1969, 14383, -16585, 4395, 9606, -14342, 14516, -4331, -10721, 19634, -8923, -4909, 12098, -11665, 4147, 4645, -19208, 12750, -329, -17241, 10628, -10705, -6374, 7130, -18128, -114, 7572, -19627, 4670, -130, -16016, 13951, -8761, -9474, 15991, -9614, -1135, 11518, -12575, 11268, 9592, -15785, 19605, 3032, -8474, 20144, -7304, 1996, 19227, -13085, 7546, 12221, -15363, 16256, -1700, -13011, 22664, -12172, -6242, 14858, -15041, 5234, 5572, -18478, 15314, -843, -16162, 17398, -9955, -1872, 14901, -15839, 6768, 11494, -14586, 9906, 4007, -10118, 15876, -6143, -5438, 15458, -11827, 113, 9764, -13791, 4966]
430D966Q86k3511K5930q350j3133K3992k2600P460J7109l1303J8629J1753l0146
443a8318K7334n287j9700L5228k5970M4K5507l1676K0565N966l1970L6414r174
456H963k6325L8642k2945k669K2605l2244K2061M709k9159K9241q662j8057L1431
469A7591k2542n061K5941k4804R417O784j7950J9520n328j6157K5089j0316j2209
482a0025K4616j8191O97J7706k2932R389J0998k0511J5414l488j6286L0977k2210
495c846r540L2691k9682N781J5763k8490K2539j31k4741L2593j9695o969L0908
508A7181l6501J6131J8201l5589K3747J884j8971K5875j9180r49K5943l1599J3562
521b65J2163k6773K3255k363j7776K0851p213p921J4426j5166P858Q778k1856
$$ y = [4966, 5852, -17659, 8271, -79, -13212, 10780, -11820, -4360, 12749, -18554, 75, 11828, -18318, 9016, 3729, -15971, 19257, -6713, -6669, 18838, -12838, 7727, 13693, -18277, 18137, 8963, -17362, 21280, -1665, -4334, 18271, -13973, 8088, 12797, -16362, 12879, 4217, -13840, 17591, -4951, -10012, 15929, -8875, 542, 7326, -10624, 8896, 3568, -12589, 12500, 2184, -10025, 14591, -3600, -2903, 14803, -8129, 1260, 12258, -8253, 7161, 3673, -12613, 18364, -3846, -13386, 19305, -10377, -4596, 11167, -17323, 5216, 5085, -19656, 12937, -6758, -13727, 17181, -19320, -3189, 15012, -20577, 3170, 5054, -13917, 11958, -7222, -8171, 17772, -13827, -265, 11898, -14875, 8380, 6017, -11759, 9092, 1879, -6042, 8384, -6782, 1076, 9854, -12002]
534a2002J6257M919j9727J4048K477j4402J6483p473p909J9051j7149N491J0051
547A0115k1537J9236K335k4969K5125m584j6633K4843j9824M280J4685k7275K0740
560F537n3k1959K7390j2966j2340K7998k3313K218J5760k2409J7855n145j3451
573a3878K3662j3897o374K0767j7328K483J3699j8229J0430J863r540J2234p098
586a206l347J3175j1080k972J5650j4538J462R965j3965Q723J823j1975J2670
599D385m291q076J6820j6193J069J8460k2873J0138P694j7155J6867o096r300
612h551K0952j7049J456J6733k3876J6896L063k0374K1981p123r334J6200j4360
625c386L817J1289k1739J4840K974j7197J6936q054o559J4918j2205j099J0817
$$ y = [-12002, 4255, 9174, -10553, 3495, 5972, -8430, 8053, 580, -7329, 11722, -5427, 64, 10115, -11422, 7814, 10149, -14820, 10305, 5721, -10912, 13931, -5893, -1613, 13072, -14203, 6537, 6484, -15475, 11915, -1051, -13391, 14607, -8706, -6488, 9272, -13137, 4718, -427, -13878, 9784, -4113, -10487, 10280, -7048, -4565, 9134, -9095, 1335, 3198, -6342, 5892, -1206, -4553, 8622, -2458, -5430, 10220, -4318, -2856, 7109, -6856, 1867, 3690, -8285, 4385, 94, -7982, 8838, -7355, -6286, 12174, -10699, -561, 7133, -10022, 6845, 749, -8551, 12401, -4648, -3192, 13541, -10335, 6561, 9624, -10750, 11231, 4108, -5226, 10974, -3386, 431, 11720, -10019, 4821, 7795, -9402, 7534, -520, -7079, 7839, -4366, -5465, 5352]
638E352j1999O344K164j2546J5766m897j0858J5075m852n448R839q737L354Q831
652G388j6779J0996L541j3319J4434o943o499J7187j3301k323J4415j6494R406
665A709K356j6105K0117q662r617J8172j3303J021J2112j8620J2104N430j7804
678a1090J7620o440n927J6313j5410K469J3274j6127O975N971j4038J5713o112
691C191r229J6838j0673j949J0160j2321N912N870j6051J2439O79j2932J4190
704F124p924k832J1605j2916K668R801j4782R243K856j3690J5706o414p310J5303
718G438j1994K028J0165j5892R611N298j6317J5170m362q851J6818j3911R1J3031
732H323j5498O033O527j5471J4159k615j2556J8419j0497l084J2820j3674N668
$$ y = [5352, -6647, -303, 1861, -10685, 5081, 184, -10674, 4401, -451, -5899, 3940, -4797, -1443, 7388, -9391, 1605, 5146, -8173, 6261, -682, -7181, 10006, -3295, -5618, 8797, -7697, 1709, 4065, -12040, 8077, -585, -10202, 7970, -5333, -4312, 7800, -10820, 1284, 6714, -11090, 6530, 90, -5837, 10476, -4934, -2465, 10809, -5318, 1657, 7628, -6410, 9303, 3191, -6038, 10800, 127, -1822, 8338, -3983, 1929, 7799, -8252, 4187, 4866, -8066, 6124, -1800, -4632, 6973, -5943, -3275, 6526, -8256, 987, 3843, -9847, 5859, -555, -7865, 7438, -4556, -2528, 7637, -8255, 1356, 6654, -9663, 5507, 1145, -7706, 9112, -4799, -4708, 8323, -7175, -1142, 5385, -10086, 4073, 1458, -11098, 7321, -3176, -6260, 6560, -7114, -1446]
745a446P846j5814J1849K137j3411J6370q637l971J5010j4298L614R443j4685
758e993R500K982j4783J6272n396q902J5652j2904K013J0263j6153Q570O249j6104
772h734J3165k591r743J6802j2885r64J4042j5491N410P446j4340J2444o16j3229
786i284J7780q652n217J4309j4208N136P687j5452J0411K889j4240J4583o682
799i40o560J5734j4649J830J0852j5158Q264L925j3937J3920l124j0308J6465
812F314j1008k95J1956j4627O802P402j4629J0769J257j1175J5704r130l893J5004
826A0451j4230L477Q795j4127R665K088j3583J5215o303p287J5113j3559K711
839a574R474j5176Q307M653j3722J2757l633q542J5657j1833K8J1421j3900O769
$$ y = [-1446, 6400, -9414, 2435, 4572, -8839, 7531, -1106, -5077, 9933, -4365, -751, 8692, -5993, 3507, 6489, -8294, 7978, 2582, -6320, 9332, -3572, -1559, 8704, -7449, 1121, 7370, -8734, 4431, 1840, -7903, 8899, -3986, -4950, 9092, -6399, -989, 6457, -7883, 4561, 3945, -9284, 8496, -156, -5373, 8936, -5272, -136, 7551, -7901, 2510, 5399, -8841, 5742, -940, -7500, 8234, -6415, -4585, 6267, -8891, -627, 3298, -10639, 3281, 157, -10151, 6314, -4694, -4989, 6967, -7660, -858, 6544, -8085, 2684, 3941, -7234, 8470, -660, -4553, 10451, -3779, -302, 8493, -5634, 4031, 6119, -7464, 7751, 1448, -5839, 9274, -4285, -1574, 7900, -7276, 1031, 5684, -8038, 4719, 1086, -7456, 8201, -3632, -3604, 7817, -6083, 686]
853F86M784j2823J1411l54j0856J3908p236l175J1190j2777M934P228j3146P550
867A324K918j1403J1986m752p333J4081j0875K87R033j2142O721L866j3523J3116
881C304j528j0829J5380r854n40J1070j3645O533N551j2440J1040j994r319J5478
895H207j0082k805J2500j2026M549L923j0106R530r80r167J2003o028l491J0166
909F193j0259L633N816r274M753K365o199O901k641n340J1340q068j649R006q568
924a991K481M717q984O454J734r617J0158n403l190J0682j2506L845P909j2851
938f562O716K270q820J0479o225l717J1792j2342M964N131j1379R743J3q540R561
953C084l916k506P647q998N480K619q867Q100r45n220O415k506k841N740m348
$$ y = [686, 5470, -7353, 4058, 3704, -7152, 6756, -480, -3655, 7535, -5242, -308, 6920, -6226, 1324, 4242, -7161, 4825, 73, -7260, 6821, -4054, -3767, 5266, -6876, -155, 3711, -9812, 3304, 1776, -9053, 6327, -3527, -4067, 7003, -6642, -109, 5442, -6998, 4042, 2048, -7271, 8207, -1875, -4680, 7820, -4206, 343, 4266, -5840, 3690, 2710, -6457, 5546, -482, -3973, 6193, -4066, -433, 5383, -3891, 862, 3227, -2972, 3929, 1288, -4052, 7288, -780, -2429, 6577, -1991, 490, 5207, -3777, 2677, 4411, -5206, 4952, -451, -3641, 7041, -5465, -1620, 6289, -6562, 154, 2424, -6396, 4083, -2142, -5859, 5933, -6409, -1445, 3686, -7693, 2050, 2063, -6477, 3084, -832, -3338, 4309, -4689, 791, 3410, -5457, 2643, 1698, -3522, 2893, 387, -2454, 3286, -1062]
968a062q9L238m701M372n11m925N148M56o150N783m46m502O690n402J367M527
984C793o650M380J409o496P993k765n742J1052p353n12N973q063O493r59o383
999c830R301n410l365R419r533K260N788r272O401j749l120O288o334J025N574
1014C443p582K822L880o542M896r32k875M569k197k78J754k233Q63K999n772K880
1030c05L185n272K038J342k781K508r08k486N464n166O66N034p986N431J158p084
1046e162P320j675l744O465n945K337N365j0042P736K31o691Q790n287j205O905
1061E398o804K192L470p154O975k502m721R153o702p18M916n029J826J519n041
1076c222M997j048m182O148m779L18M520n520J281L607m285J294K257m102M508
$$ y = [-1062, -1151, 2087, -2614, 1758, 1247, -3678, 1470, 1926, -4224, 1559, 1113, -3389, 3301, -2101, -734, 3793, -2857, 1523, 2932, -3564, 4429, 1664, -4078, 6974, -379, -891, 5082, -2981, 3512, 2553, -3830, 5471, 61, -3304, 6115, -3418, -1158, 4630, -4642, 1759, 10, -3110, 3178, -3156, -2131, 3443, -4139, -1317, 2563, -3979, 917, -15, -2890, 1679, -518, -796, 958, -1275, -412, 2587, -3185, -305, 2880, -2392, -354, 988, -1793, 715, -193, -2679, 2785, -2381, -1715, 3319, -4667, 764, 1922, -5162, 2158, 483, -3261, 3204, -2741, -404, 4961, -5081, 2655, 2886, -3805, 4985, -302, -1507, 5398, -1406, 786, 4256, -2898, 4077, 1575, -3146, 6007, -695, -1413, 3503, -1526, 300, 1819, -3222, 1775, 727, -3455, 2693, -2086, -1768, 2752, -2768, -1487, 2120, -2165, -871, 1386, -2716, 1792]
1091A792j809l025O393m512p13N282n759J512L979p317N157K71n243P125n632
1106b499LO396q065K982M393p467N414p82n264Q505n563q30O525p306M004K649
1122C095p371O657J13o003P648m033j423N693o467L178L023o268M138Q58n593
1137b755O196k379l729P199n740M04M075n758L329J822o507N665j39n472P256
1152C467m739q53O432p004K210L832o732N000K26o300Q898m704l237Q172p256
1167b588K085L788p480N385R76p062P376l133l503Q212p943J775N470p851M350
1182a43J567o353O972j889m951Q761n676m73O230p692M424K784p329O080K63n991
1198c416P795m690j858P657q189K623M237p320M901R47o761P770l030m560Q465
$$ y = [1792, -17, -3042, 3351, -1161, -1874, 3408, -2351, -839, 3140, -4177, 980, 1251, -3992, 3133, -2499, -2496, 3900, -4165, -1183, 3210, -4257, 1157, 375, -4889, 3616, -1947, -2777, 3748, -3558, 446, 3095, -4276, 2381, 2494, -3509, 4139, 106, -1317, 4376, -2091, 1087, 4110, -2158, 1980, 2838, -2755, 3441, 1062, -2667, 4532, -1208, -804, 3271, -2487, 842, 2664, -3843, 1822, 1683, -3789, 3467, -1272, -2125, 4307, -2697, -487, 3345, -3387, 1613, 1839, -4461, 4437, -267, -3504, 4668, -2588, -503, 3285, -4195, 1190, 2166, -4896, 2480, -653, -4156, 4056, -3887, -2112, 3358, -4493, -143, 1424, -4929, 2043, 154, -4797, 3964, -1712, -2185, 4045, -3647, 777, 3561, -3768, 2312, 2575, -3416, 4379, -311, -2169, 5488, -2701, -78, 4159, -3161, 1740, 2687, -4074, 3696, 666, -3894, 4571]
1213D571o799J087N216p910N004J888p248O716j146m980Q401o516q6O897q202
1228c107L319K953o568N998r60n795Q350m625k707P394p393K632L456p540N267
1243F74J060o473O875k910l674Q528p505R63N517p491M368J873o440O758j255
1258H68n408Q295m926p72O178p767M177K924p321N693M83n903P546m690j890P454
1274D941p581K363M006p073M775M35n732P303l083l404P299o304J451M235p244
1289c613M786J704n811N616j485l947P270n320l20N466o590K887J854n398N139
1304B238q20m817O243l012k251N546n995K047L147o153L854J134m987N621k616
1319h21k747O697n790N27M868o208L601J012m635N614j889l832O874m769J59M784
$$ y = [4571, -2228, -1141, 4075, -3835, 1169, 3057, -4191, 2525, 1379, -3601, 4800, -1716, -1802, 5095, -3107, 212, 3165, -3403, 2595, 1635, -4160, 4190, -435, -3142, 4252, -3141, -509, 2947, -4593, 674, 1734, -4739, 2136, -774, -4448, 4080, -3425, -2462, 3055, -4436, -68, 1805, -4635, 2123, 868, -4540, 3755, -1171, -1943, 4235, -3532, 645, 3569, -3752, 1941, 2424, -3479, 4067, -623, -2513, 4941, -2640, -277, 3729, -3344, 1431, 1866, -3866, 3437, 354, -3050, 4249, -2055, -604, 3631, -3613, 1173, 2877, -2934, 2682, 1197, -2750, 4520, -800, -1120, 4346, -2244, 643, 2497, -2901, 2238, 1418, -3399, 2844, -168, -2419, 3127, -2868, -821, 2326, -3827, 27, 1161, -3826, 1795, -821, -3568, 3129, -2661, -2134, 2734, -3474, 127, 1139, -3496, 2118, 229, -3603, 3271, -1498, -1339, 3445]
1335C445o738L950J488n039M699j226k960N628m639m87N093n719K447J780m377
1350b655M357j005k909M402k052j690M564m656J727K989n442L311J171l711L713
1365B114j124k468M831m107K8M095n290K896J130m701M597q13m085N479l520n87
1381a525M042n728L820P83m772N053j781k569M827l591j66M188m973K845N92l461
1397b416M574k682j694M284k861o00K785k910J389R73k934K975q35j444K371k021
1413a046m54L161k409p52L335l092J344J002k986L349j117j893L487k049q48M349
1429C381m827K041K225m531L844q74k114L590l385p3M147n268K467J918n097M523
1445A967j720k286M174l093N03K036m172L168Q60m577M140n57k418L129k319N28
$$ y = [3445, -3293, 657, 2145, -2894, 1805, 579, -2381, 3247, -1392, -1879, 3214, -2505, -58, 1722, -2655, 1702, 697, -2212, 2190, 138, -1552, 3012, -1644, 83, 3072, -2370, 941, 2112, -1599, 2114, 990, -1478, 3353, -754, -726, 3369, -1921, 975, 2105, -2596, 2001, 1188, -2897, 2582, -938, -1525, 2517, -3211, 609, 1392, -3380, 1673, -108, -2677, 2150, -1441, -1607, 2581, -2392, 453, 1045, -2416, 2158, -524, -2218, 2066, -795, -1395, 1390, -1520, -131, 842, -2092, 883, 48, -1396, 975, -1046, -1500, 1661, -748, -1500, 1835, -1257, 87, 1089, -1897, 1452, 335, -1558, 1929, -120, -968, 3381, -1446, 595, 2820, -1711, 2133, 1259, -855, 2735, -650, -723, 3424, -1844, 623, 2541, -2556, 1967, 247, -2039, 2135, -958, -455, 1581, -2591, 577, 1437, -3140, 1000, 443, -1975, 1154, -1165, -637]
1461f37J761k564J352J398k957K289j81k519L840j749j607K583j380l69J768k870
1477a842J610J555m364M148q86l127N031k996r16L961m223J314K568m860N042
1492B015k144k801O420m463l45M049m352K492J107m552N114k023j909M728m278
1507i42Q43K845m327K212J026l272K697o74j852L672l105K44K792l683J472J686
1523A634l079J764J233l554K859l85j919L473l171L43K915l856J561K315m520
1538b387L276r0l321M895l238o59L494m236K157J737n028M213M2l929M882l077
1554a269j13L467m532K321J494l744L540n05l223M876k464j221L794l603J263
1569H1J596l038K243N19k773L324j222k335L893k818J60K464l266J293J411l003
$$ y = [-637, 1124, -1440, -88, 1310, -1647, 642, 461, -2058, 1782, 33, -1574, 1009, -371, -740, 1028, -1842, -232, 1323, -3041, 1107, 221, -2906, 2125, -871, -1787, 2174, -2049, -735, 1833, -3027, 2015, -129, -2930, 3490, -973, -1318, 2731, -1621, 871, 1978, -2574, 2540, 517, -1392, 3336, -942, -99, 2746, -1581, 631, 1657, -1615, 1082, 408, -1444, 2228, -877, -633, 2159, -1524, -52, 1634, -1445, 319, 1552, -2002, 857, 472, -1447, 2026, -1145, -802, 2113, -1743, -182, 2133, -2387, 889, 799, -2522, 2373, -865, -1524, 1970, -2266, -109, 1628, -3400, 813, 855, -3074, 1808, -1269, -1382, 2085, -2447, -126, 1368, -2376, 1164, 659, -2564, 2312, -152, -1373, 2421, -1182, 81, 1677, -1361, 882, 1401, -1372, 1952, 730, -1605, 2288, -530, -370, 2094, -1172, 121, 1532, -1471]
1585a471K208L60l403M558k490j255L992l517P57K468m147K640R96l864M335j986
1601A81j677M369m299J024K885m511K299Q74l452L935j915j854M357l874M04K971
1617A717m354K631Q34l285K816m21k193L921k600l46L020l511J893J257l231K463
1633F11M13l159L949k010j310L597l245P44K135l569K404R31l480L396q91k289
1649a773M017l026j81K856l456J807J262l317K971l23k667M319k785n91L014l272
1665a145J622J038k932K392L90k816L489j879j081L433l719J082J574l137K038
1680C49M48k543K973j201j821L357k705L74J997l193J825Q00l003K701l32j819
1696a793L051k219j68K585k998J348J154k740K387q9k075L070j711j058K775k577
$$ y = [-1471, 737, 1097, -2306, 2252, -238, -1493, 2499, -1018, -261, 2207, -1940, 700, 1696, -2168, 2167, 181, -1496, 2873, -1426, -402, 2483, -2028, 271, 1145, -2307, 1628, -287, -2141, 2216, -1658, -1254, 1717, -2637, -6, 828, -2457, 359, -62, -2255, 1666, -934, -1280, 1740, -1771, 122, 1379, -1852, 611, 1024, -2135, 1814, -196, -1506, 2091, -1154, -410, 1725, -1844, 560, 1491, -1989, 1407, 516, -1773, 2244, -782, -963, 1893, -1563, 244, 1506, -1811, 1160, 837, -1830, 2489, -296, -887, 2127, -1145, 477, 1515, -1417, 975, 1365, -1451, 2038, 159, -922, 2511, -1208, -126, 1448, -1689, 349, 797, -1746, 1227, 26, -1795, 1562, -1143, -769, 1228, -1965, -140, 660, -2343, 358, 26, -1793, 1258, -961, -1129, 1456, -1542, -194, 960, -1780, 607, 518, -1557, 1513, -198, -1256, 1519, -1058]
1712a058Q83J505k828K093J6j952K437j237r59K804k596O64J563k647K083q0j832
1729a141K288q84j202K403k025L69J859k819J784K57j909J743l6j446J936j118
1745E9n68K024k333O67R72k103J678j53j272J722r00p76K307k512R95R97k267
1762a463J650J14j807K247r80j042K427j802K64J285k081J333J46j364J490n85
1778a68j058K022j350o6J496k032J366R5j274J446o53n30J283j046J5J539j955
1795h70J140M44j372J579l07j169J491l64p92J499j453O90O35j787J403k78j182
1812f93J635q76l63J532j909M94J369k365J836n45j084K126j437k12J347j571
1828g16L59Q98j735J571l16j035J918j619K29J153j831Q65P46j381J098p3q75
$$ y = [-1058, -175, 1330, -1498, 595, 611, -1341, 1096, -141, -1100, 1704, -892, -228, 1335, -1312, 771, 691, -1141, 1147, 263, -939, 1464, -561, -192, 1667, -1152, 632, 889, -1020, 723, 687, -759, 1177, 59, -509, 1515, -818, -151, 821, -1282, 396, 243, -1029, 693, -207, -983, 1324, -1188, -193, 804, -1463, 187, 301, -1506, 741, -239, -1281, 1146, -656, -392, 893, -1188, 145, 291, -1073, 417, -168, -1226, 796, -554, -620, 876, -1156, 210, 305, -969, 477, -176, -706, 577, -469, -454, 1085, -870, 270, 714, -658, 921, 614, -555, 936, 572, -220, 1279, -174, 516, 1151, -636, 767, 489, -693, 942, 66, -297, 1235, -674, -180, 1189, -1176, 660, 115, -969, 1157, -280, -492, 855, -716, -357, 541, -1194, 377, 61, -974, 944, -675, -446, 707, -1124, -259, 487, -894, 204, 131, -744]
1845g44J384r36k56P82o89K58L90j054M96P67j480J015M7p07J251r99K49R87j382
1864f21M18J189j921J696k83j645K513j352m72J514j528P52P82j949J845k39j736
1881a037K415j632J21J257j807J009K52j368J468m04j553K282j413q8J518j691
1897f71P65L62j021J002qj201J391r60m54J692j250j62J020q97M24L38j216J094
1915B48J72j677K046j287n32K058k186L65J417k000J037Q04k193K735j338o26
1931i57K463k700R44J574k562J670M37j984K062j072o33K440k759J180R74k282
1947a205K047k23j517J996p17j049J674j611P47Q69j902J340K53j479J351P1j468
1964h23J710p78n78J605j508M01J060j841J408J88k317K494p29j434K401k135
$$ y = [-744, 640, -296, -552, 230, -459, -201, 189, -865, -369, 398, -1082, -67, -20, -727, 524, -475, -226, 761, -621, -203, 986, -935, 761, 478, -1167, 1346, -6, -478, 1036, -492, 260, 1042, -907, 938, 699, -1037, 1378, -254, -133, 1124, -683, 326, 578, -790, 678, 274, -1279, 1003, -410, -498, 1020, -671, 94, 456, -565, 437, 429, -772, 619, -341, -795, 897, -353, -515, 505, -392, 32, 370, -846, 248, 420, -1257, 789, -498, -1030, 1028, -1158, -793, 624, -1376, -339, 465, -1728, 1007, -331, -957, 1506, -1194, -250, 1324, -1238, 432, 869, -1115, 947, -125, -758, 1682, -1077, 103, 1077, -1205, 842, 619, -898, 1098, 381, -668, 1006, -605, 142, 1011, -891, 449, 702, -777, 574, 645, -823, 887, 109, -469, 1136, -372, 29, 1089, -752, 656, 844, -1473, 1021, 292, -1142, 1259, -876]
1980h76M86J391k069J238L30k138K480n48j826K686j819J2J601k522J478M30j805
1997a471K084o94j204K435j722J84J618k144J191L03j243J038q8r70J496p97n13
2014d97J742j803M72J248j786Q63L66j386J375J43j646J787q65m54J785k056O65
2031d7J060j662J140J76j784K218j170l33J753k218J130R36k239J595J70j679
2047i54J958j040q16K096k348J058P94k070J510J97j515J583n93r40J936j574
2063g18M04Q92j739R45N06j319J282K9j495J801o54p47J525j411N84M55j316J170
2081A94j7j249K000r17q80J894j470L96Q22j506J115K57j358J522n52j088J821
2098I84j431M72J062j726J070L08j400J497n91n82J287q64K0O38j306P55K29q47
$$ y = [-876, -390, 1001, -1068, 170, 500, -1638, 842, 294, -1532, 1154, -665, -653, 948, -1574, -96, 334, -1471, 613, -81, -1285, 1150, -572, -388, 1230, -914, 277, 580, -663, 375, 287, -683, 813, 16, -497, 1245, -558, -86, 1162, -624, 239, 605, -781, 594, 737, -909, 878, 13, -441, 1344, -712, -47, 1013, -649, 491, 667, -1117, 1101, -69, -402, 1351, -867, 263, 1199, -1040, 555, 725, -954, 1004, -36, -852, 1244, -1104, -46, 748, -1322, 188, 385, -1130, 453, -140, -1080, 856, -718, -314, 578, -1161, -216, 290, -1029, 253, 282, -1213, 588, -66, -813, 712, -699, -115, 340, -976, 194, 177, -1072, 928, 11, -869, 1025, -445, -49, 773, -733, 382, 639, -719, 803, 251, -837, 984, -447, 25, 1087, -639, 431, 739, -661, 836, 245, -337, 950, 86, 106, 744, -562, 193, 422, -425]
2116d25R78o3j121J338o40p23J449j316K67N93j116J041j6r70J104k16j042J616
2134G38j255J97Q30j185O42L44q90R25n17n34J281q40k23J283j526N46L27r42
2152g99J239m69m47J021o13m06R44j172O74O82j302J153l23q49J218n86k74Q93
2170E84j044L46Q80j402J068j30o45R70m03k51Q58r55KJ008j384P65K20r37R63
2189E13l94m49P94o60j61Q43r95O95p0r15J376r80J2P24p64N2O99q63M00O37j532
2210a038J347n66j00P25p07M6O07q96O61L54j348J146n02k32R36q39M6P17n69
2229b12J40L07q42P41R2p28O80n20L07K50m61K02O34q95N11M03r46Q81l52m09
2249b17R63q40p1O19n48K98L04j127J192m17m23J026r99J66O29r12L27N18j067
$$ y = [-425, 553, 490, -631, 707, 67, -656, 793, -523, -256, 337, -779, 262, 246, -724, 380, 164, -878, 738, -517, -320, 510, -675, -33, 311, -579, 346, -171, -705, 576, -264, -487, 796, -730, -184, 143, -799, 440, -29, -476, 545, -68, -474, 470, -702, -28, 654, -648, 505, 182, -667, 551, -35, -309, 584, -460, -114, 766, -636, 432, 302, -343, 627, 224, -27, 831, -124, -122, 886, -498, 267, 487, -450, 513, 119, -330, 464, -196, -357, 486, -509, 186, 116, -799, 577, -403, -391, 333, -431, -379, 320, -543, -143, 494, -1038, 309, -257, -357, 368, -339, -293, 314, -582, 79, 433, -915, 231, -271, -503, 433, -406, -360, 357, -212, -72, 235, -607, 134, 226, -502, 178, -342, -35, 215, -246, -44, 590, -305, 206, 609, -337, 544, 192, -217, 746, -94, -165, 454, -94, 204, 508, -619, 573, 156, -267, 759, -240, -74, 555, -357, -30, 488, -579]
2268e79R26k23o72J284r49K09N40q44O8M07p72Q13o3q15J344j204J5Q28o24j7
2288c28N37o07N23Qr57R99l23m68Q40o60M38J96n92L70M29j256J183j53q93J338
2308F24o21K0M61n59K78M11j079J010l21o97J260r72l8J086j190M32L62j054R95
2327D08M6r27R50o05k78J144r52K12N51q92O07J55p06O74m29l73J037q86K05N16
2347D57o33j5M90o42M12N83j108P31m19j65O37p74L13M17j114Q81L38j478J276
2366A87n22m04J132r80L51N51j111Q07J57q76J159o88j89Q80j038N43O90r49O37
2385C37k55n24J044n49m51R26p83J18O65p29M23P5q87N81J74m62Q06k77m53Q45
2405F24q73R3Q09p64M56k04n29P34k9p25J360j292K68N61q91N23N4q20R30l02
$$ y = [-579, 347, 124, -548, 736, -213, -4, 536, -308, -240, 167, -605, 208, 145, -670, 674, -530, -515, 313, -311, -328, 209, -398, 125, 133, -824, 175, -148, -616, 224, -436, 2, 198, -394, -24, 405, -851, 332, 179, -714, 624, 3, 23, 484, -75, 203, 614, -465, 545, 224, -473, 787, -185, -223, 863, -327, 105, 467, -587, 408, 454, -473, 477, -128, -406, 738, -214, -2, 549, -343, 264, 419, -287, 387, -42, -415, 622, -264, -59, 457, -176, -191, 299, -343, 69, 652, -456, 275, -144, -309, 328, -446, -133, 284, -830, 51, 389, -1089, 187, -335, -739, 393, -587, -236, 315, -796, 11, 168, -708, 451, -237, -426, 454, -584, -41, 649, -300, 337, 82, -442, 602, 53, -398, 528, -255, -137, 528, -201, 222, 297, -590, -9, 165, -297, 509, 232, -221, 624, -249, -156, 653, -111, 345, 141, -388, 346, 317, -408, 952, -340, -72, 489, -402, 121, 175, -645, 285, -17]
2425a7n88J220r51J37O21q67O31n6q06O73m5m86Q41l54m01P28p50J60K59l59K33
2446a77K76o14Q10j36n65J130j115L87J58o74M73M30q42P78R6p53R87p52k36Q11
2466D72q52M47L80r54Q15K19q15R89o39l92J128j034O28n8o31P68j45l75M40k01
2486A90p3M35o02J45j8m62N32L8k99M40K6p80M51n24K31M22o27L45r2k60P36k86
2508c2l02M25j52j47Q66j105K59Q4m71O62m1k67K38m3l51N76l53lL81p65N11N8
2530B8m00N58k23m1N31p14R9N56q73R59l04k13M01k98k84P54o61K61K16n97M29
2551A84rm07L54j11k63N76m39J2M65m87M07j53l85O56l83k08M72k98l6J03j31
2572h1L4J92n16L46j6k95M23k91j79N22j14l80N92n19N26l14j35J07j83J69K65
$$ y = [-17, -605, 615, -336, -199, 422, -445, 186, 130, -676, -3, -48, -534, 307, -47, -448, 280, -470, -310, -51, -410, -177, 99, -515, 295, 159, -406, 724, -391, -4, 154, -520, -47, 383, -459, 319, 415, -338, 649, -103, -339, 472, -380, 67, 447, -507, 308, 527, -288, 701, 62, -330, 798, -236, 392, 334, -297, 471, 326, -49, 391, 190, 117, 552, -50, 95, 77, -385, 147, 185, -114, 326, 352, -428, 23, -501, -270, 152, -475, -130, -222, -482, 254, -32, -334, 91, -61, -208, 658, -447, -188, -104, -575, 87, 46, -221, 17, -26, -377, 199, -154, -157, 224, -541, -30, 28, -372, 186, -37, -78, 453, -261, -162, 394, -479, 480, 176, -37, 364, 66, -218, 536, -125, 136, 352, -245, 184, 175, -232, 122, 11, -252, 324, -115, -103, 362, -125, 282, 129, -256, 400, 17, -191, 281, -17, -53, 50, -81, -47, 145, -371, -25, -41, -336, 87, -204, -383, 139, 25, -355, 237, -282, 244, -70, -205, -98, -281, -112, 153]
2593A53m06Q2M09n03N11k80m31R58o14J86K81n88K4N78n63K59m0l25M02m82K60
2614a29M69n70J25M69m42K46pl63N96k85m70P14k55j91K21k01K27L76r21N38j98
2635e1n9L89m59L44o1k45K15K47n81M16J1l33L71j76L9J10p02P99j19n51M73l3
2657D4k71O58p96K92K89n06M47o7k45K65Rn22N33l79j06P12n23K4L70l68K45N9
2679A64l62L20r4l74P01n01K21M28n20J68L24n72J99J98m87M08Kj95M53n99L55
2700B37r0m85L07K83p10Q53k54l84N81o71M78K70m79k9N33m99M39m41j8M89n90
2721a80K7L21l89J72K47m87L23K6l69Q75m66n36M64l90R9O31m97Q7J50m46N94
2742B56l24m45Q31m52R7L75n45J35L18o45N31l05o7P97q44L32L89p79L71J71n76
$$ y = [153, -253, -171, 238, -265, 246, -34, -465, 493, -121, 65, 346, -242, -218, 360, -203, 56, 16, -309, 93, -389, -129, 340, -230, -105, 364, -78, 168, 161, -202, 394, 109, -361, 353, 98, -93, 128, -73, 154, 530, -391, 147, -51, -110, 279, -180, 164, 103, -142, 73, 320, -261, 155, 166, -167, 204, 28, 67, 177, -525, 274, 155, -396, 77, 44, -227, 431, -365, -73, 216, -290, 157, 90, -155, 110, 119, -403, 130, -249, -355, 357, -166, -142, 228, -140, 105, 164, -198, 122, 28, -346, 355, -146, 75, 503, -17, 151, 475, -97, 102, 300, -187, 221, 223, 28, 481, -118, 237, 147, -338, -31, 252, -458, 395, 141, -243, 338, -333, 145, 415, -64, -93, 440, -59, 380, -61, -79, 410, -180, -153, 168, -221, -49, 198, -289, 34, 60, -309, 566, 100, -436, 28, -362, -263, 368, -129, -42, 108, -338, 256, -68, -513, 318, -134, -37, 338, -207, -72, 246, -399, 132, -173, -240, 557, -287, 45, 434, -345, 26, 197, -379]
2763c79M79k7l04M79m56l9M69m48K61L6m72M79P9l17O14m61j34K98j83P3N22o90
2785a21J52K25n51N79j71l76P56p57J04N67o61K89J98l89O3O1k88O03m51k04P88
2806D16q55L86K73o24O87m37k30M65K7k19J82l14M88r2n38N18p6k86N33k27n5
2827B2M84o14k7L51n07L13P8k46N15l95%L63k90j75M29m88K28J23l61L80q7k83
2849a87L73O2l85K99k61J02J09j04QJ48k92L69J3o06P64l99k75O40q08O36q4n45
2871d23M03J61m27O33l15k67L33k50K21O9j58J04O2k91K43o8j69J67j01J5L05
2892B47l07J37M5j74p0M12l46Q2k48P2M09l91J91L9j68j08L96m84O11j46l02L08
2914B05l30J67J10j25L58N3l34J67m44N2J46k37K63O2o6J37o2k83L16n0p5J27
$$ y = [-379, 100, 73, -231, 248, -208, -247, 222, -226, 35, 71, -401, 78, 157, -160, 454, -7, -141, 157, -26, 47, 569, -121, 31, 256, -295, 284, 113, -263, 493, -264, -160, 407, -254, 35, 233, -156, -93, -32, -320, 283, -168, -372, 416, -439, -53, 220, -404, 283, -154, -384, 81, 108, -111, 71, -243, 245, 153, -385, 133, 57, -229, 304, 77, 22, 506, -108, -135, 216, -291, 22, 100, -146, 369, -26, -26, 337, 47, -128, 301, -187, 41, 164, -197, 183, 96, -187, 186, 248, -137, 162, -99, 3, 112, 8, 16, 164, -128, 241, 254, -352, 412, 13, -262, 378, -430, 206, 122, -423, -20, 141, -286, 347, 32, -235, 98, -152, 69, 138, -20, 84, 146, -145, 98, 30, -139, 28, -73, -58, 247, -60, 77, 122, -52, -122, 290, -56, 26, -222, -150, 259, -132, 59, 98, -70, -178, 218, -266, 345, 199, -103, 205, -125, 42, 152, 27, 385, 438, 104, 271, -173, -121, 25, -212, 51, 113, 47, 184, 122, -161, 155, 105, 30, 157]
2936A57l85K45J46l49M37l47k3J71j56J00j4j26j3R3n5K19j50j65L81j26k89M95
2958B46k27pK8k24P2J72l95O58k56l38Q9J93j64J12L7p2K36m08L64o4l50L39R2
2981A33r0J98l34K41P7l32l2K17l03L46j74K11m2l64J06M7q9M22N1l14J53J2j70
3004c0R8m7j13P1r1K28oj59o3L00k67J49M2o80O67j73J51j31m2L18j62k95J52
3027h3p0J86q7J66j73J52j90J58J51m31J94o7q9J70K3j52o9k34N10j11j11L03
3049A46j13j11L98p4j02l07K05r8J61J63j58n8n9J50j59n7K12j17R9J00j74P6
3071A23Q8j27K97l31k3L5l42K12J12k49K06j02m4J78j79J06J27k39K06R3k54J78
3093G1j14l13M50l25N1L49k63K1K38m37K46K5nJ59k28r0O4NM5l4l38N43j79J42
$$ y = [157, -228, 17, 163, -186, 251, -96, -119, 52, -104, -4, -18, -144, -157, -64, -119, 100, -50, -215, 166, 40, -249, 246, 19, 12, 40, -184, -112, 60, -335, 323, 67, -271, -182, 11, -153, -41, -4, -76, 160, -248, 116, 52, -298, 41, 133, 43, 241, -93, 148, 225, -107, -139, 78, -225, 121, -53, 158, 116, -248, -142, -95, -184, 238, 289, -25, 128, 140, -30, 68, 21, -92, -21, -112, 116, 110, -49, -112, 188, -79, 70, 112, -568, 99, -74, 77, -54, -96, 222, 60, -235, -83, -153, 33, -54, 112, -61, 91, -99, 59, 210, -221, -27, -94, -183, -13, 10, -142, -211, -445, 65, -46, -157, 146, 33, -78, 320, 246, 144, -163, 42, -56, 105, 268, 110, 52, -7, 143, -16, -73, 139, 22, 121, 221, 47, 123, 211, 84, 381, 50, 27, 62, -280, -68, 44, -205, 1, -101, -145, 33, -146, -40, 87, -152, 54, 147, -107, 71, -43, -356, 94, -231, -180, 169, -94, -73, 165, -272, -26, -1, -6, 153, -75, -165, -101, -96, -51, -85, -423, 120, -59, 83]
3117H3K9p6j28P7k70L26j3q9RM4j72J10L66n24J85k09K73K22l85K05K94m88J68
3140C7P1k16L62j41qJ52k03q1Q9k33l1M06k71M58n12k03Q12n04m8M1j95J52J29
3163F3J20k63J88k39L48l5k39K59k33K09j95n9R6j20k31L76k23k69P84n99L65
3184A03J68l08K56k61j75K87%l09M73m94R4J41j85L92l6l11L24k48l89M07m1J39
3206B7K24m45J66M29o93M71j10n0K05k91j50M43n01L49J42l93M81kl74K77j90
3227A5k13K38n9J22K52n16K86J3l59L06n19K26L69m42R6L73n07J87R9k78L18l5
3249b8j30L66k63j33N31n71L81j82L3j9J01J9j37N8j68L79k44k45M41k19J13j45
3271f2O1o3l3m3K69k78j3P7N7K63j31k73K05J46q0n4J7j95M03l77j4R4l7L95k11
$$ y = [83, 112, 36, -92, -15, -285, 41, 28, -61, -52, -8, -180, -70, 296, -228, -43, -252, 21, 243, -142, 63, 357, -131, 37, 108, -108, 254, 113, 105, 257, 54, -27, 62, -171, -202, 204, -67, 391, -121, -324, 488, -16, -64, -23, -218, -66, 63, 183, -80, 108, -131, 217, 182, -57, 202, -31, 178, -17, -76, 20, -100, -331, 45, -178, -447, 337, -262, 103, 271, -37, 219, -42, -217, 70, 70, -239, 234, -260, -166, -25, -210, 182, 146, -165, 159, -89, -478, -71, -112, 27, 251, -194, -28, 401, -292, 179, 69, 19, 224, -67, -217, 226, -275, 74, 216, -177, 304, 302, -72, 205, 15, -198, 40, -19, 103, 355, -161, 125, 138, -221, 85, -434, -208, 161, -281, -185, 188, -319, -132, -33, -311, 7, -28, -158, 208, -55, -188, 343, -228, 153, -29, 4, -15, 86, 105, -32, 26, -142, 237, -7, -252, 189, -30, 83, -62, -1, -64, -97, -140, 129, -149, -162, -85, -28, 235, 104, -169, 36, 182, 102, 48, 65, -130, 273, -104, -118, -24, -61, 334, 123]
3296A23k45J41L5j32L60l13LJ59m30O28p0m05J03p9j58M93l28P7Q6L2M1j2l22
3319b13M26j75p3M7Kk48K44j00J52o7j51K35k00K50j44J63m58L82j91k8lr9L93
3342A44q4j88K48k20J69o9J14j98J74m6O2M8l96M99m3k03J85k52J04N8j3K33n37
3365b11J15K95j5k54K79l37n7M15l35r5K13k47M35k99k85K85L6o2o1J20O9j0j34
3388a40K76j39K06j19Q5n07M08q0jJ47l46J7j7j27M16Kk99L73j58k3P2j92J60
3411A4L5l76M37k62P1N4J01K4j15j61L20m8l02J97j38P9kOJ10Q6j74J35M7k88
3435a50L40k88J26P7j74oL76m43q1K77pK50k33J7K9j16J17J81m74j9M73l90m2
3458a60J43l84M97k51j2L02j43J40P0k22kj66j85Q17n84O5J96k33l6J64k75L82
$$ y = [123, -122, 19, 54, -78, 282, -31, -28, 131, -299, 329, 259, -146, -43, -122, -280, 213, -115, -38, 48, 80, 121, 109, -213, 213, 38, -35, 12, 14, -234, 10, -90, 62, -5, -156, 79, -121, 129, -15, 148, -310, 72, -119, -147, -150, -249, 144, 60, -128, 120, -100, 69, 0, 114, -84, 90, 44, 106, 154, -242, 257, 214, 11, 196, -56, 48, 106, 93, 326, -211, -96, 199, 184, -70, 209, -128, -185, 230, -105, -200, 13, -234, 201, -98, -383, -98, -62, -124, -185, -65, 4, -6, -140, 136, -3, 203, 84, 169, -338, 70, -10, -11, 136, -210, -193, -210, -337, 79, 81, -218, 155, -3, -26, 46, -146, 14, 49, -327, 110, -152, -81, -27, 74, 98, -17, -178, 142, 94, -208, -11, -149, -70, -72, -66, 44, 130, -44, 91, 138, -150, 190, -98, 28, 105, -69, -75, 301, -142, -223, 54, 47, 297, 64, 81, 110, -6, 111, 292, -182, -201, 272, -118, -160, -17, -401, 96, -155, -167, 135, -8, 132, 202, -20, -22, -188, -373, 444, -140, -75, 121, -112, -148, 16, -259, 123]
3480A23j36j74L96j22k28J73r%n7k49L40J95l75K14L2l18N96m73j29K82j18L04
3502B67On84N21k14l0J38L3l18L65j44j00L42l81K18j33k35N12k53k04M29l03
3523f8M4M00m63J51K10l25J16R1k81R1J20k52K20j20R0q7L4P0Rk98L39l5k65L67
3547A58j50N5ml12K94J7j21J59L0q5K19l74K2R0j52J82o2k20J71J36j47J71k08
3570a31Q7L10l23N7L4j51K14N0k42J03J9m0P3l24N22k33K0J43m3m8j25Q4j7K10
3594B49l13j3K22l51J56K39j04P3k96J50Q9l24O6K65l31K28k1J46o1J19m27L21
3616H2l27K36K07k69J07k06J99j25K35j18r4Q2q6L55l77rK59l03N8J14k6K37l09
3639g8j40L81j98r6J70Q4j51R0k10P7J86j83K06j82l0J97j46N4L70k43J38m20
$$ y = [123, -13, -187, 209, 87, -141, 32, 23, 23, -34, -283, 57, 252, -123, 91, 123, -195, 401, -72, -201, 81, -37, 267, 273, -311, 210, -4, -34, 104, 137, -181, 184, 40, -60, 282, -99, 119, -14, -249, 263, 10, -194, 235, -68, -24, 376, -87, 64, 274, -51, 65, 156, -125, -34, 86, -166, 54, -66, 24, -63, -29, 41, 50, -248, 91, 56, -209, 158, 8, 63, 59, -253, 41, 58, -63, 96, 126, 41, 260, -114, -92, -2, -154, 28, -34, -254, -83, 53, -94, 77, -131, -44, 266, -57, 0, 34, -117, 97, 147, -95, 8, 27, -13, 60, -264, 258, 25, 45, 188, 145, 97, -28, 56, 39, 249, -64, -77, 145, -206, -50, 189, 85, 158, -138, 12, 101, -223, -157, 108, -223, 5, -16, 130, 69, 188, -239, 82, -245, -9, 198, -71, 36, -170, 29, -96, 139, 21, -73, 9, -77, 278, -99, -108, 151, -152, -94, 20, -6, 231, -78, -218, 163, -35, -131, 39, 123, -28, 62, -148, -71, 115, -68, 138, -44, -74, 123, -23, 31, 401, 158, 296, -124]
3661a24Q2K20l9j09J55m85J30M33m65M39l35J0P9Q2j06N8p0j13J05N2j7J10j72
3684h0K52N2l93L16l61J87n5k76N36m25K8L78n08J74O2P3j72J31k19N4K61o2J49
3707A02j38n0j41J39O2q4l4J70k56K09O4k99K13J50j80J45Kq0LJ83j84J16j06
3730Fj82J84j21K79q4J04k52k9R8J06m3k5J40l2r4j57j86N50j05M8RJ58m18r8
3754a44O6k3K74j46k4o6J24j85K42k14R9k38PK01Q7j50M5o8O2L7j14K30j61k55
3778c14N21k93r0J58k62K55Q0p9J27J23l31p4j00J15J98k20J81N0j08J61pj27
3800c6j5l6K68l0j3l24K81j38K03j03P7O4k00j54J21M42k52J87l01J67p2m46K85
3823b5O8M4M0n19M48RK48k16o3j29N9p2LJ05l5q4J73l41J49L48m09J99J26m49
$$ y = [-124, -42, 178, 139, 30, 185, -300, -170, 263, -202, 237, -98, -88, -9, 73, -33, 25, -45, -158, -53, -1, -18, 92, -80, 172, 224, -169, 147, -214, -27, -82, -358, 178, -247, -219, 159, -349, -175, -113, -40, -212, -81, -300, -246, 15, -47, 102, -36, -86, -227, -88, -26, -110, -144, 26, -230, -21, 43, -256, -43, 107, -73, 72, 74, -6, -3, 180, -4, 112, 6, -176, 8, -113, 166, 82, 186, -66, -95, 3, 109, 66, 41, 181, 149, 55, -102, -288, 262, 157, 205, 214, 372, -46, -144, -78, -101, 173, 27, 3, -63, 61, -124, 118, -96, 3, -235, -228, -27, 60, -90, -45, -113, -51, -14, -128, 102, -59, -314, 207, -86, -176, -18, -280, -25, 55, -24, 103, 226, -105, -179, -279, -164, 34, -186, -5, 45, -63, 98, 91, -36, -51, -87, 181, 151, 138, -186, 95, -43, 160, 57, 134, 198, -2, -156, -35, 407, 155, 342, 41, 208, 136, -310, -25, 43, 87, 127, -392, 56, 65, 313, 97, 34, -95, -36, -108, -105, 0, -35, -119, 54, -287, -138, 210, -199, 0, 126, -323]
3847c23K07k3J7L69m47K19J25l84L10m36K04L02j55o4K06j87J62n7J01l1n9j36
3869h0K54j51R8L4j30qK7J05o8j4j09J52j90o9J71Q8k79N53m68J81O0j76pn4P
3894g3J0j3M2J17K6PJ1k99L30J78l23J20j17k3P9o3O3K66l74J97l88Q2M6k60J02
3919b57L03j4j80n1J01m3Q0k41M00j08l77L86r4j62M11m21M56j67l13L35j65K7
3941i4J55J63l99J79J55m0Q1l69M12j91l02P52m95j6J40J35l05J04m24M92L6j31
3963C8J79l7j11R5N6k57K50j94k9J29l08M26k48N4j31JJ98R0m32L84K7l93J95
3986a8m7q1j35L06j62O7j3J60l9k89l6J93O6j4K87l95O5L3j80L36l04J23K13j81
4010d5K3o8J80J91k12k50K26j1k61K47j70j40L12j91L34O4k16K44k79M7J04k55
$$ y = [-323, -116, -139, -122, 247, -200, 19, 144, -240, 70, -366, -162, 140, -15, -79, 127, -60, 102, 45, 146, 115, 56, -80, 174, 23, 121, 155, 25, 17, 44, 149, 81, 67, -42, 110, -80, -149, 22, 110, -169, 384, -84, 97, 157, -19, -26, -80, -73, -63, -76, -34, 83, 109, 116, 127, -172, 158, 336, 13, 133, 16, -7, 72, 9, 72, 338, -36, 161, -227, -145, -99, -359, -257, 46, 32, -148, -199, -98, -141, -61, -302, 98, -10, -387, -1, -95, -257, 154, -267, 189, 22, -291, 44, -121, -94, 61, 224, -175, 4, 159, 119, 200, -169, 243, 52, -250, 502, 7, -9, 131, 266, -39, 65, -359, 133, 169, 38, 217, 180, 69, 164, 220, -37, 213, 19, -10, 119, -189, 237, -11, 43, -88, -87, 111, 201, -231, 153, 180, -213, -18, -65, -146, -281, 25, -137, -70, -83, 77, 38, -251, -287, -94, -28, -42, 245, -150, -85, -52, -232, 104, -200, -77, 136, -45, -22, -90, 90, 281, 69, -181, 45, 34, -227, 20, -150, -290, 22, -169, 165, 229, 13, 257, -22, 25, 129, -126]
4032a26L31m3k08K12j02k89M66m6l48L83k26k4R0k54L44j37K7N3l85L42k0j48
4054a08o6J30j3J37l41M58l24J22N2J96k01k2O5j93m6M03m64J63l7q9K3K52k84
4077a87L45o16O02j4j40K33l50R3j02K60o3Mk54J49K45l74J86N7k31M48k19J21
4099A93j34J26j20L0j8q4J70k43J69Q5o9j06m9N8J49p5K22j7j09j30j48M8J54
4122A02J39j09k7p5k8K85l89K85m70J98J48r5K44l62K20m5R7m10M1K54k13K75
4144F5O9j81n6l8j7K07r8j47J91r4J60k01Q3J3N2j77n9K70j91L22j73P5K2J52
4168B49k96j00L18k17LJ30k02Q7K64j12k83K65j66m0M14j68l1j0K4m2k0k24L99
4191B42l92QK34j24K35j96R6l00K94mOO5j27Pj58P5K06k22k5L7J4No9q0K25j17
$$ y = [-126, 205, 162, -46, 166, 64, -225, 241, 195, -153, 230, 4, -20, 70, -184, 160, 23, 50, 103, -282, 60, 40, -108, -174, -44, -57, 80, -261, 197, -127, -5, 47, 243, 42, 20, 85, -108, -154, 249, -215, -52, -89, -178, -155, 97, -187, 158, -458, 144, 130, -10, 223, -127, -34, -136, 124, 61, 65, -189, -40, 205, -169, 17, 74, -157, 291, 72, 193, 59, 185, 65, 95, 77, -7, 163, -80, 89, 174, 105, -1, -50, 8, 157, 82, 304, 287, 178, 48, -100, -52, 102, 241, 132, 105, 30, 2, 287, -102, 183, -287, -89, 59, -36, 208, -154, 66, 21, 118, -292, -251, 3, -210, 65, 134, -47, -103, -141, -158, 49, -49, -196, -5, -99, 61, -140, -57, -44, 8, -169, -228, 42, -149, 173, 0, 75, 97, 249, -47, -147, 171, -46, -43, 87, -115, -28, 236, 124, -159, 106, -60, -100, 314, 146, 115, 105, 129, 87, 67, -157, 242, -150, -142, 92, -32, 203, 7, 103, -197, 97, 93, 99, 164, 37, 44, -114, -39, 167, -55, -80, -43, -29, -24, -93, -173, 52, -65]
4217f5K3Q8Q0l69J66k61K26K7j3K23j39JL20l82J18r3j00K82j78M1K3j16QK28
4241A38k17J6k2J07K19n6l00K93k20k1K45j64m4J76l99L53j26J0Q3m2Q7L4j48
4264Bk18L64P0m1l77K96q6M3m1J81l56M4Q4O2K2K5k89J41K06k15K19j41r7L0j82
4289b54Q1Q2o8J65j7J8k4J2m7K67k51p8L86l82J32K31k09J3q7r0M8j3J52j04m6
4314h3K56j86j85K76N3j03J78j2k59P8j18K46N7m01L43Q5l52L00K1j24J41j39
4336G2j1J78k41M5J01l62K60J75o8l1j47k14M39l11J44J20k31O3K25k32J49l17
4358a94J65o5k80L54O1j22k14L96j43J4M4j65L58l94J39K84m71J99kj69J23K02
4380A20j35q5j7l5R3Q3j9J81j09M3j20j31J76P9k01O8jQ0j57m2K26l1j26J70o6
$$ y = [-65, -42, 46, 126, -243, -77, -338, -112, -85, -98, 125, -14, -13, 307, -75, 43, -50, -150, 132, -46, -5, 18, -98, -90, 138, -79, -63, -85, 22, 241, 185, -115, 178, -42, -63, 182, 18, -26, 150, -249, 104, -22, -12, 71, 29, 116, 150, 2, -216, 148, 218, 177, -200, 96, 10, 53, 12, 193, -163, -119, -35, 27, 49, 74, -215, -74, 132, -83, 136, -5, -102, -72, -254, -173, -91, -159, 6, -11, 7, -17, -5, -52, 215, -36, -114, 272, -110, 22, 253, 44, 57, -30, -120, -72, -85, 67, -37, -83, 173, -13, -198, 78, 131, 28, 206, 194, -65, 13, -105, 141, 198, -203, 140, 225, -127, 173, 194, 70, 211, 72, 61, 239, -2, 43, 144, -218, 42, 217, 149, 118, -29, -243, 196, -115, 29, 149, -82, -19, 206, -26, 123, -194, -29, -94, -374, -20, 41, -81, -295, 101, -42, -28, 16, -149, 209, -185, -46, 238, -233, -34, -36, -205, -82, 120, -15, -100, -117, -152, -59, 24, 5, 186, 77, 120, 0, -131, 45, 124, -77, -9, -10, 70, -87, -129, 97, 66, -60, 110, 44]
4405D4k04K28j59K45J2j77K39k40l2K08j45R1l9j27R2M24n07p4O2l3N3J23J6j75
4429g5r0q5L10j60p5J15J19k06J94j73K03J39j90R1m23M40ml66J75K2N2j10J13
4452A6k7p3r2%j2M9J00J09q6lo7Q0K4J22m45K80q4J18M6nj50R1m6R0o2J32K8k48
4480a15k3J38j61L34k98J22K47mp0r6Lj7N3l0k4l30K14M4k40J45K84l53j3K05
4504A5k10q5K38k4K93m15J30O2J51m07K83j12K0N2j16K43m27K89N3J52j56L3l57
4527b95K01K23l96K26J0m9J35K23j30k03M2l2J62m14L58Ll3J37m7r0o0l0L16k53
4551DNk07K09J40j94J89k30K56J3j74n3j05n1J97K7J88j93mL9j23J15J7j55K26
4575A36j55kJ05l7r3R7l19K67j14R1j26K31k1p2L0j25J55j51K3j79L48L4J0k16
$$ y = [44, -160, 68, -91, 154, 166, -11, 228, -12, -44, 164, 19, 110, 71, -56, 36, 460, -47, -121, -59, -92, -39, 84, 100, -75, -165, -250, 60, -100, -175, -60, 59, -147, 47, -126, 77, 216, 26, 117, -306, 134, 130, -236, -61, -39, 13, -97, 16, -11, -84, -176, -176, -188, -139, -39, 70, -16, -19, -86, -6, 18, 140, -305, -25, -109, 9, 55, 50, -100, -9, -55, 35, -27, 105, 133, -115, -138, 0, -161, 173, -125, -3, 244, 240, 170, 74, 77, 60, 113, 83, 59, -271, -57, -13, -253, -108, 176, -177, -190, 15, -195, -280, -42, -66, 227, -188, -58, 4, 155, -252, 31, -81, -61, -9, -125, 118, -309, -20, 33, 185, 29, 62, -295, -94, 129, -267, -41, -31, -80, 55, 278, 148, -55, -13, -45, 117, -297, 61, 64, 31, 168, 121, 31, -29, -59, 257, 4, 9, -198, 11, 151, -43, 146, -84, 172, 185, 11, -42, -147, -198, -1, 26, 214, 21, 17, 56, -67, 48, 65, -90, 136, -19, -21, 84, 47, -46, 51, -268, -1, -115, -24, -150, 81, 60, -12, 18, -107, 48, -103, -80, -259, 89, 123, 133, -83]
4599h3J94p0pj84K79m02J81m0L21j72rJ49p0m4j64L1j24J65K52k16P6n6Q2kk55
4624a68K69K6k25OJ9J5l8r9J49J48k94J47J88Q4n4m11L36R0l38L82j54R6k42L
4648f5j65L33r7o7K94j8q0Jk79K41n8j75J41J06j54J42j87o3J71p1K06q7J24J2
4672B05l19J79K5j91nJ90k99p3M52l49K29k63J91J38l65j05O02l92L26j72J0m5
4694c1N4K4L26m13J7K59l34K47J43m10J18K43k5j3q8j74l9j66J97K35k94j02L24
4717I8j64J54k1j28J73j95l47L30m6P0L44k01J75l10n7K22o0m12N16k33Pp6k78
4740d39M72k31J19K74k47n3J69j45K43k27m5OM02n13L25K7r3q3Q9j5PK3m7K30
4764B48l88j29L80k88J15j96l6P09l44j96K68m27M10k11J67q8K20k16j06J23P6
$$ y = [-83, 111, 41, 34, -150, 129, -273, -92, -132, 189, 17, 8, 157, 87, 43, -121, -90, -214, -49, 203, -13, 63, 7, 89, 87, -168, 101, 127, -98, -92, -73, -58, -96, -195, -46, 102, -192, -45, 143, 227, 173, -238, 98, 188, -150, 232, 78, 174, -68, -65, -230, 103, 6, -61, 233, 215, 135, 136, -143, 98, 40, -135, 6, 112, -42, 100, -87, -150, 21, -50, 156, 69, 193, 205, -114, 65, 90, -101, -106, 84, -215, -288, 164, -185, 44, -219, -28, 110, -255, -360, 242, -150, 176, 4, 14, -31, 23, 47, 373, -40, -23, 236, -98, 149, 292, -118, 0, 243, 218, 205, 117, -57, -96, -262, -65, 170, -124, -226, 98, -66, 88, 67, -61, 112, -83, -430, -100, -146, -76, 268, 67, 242, -68, -125, 97, 37, -375, 141, -92, -85, -161, -439, 33, -198, -79, 195, -52, -105, 64, -81, 162, -65, -110, -104, 298, -215, 110, 137, 44, -39, 50, 35, 42, 65, 18, 248, -140, -269, 111, -177, -62, -258, -294, 415, 71, -125, 143, -284, 126, -85, 82, -6, 214, -2, -108, 15, 91]
4785I1n1j49J77J09l36J52l9K38qj20r2K05n8k55L09k1m8j99J71k92L82l86M06
4808A86l46n7M82m26J36j4k61L6L50k31n8L06k56K18N2j38N3l35N07k28m7j69
4830b40J05J38J72j94j06J78l37J12M20j62p7r7mq2J52KJ05k35L01l93K27K92
4852B77j76k05L31o9l0j0K4O0m19M73m24J17J13K10j84m1J06k05J07P9j68J43
4874A09j50j08K47m9NM4k33J29Q7j25P0k45K31Pq5M7Q2K2j08J35k75K16q9n7L8
4899e5J23j06j82L00k25K16j96J3o3lL73q8m8j2K24k85J84j27o1k09K69J59o3
4922A38q9no8m8K54k21J9NJ8K23l21J21J05q2k89K06K35k63R4P8K09l07Pj39J99
4947G9O3m3l33L07l2j74J63N8k81M78k79o9n1L03k78r6J72j51K67k15J19l4Q0
$$ y = [91, 40, -109, 68, 177, -159, -7, -46, 192, 184, 64, -28, 177, 119, -136, 173, 152, 104, -95, 76, -216, 166, -220, 186, -160, -217, 265, -161, -25, -39, -300, -264, 86, -145, -203, 103, -153, 65, 117, -21, 32, -303, 204, -24, -71, -240, -135, 3, 175, -19, -125, 53, -284, -172, 248, 86, 9, -88, -92, -174, -22, -20, 85, -150, 151, -242, -15, 277, 101, -104, 227, 158, 128, 118, 142, 202, -217, 256, -168, -51, 62, 272, 88, 47, 153, -52, 55, 134, -34, 109, -41, -149, 98, 49, 54, 98, -135, -6, 81, -44, 26, -219, 12, 19, -66, -19, 63, 85, -23, 112, -163, 53, -36, -93, -55, 68, -38, -220, 80, -145, 71, -125, -112, -175, -178, 195, 107, 59, 47, 271, -14, 170, 43, -18, -227, 42, 201, 138, 49, 44, -24, -72, 182, -39, -20, -15, 3, 226, -95, 26, 131, 49, -240, -34, 201, -62, 32, 110, 319, 12, 19, -120, 79, 142, 99, -234, 73, 41, -133, 30, 88, -193, 285, 6, -63, -114, 189, -89, -185, -13, -164, 103, -112, 7, -27, 53]
4970E3j29p9J37L17j85l43K98K00j13m7l24M51l73R6k10PM58k21j81K9J72N2K16
4993B81j66k66L32j22j96M19l91J47k6q9j03L27p0l1j72K93l16M2J41j35Q8k11
5015b24L77k87L28k49m7n9%L7P8l05M39J05k93J04j27J46N8j20J87j84k05J81
5037f0J88n19N09l10j17J94K23j2j97k7k10M17j32J60j54Q4R4j82J37qj82K71
5059A67k44k8lK01k42J57M3k7L39l43j7m8M6M1L4p7J31L10m53k7M5K07N1l48J47
5084F2q3l7M41k45m1J86n14J70R0k17J54%P8j88o5J35K29l29KL11j68Q9J18j63
5108A5j65M7j31J00j9J47K11l66L07k95J09Q1j7j49l5M1J92Nk28J10o8K09j06
5131eP3r1K09l24J43J24k14R5j3MN7Q6k94L23j93J2J32k26K92j36K4k12K50k32
$$ y = [53, -76, -155, -18, 299, 114, -229, 69, 269, 156, 109, -215, 236, -137, -41, -251, -244, 214, -7, -188, -159, 13, 65, 281, 115, -151, 181, 59, -137, 282, -109, 38, 12, -77, -180, 147, 77, 46, -126, 167, -149, -107, 34, -101, -13, -224, 153, -134, 194, -55, -102, -161, -161, -124, -46, -351, 88, 193, -100, 4, -123, 23, 81, -39, 148, -36, -241, -60, 128, -391, 118, -192, -309, -115, 108, 96, -101, -128, -338, 79, -53, 107, -47, 37, 131, -51, 86, 78, -104, 167, -77, -105, -108, 93, -149, 8, 51, 24, 363, 20, 3, -45, 1, 42, 76, -1, 130, 440, -13, -40, 5, 212, 263, -85, 62, -21, -58, 383, 138, 97, 283, -231, -61, 29, -188, -34, -34, 44, -144, -209, -74, 155, -174, -172, 139, -29, 60, 178, 15, -150, -103, -234, -134, -153, -6, 205, -161, 146, -149, -40, 41, 24, -125, -160, -119, 73, 78, -150, -40, -108, 101, -5, 68, -23, 186, -138, 5, 129, -85, 10, -3, 1, 58, 144, -150, 173, -20, -8, 124, -102, 190, 54, 78, -134, 116, -116]
5155a16L31k06K80k61P0l08J59j19J94J13l22j4K57k54QO5r8J84p6nK67m39K33
5178e7R3nP9k82N3K65O0j20j45r0mQJ23k26O8O5k6j18L67J58k28j45RJ12J7p1
5204d0L1K67l41k7q7J38o2O2R9j17J96j53J9r3J31J57k03pR5j52J32l4l3K35n0
5229A63k04Q8J46np4j5j08k9J4mk3o0L35j16j1p5L0j28J90k26J7P3N2M07m04m4
5255a1PM6j46j99N26J9j59o4m4j44K05K3j95Q4J72N1k23J74j62m9K61p3r8K5j45
5280a19L32j01j16J46m67M67RrR7m6r9P7r1M6N6n7m0P0q4j40J79j03k31K74R2
5305A42k0j91j17J24J94k16R8O1r0J39K75n61K47j82M0J09r0k15L4M85k08n6Q5
5328H7q6%j54K14L80o62K20J82r1m8j84p3k9L34j22J22n45L09J51j5K03j80Ln8
$$ y = [-116, 215, 9, 289, 28, 98, -210, -51, -170, 24, 137, -185, -199, 58, -196, -188, -123, -221, -37, -113, -118, 149, -290, -57, 36, 31, 110, -172, -119, 146, 206, 86, -59, -149, -153, -145, -22, -248, -180, -115, -141, -259, 108, 266, 38, -107, -98, 14, 31, -40, -9, 258, -83, -110, -197, -59, -121, -59, 40, -77, 119, -34, -15, -108, 23, 180, -23, -30, 65, -87, 45, 11, -22, 213, 163, -41, 47, 193, 188, 114, 99, -9, -38, -24, -28, -51, -111, 224, 108, 97, 22, 52, -76, 114, -112, -95, -22, 30, 437, 33, -11, -4, 42, -104, -303, 223, 242, 83, 19, -25, -169, 36, 59, -136, -52, 120, 171, -52, 122, -40, -89, 172, 99, 1, 26, -119, 213, 112, -4, 142, -325, 142, 151, 142, 239, 193, 94, 171, 80, 126, 182, 125, 85, 155, 71, -69, 110, 7, -224, 50, 142, 122, -69, -186, -62, 132, -84, 14, 75, -15, 124, 399, -162, 85, -97, -57, 52, -38, -253, -219, 266, 58, 2, 87, 1, 1, -153, 61, 441, -221, -1, 181, 90, 42, -142, -215, -244, 90, -32, 90, -455, -146, 5, -10, 193, 13, 16, -42]
5352d2J7P6j56j39K48k50J62K69j28r1P4J58j66k13J74k0K2L4j22K33Oj03P3j62
5376d6n2K17j54J32mj31O6k0N9q3l0J10k7J79J4j58k89L38l73J50K51o9J07k69
5400h2K73k81K08l7r5J18J70j91j11j24N5J6P5j39q6K51M5N0m5n6j02P2j00oL38
5425B16k54KJ11r4P9N2Rl30J00j21K27p3P1J43k76R5J88j38N8k17J28J91k74J2
5449i5J52j08L38j79j15Q0k08K12k10J12rj47K17J15p6j1lj95J35K27l17J82J7
5472A14j89K47l50K14O8k61L10j3k63J43j60j24K29L6J1K7j31P8M2j60M21k64
5494B5OJ33L2j11j0P2o3M0j14Jl5j33pK40k97L41j71k07L96k32J06m1k03K44j37
5519a25J44K49M5o39L09Q7L4l9q5K01k29Q9J55j63k19O1M42l68J62l13J51J47
$$ y = [-42, -25, 51, -105, -244, 4, -246, -84, 185, 57, -34, 40, 198, 32, -181, -7, -27, -5, 29, -93, 140, 146, 43, 116, -46, -98, 119, -35, 97, 93, -38, 28, 8, 67, -16, -46, 64, 37, 216, 230, 72, -217, 121, -252, -102, 149, 80, 187, -82, 191, -90, 118, 81, -14, 104, 274, 83, -28, -152, -97, -81, -6, -145, -231, 20, 65, 115, 70, 14, -88, -16, -116, -122, 216, -38, -36, 75, -19, 60, 112, 121, -209, -109, -230, -3, -76, -5, 138, -138, -43, 145, 7, 65, -152, -24, 167, -107, -95, 57, -51, 287, 108, -7, 73, -135, 77, -133, -21, -30, -177, 40, 155, 79, 68, 65, -130, 5, 232, -85, 97, 114, -75, 172, -178, 36, 104, -157, 153, 140, -123, 20, -140, -264, -35, 1, 12, 39, -92, -14, 28, -132, 289, 25, 31, 164, 196, 85, 75, 147, 84, 124, 10, 11, -24, -157, -164, 76, -221, 120, -51, -258, 138, -94, 12, -29, -232, 12, -125, 19, 268, 313, -326, -17, 70, 104, 65, -20, 181, -48, 41, 196, 33, -186, -125, 317, -51, 111, -202, -51, 96]
5541I6k33J92R1j39K5r5q3K28j87O1N4j68J92j80J06K21k53j3J17j57j33L03K00
5564B45k81m9jJ06k64R2l3M30q3j6l56J06J89j70j03K14m9O7o4j83J73j94M5M36
5588B57k22n9j3K40o3j68M5M2j50j11K69O3j84J16p0j3q3J4J19M1m5M0J11k68
5612i2N1k37J75r4L7J44j1K9j7J08j94RJ77j89m2J35j6P3j34J04j8r0P2j49M12
5637B43j48k12q0L23l69J99J50j36L9j52K88j52O8O7O1k46J03J8L4m02J53P8J69
5660I6K9J92j42k81L23k73k5Q1N2k14L89k45M1R5k68K07k25R9K56j14j78J15Q3
5683I3kl9k1J5j55J58l9L8Oj36OK03J09k59j64M0L57k15o4j52o0M04j73J2j9J50
5709I3k22K3K31k62J59j17R9k4L7q0J40j67J26rJ19k20q7J09R8K35q2j00J33m52
$$ y = [96, -137, 55, 146, 7, 32, -63, -146, 82, -105, -44, 10, -158, 34, -146, -40, 181, -72, -85, 32, -125, -258, 45, 245, -36, -85, -86, 20, -244, -152, -185, 245, 162, 146, -210, -104, 85, -85, -188, 26, -23, 44, -20, -203, -30, -224, -179, 257, 35, -24, -37, 203, 140, -28, 17, 59, -91, -202, 67, 130, -54, 62, -8, -21, -104, -90, 29, 70, 25, 65, 176, -92, -41, -278, -103, -197, -160, -16, -27, 2, -15, 93, -101, -92, 85, -104, -146, -11, -27, 46, -88, 16, -2, -92, -20, -169, 243, 95, -117, -197, 126, -243, -44, 106, -30, 9, -143, 145, -7, 61, 128, 189, -57, 46, 64, 98, -304, -151, -73, 96, 125, 317, 175, -106, 217, -56, -81, 0, 52, -162, 227, -18, 23, 118, -150, 57, -168, -69, 187, 73, -105, 10, 93, 91, 52, 31, 46, -109, 49, 10, 48, 54, -82, -76, 127, 236, -23, -187, -147, 210, -5, -69, -221, -281, 123, -50, -38, -57, 93, -129, -106, 125, -137, 22, -95, 4, -20, 17, -63, 77, -90, 36, 27, 146, -74, -161, -52, 46, 281, 199, 99, 232, -220]
5733b20K17r8J66j12P8O5r2p2k7K47j9r9j0J14j77M6qP3P4p8J59j41q8O6j39K17
5759A42J11m6k73Q5M4N4O3j46k02o1K3j2L04m5k32J35j47oL84j59j00J96l20K8
5783a80R3j18K44j32l3K9K12j91j16K66L8k5j26O0M7k72j6J38J83j20j78j5M47
5806B35n56L16p0K88j74N7j35l3O2j55k6K42j9J19j63pj03PL35j9j4m03J00j83
5830b99L48J7O7J80n31K80j30M51k63n3p0o3j1J47l1j37K60m62M03j03N4j94p6
5853b16J66j2P2j57J63m43L88L39l07L2q4K33l19J63j56M9Q6j59q6K40kJ97l80
5876a93J55K67j73L03o1l77Q7m7k05L79M7j71J2R7j18J35k42J47l8RJ07r3J3O
5900D6R5p7P6j16K02k19O2k06K46j71L18n1k65L04l66j12M11m49L84l62J38RJ65
$$ y = [-220, -3, -101, 65, -47, 31, 96, 4, -68, -95, 152, 133, 34, 24, 138, -39, 7, -1, 72, 146, 68, 227, 86, -2, 64, -75, 142, 253, 207, -66, 19, 63, 117, 180, 34, -168, -229, -206, -218, 86, 41, -191, -56, -203, -209, 175, 16, -84, 112, -208, -180, -87, -205, 39, -93, -126, -97, 115, -76, -192, 74, 112, 87, -39, 21, 68, -204, -220, -82, 101, -19, -197, -212, 235, -321, -5, -75, 213, 39, 96, -39, -72, -10, -165, -191, 51, 32, 151, -12, -19, -122, -115, 220, 201, 187, -216, -116, -299, 49, 66, 133, 313, -218, 62, -68, 383, 120, 67, -3, -66, -77, 70, 39, -98, 162, -300, 103, 0, 54, -140, -216, -50, -62, 10, -147, 16, -427, -39, 300, -7, 25, -59, 174, -145, 18, -138, -89, -3, -162, -248, -8, -10, 187, -193, -38, 229, 56, 359, 298, -79, 8, -39, -244, 135, 182, 11, 23, 120, 2, 137, -105, 42, 4, 13, 120, 27, 40, 46, 141, 64, 140, 24, 226, 7, 69, -137, 109, -62, 256, 205, -60, 244, -122, -234, 177, -272, 112, -250, -112, -103, 62]
5923F2PL5l4O5j89q4Q5j60K10j58J65j92K70j36r0J86j80J12j06J05M6j23J24
5946B0K3r2j2n1R2o0o4K26K28j12p6j12j9J43J23n07J92q6K82j78j0J78J48l76
5970a00L13k56R3KQ4k57O3j40K98k19j37M76j11j87n0L72j34q1K0j6R6j71J00
5993E8j26L9k7q7J29k08L65j74P1j1k43K57k21J07j9J66J68l60K6o1K78J38m41
6016a76J15jn1P1P9k2k9J8K18m48L87j72j2k6O4kM6j10l4M1K9Q3m7qK1j8j35N4
6044f5K52qk92K2oJ27j8Q6j53K6m8J03m6L5r4nL06k10J66r4j39j41L09R4l01J98
6070A04l87M23m9j76j48K18Q1o7J67q1kp5J01l5p5J63k17o1N8R8o0o0J60k54J40
6095c4K08K4l06J46M7l4j01K45k61L50m55k8J82q8K74k51m2K24j13O8o6kJ70l49
$$ y = [62, 69, 104, 70, 135, -54, -138, -53, -213, -3, -161, 4, -188, 82, -54, -144, 42, -138, -26, -132, -27, 19, -104, 20, 43, -49, -61, -112, -20, -80, -144, 82, 310, 198, 122, 10, -9, 134, 257, -250, -58, -144, 138, -40, -50, 128, 276, -100, 213, -43, 50, 52, 136, -121, -58, -198, 100, -119, -256, 220, 109, -78, -128, 244, 110, 29, 49, 33, 129, -42, 58, -68, -29, -56, -143, -14, -222, 143, -31, 40, 29, -214, 43, -178, -71, -90, 76, 244, -116, -90, -151, 127, 265, -176, -61, -62, -113, -42, 37, 15, -14, 4, 222, -226, 161, -11, -23, -49, 15, 13, 59, -51, -85, -44, -15, 68, 21, 13, 34, 16, -119, -65, 187, 179, -113, -91, -97, 30, 12, 98, -55, -29, -77, 26, -20, 15, -79, -84, 222, 12, 178, 84, -55, -196, 113, 207, -94, 104, -283, 140, 91, -85, -233, -15, 66, -1, 166, 85, 83, 8, 109, 74, -1, 162, -55, -116, -58, 40, -20, -80, 80, -174, -34, 174, 198, -108, 38, 85, 51, -50, 195, -66, 284, -171, -199, -17, -105, 169, -82, -124, 100, -13, 55, -11, -13, 157, -192]
6119a92J93P2K9j82m9L5K48k10j81J83J85k23Q6j36J04K85j25n7Q6j44K27j74
6141F0n5L7r7J66r5m4j44L17j7j73M0m3J51m50K13K6n9o9O06k23j77K55l45K2
6165i8L51j58j01J14l40K36j29J68o5J23k32nJ25J76L0m22M14k98J73J67j72q3
6187b6l51M47rN7j37J10o6j4L48n22Q5k88N14k39OJ63l85M42k47Q1Q4j44M47l31
6211B5j4J14q3j27L26l75K57JL3k38o9j06L24j65K18k35j19K04k00J99k24K14
6233d0M7j20J58K30r6J8l48J44K6j16J65K8mj85Q6N6L6k23K18j04J0K5j01P6O5
6258E1j32K20j36K9j09J9O4o2J10P4m57K25L22mm6k12j02j9L70k50J75l09r9M68
6282A90j0k42m2L05m16K1K50k8k60K70M7m3J64l33K77k34K05j10R4k76J29K84
$$ y = [-192, 1, 73, 102, -80, -129, -94, 154, -56, -237, -54, 131, -92, -6, -142, -38, 247, 122, 65, 151, 7, 234, 60, 5, 42, -55, 111, 16, -28, -172, 145, 128, -45, -5, -48, 103, -347, -134, -108, -167, -236, 370, 147, -30, 225, -120, -98, 253, 95, -6, 108, -232, 4, -125, 43, -22, 101, -131, -136, -11, 165, 195, -227, 187, -111, 62, 229, 57, -26, -377, 70, 61, 118, -19, 91, 25, 11, 359, -163, -78, -366, 148, -91, -85, 78, -307, 135, -112, -31, 53, -91, 356, 25, 11, 125, 42, -85, 241, -134, 123, 124, 157, -81, -150, -256, 68, -97, 121, -114, -233, -29, -229, -30, -254, -40, 7, -113, 45, 275, 179, 197, -151, -7, 19, -97, 68, 96, 92, -93, -7, 49, 85, -138, 80, -24, -14, 11, -90, -14, 51, -81, 139, 3, 32, -77, -58, 6, -56, 54, 128, -329, -104, 218, 214, 168, -44, -146, -165, 205, -45, 130, -179, -278, 190, 180, -62, -104, 201, -215, -194, 56, 28, -232, 38, 85, 42, 206, -127, 150, -84, 121, 11, 105, -171, -42, 242]
6304B42j54j26J78k29K11j70K19k27J5j10R0K72n5k04J28q2k13L3J46J64j2j10
6326Fk01L66p4j95j06K21j5oJ03k55J01L10k01J59k13K04k26K3p0kJ28J34k12
6349b1N8qj03J85o5o5M3p6p9l1%j61L42K76k44j4p2Q3M2j92oK3m5J52k47Q7M52
6376C14o49N00n4j36Q6l82K96k13L22k38J20j34K10j06K12o5j19j06J98j16L5
6397b5J81k11l4J00n9L97m60J02m5J46j01K6J30j22j86L64jk34k34K70R0j50K31
6420A75j11n3J5M4j28J06r7q8K84l16Q4L55r7m18L31k64J1m0J08J63j71O5k8N6
6444a4L9o1k12J93j37J23p6L1O4j5K00j43M7J7Q2j41l3N1PJ47k70J00k9L6j7j
6470a2J07j64j20J00RJ07L01k30O9k25M3m0K7m2O6o8N3j2R0P0k02J35J39n4l7
$$ y = [242, 88, -38, 140, -89, 122, -48, 171, -56, -41, -151, -61, 211, 156, -48, 80, -2, -215, -182, -36, 128, 116, 6, -195, 171, 97, -98, -204, 17, 2, -4, 99, -156, -55, 255, 54, 213, 0, 204, -22, 1, -69, -71, 57, 191, -21, 37, 29, -74, 111, 46, -19, 24, -52, -131, -162, -162, -323, 19, 295, 51, 37, -35, 48, 90, -102, -108, -85, -130, 22, -225, -138, 314, -335, 165, 111, -25, 61, -321, -25, -238, 84, -154, -34, -168, 42, -64, 148, 83, -36, -142, 56, -60, -25, 156, -55, -89, 11, -48, 349, -111, -9, -54, 92, -9, 17, 147, 25, -161, 203, 202, -32, -266, 4, 94, -56, 175, 64, 11, 26, 70, -58, 48, -49, -137, 147, -169, -85, 270, 173, -245, 86, -178, -167, -207, -99, 64, -107, -42, -70, -14, 25, -36, -248, -55, -192, -69, -145, -114, -50, -65, 135, -8, 39, 56, 138, -3, -36, 15, 22, 169, -101, -1, -30, 6, -11, -12, 95, -69, -189, -89, -80, 27, 328, 98, 167, -58, -15, -55, -28, -70, -4, -72, -19, -31, 59, 129, -73, 62, 201, 147, 110]
6495A10l8K14k79J17P1l16O0R5j2p2K31j44j05J27l0q6J03o5j33k6K89k2j26J15
6519G8j83J39l7R8q0j12l6m1K32l2R0p8J48m51J57J86K1l22N1K00n8K92l69J79
6543G2P5k93J83q0J86j3j41k10M21j39OL0j8j15K6j04J86Kk65L55o7M6j97K1J98
6568A65k03K5M5r9K76M3j77l12L87r4J07l28J55Q1pm4r0K1j62P9L31k40R0M55
6592E04n19o4O5k4J49pj70N1P9m30K83J08j31K53l56J81K10m31L27k23P5n6J31
6615En6P9J68l39K9R9o4k58L43pp4j03K21L44l99J31n3m8l43L16J30k30K81r3
6639G9ON9J4Qj45n6J37j30J55M0m08M19k18J03j85O3j93L2K86j16J83l05K05N0
6663H3j23j21J30j45J88j07R2j7J27k60K20m4N2J13l18J21R0%k2N9m14M06R0m1
$$ y = [110, 72, 286, 7, 124, 195, -121, -61, 34, 22, -50, 181, 37, -68, 59, 29, -57, 46, -19, -152, -178, 111, 89, -37, 78, -105, 34, -3, 95, 15, -97, -133, -174, 58, 26, 116, 38, 186, -265, -108, 78, 99, -223, -172, 28, -30, 262, -107, 72, 147, -146, 37, -43, 143, 130, -11, -221, 200, 61, 67, 97, 79, -36, -10, -114, 72, 74, -191, 164, 97, 143, -54, -33, 165, -38, -13, 32, -67, 209, 252, 75, -237, 150, 56, 163, -165, -10, 71, 64, 20, -70, -49, -211, -132, 199, -41, 49, 504, -15, -79, -14, -38, 111, 104, -66, -15, 64, -366, -83, 25, -106, 147, -209, -28, 182, -249, 78, -145, -70, -126, 5, -51, 28, 196, -143, -114, -15, -79, -337, 6, -1, -75, -178, 43, 387, -12, 119, 66, 18, -325, -9, 121, -109, 172, 79, 85, 144, 158, 166, 21, -35, 102, -28, 127, 167, -241, 178, -40, 63, -122, -59, -252, -220, 66, -50, 133, -172, 33, 83, -40, -161, -31, -176, 12, -95, -3, -20, 107, -153, 67, 23, 75, 188, -130, -9, 81, 81, 59, 118, -296, 110, 200, 159]
6687A59k97J99j41o1J62j89K67p6jm0j72o4K75k06K86j6L3k58J28l6J04m1L9J36
6711A90p2P4j90J16M2O1j95k57K00n3m6L9J08Kj11J73k90K53l9j04j40R9J47j33
6735a26J13O3Kj68k1J37K08k01k4J21j05j71K37M5j24J73o5j71j14q5M84l08j46
6758b46L26j49J8k39L95k61J56l7J86j00k1mj91L42lk48j22J88K6r0K15j07QK18
6782B60l11M2L33k48k9Q3q3j65n3K25O9r0K2q9P8j73oJ96j14m6P0j12J44K7k69
6807b39J31J09j00j35rJ91O3j30K28J44k31j28K40k06n6J77r7k0J54p4L0P5l64
6830b47NM40l80J22k4K5K05k81M5l31M03r3K54j67J0l5j55L65j24Lq9m4O2j16
6854a47L47l29L19j06k96J87o2l3K10J88k55q3M7J45j13p5J24j55r0K27k28J24
$$ y = [159, -138, 61, -80, -141, 21, -168, 99, 23, 22, -18, -190, -254, 21, -185, 101, 85, 118, -140, -12, -48, 56, 15, 54, 190, 118, 192, 2, 118, 160, 221, 26, -231, -31, -84, -130, -91, 17, 19, -92, 81, -209, 44, 5, -99, -239, -140, 7, -126, -13, 50, 52, -116, -137, 0, 208, 7, -17, 104, -1, -172, 65, 110, -14, 159, 94, -77, -191, -276, 208, -100, -246, 80, -69, -51, -290, 105, -156, 0, -37, 149, 49, 28, 24, -167, 175, 172, -76, -198, -10, 16, -74, 141, 34, 42, 260, -51, -9, 324, 76, 47, 130, 47, -118, -171, 54, 123, 33, 55, -34, 44, -129, -135, 61, -53, -99, -29, -141, 3, 30, -239, -108, 1, -99, -234, -243, -52, 11, -119, 109, 253, 22, -106, 134, -72, -128, 49, -48, -68, 86, 12, 42, 117, -247, -242, 198, -182, -60, -84, -59, 146, -135, -90, -421, -18, -111, 143, -24, -14, -49, -204, 161, 37, 40, -49, -93, -31, -147, 200, -129, 190, 84, -212, -25, -87, -120, 90, 278, 23, -60, -13, 132, 19, -56, 68, -87, -177, 50, -178, -54]
6876e4K55q8j36o9n4J50J26k13R9k1J47j53J53j14q6R3R6j04ON8o7n1N4k17J15
6901g5J24O6Q1J0k86K05l86K0L66k16k0j34Q0J05N6J28j0kj2j97j95P8L32k33
6925a15J40J6o3l32J62J65J60j62J10j63J44N0j66j65J05K29oL2j93K77j65j31
6947g1K63l21L50k45M8J40r6r8k9K2L70l80K15n3j9j67l2R1jLj75kJ56J08m0j06
6973f9q0J76p1J17K4p3j44J74j85q8K29j31J2L9N5k3M3K29k17N6L9k20K09k09
6997a08K54k58K0N7K11k38J19k5J63k1l82J29l8P6nj73L64l3q2o8p5K4J90J19
7021B20r1j04Q2r9j4j54J46l06J75N1J91k44R1Q6K1k90M57l87N1J35j44K04Ll04
7045b24K97l24J57q2M4n9K22ok01J7R3l9K77k08j32L04p5J32m2r5k22K52j58j5
$$ y = [-54, 201, 113, -23, -92, -146, 4, 130, -83, 16, -5, 142, -11, 142, 28, -58, 35, 131, 27, 33, 91, 24, -27, 27, -190, -75, 49, 115, 196, 206, -80, 125, -261, -241, 125, -91, -111, -245, -165, -60, -4, 124, 114, 112, 100, -97, -292, -214, 118, -115, 25, 41, -22, -354, -192, -27, 133, -29, 81, -82, 62, 112, -54, -219, -114, 115, 109, 141, -52, 225, 60, -71, 192, -129, 221, -24, 24, 164, 68, -30, -59, -37, 333, -47, 168, 115, 96, -71, -103, -12, -13, -10, -185, -187, -31, 77, 37, -69, -149, 27, -44, 73, 97, 24, -120, 54, -131, -219, 10, -121, -109, -70, -15, -38, 5, 234, 17, 73, 112, -108, 101, -108, 146, -112, -92, -35, 176, -62, 57, 32, 195, 174, -208, -79, -117, -41, -46, -219, 145, 112, 30, -38, -113, -89, 101, 220, 129, 25, 107, 8, -6, -160, -14, -320, -145, -94, 97, -147, -56, 30, 51, -239, 218, -169, -118, 17, -127, 77, 80, -224, 73, -251, -94, -176, -132, -191, 31, 25, -176, -159, -66, -105, 172, -36, -168, 136, 61, 193, 151, 56, -166, 86, -72, -87]
7069h7K07j62R9J39l06p4L28j20J41P9j95k78J23K15r9LK8J76j94l44L77K31l54
7092f7nL12l71J47O8l18K95J07j05q2oK22j75R1k71J59q0K61k16n1J25l46N69
7115B63l77J65Q2k9J9j60J9k03J75L05k88q8R9j04K37k73J10J02j38J96p3j63
7137a24J59K41k22R2j51OR2p7M7K07j83k8j23J64l80n7L22J93q8o5q6q8R4J36
7161H1kj94K64k85K51N2j22R3n7p4j52K96j65j1J91j34l7P3nQm1O6L9m25K01P4
7187a5k41K85l4N2O4m86K86j0Q0J0R4j58K30j99J2J00j42K84l57J35J50j16k54
7210b30K93q5j99K59J25j08q3J1l52K82j1J82j27j80L04K5k20K32l12K93j29M0
7232A0J40p2k55k2K74j34J41k84K62qN7L2r3j03n0J6L6M4J83j24j69M59j25p3
$$ y = [-87, 120, -42, 57, 196, -110, -184, 144, 24, 165, 244, 49, -229, -106, 109, 10, 13, 41, 217, 23, -321, 56, 287, -67, -72, 240, -131, 16, 84, -234, 61, 168, 63, -19, -25, 197, 22, 113, -158, 1, -79, 182, -34, -85, 40, -306, 263, -114, 51, 133, 104, 123, -37, -18, -221, -46, 259, -29, -117, -18, -122, 115, -158, -48, 54, -84, 112, 39, -124, 35, 276, 54, 146, -5, 1, 93, 16, 63, 270, 87, 59, -64, 100, -280, -337, -15, 178, 90, 25, -61, -149, -55, 81, 79, -115, 149, -136, 115, 167, 45, 138, 81, 7, -145, 151, -14, -25, 166, 32, -5, 68, 63, 71, 30, 96, 135, -290, -89, -15, -256, 29, -5, 47, 111, -375, -89, -99, -19, -9, 85, -73, 157, -42, -30, 70, -72, 212, -145, -10, 140, 24, -230, 63, -22, -221, 38, 163, 55, -28, -17, -369, -87, -98, 84, -43, -223, 81, 106, -114, 118, -194, 99, -30, 10, 150, 78, -177, -199, 75, -59, 82, -202, 60, 52, 109, 141, 48, -55, -105, -89, -53, -9, 174, 50, -119, 340, 215, 142]
7256A42J37l50j1j59K11J42r0p5J0m7j08K72R1J92k57l0j09L19l35J14J12j97
7278b6Qk08L1M05o8k72J55j58J46J38o8j79J41r9K54k97M2L58j52j51M1r3J91
7301A39J10j85m9k79O9J15n4M5K89j00j16J27K8j56J02j1l9q9j04K14j62K26j3
7324A07O8k84M9Q9k63L00J07k24K95l83j7J92j47n2K41p0K8J40l38o5J69N5Q2
7347G9j52J66P9l39K02J38k86J44J47k03P0J37j89n2Q2j6J94l93M26l97K16KJ46
7370B01J9n12L03j36J72m4J8r1J34l0J30j03J10k43J22J3n4Pj07K12j32J07k11
7393a15M5J12j4J97j61N5j17J71j62k98K24j23K24K6n9k62J48L69k47j9l60M74
7415A08l29P0K00K38j43j02J3l3j1P4q2p7M0mO9QJ16k47J0l9k66M45l46K26J80
$$ y = [142, 279, -71, -82, -241, -30, 112, 22, -53, -43, -90, -198, 74, 165, 357, 100, 70, -39, 280, -55, 59, 171, -26, -18, -226, -195, 210, 142, -130, 25, -133, 13, 151, 83, -96, 45, -54, 200, -97, -55, 303, 151, 0, 41, -52, 139, 249, 64, 15, -264, -195, -80, -134, -89, 200, 100, -16, 111, 139, -17, 85, 74, 35, -54, -158, 56, -106, 120, 107, 175, -109, -60, 29, -234, 66, 173, -51, 244, -139, -156, 36, -111, -163, 78, 8, 36, 176, -162, -227, -58, -3, 79, -73, 93, 172, -167, 35, 173, -113, 31, 178, -25, 45, 182, -7, -59, 23, 7, 201, -192, 234, -163, 53, 55, 201, 220, -292, 11, -125, 47, 3, 21, -70, 64, 34, 164, 61, 171, -72, 50, 63, 9, 16, -91, 121, -11, 96, -115, -70, 42, 28, 225, 64, 119, 2, 173, 11, -287, -63, -186, 38, 64, 5, -257, -109, 260, 13, -6, -366, 108, -221, -151, 49, 287, 144, 42, 55, 22, 11, 85, 3, -74, -34, -38, 31, 39, 155, -92, -82, -121, -387, 58, -288, -62, 118]
7440A18J09j68j9k78K19j47L02k31J52j7P3j20K22l81K11J50j29j75J25M2j20
7461f2k3Q4j7n3K4j52K98j0j34K29j66j60J78j55L29k82K28n5l24J14O0Q9l8l44
7485c42L59L1j02lO4Q3o9J15j52k8M6L35j84j30k50R2L79m86J4L8J71J10j15j91
7509b15K52j31JK44l19J30J57J77l12o0K73m2r7j16j09L36j6l1j3k05j1l1J87
7532D9J5K24j40j29m3j19J86k67K12j00J14K2J06r1j62K13k56J75l71M91J8J2
7554A59r0j00K0J53o4q0j2K70l51J16l08K21R0l1J61J65k76j88J36j00L69m52
7576a92M9K63K1J8n1M4j62J76k11n8J44J10m18K10K32j62m2j45K06J48n4j85K04
7599A45k35J38l8%k9O4n2J92j58j24J71R3j89j80K06k3K28l23J20K10j43k0n4
$$ y = [118, 227, 59, 40, -238, -19, -166, 136, -95, 57, 40, 113, -7, 215, -166, 45, 195, 66, -109, 16, 58, -62, -85, -1, -18, -71, -47, -199, 99, 89, -45, 184, 18, -142, 36, -119, 210, -72, 156, 101, -223, -109, -49, 40, 2, -342, 17, 48, -54, -57, 7, 90, 21, 136, -16, -44, 2, 337, 153, 23, -227, -135, 244, -242, -228, -190, -19, 91, -24, -215, 37, -94, -93, 151, -168, -38, 119, 296, -16, -76, 197, 155, 58, -58, -167, 169, 153, 122, 109, -96, -107, -138, 49, 64, 288, 148, 19, -24, -143, 43, -224, -12, -112, 2, 24, 130, 39, -123, 90, -166, 9, -362, 129, 147, 159, 69, -31, -11, 142, 78, -2, -14, 256, -95, 21, -287, -66, 24, -7, 154, 319, 43, -145, -9, -109, 260, -192, -143, 120, 141, 159, 108, 152, -10, 166, -45, -103, 41, 151, -267, -57, 175, 13, -29, -174, 32, 180, 126, -59, 145, -90, 48, 10, 10, -19, 45, -7, 185, 27, -97, 74, 167, -22, -202, 4, -19, 209, -114, 6, 216, 73, 53, -1]
7622aq1M7J33J33l50K19k10K60j46J23j28J57M4l88J53Q3j09K33l60K54k1lP7
7645A19Kj24q6k5L0Kj11K15O8k93L08J70l17J02n5q7Q9J22j14o9J09j19kL62k47
7670D9q5J79L9j15L3l33K95K4j46j73N4J94J19j0k06j72K58k4j46J01O1P5j13
7693d2Qq0L2qK66k2k03J31j21k21J30L76k14p0J41N7j32j35J24o9J46P8j75j49
7717a52J25q9J17k90J46q0J07K80j22o6M2j25J11O8J19k55J19J47j51k39K46j23
7739f5O1M8K40k99P1J24q0j15r8P5M6Oj62M09j93o9J67P3k54J79l15k2K59m8k3
7764A5nL3r8J76j75n2L54j39j31n8R1j43L02J03l48j48L38J7q2m8J00K5q5O5r1
7789A6M2JJ4k14N0J28n9j83L44R3j32j95K95j16l6Po9J09k54K46p1o0k61M78n7
$$ y = [-1, -82, -35, 98, 231, -119, 100, -110, 150, 4, 127, -1, 156, 200, -188, -35, 48, -61, 172, -188, 66, 45, 42, 119, 121, -3, -89, -114, -84, -82, -193, 22, 90, -203, 105, 275, -42, 60, 5, -82, 7, 129, 15, -54, 55, -64, -66, 296, 49, -36, 143, 182, 67, 100, -233, 62, 86, -60, -233, -179, 15, 134, 124, -82, -254, 4, -20, -166, -65, -4, 71, -42, -34, -114, -82, -90, 176, 154, -49, 82, -39, -260, -130, 246, 32, -38, 103, 160, 28, -107, 17, -52, 94, 172, -3, -152, -27, -116, 1, -289, -143, -223, -116, 164, 42, -24, 18, -107, 4, 72, 191, -64, 55, 202, 51, -188, 58, -65, -4, 44, 284, -15, 56, 180, 100, -15, -113, -38, 8, 14, -148, 261, 68, -1, 166, 239, -15, 164, -151, -173, 86, 38, 15, 10, 43, -55, 121, -54, -106, 248, 109, -22, -80, 11, -132, 170, 273, -75, -223, 115, 132, 50, 2, 102, 127, 42, 107, 16, 58, 59, 73, -141, -91, 37, -22, -205, 139, 232, 100, -95, 200, 84, 48, 55, -14, 95, -159, 87, 16, -44, -305, 173, 116]
7814A16k69K06l30K58J38k75K81p3l9K03k06j4j05j13L49l39K57r1O4K55m7m16
7836a90L34k94J47k8o1J25j39N5J96k86J39N4J74p2j28P3Q0j68j99K45j52J41
7858D6j85m9p0L20J01k90J68q1J7nk3m4K1k2J80p5k6J05k58m8M56Kk41j30N3M3
7884c5o2J68o1O5j40R1j12J86O8j99M7n0J28j15k06K11j14J16P6J27J07j89J30
7907B37k31Rl02L13r6q0K71k45J11O0j81j37J47n1mJ18k3M3K42k30o9J89k85L92
7931A98k19m8J67k90J17K7J08o7j7j4K40k88%J82nq3r7J48l07L75l52J13j7K26
7955I7rj61j3J59j61L3J15M9o8l3K22l34J08L3L9p3q5J52j78J81p5k02J74j59
7979a89J89Q8o6k5p7J4L7J24q2j83l2K85Q0k36j58J46j34L04J27k63K39k51M4
$$ y = [116, -153, 53, -277, -19, 119, -156, 125, 52, 13, 216, 10, -4, -109, -222, 127, -212, 45, -46, 18, 273, 226, -190, 144, -150, -3, -31, -92, 33, -106, -51, 145, -141, -2, 52, 226, 154, 26, 99, 179, 11, -188, 57, -95, 46, -139, -188, -258, 62, 163, -127, 41, -40, -23, -28, -51, -95, -74, -96, 84, 9, -17, 88, -170, -218, 238, 240, -1, -131, -78, -35, -97, 71, 10, 75, -65, 26, -86, 100, 168, -31, 16, -34, 94, -21, -227, -16, -130, -14, 62, 189, 296, 107, 237, 6, 15, -287, 26, -70, -150, 121, -124, -13, 47, -134, -271, -124, -175, -179, -61, -84, -41, 201, -29, -98, 91, -194, 198, -21, -69, 98, -192, -75, -48, 60, -7, -24, -38, 202, -86, -86, 96, 91, 8, -89, 59, -248, 127, -225, -112, -129, 97, 88, -73, -86, 73, -88, -55, 60, 109, 41, 8, 230, -104, 4, 37, 76, 3, -82, 70, -108, 73, -2, -204, -30, -189, 0, 88, 22, -3, -80, -66, -29, 95, 13, -170, -202, 83, 163, -73, -231, -85, -219, 85, 212, -51, 188, -63, -19]
8002a9O3M3j27j33J79m5K19M2l85L63j31l63L93k62K03K80l03j9K6k8P8J35j37
8025G2o5K22l11K38j46k8J94k09K9K23j03r3o6J68l38J67K00k93J58j02J53j60
8047i0PM98m19J10pP3N4j17k14O1P0l1J07j7k9l65L47J4q5O6l6K54j60j62L1k91
8073c31O10n36L68j44l9l5P3j0J2q8K22k69J35k10J75j46J3L02q7p0K5P4k25j9
8097b00K92j15J1Kj2J77k28J26J0j53Q4j53LR2J93l9j76n4K59j9k5j21M8n9L7
8122b0J61l17L17k57J29K5P9l04J39K42k29L5n1L63l23Q9q6j38K36K0j37M00k90
8145H3L1o5p5J42q0p1J20j01J64p1k97K30l4J21o1j2M8k27J43Q1q3L04j91j4k22
8170a37L04j05l55K88J68j57N3J36l20LL2K45l36R5J59k45K85r2P0M3j87
$$ y = [-19, 44, 87, -40, -173, 6, -39, 180, 222, -163, 200, 69, -294, 99, -163, 40, 320, 17, -2, 24, -4, 74, 209, 72, 7, 229, -82, 156, 10, -18, 176, -33, -4, 219, 116, 23, -43, 125, -213, -46, 154, -139, 19, -83, 70, -90, -83, 415, -4, 106, 99, 172, 226, 109, -105, -44, 26, -5, 102, 85, 56, -309, 38, 52, -33, 33, -3, 251, 91, -71, -40, -331, 279, -257, 111, -33, -72, -107, -34, -44, -32, -120, 102, -167, -32, -242, -67, -213, -200, 102, 15, -55, -30, 44, -181, -200, 92, -23, -12, -10, -22, 155, -73, 53, 63, -90, -6, -159, -156, -64, 129, 90, -86, -140, 119, 100, 75, -46, 2, -57, -20, 141, -176, 141, -116, 13, 38, 117, -187, -48, 194, -35, 0, -51, 312, -11, 78, -8, -146, 90, 110, -27, 373, 83, 114, 49, -26, 116, 36, -35, 85, -16, 148, 77, -220, 10, -24, 97, 36, 24, 72, -155, -12, 69, -14, 290, 99, 85, -137, 167, 62, -293, -5, 163, 6, 59, 195, -125, -122, -90, 155, -181, -86, 73, -172, 113, 21, 91, 134, -53]
8191e3
$$ Imaginary data points
##PAGE= N=2
##DATA TABLE= (X++(I..I)), XYDATA
0@%%%%%%%%%%%Qj6J6j6J8k6L2m0M8n6P2q5R6j13J34j52J76k06K36k69L05l45L90
34B07m42N00n62O27p00P84q72R68j076J191j315J451j601J766j948K146k363K603
52A364k867L163l492L863m288M773n334N994o781P741q943J0495j2579J5541k0097
67a1447K8038m5629J48172l4141k12842K50298j21932j896P5340j44660J17334
78D6635L8361j76140J43314l0743p1563J12713r1459n391Q6830q5469J5935K1766
90D789k7522N9184m9286k9660R2308o9054o543N7186n8290M1517K9193q4181O2076
103B1717J2523p1270Q3300m7722k8394J08420j06508k704J03660j06899L2717
114a160M5236j07354R9983k1017r2539J21292n6505j9750P1323r8598N9017M0023
$$ y = [0, 0, 0, 0, 0, 0, 0, 0, 0, 0, 0, 0, 8, -8, 8, -8, 10, -16, 16, -24, 24, -32, 40, -45, 51, -62, 72, -80, 96, -110, 126, -143, 162, -183, 207, -235, 265, -297, 330, -370, 414, -458, 510, -566, 625, -690, 761, -840, 926, -1022, 1124, -1239, 1364, -1503, 1660, -1832, 2031, -2257, 2516, -2818, 3176, -3605, 4136, -4807, 5688, -6891, 8650, -11447, 16591, -29038, 119134, 84993, -127849, 122449, 517, -1379, 73961, -70699, 46635, 84996, -91144, 52170, 21427, -50136, 62577, -28882, -34273, 52557, -32912, -16977, 4789, -22733, 36451, -12835, -42495, 49813, -19241, -25784, 31402, -26888, 14629, 43822, -40359, 21717, 34240, -37030, 46270, -1452, -29846, 78574, -27934, -30638, 73022, -33877, -1160, 44076, -63278, 36705, 15688, -76851, 44441, -12064, -31814, 39509, -59089, -72, 39951]
126C9951j20442Q9721J2627p2577Q0974n3027O796N7402r0327N5625L2871q7090
138d7496P0445K034o5637P6750k9373k2913N4362n6449J9312L3247p0077L9417
150C622L0936o7682M8889j087n0653O3439l3898k4163N6630m3215Q613K9895o1265
163c9939N4154P192p0244P6245k3414l3129N8149n5665K3434L8571p5247N3035
175A3142R971o4822P2147l8900k4383P4134o6899J2465L9676o3505M4534L702
187A1262n6575O5314k3295l0149N5964m9584J5973L5348n9962L2644K3114m7217
199b7163L2341n215j9313M8286m1874j611M7516m5597Q507K2585l5510L1749N68
212A5269l9528M7917j8598k0729L9266l8673J5229K4293n0139K9108J4558m1804
$$ y = [39951, -80491, 9230, 21857, -50720, 30254, -22773, -15977, 41425, -48902, 6723, 39594, -47496, 22949, 24983, -40654, 36096, 6723, -16190, 38172, -18277, 1035, 34282, -35795, 3622, 34558, -33124, 15765, 14678, -35975, 27464, -6434, -30597, 26033, -17182, -8569, 21326, -39939, 14215, 21407, -48837, 27408, 3994, -29135, 29014, -26651, -3217, 35354, -39893, 13142, 23113, -41709, 30438, -8462, -32845, 41289, -25610, -13145, 26531, -36974, 7560, 11262, -45313, 20001, -3294, -33443, 22521, -27063, -11090, 24258, -35704, -3060, 20054, -27163, 5178, -37, -19350, 28936, -12938, -14549, 32967, -12630, -4123, 18462, -17048, 14701, 15269, -24259, 23658, 5060, -15669, 23597, -15076, 153, 24446, -25693, 3415, 17973, -23831]
224b3831L7915j4000j7455M4850m4025P706L0968m3102K8151Q342l7182M0663
236A9000j0631k6643M1646l0707O557K6654m4450K5411J2150l6200K7810m085
248F512k0700L4548l0233m245L3640l7697J4626J3187l0213K6538m640k6423L5507
261A0407j5975j1887L3385l3459J2782J9053l5459K4786M473k3867L0189j5251
273h23j4264L7613l1251M166K3156l2316K4018r96k7509L2448j0064j8573L0735
286A6340k4875M179K1268l8844K4748P138k7498K6611r995j2542L0360k5509j547
299a0166K9550l0614J6067O068k5641L0561r362j8446L0047j4828n794K1709l0133
312a0982J7083J2704l3356K5451l012j7138K3064j9650m009K7721k8853M870J6405
$$ y = [-23831, 14084, 84, -17371, 27479, -16546, -8840, 22128, -20974, 7177, 15519, -21663, 19000, 8369, -18274, 23372, -7335, -778, 25876, -18574, 6837, 18987, -17213, 10597, 6512, -14188, 20360, -9873, -14118, 19522, -18175, -3549, 9638, -20575, 5963, 1323, -25100, 10407, -5568, -17455, 15930, -17529, -4747, 14306, -21153, 3633, 8106, -15761, 14428, -823, -15087, 22526, -8725, -4559, 18597, -13719, 10299, 9303, -18206, 14242, 4178, -14395, 16340, -8535, -4356, 16912, -21932, 2816, 9954, -17544, 9067, -928, -13470, 16890, -8619, -10166, 19384, -11230, 4837, 10905, -14736, 15825, 6463, -11983, 18064, 3236, -2558, 19151, -10982, 6101, 18805, -14551, 10900, 7888, -9250, 13814, -5836, -9845, 17876, -10977, -6107, 10298]
325A0298k7979K3460p229j9541L2549j5770j1747K4388k1227O992J6794l3189
337b2201K6551L673k6718K8504j3186p328K7116k5509K811K3306k9837J6467M722
350H371k4806L2771j5136j5006K8215j8504p10J7084k5995J8596Q104l1842K8150
363I292n558j4449K3888j9773K469K1059k7088R542J4704k6924K3777m371k0171
376a3603L1218j7244r561K4213k1467N863J6249l2104K2589O200l1313L1268j2270
389C8j2396K9168k6395J701K4140l1533J7209P822k9740L5796j5693j8173L6014
402A7958k4730Q90K0543k9454K0413O364l2667L2954r374j6554L0072k7031M139
415f477K1696l0554J2823J1857k5409K1233n033j7401K8507j8975m570K2906k2521
$$ y = [10298, -17681, 5779, -1450, -20991, 11558, -4212, -15959, 8429, -12798, -5806, 10988, -22201, 4350, 8023, -18695, 9809, -3377, -10705, 16411, -9098, -6287, 17019, -12818, 3649, 8371, -16435, 16336, 1200, -13806, 14409, -4095, -4805, 12279, -13716, 4880, 12984, -18858, 9292, 3734, -10715, 13173, -6600, -4131, 16928, -10160, -618, 14086, -12838, 10939, 6568, -13603, 17615, 371, -9190, 15023, -6444, -581, 15668, -16436, 6153, 12353, -18960, 12308, 38, -12358, 16810, -9585, -7884, 16256, -15277, 1932, 9754, -19986, 15810, 117, -18056, 17958, -6772, -5882, 14661, -14793, 5620, 11984, -20683, 12271, 2897, -13657, 16415, -10616, -6477, 15219, -15335, -2512, 9345, -16064, 5169, 136, -17265, 11242, -7733, -12303, 10603, -11918]
428a1918O304J5548k5830J5231J0952k5623K2848o432j1200K6771k3905R24K7281
441B0951k9824R359J6820l1683K7242l580k4425L4807k2252l106K5113l4583J8055
454B894J5159m0790L0947O28k7663L2230k2232j36K4594l3344J6223J2794l0577
467a9273K5733k099k3189L1445j4174q764K0887j9146Q792Q223k1852J7934M410
480H927k3557K1761m113j5502K3495j5853n343K1021j9001K210J2644k2089K0946
493E546j247k7151L5597j3879j6256L0565k3475M710J9590l0672K1241M610k7130
506a7951L4989j9393r990L6128l3655N980K2171k8232J7350N98j9253K9432j9324
519a150q266K8563k7877Q816J3902k5871J5356M904j7539J4763n388n467J6820
$$ y = [-11918, -5614, 9934, -15896, -665, 10287, -15336, 7512, 1080, -10120, 16651, -7254, -6330, 20951, -8873, 486, 17306, -14377, 12865, 9285, -15140, 19667, -2585, -5691, 19422, -15161, 2894, 18053, -22737, 8210, 8838, -18825, 13405, -8827, -8963, 15631, -17713, -1490, 11304, -19273, 6460, 4361, -18828, 12617, -1557, -10321, 10566, -8580, 212, 8435, -13417, 4517, 8927, -14630, 7131, 3018, -12484, 11011, -4842, -10185, 10836, -8165, -5955, 6689, -15400, 5546, 4299, -22852, 12745, -1134, -17390, 13175, -10300, -5590, 14000, -16672, 4569, 9179, -17951, 17038, -2355, -12345, 23783, -9872, -3892, 18279, -9953, 7397, 7995, -11258, 18174, -1150, -9416, 19147, -8730, 86, 13988, -11883, 3473, 8377, -9162, 5601, 213, -5254, 11566]
532A1566j8960M484J6337k1475O202J2545j6595Q675N247j6597J8091n473r975
545e928J8757j7504M428J5691k7311J3369J3128k7697K0005k924j5231K4586k2281
558h912L443J8049k8246J7565N517k5567K6594p639j6440K6822j8093K688J2046
571G827k1385J9225j31j8218K1911p148j0731K0092j4016m88J2946j4235Q679
584D328O42r801J2171l838j0284J5693o388r093J5359j0708k62R772j3070O404
598I25N351j3762J2941l301j2151K2917j5473m524J9657j8753O756P101j7292
611i608J7567l932j4315K3158j6733j086J8331k4817J2748P536k0294J5821l756
624F20r136J7434j6710J666J6196k1678J0256M887j4668J4997m155r311J4303
$$ y = [11566, -7394, -2910, 13427, -8048, -1846, 10699, -5896, 2779, 8026, -8571, 9520, 4047, -5928, 12829, -4675, -247, 15444, -11867, 1502, 14630, -13067, 6938, 4014, -11217, 13369, -8912, -5469, 12580, -15666, 1899, 7416, -18151, 8443, 804, -15636, 11186, -6907, -4219, 7827, -13558, 5667, 5536, -12682, 9229, 2081, -8650, 11442, -2574, -3062, 9884, -4351, 4328, 4970, -4831, 7340, 3502, -6782, 8911, 2523, -6570, 8789, -1919, -2181, 7591, -5479, 925, 6276, -7486, 5455, 2154, -9997, 12920, -2553, -7077, 12580, -6173, 583, 7684, -9608, 7959, 4027, -10288, 12870, -3863, -4949, 13382, -11435, 1313, 8849, -11445, 4376, 620, -8516, 8918, -7792, -6126, 10070, -11608, -1352, 3535, -11133, 3864, -291, -9602, 4701]
637D701o608l241J0275j2426Q448N251j6518J3005K652j1787R498k089n495J2646
651H312j3025J134J2858j6440Q481L335j3445J5059m049j2777J8038r642l731
664e892J4135j7846J1597N005j8576J8044l283j0761J7038j2294p19J6174j9612
677f990Q936P141j5886J5824o486q760J7614j1491m008J3842j4547O268N903j6821
691i461J4460k045j1299J3154p275k819J1612j3988L565J1195j6630R197K739
704B405j1086J3219o687n228J4079j0581p39J2133j5134Q643N103j5458J4835
717E504m008p844J4023j1055j182J3842j6220N865Q226j6894J4863l758j0405
730i043J7170j0279m061J4002j3862M607R292j7680J3952J077j3099J5313p427
$$ y = [4701, -1907, -5148, 5127, -7299, 1149, 6400, -10118, 2887, 5539, -6248, 3250, 1161, -4334, 8312, -4713, -3579, 9279, -7161, 1320, 4655, -8790, 6269, 2220, -10557, 7481, -2161, -5892, 8243, -9603, 1994, 6999, -11577, 6467, 3184, -7577, 9461, -2833, -3552, 12622, -6990, 1946, 9087, -6799, 9025, 2539, -6221, 11393, -98, -4106, 9736, -4811, 1457, 7360, -9461, 4999, 2954, -8345, 4809, -2466, -5285, 6327, -7661, -4096, 7099, -9531, -334, 2405, -8681, 4538, -2149, -7377, 6702, -3879, -4618, 7515, -7619, 1024, 6127, -9331, 5504, 1496, -6348, 7675, -3380, -4562, 9280, -6940, -1075, 7151, -9743, 5120, 1362, -9043, 8127, -2152, -6213, 7789, -6073, -1466, 7826, -9854, 4098, 5175, -7924, 7389, -38]
743c8m106J3805j3343K222J1898j6692R877L124j3951J5724o969o919J4767j1927
757b528k49J1785j6013Q225N810j6724J4607l822q707J4915j1522j116J3481j5116
771f974M434R463j5879J2845j966j1427J7531r345n001J4126j2652K682R677j6836
785i322J1773K913j5276J5715o710n501J4010j3156J435J1613j5770P618N772
798E114j4636J5049n437q345J6271j1259j037J2257j3838N944P694j6108J3567
811E236p20j1303J5999r843l041J4004j3749K308J0417j5096R655J445j3467J5869
825G714p052o985J4482j1453J73J0420j4564P942M977j5191J4867m545q393J5581
839G973j1703l87J2527j4154N515P118j4720J2938k361j0427J5975r647k597J1490
$$ y = [-38, -4144, 9661, -3682, -1460, 10438, -6254, 3623, 6747, -7204, 8520, 1551, -5368, 9399, -2528, -2777, 9008, -7005, 1220, 7030, -9694, 4913, 1091, -7616, 7299, -4223, -5339, 8142, -6974, -2540, 6923, -8956, 3889, 1923, -9504, 8027, -1318, -6319, 7807, -4845, -2163, 7514, -9322, 2451, 5364, -9912, 5803, -907, -6408, 7602, -5554, -4119, 7494, -8276, -658, 5114, -9522, 5527, 90, -8255, 8016, -3243, -4280, 7977, -5861, 83, 7777, -8331, 5236, 4516, -6787, 9212, -631, -3672, 10332, -3417, -1109, 9308, -5788, 3867, 5312, -8155, 7714, 662, -6323, 8159, -3294, -3121, 7299, -7265, 677, 5654, -9537, 5330, 785, -7608, 7973, -3730, -4117, 8410, -5744, -229, 6889, -7831, 5107, 2746, -7681, 8294, -1353, -3950, 7540]
853G540j2373M052P342j4331R156K073j1542J2574o586m309J2224j1047M32R660
867D865j2046N741N025j3063J2913k371q626J3362q023j297J0955j2548N114Q464
881H465j5318J1324L42j0388J4543r340k889J2460j2547L454P457j3664J0808
894D707m91j2160J5138p244m407J0352j0425M047N454j1749Q054J928r891J0854
908D167m766l996J0388q433J16O729o684K835K721p926Q586j391q321J0817m900
923e8l553Q211p896P75P548j0663N225L137r566J0535o023m527J3085j0790l60
938d920R516j0378N448K275r937J2684n699m567J1784j0884L386O997j0948O446
952A203K727q316Q365m343j956Q536j0089M209M399q335N041J003n335N295j086
$$ y = [7540, -4833, -781, 6561, -7770, 1386, 3459, -8083, 4491, -2095, -6404, 5820, -5227, -4795, 4865, -7181, -1440, 3585, -9478, 3435, 1064, -7562, 5800, -2223, -3520, 7435, -5113, 1, 8465, -6853, 4471, 4813, -5575, 8968, -372, -3261, 9199, -3348, 106, 7563, -6101, 4707, 4216, -7944, 7194, -50, -4457, 5895, -4530, -483, 4971, -6778, 1276, 3204, -6687, 4167, -599, -4595, 5793, -2640, -2524, 4205, -2479, 356, 3077, -4849, 3737, 2346, -5975, 4842, -58, -3611, 4600, -3296, -2521, 5027, -5636, -411, 2726, -6840, 3695, -2328, -6855, 6230, -4560, -4920, 4596, -5782, -334, 1941, -7996, 4688, -1011, -5578, 6206, -4678, -1292, 5705, -5243, 1203, 3930, -4386, 3979, -364, -2320, 6216, -3873, 336, 4735, -3600, 1441, 2444, -2891, 2404, 1318]
967A318m045N480l421N03K543n037L161L179o357K977L550o918N524r39l769O402
983D151n088j46N308o793L494L373r722Q917j037p714R631o455N87M961q654O156
999I69J092q396R218l725m802J0187q359J593M727o876N793k003l182P427m786
1014a123k266P585n838P57L811n477M254o11k186K362j427m6K642l535q10N793
1030C885m914p65L845k961O84J168l033L727r31l592P039n688K51O144q041M304
1046A122K895o775N473q87l441P571p811J405O849j0048O412J98o753P896l783
1061C23l183O582n944J826L382q303P815j688o040P515l267j830M172m556J873
1076a323L070n956M504N5l826O055l737j862N458k892j526M549m238J621K210
$$ y = [1318, -2727, 2753, -668, -165, 2378, -2659, 502, 3681, -2676, 301, 3851, -3067, 2457, 1518, -2251, 4151, -937, -1083, 4225, -2568, 926, 4299, -5423, 3494, 2457, -5257, 4374, -2081, -1494, 3467, -5187, 969, 2061, -6335, 2883, -842, -5644, 4543, -3816, -2223, 2504, -4372, 1421, -582, -3764, 3663, -1123, -3389, 4196, -1642, -885, 2926, -2551, 1703, 1092, -1094, 1268, -159, -205, 2437, -1098, -1908, 3885, -1029, -1794, 2051, -910, -226, 942, -2091, 1636, 705, -2887, 4152, -1536, -1285, 4859, -3182, 1122, 4017, -2758, 2715, 1828, -1613, 5958, -1853, -448, 6401, -3647, 2765, 2963, -3790, 4106, 323, -2860, 3722, -2222, -396, 2986, -5317, 2498, 810, -5230, 2285, -982, -2812, 1360, -3196, -1323, 1747, -4209, 295, 350, -3476, 2579, -1158, -3020, 2438, -454, -1980, 2569, -1669, -48, 2162]
1091B162n528N500j059m464N879k850k365O269n584J39N642p522M888j88n050
1106d131Q126n051k206Q000o672R60M941p696O233L29o748Q461m485j272O021
1121D810p050K599M528p847M703J517o289O897m183j540N979o031J082L893n886
1136b818L149J785o616O561j451m177O156m349l52N013o077K264M544p865N224
1151I91O58n945P881m439k568O996n905R85M456p627N696J339q306Q662l281l569
1167c976P789o905J158N500p876M057K955p543P670k600m097Q437o044n13O090
1182D102o306L042L158p818O947m38n936Q369n308j046O103p112K052M785p858
1197c264M880Q39o815Q362m050l415P890o453O11M926p162M183K481q120P492
$$ y = [2162, -3366, 2134, 1075, -3389, 2490, -360, -2725, 3544, -2040, -1901, 3741, -3781, 1107, 919, -4131, 3995, -1056, -3262, 4738, -1934, -974, 3967, -3729, 2504, 2833, -3915, 4546, 61, -1211, 4810, -2240, 359, 4887, -2960, 1743, 3260, -3029, 3868, -315, -1855, 4124, -1907, -825, 3068, -2818, 331, 2116, -4500, 2061, 610, -3567, 2589, -1760, -2112, 2901, -3176, -912, 3632, -4233, 991, 1649, -4296, 3585, -854, -3422, 3574, -2331, -1346, 3110, -4517, 1179, 2518, -5788, 2874, -407, -3976, 3813, -3092, -1934, 3566, -4310, -253, 2702, -4841, 2829, 229, -3868, 4569, -1475, -1988, 4102, -2204, 838, 3996, -3822, 3125, 2687, -3249, 5120, -188, -1234, 4869, -2243, -191, 4594, -3264, 1616, 2455, -4360, 4002, -48, -3463, 4427, -2026, -1415, 3511, -3651, 532, 3013, -5107, 2385]
1212B385j355n067Q071o157K21O302p553K870M017p728O047n08n939Q752n385
1227a027j807O797o827K015L868p802N893P76p245Q147l654k875P341o888J180
1242b108N505p349L288L165p240P593k352m701Q770n695m58N713o645L283L057
1257C826p325O059J62o104P802m777j309O454o991J793M636p084M124J035o703
1272d402Q183l837l559P777o198J000M619o890M442J711p068P097k062l778P257
1287D292o313O64N211o413K608K868o173N237r99m718P013m716j180N254n466
1302b831J997K896o007M150J204n955O484k882k352O085n369P40M134n207K725
1317a88K067n592O051j450m142P242m906l47M474n592K918K634o385N143m72m295
$$ y = [2385, 1030, -4037, 4034, -2123, -1902, 4400, -3153, -283, 3734, -3994, 2053, 1545, -4394, 4358, -1027, -2834, 3963, -2864, -849, 3019, -4783, 1110, 1886, -5359, 2788, -866, -3741, 3600, -3288, -2108, 3397, -3952, -664, 2501, -4739, 2854, 502, -4199, 4571, -1124, -1582, 4131, -2514, 769, 3826, -3499, 2560, 2722, -3382, 4420, -357, -1666, 4788, -2203, -410, 4226, -2858, 1266, 2301, -4402, 3781, -56, -3615, 4162, -2036, -1036, 3583, -3307, 1135, 2846, -4222, 2875, 813, -2965, 4292, -2021, -1357, 3854, -2559, 49, 2917, -3256, 1981, 982, -3736, 3277, -1439, -2619, 2635, -2831, -834, 2062, -3945, 205, 1409, -4546, 1938, -944, -3296, 2789, -2580, -1840, 2294, -2913, -188, 1879, -3713, 2338, 888, -3254, 3988, -918, -1265, 3209, -2383, 535, 3169, -3216, 1927, 1455, -2840]
1333b840O698m950m46N645o460K508K213m754M101n55m223O252l280j535M839
1348C213m794J863J978m229L131J009m127M014j447j999M648m773P54L421m260
1363a598J485J914m308L673p04l583N747m221m16M203n238K620K478n550M026
1378E28K44m195N340l510m37M827n920K834K338m796M213r37l132N400l120j150
1394a473M197n158L085P27l997M242o97k815L402j584r29K815l431J562J318k931
1410a667K447q9j780K562r57k149L918j737j104K632k846J561J307l304K715J55
1426A664l266M229k403j967M784m523J387K226m248L461j046k673M723l248j468
1441b368N102n062J680J954m291M043j140k110L497k607J08L206m528K077K250
$$ y = [-2840, 3858, -1092, -1538, 4107, -2353, 155, 2368, -2386, 1715, 1160, -3063, 3189, -91, -1626, 3213, -1581, 282, 2260, -1969, 1162, 2171, -1956, 2058, 611, -1388, 3260, -1513, -759, 2662, -1598, -113, 1801, -2507, 1166, 462, -3121, 2626, -1595, -2011, 2192, -3046, -426, 2052, -3498, 528, 772, -3423, 1917, -1593, -2030, 2797, -3123, -289, 2049, -2747, 1466, 529, -2603, 2797, -323, -1473, 2724, -2434, 651, 1378, -2619, 1623, 926, -1889, 1513, -71, -1000, 1815, -1616, -54, 1264, -1667, 780, 691, -1089, 1473, 516, -1633, 2285, 548, -556, 2076, -770, 791, 2098, -1206, 1509, 1664, -1602, 2627, 224, -1743, 3041, -1482, -95, 2131, -2117, 1344, 298, -2375, 2348, -900, -2368, 2734, -2328, -648, 1306, -2985, 1058, -82, -2192, 1305, -1302, -1194, 2012, -2516, -439, 1811]
1456A811m179L259r00j229K291j404o66K468k358M16K012l298K169R06l392K497
1472D03K47k011K192j271o46L489m467J794K304m664L873N8l449M261j740j783
1488a410M209m090J815K156n251N331r20m162N352l265q77L899m412J803K016
1503B194m852M789j938k040M656m119M4L082l044P61J383l168K817o17k288L779
1519A439k145q74L033k547J7K947l504J258J682l249K880j086j738L731k984o13
1535a753L795l669N83K779m353L302n9l321M651k968o08L574l719J108L396n485
1551b747L554N65l532M700k783p24L741l822J464J946m102L156L88l817M408j926
1567D69j525L325k892N47J788l366K025J439l853K918l41k358L776k369j088L189
$$ y = [1811, -2368, 891, -9, -1238, 1053, -351, -1017, 1451, -907, -491, 1521, -1777, 392, 1298, -2094, 403, 650, -1361, 831, -440, -1086, 2403, -2064, -270, 2034, -2630, 1243, 1301, -2148, 2113, 373, -1410, 2799, -1291, 524, 2680, -2571, 2760, 1840, -2322, 3030, -235, -1112, 2787, -1625, 178, 2194, -2658, 2131, 193, -1847, 2809, -1310, -1266, 1816, -1228, -467, 916, -2252, 565, -52, -2340, 1439, -706, -1580, 1453, -1094, -1077, 1870, -1634, -376, 1306, -1943, 937, -149, -1887, 1844, -1140, -1753, 2042, -1627, -1044, 1735, -2618, 684, 625, -2696, 1955, -1013, -1621, 1953, -1766, -658, 2738, -2747, 807, 1372, -2160, 2540, -243, -967, 2774, -1048, 416, 2362, -1740, 1416, 1804, -2013, 2395, 469, -1056, 2269, -623, -76, 1712, -1654, 371, 1810, -2043, 875, 534, -1824, 1952, -417, -1505, 1684]
1583A684k586L41K311l871K872O96l951M227j564k022M029l253p7L498m317K268
1599B85J336m238M293j826k181M434l576O0L224l668J775J294m194M137r11k699
1615b455M483l262R1L180l502J478J646l507K832J64k733L799k376p40L078k841
1631f65O12K112l175K053Q11l610L644j121j893L347k755Q2K736l356J370J569
1647A761l583L083o30k509M035k547n60K880l169J436J461l548K948J84l330M117
1663B029k248p64K899l205P44J950l152K026P30l288L733j981j218L002k482L03
1679i22K186l119J797J086k980K712n19j952K997k064o6K318k750J115J513k789
1695a437K273j44k136L296j931q02K613k745R45J513k477J741N11k994L275j735
$$ y = [1684, -902, -561, 1750, -2121, 751, 1447, -2504, 1723, 159, -1863, 2166, -1087, -1164, 2334, -1983, 285, 1621, -2617, 1676, -150, -2331, 2103, -1473, -1413, 1811, -1857, -82, 1212, -2982, 1155, 244, -2455, 2028, -1234, -1143, 2037, -1465, 13, 1659, -1848, 984, 1148, -1585, 2214, -162, -902, 2176, -665, -53, 2059, -1116, 937, 1748, -1862, 1782, 661, -1232, 2115, -640, -558, 2178, -1178, 192, 1761, -1822, 1261, 631, -1878, 2157, -390, -950, 1930, -1239, 197, 1658, -1890, 1058, 1242, -2088, 2029, -219, -983, 1916, -1289, -545, 1405, -1747, 279, 1009, -2279, 1454, -527, -1745, 1257, -1225, -922, 1264, -1855, -58, 1028, -1952, 760, 241, -1711, 1286, -778, -844, 1474, -1276, -161, 1352, -1437, 836, 692, -1444, 1852, -79, -881, 1732, -1013, -68, 1445, -1032, 709, 1220, -1774, 1501, -234]
1711b34r13K849k385L74J877k598J451Q35k553K420j000j339K856k207O50J268
1727A351k190J086Q24k032J722k14j783K689j902j67J952k421O92J144j972J360
1743A39J49j849K338j329p62K169k012P56Q48k018J816n7j909K594j066j034K239
1760A012j977N08J315j842J228K25j654J803m41j159K176j699L25J387k347J406
1776B66L01j522J450j94j262K004j358J19J454k208J343M64j184R45R1j399J830
1793A140j044k92J435j770Q63M54j365J464k23j298J255m63r85J590j518N98R16
1810G57k006J294L72j565K032r25j247K276j829K71R10j654J628j87j305J805
1826F27m88r01J249j274N15J278k422J719j60j097J751r47k91J090j413M85J050
$$ y = [-234, -1147, 1702, -683, -309, 1568, -1030, 421, 1256, -1297, 1123, 123, -1216, 1640, -567, 83, 1351, -839, 247, 1071, -961, 761, 547, -1236, 1453, -449, -616, 1336, -1085, -393, 751, -1221, 139, 288, -1561, 777, -552, -1314, 855, -1157, -401, 447, -1571, 245, 188, -1721, 873, -193, -1227, 1012, -965, -457, 858, -984, 244, 469, -1185, 618, 177, -982, 1194, -505, -180, 1207, -1140, 266, 567, -955, 495, 301, -961, 1043, -315, -196, 1258, -950, 393, 857, -327, 618, 709, -690, 1140, 96, -196, 1239, -531, 332, 786, -579, 885, 662, -636, 619, 156, -829, 761, -757, -159, 757, -1249, 45, 417, -1148, 884, -41, -1288, 988, -841, -570, 340, -1314, 314, 127, -1178, 627, 139, -762, 487, -787, -272, 1006, -1416, 303, 143, -954, 797, -150, -441, 649, -764, -279, 771]
1843G71j859J402j47r32J504o53m17R83j051J11J477j482OJ232j502J166k83q55
1861e29J255o84k44J415j225j40J701k401J629j3j469J729j036n25J625j647K83
1878b76J563k657J607K34j709K213j210k51J224j665N57J320k419J640J86j802
1894a445K343j277l64J362j361N54P56j642J155L37j580J784m30j011J599j060
1910b80m11J252j045j35J336j589J176O5j695K328j091q73J846j071k06J564k189
1927a018J229Q71k231K613j342j163K776k229N21J637k823J672O62k253K498j472
1943e2p08K455k352L24J365k103J375N71k108K037p49r01J939j808L58J379j818
1960g96O12J130j894R24N82j782J835q37n42J612j593M39J164k002Q91J234k469
$$ y = [771, -1088, 314, 167, -765, 739, 86, -331, 652, -399, -288, 1189, -293, -287, 945, -557, 609, 326, -529, 726, 42, -202, 1213, -12, -152, 1549, -852, 777, 764, -705, 1024, -12, -537, 1088, -559, -276, 1287, -1370, 237, 471, -1238, 975, -235, -486, 738, -927, -370, 950, -1469, 171, 357, -1445, 898, -379, -743, 619, -742, -188, 568, -1074, 81, 418, -1162, 622, 192, -819, 780, -280, -691, 561, -484, -619, 717, -872, 304, 369, -1326, 1002, -89, -962, 884, -187, -393, 1171, -1018, 211, 1082, -1149, 1464, 122, -1041, 1735, -494, 27, 1664, -1159, 513, 1175, -1078, 1420, -52, -760, 1695, -657, -333, 1032, -1071, 304, 875, -1233, 804, 55, -846, 1093, -715, -357, 1022, -796, -184, 946, -948, -24, 558, -1224, 611, -226, -768, 844, -749, -310, 854, -1148, -257, 977, -1492]
1977a492J949j64j522K191j598k48K068k363J232P30k433K479m97j710K704j995
1993f69j19J794j913J127N95j981K019k39j746K280j143l35J415j401M51N32j376
2010g09J141N7j460J770p89m46J385r49k35R97j256L06J016j703J384Q1j581K102
2028A111j186n82J857j694J21J265j953R99P95k083K144q50r36K103k112N55J333
2045H87k010J067N34j791J812p80p98K008j787K40J506j875R60O65j514J304q4
2062C44j529K116j268Q5J323j715O97Q29j540J192Q6j408J882j285l66J443j207
2079c21K40P96j235Q33L25j507J832o92j133J992j526K14J154j700R00N35j643
2096i36J757k68j388K097j740K33J339j855J086K88j473J359j58j058J304j011
$$ y = [-1492, 457, 293, -1229, 962, -636, -884, 1184, -1179, 53, 783, -1650, 829, 332, -1378, 1326, -669, -788, 1006, -907, 220, 815, -1166, 853, 614, -1132, 1148, 5, -330, 1085, -316, 135, 667, -709, 432, 489, -971, 799, 10, -436, 949, 0, -235, 762, -494, -188, 828, -875, 509, 590, -991, 1111, -75, -657, 1200, -494, -373, 892, -1061, -62, 733, -1350, 794, -56, -992, 1111, -1001, -446, 887, -1123, -56, 478, -1313, 499, -281, -1079, 929, -858, -618, 888, -987, -27, 638, -876, 428, 344, -1185, 931, -337, -252, 1071, -644, 53, 882, -658, 534, 620, -788, 1094, -191, -557, 886, -321, -81, 715, -520, 313, 638, -869, 963, 271, -862, 1130, -396, -182, 972, -728, 172, 707, -936, 821, 553, -835, 1262, -478, -245, 1094, -761, 325, 613, -860, 499, 341, -717, 587, -424]
2112d24l58J464j434L84N77r43Q56J54j148J345q03l97J231p93J19N91j028M96
2130a11M89j148J272m67q70J461j058R3J019j447R26N13j359Q21J43j103J711
2147H85r49k70J219j419Q63M68j359R44k9p87J065n02n70J392j380L56P38j069
2165d04P34N5p39J146p89o17J546j335M09P58j299O86J62r88Q67j77o22J237j145
2184e15L39L95r10N28L43r24O86n9m36R69p15j03Q68j058M67L55r66J011j42m69
2204c36Q54m97n86J154j109L06O41j149R92l61n11J180m89m07J096j244L16N54
2222D04q95Q32k5r39J233l39o49R69q40J51Q07j256O74J13m97Q56m38k00O49o33
2242b3r4J066j413O04M63j199R39k48m82Q83o36k91R57j098N80N45j236O67R5
$$ y = [-424, -782, 682, -752, -368, 209, -734, 122, 276, -872, 473, -330, -727, 504, -289, -170, 421, -607, -111, 378, -770, 502, 35, -835, 626, -432, -339, 680, -767, 159, 672, -687, 134, 277, -826, 885, -64, -334, 885, -534, 329, 797, -562, 382, 353, -434, 631, 129, -441, 951, -429, -73, 665, -404, 330, 385, -354, 792, 3, -614, 932, -403, 6, 764, -535, 151, 313, -675, 192, 15, -607, 630, -515, -176, 219, -691, -163, 180, -744, -58, -117, -553, 416, -299, -402, 466, -592, -125, 230, -736, 275, 133, -336, 518, 21, -565, 589, -520, -214, 427, -722, 270, -91, -602, 578, 89, -318, 778, -466, -150, 404, -491, 341, 316, -623, 610, 271, -378, 591, -249, -98, 709, -547, 127, 240, -257, 599, 161, -39, 610, -23, -117, 949, -464, 140, 603, -596, 343, 95, -387, 496, -140, -431, 526, -572, 8, 553, -683, -16, 79]
2261G9o62J017r13L8Q62r57L47N47r62R53k74q44J149q85JQ84q32N0Q22j022R00
2282B98k41p91J021n25p3O93m54R5O01j114M82L64r35R57l06n19R09l72j17O33
2302F06o53J62O51j334J131pp44Q97m53l66J023j197L54N44j310J042m3o39J259
2321I23j006l23J094p92k18R24j231P49R7r66J279n69m82J008r99J12Q20n80l9
2340a99M14r34R17j69o94R64o46J00L38m46N7N91r44Q75K85j255R60l73j04Q87
2360F24r14m3P88r99N13K49q76R53k33n78J295j054K91O75j340P30N93j141Q49
2379C82k73m48J134r46J55M71r58O85M44j188O81l4n12R75r98K32N48o47M10O36
2399G49j198N55L06p61Q66k40o61Q57p14J32M99j061M90N00p62O72R7j081J230
$$ y = [79, -583, 434, -479, -441, 421, -536, -189, 358, -604, 349, 75, -769, 380, -505, -504, 380, -452, -402, 420, -602, 298, 57, -734, 287, -238, -311, 382, -72, 23, 624, -490, -8, 356, -579, 378, 72, -447, 462, 90, -27, 606, -47, 115, 766, -568, 563, 556, -188, 709, 256, -110, 913, -284, 70, 614, -696, 346, 303, -336, 923, -83, -406, 688, -104, -322, 602, -629, 120, 217, -749, 530, -39, -521, 487, -512, -400, 420, -160, -199, 215, -719, 198, 29, -665, 299, -347, -247, 91, -355, -298, 293, -651, 224, 509, -746, 214, -159, -263, 624, -290, -333, 455, -544, -31, 218, -658, 295, 62, -516, 779, -275, 16, 691, -649, 81, 674, -467, 382, 109, -339, 795, -151, 4, 475, -483, 202, 646, -542, 139, 105, -407, 568, -430, -198, 350, -297, 113, 749, -449, 106, 412, -349, 517, 277, -384, 473, -241, -109, 390, -671, -181, 319, -443, 229, 326, -755, 475]
2418D75p88k5N76p92L31M85j016J231l09p77J158m87l29O83p36N92J28q17P35
2437C18m9p25Q45n18j1P58r17J58L00l93K90L12m70L02j86j98O12l34j49M93m85
2458d7RM65n59J22J61n79Q63m15k01P02o96mO13r44O31K88p06P28l18n44Q36m72
2480f7j09M66p25N60J00r48P27l45O2P22p97K78J88m27K66N5p07O68L7m26L55
2501f7j22J29K18m57L04J1l08K00K47p62O37K9k76N78m82K62j10j00J57K45o58
2522c25O78k26l39P67o67K45J49q06Q90J24p45O44k55m79R19p24L72j3l76K86
2542A19j0l43M54o9k41L43l68J82J01k02rP4k34N71n42J40K99n92O3L94n25L40
2564e5J4k70K27J49m92M09k64j70O02m71J39L94l80M9K47o10N76k02k78O93n75
$$ y = [475, -313, -338, 238, -554, -223, 262, -754, 477, 168, -609, 549, 62, -267, 416, -320, 272, 400, -417, 318, 269, -456, 389, -129, -140, 618, -299, -141, 159, -234, 56, 368, -102, 200, 14, -184, 428, 94, -55, 438, -47, -38, 427, -132, -10, 151, -428, 435, 20, -181, 521, -175, -179, 434, -510, 121, 409, -297, 431, 113, -431, 405, -67, -176, 290, -435, 125, 225, -723, 4, -341, -279, 443, -354, -76, 112, -315, -49, 6, -701, -33, 4, -422, -67, -189, -60, 158, -299, 5, 16, -292, -92, 155, -607, 30, 59, -217, 361, -121, 141, 31, -69, 88, 333, -325, 353, 127, -212, 555, -112, 133, 282, -524, 366, 490, -255, 389, 134, -345, 574, -150, 222, 209, -167, 119, 109, -234, 220, 151, -90, 253, -115, 67, 168, -34, -43, 31, -203, 368, -174, -34, 265, -327, -264, 130, -395, -55, -41, -311, -84, 65, -427, -18, -282, -452, 150, -321, -182, 212, -168, -119, 128, -482, 94, -108, -386, 307, -268]
2585b68M7M77m80M28o0l66L30j49j30N73n18k9L98l25L89k14j60L46k24j65N99
2606D99n45k9L58m70M21O7l92L82l22N8J68j13n2L71m35j30L87l45L90l33n2J30
2628A3n8r8P2R9j97M60p84M10p7NL36m55J47L25m14K71J17m87N89m77j13M93m71
$$ y = [-268, -221, 256, -224, 204, 144, -222, 108, -41, -171, 402, -116, -145, 253, -72, 317, 103, -57, 289, 65, -100, 499, -46, -75, 283, -187, 234, 301, -91, 291, -31, 27, 195, 82, 30, 401, -34, -164, 223, -122, 268, -65, -117, 13, -45, -143, -71, 28, -169, 291, -493, -83, -160, -155, 181, -274, -127, 198, -216, 55, 172, -315, 274, -203, -316, 177, -294]
$$ [...]
8191h8
##END NTUPLES=NMR FID
##END=
