##TITLE=1H_Ser-2
 CDCl3
 8 sc, 
 26.12.2023
##JCAMPDX= 6.0         $$ Bruker NMR JCAMP-DX V2.0
##DATA TYPE= NMR FID
##DATA CLASS= NTUPLES
##ORIGIN= UXNMR, Bruker Analytische Messtechnik GmbH
##OWNER= root
$$ XWIN-NMR		Version 3.5
$$ Tue Dec 26 15:43:01 2023 Russian Standard Time (UT+4h)  she@DPX200
##.OBSERVE FREQUENCY= 200.1313
##.OBSERVE NUCLEUS= ^1H
##.DELAY= (6, 6)
##.ACQUISITION MODE= SIMULTANEOUS
##.ACQUISITION SCHEME= undefined
##.AVERAGES= 8
##.DIGITISER RES= 18
##SPECTROMETER/DATA SYSTEM= spect
##.PULSE SEQUENCE= zg30
##.SOLVENT NAME= CDCl3
##.SHIFT REFERENCE= (INTERNAL, CDCl3, 0, 15.7039)
##AUDIT TRAIL= $$ (NUMBER, WHEN, WHO, WHERE, WHAT)
$$ ##TITLE= Audit trail, XWIN-NMR		Version 3.5
$$ ##JCAMPDX= 5.01
$$ ##ORIGIN= Bruker BioSpin GmbH
$$ ##OWNER= she
$$ F:/spectra/data/she/nmr/H-F/1/audita.txt
$$ ##AUDIT TRAIL=  $$ (NUMBER, WHEN, WHO, WHERE, WHAT)
(   1,<2023-12-26 15:41:47.76 +0400>,<she>,<DPX200>,
      <created by zg, POWCHK disabled, PULCHK disabled
       configuration hash MD5:
       00 E9 B6 7A A2 85 ED C7 34 08 36 98 17 FE 4E 26
       data hash MD5: 16K
       0D 59 E3 DC EB 70 01 11 4C 70 44 9B AE 18 CE F7>)
$$ ##END=
$$ 
$$ hash MD5
$$ 49 58 70 1E 1E 02 FD 0F 4D 2F 23 77 91 7E 23 4E
##$RELAX= 
##$RELAX= 
##$RELAX= 
##$RELAX= 
##$RELAX= 
##$RELAX= 
$$ Bruker specific parameters
$$ --------------------------
##$DU= <F:/spectra>
##$EXPNO= 1
##$NAME= <H-F>
##$PROCNO= 1
##$TYPE= <nmr>
##$USER= <she>
##$AMP= (0..31)
100 100 100 100 100 100 100 100 100 100 100 100 100 100 100 100 100 100 
100 100 100 100 100 100 100 100 100 100 100 100 100 100 
##$AQSEQ= 0
##$AQ_mod= 1
##$AUNM= <au_zg>
##$AUTOPOS= <>
##$BF1= 200.13
##$BF2= 200.13
##$BF3= 200.13
##$BF4= 200.13
##$BF5= 200.13
##$BF6= 200.13
##$BF7= 200.13
##$BF8= 200.13
##$BYTORDA= 1
##$CFDGTYP= 0
##$CFRGTYP= 5
##$CHEMSTR= <none>
##$CNST= (0..31)
1 1 145 1 1 1 1 1 1 1 1 1 1 1 1 1 1 1 1 1 1 1 1 1 1 1 1 1 1 1 1 1 
##$CPDPRG= <>
##$CPDPRG1= <>
##$CPDPRG2= <>
##$CPDPRG3= <>
##$CPDPRG4= <mlev>
##$CPDPRG5= <mlev>
##$CPDPRG6= <mlev>
##$CPDPRG7= <mlev>
##$CPDPRG8= <mlev>
##$CPDPRGB= <>
##$CPDPRGT= <>
##$D= (0..31)
0 1.2 0 0 0 0 0 0 0 0.06 0 0.03 0 0 0 0 0.0002 0 0 0 0 0 0 0 0 0 0 0 0 
0 0 0 
##$DATE= 1703590907
##$DBL= (0..7)
120 120 120 120 120 120 120 120 
##$DBP= (0..7)
150 150 150 150 150 150 150 150 
##$DBP07= 0
##$DBPNAM0= <>
##$DBPNAM1= <>
##$DBPNAM2= <>
##$DBPNAM3= <>
##$DBPNAM4= <>
##$DBPNAM5= <>
##$DBPNAM6= <>
##$DBPNAM7= <>
##$DBPOAL= (0..7)
0.5 0.5 0.5 0.5 0.5 0.5 0.5 0.5 
##$DBPOFFS= (0..7)
0 0 0 0 0 0 0 0 
##$DE= 6
##$DECBNUC= <off>
##$DECIM= 32
##$DECNUC= <off>
##$DECSTAT= 4
##$DIGMOD= 1
##$DIGTYP= 9
##$DL= (0..7)
0 120 120 120 120 120 120 120 
##$DP= (0..7)
150 150 150 150 150 150 150 150 
##$DP07= 0
##$DPNAME0= <>
##$DPNAME1= <>
##$DPNAME2= <>
##$DPNAME3= <>
##$DPNAME4= <>
##$DPNAME5= <>
##$DPNAME6= <>
##$DPNAME7= <>
##$DPOAL= (0..7)
0.5 0.5 0.5 0.5 0.5 0.5 0.5 0.5 
##$DPOFFS= (0..7)
0 0 0 0 0 0 0 0 
##$DQDMODE= 0
##$DR= 18
##$DS= 0
##$DSLIST= <SSSSSSSSSSSSSSS>
$$ [...]
##$SUBNAM2= <"">
##$SUBNAM3= <"">
##$SUBNAM4= <"">
##$SUBNAM5= <"">
##$SUBNAM6= <"">
##$SUBNAM7= <"">
##$SUBNAM8= <"">
##$SUBNAM9= <"">
##$SW= 18.0517328524113
##$SWIBOX= (0..15)
0 0 2 0 0 0 0 0 0 0 0 0 0 0 0 0 
##$SW_h= 3612.71676300578
##$TD= 16384
##$TD0= 1
##$TE= 0
##$TE2= 300
##$TE3= 300
##$TEG= 300
##$TL= (0..7)
0 120 120 120 120 120 120 120 
##$TP= (0..7)
150 150 150 150 150 150 150 150 
##$TP07= 0
##$TPNAME0= <>
##$TPNAME1= <>
##$TPNAME2= <>
##$TPNAME3= <>
##$TPNAME4= <>
##$TPNAME5= <>
##$TPNAME6= <>
##$TPNAME7= <>
##$TPOAL= (0..7)
0.5 0.5 0.5 0.5 0.5 0.5 0.5 0.5 
##$TPOFFS= (0..7)
0 0 0 0 0 0 0 0 
##$TUNHIN= 0
##$TUNHOUT= 0
##$TUNXOUT= 0
##$USERA1= <user>
##$USERA2= <user>
##$USERA3= <user>
##$USERA4= <user>
##$USERA5= <user>
##$V9= 5
##$VALIST= <valist>
##$VCLIST= <CCCCCCCCCCCCCCC>
##$VD= 0
##$VDLIST= <DDDDDDDDDDDDDDD>
##$VPLIST= <PPPPPPPPPPPPPPP>
##$VTLIST= <TTTTTTTTTTTTTTT>
##$WBST= 1024
##$WBSW= 4
##$XGAIN= (0..3)
0 0 0 0 
##$XL= 0
##$YL= 0
##$YMAX_a= 146447
##$YMIN_a= -167906
##$ZGOPTNS= <>
##$ZL1= 120
##$ZL2= 120
##$ZL3= 120
##$ZL4= 120
##$ABSF1= 10
##$ABSF2= 0
##$ABSG= 5
##$ABSL= 3
##$ALPHA= 0
##$AQORDER= 0
##$ASSFAC= 0
##$ASSFACI= 0
##$ASSFACX= 0
##$ASSWID= 0
##$AUNMP= <proc_1d>
##$AZFE= 0.1
##$AZFW= 0.1
##$BCFW= 1
##$BC_mod= 2
##$BYTORDP= 1
##$COROFFS= 0
##$CY= 11.3945322036743
##$DATMOD= 1
##$DC= 2
##$DFILT= <>
##$DTYPP= 0
##$F1P= 15.7292609196834
##$F2P= 12.9074282941183
##$FCOR= 0.5
##$FTSIZE= 0
##$FT_mod= 4
##$GAMMA= 1
##$GB= 0.15
##$INTBC= 1
##$INTSCL= 1
##$ISEN= 128
##$LB= 0.24
##$LEV0= 0
##$LPBIN= 0
##$MAXI= 10000
##$MC2= 0
##$MEAN= 0
##$ME_mod= 0
##$MI= 1.114404
##$NCOEF= 0
##$NC_proc= 0
##$NLEV= 6
##$NOISF1= 3.799351
##$NOISF2= 2.8
##$NSP= 1
##$NTH_PI= 0
##$NZP= 0
##$OFFSET= 15.70392
##$PC= 1
##$PHC0= -24590.72
##$PHC1= 9.05273
##$PH_mod= 1
##$PKNL= yes
##$PPARMOD= 0
##$PSCAL= 0
##$PSIGN= 0
##$REVERSE= no
##$SF= 200.130013532006
##$SI= 16384
##$SIGF1= 3
##$SIGF2= 2
##$SINO= 400
##$SIOLD= 16384
##$SREGLST= <1H.CDCl3>
##$SSB= 0
##$STSI= 0
##$STSR= 0
##$SW_p= 3612.71676300578
##$SYMM= 0
##$S_DEV= 0
##$TDeff= 0
##$TDoff= 0
##$TI= <>
##$TILT= no
##$TM1= 0
##$TM2= 0
##$TOPLEV= 0
##$USERP1= <user>
##$USERP2= <user>
##$USERP3= <user>
##$USERP4= <user>
##$USERP5= <user>
##$WDW= 1
##$XDIM= 8192
##$YMAX_p= 0
##$YMIN_p= 0
$$ End of Bruker specific parameters
$$ ---------------------------------
##NTUPLES= NMR FID
##VAR_NAME=  TIME,          FID/REAL,        FID/IMAG
##SYMBOL=    X,             R,               I
##VAR_TYPE=  INDEPENDENT,   DEPENDENT,       DEPENDENT
##VAR_FORM=  AFFN,          ASDF,            ASDF
##VAR_DIM=   8192,          8192,            8192
##UNITS=     SECONDS,       ARBITRARY UNITS, ARBITRARY UNITS
##FACTOR=    0.0002768,     1,               1
##FIRST=     0,             0,               0
##LAST=      2.2672688,     0,               0
##MIN=       0,             -167906,         0
##MAX=       2.2672688,     146447,          0
$$ Real data points
##PAGE= N=1
##DATA TABLE= (X++(R..R)), XYDATA
$$ plain form
0 0 0 0 0 0 0 0 0 0 0 0 0 0 0 0 0 0 0 -3 8 -8 8 -8 8 -8 14 -16 16 -17 24 -24 29 -32 37 -40 46 -51 56 -62 70 -78
40 -78 86 -96 105 -117 129 -143 156 -172 190 -209 230 -255 281 -310 343 -384 426 -480 542 -618
60 -618 712 -832 991 -1209 1526 -2026 2899 -4712 9874 -50954 -167906 85609 100336 -114402
74 -114402 -28609 99675 -21805 -47558 58612 13048 -51256 25868 26688 -49339 -2212 35899
86 35899 -31260 -17429 30461 -6747 -13853 10903 -6337 -1115 10495 -10260 -3717 15022 5112
99 5112 -2476 4278 9330 1483 -8133 -1728 2205 -3603 -8695 -11141 7352 12069 -18637 -8600 22162
114 22162 -2511 -14654 9471 1647 -6978 9277 7686 -4969 685 13412 2033 -12402 6737
127 6737 6215 -21573 1478 15542 -21468 -7997 20501 -9865 -11467 16254 -4209 -14311 16792
$$ packed form
0@%%%%%%%%%%%%%%%%%lJ1j6J6j6J6j6K2l0L2l3M1m8N3o1O9p7Q6r7J07j18J32j48
40g8J64j82K01k22K46k72K99l28L62l99M39m85N36n91O53p27Q10r06J022j160
60f18J330j544J823k200K735l552M925p611J4586o0828j16952K53515J4727k14738
74a14402Q5793J28284j21480k5753J06170m5564o4304P7124Q20p6027M7127L8111
86C5899o7159J3831M7890l7208p106K4756j7240N222J1610k0755O543J8739r910
99E112p588O754N052p847r616O405L933n808n092k446J8493M717l0706J0037L0762
114B2162k4673j2143K4125p824q625J6255j591j2655N654J2727j1379j4435J9139
127F737n22k7788K3051J4064l7010J3471K8498l0366j602K7721k0463j0102L1103
$$ plain form
140 16792 8768 -21264 8018 28509 -18206 -13089 37667 -4493 -35038 24813 13162 -35747
152 -35747 6453 17685 -25442 -901 20139 -16955 -11170 21127 -245 -18028 11484 13447
164 13447 -13176 3070 15853 -8107 132 10850 -9486 503 8449 -15528 -1961 11312 -13385
177 -13385 -6067 10345 -7247 -5504 8450 -2829 -5087 7896 3491 -6507 6136 10182 -8609
190 -8609 265 14711 -8065 -7786 13559 -5733 -11197 9974 -4545 -11956 7967 510 -10776
203 -10776 2231 6137 -3078 -3527 6220 5124 -5013 3920 8309 -5521 454 8852 -4306 -4719
217 -4719 4107 -1023 -4707 -2301 658 -1867 -5909 3186 1997 -8827 4357 7866 -8429 2158
231 2158 10668 -4509 -309 8079 -850 -1746 2566 209 -2296 -1539 1061 -3005 -4715 1861 -1093
$$ packed form
140A6792q024l0032K9282K0491m6715N117N0756m2160l0545N9851j1651m8909
152c5747M2200J1232m3127K4541K1040l7094N785L2297k1372j7783K9512J963
164A3447k6623J6246J2783k3960Q239J0718k0336R989P946k3977J3567J3273k4697
177a3385P318J6412j7592J743J3954j1279k258J2983m405r998J2643M046j8791
190h609Q874J4446k2776K79K1345j9292n464K1171j4519p411J9923p457j1286
203a0776J3007L906r215m49R747j096j0137Q933M389j3830N975Q398j3158m13
217d719Q826n130l684K406K959k525m042R095j189j0824J3184L509j6295J0587
231B158Q510j5177M200Q388q929q96M312k357k505P57K600m066j710O576k954
$$ plain form
246 -1093 -4109 1359 -832 -151 3194 -2938 3002 5354 -5991 4681 9445 -9280 -377 10904
260 10904 -5906 -5008 6378 -3730 -6593 4369 762 -9709 -319 8620 -6197 -5845 10788 -1173
274 -1173 -7139 10949 2475 -7038 7752 3292 -5165 4452 331 -4390 1574 -1325 -3152 -397 -1921
289 -1921 -1933 -950 -269 -141 -1250 980 417 326 5273 -634 -2867 8646 1705 -5533 6316 246 -5969
306 -5969 5561 -1793 -8963 3577 1437 -6985 -434 2390 -2047 -2467 2289 3117 -2387 1096 4667
321 4667 -1067 2495 4233 -3338 1521 4300 -3438 -1657 -301 -2476 993 -3808 -3571 3766 -3354
336 -3354 -4254 5323 -1100 -3938 4473 2120 -1449 2984 3509 -641 -369 5375 467 -6039 3767 2713
352 2713 -8561 1093 3111 -8846 5 4138 -6070 -638 3635 -1997 183 2035 1340 1221 15
$$ packed form
246a093l016N468k191O81L345o132N940K352j1345J0672M764j8725Q903J1281
260A0904j6810Q98J1386j0108k863J0962l607j0471R390Q939j4817L52J6633j1961
274a173n966J8088q474r513J4790m460q457R617m121m721N964k899j827K755j524
289a921j2R83O81J28j109K230n63r1M947n907k233J1513o941p238J1849o070o215
306e969J1530p354p170J2540k140q422O551K824m437m20M756Q28n504L483L571
321D667n734L562J738p571M859K779p738J781J356k175L469m801K37P337p120
336c354r00R577o423k838Q411k353l569M433N25m150K72N744m908o506R806j054
352B713j1274R654K018j1957Q851M133j0208N432M273n632K180J852o95j19j206
$$ plain form
367 15 3567 3123 -2096 957 2214 -1583 -1560 -1016 -65 -1871 -5066 1892 764 -7018 1694 3494 -5015
384 -5015 1919 3493 -2953 3337 4218 -1879 1982 2906 214 481 -372 237 -586 -2625 -141 -1181 -2882
401 -2882 45 -1367 -1244 413 -1110 1819 170 -1982 5841 1408 -4943 7056 3335 -6959 5363
416 5363 4167 -8084 1645 4028 -7415 -2662 4950 -3758 -6486 4619 2445 -8490 2919 8278
430 8278 -7758 -168 10917 -5299 -2678 10500 -3330 -4613 7359 -1465 -5852 3440 159 -5062
444 -5062 -471 1750 -3107 -2802 3357 -746 -3341 4255 704 -2826 5193 991 -2271 5297 -9
459 -9 -3103 4452 -1199 -3966 2828 -1444 -4458 1193 -464 -3319 -1134 1918 -444 -3427 3217 3154
475 3154 -4441 2799 6284 -4341 279 6535 -2797 -2312 3794 -274 -3932 -387 2092 -3905 -5198
$$ packed form
367A5L552m44n219L053J257l797K3N44R51j806l195O958j128p782Q712J800q509
384e015O934J574o446O290Q81o097L861R24k692K67q53O09q23k039K484j040j701
401b882K927j412J23J657j523K929j649k152P823m433o351J1999l721j0294J2322
416E363j196j2251R729K383j1443M753P612q708k728J1105k174j0935J1409N359
430H278j6036P590J1085j6216K621J3178j3830j283J1972q824m387R292l281n221
444e062M591K221m857L05O159m103k595P596l551l530Q019m202l262P568n306
459il094P555n651k767O794m272l014N651j657k855K185L052k362k983O644o3
475C154p595P240L485j0625M620O256r332M85O106m068l658L545K479n997j293
$$ plain form
490 -5198 4767 -713 -8102 4954 4017 -8169 3719 7012 -6548 1060 8809 -2976 -3535 6687
504 6687 1578 -6324 1967 4566 -7332 -2509 6393 -6302 -5192 7079 -4323 -5837 7505 -1579
518 -1579 -5453 7255 1382 -4077 5260 2999 -2949 2336 3234 -2555 -833 3360 -3228 -3693 4489
533 4489 -2855 -7439 5442 -530 -7712 5598 1389 -7099 5904 4131 -6556 3983 6697 -4412
547 -4412 -361 6537 -1771 -4703 4332 1643 -7971 811 5161 -8176 -2550 6583 -5667 -3448 6797
562 6797 -1391 -3621 4517 1841 -1628 1681 3060 344 -1229 2617 1575 -4051 989 1881 -4892
577 -4892 -668 1617 -3936 -1322 1131 -1662 -573 75 613 834 -147 2581 1304 -850 2906 1079
593 1079 -1361 2133 -792 -1273 2031 -2934 -2479 2533 -3945 -2774 3522 -2445 -3343 3494 1192 -2735
$$ packed form
490e198R965n480p389J3056r37j2186J1888L293j3560P608P749j1785n59J0222
504F687n109p902Q291K599j1898M823Q902j2695J110J2271j1402j514J3342r084
518a579l874J2708n873n459R337k261n948N285Q98n789J722M193o588m65Q182
533D489p344m584J2881n972p182J3310m209q488J3003j773j0687J0539K714j1109
547d412M051O898q308k932R035k689r614Q782M350j3337N626R133j2250K219J0245
562F797q188k230Q138k676l469L309J379k716j573L846j042n626N040Q92o773
577d892M224K285n553K614K453k793J089O48N38K21r81K728j277k154L756j827
593A079k440L494k925m81L304m965M55N012o478J171O296n967q98O837k302l927
$$ plain form
609 -2735 1837 3928 -1480 -959 5985 -172 -4724 6058 1503 -7311 3626 2111 -8468 1797
623 1797 3702 -7394 -463 4829 -3892 -2051 4483 -205 -3047 3824 3422 -3253 1417 5366 -3877
638 -3877 -488 5528 -3702 -2739 4064 -3689 -3088 2454 -2931 -1885 2021 -1860 -719 2133 -961 152
654 152 2644 752 -555 1707 3267 -1630 -402 4242 -2972 -2674 4798 -3083 -5350 4327 -1435 -5604
670 -5604 3055 720 -3637 1572 2503 -1281 -180 2856 1422 -2131 2443 3274 -3144 1124 4063 -4171
686 -4171 -1368 3261 -3419 -3141 1704 -1214 -2855 2 1616 -641 -1622 3332 1369 -3097 3660 3106
702 3106 -3471 2542 3882 -3308 611 2410 -2662 -1124 251 -2266 -1666 -28 -631 -1865 -56 1868
718 1868 -1773 324 3663 -1837 376 4484 -2013 394 4629 -2964 -302 4268 -3325 -2773 3301
$$ packed form
609b735M572K091n408N21O944o157m552J0782m555q814J0937j515j0579J0265
623A797J905j1096O931N292q721J841O534m688k842O871m02o675M670L949r243
638c877L389O016r230R63O803p753O01N542n385J046L906l881J141K852l094J113
654A52K492j892j307K262J560m897J228M644p214K98P472p881k267R677n762m169
670e604Q659k335m357N209R31l784J101L036j434l553M574Q31o418M268K939q234
686d171K803M629o680K78M845k918j641K857J614k257r81M954j963m466O757n54
702C106o577O013J340p190L919J799n072J538J375k517O00J638o03j234J809J924
718A868l641K097L339n500K213M108o497K407M235p593K662M570p593N52O074
$$ plain form
733 3301 -2557 -4190 1751 -114 -4223 606 3665 -3504 -1416 6535 -1426 -3936 7185 729 -5411
748 -5411 5956 2600 -5632 2746 2771 -4982 -554 2348 -3096 -3127 1599 -247 -3829 983 2814 -3049
764 -3049 430 3915 -2080 215 4065 -1351 391 2708 -1256 249 881 -1822 -69 -710 -1722 -344
780 -344 -1260 -1086 -283 -873 488 115 -461 2093 227 103 3174 -399 -907 3205 -285 -1096 1397 -239
798 -239 -867 -750 -706 -283 -2336 -814 1517 -2885 -1007 3574 -2033 -1309 4560 -631 -1584 3664 1663
815 1663 -1248 800 1786 -1128 -1509 2009 -571 -4186 1549 554 -5143 1564 1519 -4550 1559 2738
831 2738 -3052 908 3018 -997 668 2540 620 -448 529 1476 -1461 -1058 1215 -2070 -1897 1437
847 1437 -2491 -1450 1499 -2377 -433 1858 -1471 875 2307 -1392 1755 2152 -1003 1042 1536 -864
$$ packed form
733C301n858j633N941j865m109M829L059p169K088P951p961k510J1121o456o140
748e411J1367l356q232Q378K5p753M428K902n444l1M726j846l582M812J831n863
764c049L479L485n995K295L850n416J742K317l964J505O32k703J753o41j012J378
780c44r16J74Q03n90J361l73n76K554j866j24L071l573n08M112l490q11K493j636
798b39o28J17M4M23k053J522K331m402J878M581n607P24N869n191r53N248k001
815A663k911K048R86k914l81L518k580l615N735r95n697O707m5o069O109J179
831B738n790L960K110m015J665J872j920j068R77R47k937M03K273l285J73L334
847A437l928J041K949l876J944K291l329K346J432l699L147L97l155K045M94k400
$$ plain form
863 -864 69 -32 -432 -1273 -1191 554 -1832 -1773 1658 -1578 -1772 2630 -400 -1201 2900 384 -67 2106
881 2106 167 849 823 -468 1020 -558 -1868 444 -929 -2130 342 -698 -1493 -228 -155 119 -817
898 -817 667 2324 -1163 287 3495 -1501 -295 3591 -1333 -1294 2828 -1463 -2205 932 -529 -1588
914 -1588 -648 -357 -352 -1320 737 829 -1476 1470 1751 -1265 1622 1917 -859 1096 351 -363 740 -1026
932 -1026 -450 902 -2749 -1243 912 -2627 -866 1032 -1250 58 794 85 339 337 1653 937 -968
949 -968 1945 1290 -1763 1062 800 -2222 412 -539 -2051 0 -954 -815 384 -1729 1049 1447 -1907
966 -1907 1322 2006 -1347 901 1992 -454 117 1064 407 -818 -705 1301 -1840 -2296 1805 -1894 -3029
983 -3029 2637 -774 -3235 3071 952 -2090 2264 1448 -745 944 1152 467 -153 404 988 -1439 -412
$$ packed form
863h64R33j01m00q41Q2J745k386N9L431l236j94M402l030q01M101k516m51K173
881B106j939O82k6j291J488j578j310K312j373j201K472j040p95J265P3K74r36
898h17J484J657l487J450L208m996J206L886m924L9M122m291p42L137j461j059
914a588R40K91Nr68K057R2k305K946K81l016K887K95k776J955p45p14J103j766
932a026N76J352l651J506K155l539J761J898k282J308P36p09K54kJ316p16j905
949i68K913o55l053K825k62l022K634r51j512K051r54J39J199k113K778L98l354
966a907L229O84l353K248J091k446N71R47o57j225J13K006l141m56M101l699j135
983c029N666l411k461O306k119l042M354q16k193J689K08o85o20N57N84k427J027
$$ plain form
1000 -412 758 -2410 -518 576 -1924 -265 561 -1699 1706 749 -1586 2116 1071 -1270 1911 886
1016 886 -869 1504 782 -776 -177 146 -550 -2167 -611 745 -2850 -781 1945 -2368 -194 2859
1032 2859 -1762 -119 3087 -560 -288 1532 655 65 -320 810 594 -2084 122 194 -2465 -252 609
1049 609 -2673 230 1291 -1434 11 671 512 596 108 1616 1204 -805 1822 676 -1684 1439 88
1066 88 -2161 871 -330 -1905 398 -719 -994 560 -949 -19 870 -127 387 917 649 1191 99
1083 99 1089 672 -1072 1166 406 -2785 1114 299 -3615 863 1027 -3632 441 1824 -2252 -42 2245
1100 2245 112 -784 1804 1678 -1519 643 2985 -1902 -632 3270 -2409 -2247 2834 -1708 -2942 1996
1116 1996 -983 -2167 1221 433 -790 528 1269 239 -168 1723 1482 -1028 1251 1215 -1400 1129
$$ packed form
1000d12J170l168J892J094k500J659Q26k260L405r57k335L702j045k341L181j025
1016H86j755K373p22j558N99L23o96j617J556J356l595K069K726m313K174L053
1032B859m621J643L206l647K72J820q77n90l85J130k16k678K206P2k659K213Q61
1049F09l282K903J061k725J445O60j59Q4m88J508m12k009K627j146k360L123j351
1066H8k249L032j201j575K303j117k75J554j509R30Q89r97N14N30k68N42j092
1083I9R90m17j744K238p60l191L899q15l914M478J64m659M073J383m076K210K287
1100B245k133q96K588j26l197K162K342m887J270L902n679J62N081m542j234M938
1116A996k979j184L388p88j223J318P41j030m07J891k41k510K279l6k615K529
$$ plain form
1132 1129 462 -2195 572 -217 -2565 407 -478 -1331 337 -348 -470 885 223 439 465 594 1666 -69
1150 -69 33 1889 -862 -688 1607 -1652 -1328 1284 -1326 -1711 251 -424 -516 -153 685 277 -909 1592
1168 1592 1500 -1892 1992 2435 -2209 1109 2419 -2320 -358 1739 -2065 -1666 870 -569 -2201 -379
1184 -379 844 -1845 -1021 2553 -617 -1204 3470 -141 -1760 2878 167 -1765 2412 -54 -1365 992
1200 992 -173 -1467 -38 -417 -809 -752 251 -136 -1347 895 535 -1227 1798 1353 -1806 2114 1181
1217 1181 -1342 1705 1080 -2267 627 998 -2002 -433 503 -880 -1442 -339 835 -1795 -421 2208
1233 2208 -824 -616 3158 -510 -694 2701 -23 -796 1270 112 -579 -364 -153 -261 -1744 -544 339
1250 339 -2047 -702 1317 -1483 -161 1491 -412 372 1553 232 376 590 670 720 -448 185 255 -1727
$$ packed form
1132A129o67k657K767p89k348K972q85q53J668o85j22J355o62K16K6J29J072j735
1150f9J02J856k751J74K295l259L24K612k610l85J962o75r2L63Q38m08j186K501
1168A592r2l392L884M43m644L318J310m739J962K097l804L99K536j439j632J822
1184c79J223k689Q24L574l170n87M674l611j619M638k711j932M177k466j311K357
1200I92j165j294J429l79l92N7J003l87j211K242l60j762L025m45l159L920r33
1217A181k523L047o25l347K894L71l000J569R36j383n62J103J174k630J374K629
1233B208l032K08L774l668j84L395k724p73K066j158o91K15K11j08j483J200Q83
1250C39k386J345K019k800J322J652j903P84J181j321J44K14Q0N0j168O33P0j982
$$ plain form
1268 -1727 26 -293 -1474 515 -174 -1840 678 -34 -1097 1052 191 -345 1743 265 -176 1503
1284 1503 567 73 -37 48 244 -973 -20 254 -2093 108 299 -2521 352 1214 -2487 519 1805
1301 1805 -1265 311 2005 -191 257 1329 593 -224 -238 1024 -755 -1248 798 -920 -1733 908 -958
1318 -958 -1364 1069 -375 -678 1146 -16 532 1230 318 774 455 -276 1260 -66 -732 293 -404 -478
1336 -478 -301 -1276 -437 -664 -861 871 -637 -684 1548 -322 -485 1764 80 121 1031 -236 222 744
1354 744 -478 -45 -34 -742 292 -1121 -1044 503 -1077 -668 310 -457 77 524 6 908 91 174 1646
1373 1646 -169 -196 1439 -805 -51 863 -1561 -598 679 -1263 -789 111 -684 -338 -55 301 456 -461
1391 -461 1211 688 -662 805 1393 -667 841 352 -846 235 -794 -798 166 -1307 -764 249 -1162
$$ packed form
1268a727J753l19j181J989o89j666K518p12j063K149q61n36K088j478m41J679
1284A503r36m94j10Q5J96j217R53K74k347K201J91k820K873Q62l701L006J286
1301A805l070J576J694k196M48J072p36q17j4J262j779m93K046j718q13K641j866
1318i58m06K433j444l03J824j162N48O98r12M56l19p31J536j326o66J025o97p4
1336d78J77r75Q39k27j97J732j508m7K232j870j63K249j684M1R10j267M58N22
1354G44j222M33J1p08J034j413P7J547j580M09R78p67N34M47n18R02q17Q3J472
1373A646j815k7J635k244P54R14k424R63J277j942M74R00p95L46K83L56J55r17
1391d61J672n23j350J467N88k060J508m89j198J081j029mR64j473N43J013j411
$$ plain form
1408 -1162 -161 698 -925 176 833 -131 556 725 716 564 -99 1133 -86 -1347 1332 73 -1492
1425 -1492 915 -149 -1805 691 -75 -1309 302 -101 32 352 156 746 532 -42 1383 441 -359
1442 -359 1262 -107 -559 209 -721 -1 -260 -1069 17 -515 -1062 671 -219 -1457 1443 396 -762
1459 -762 1542 399 -166 987 422 211 -86 114 321 -952 -479 400 -1321 -606 546 -1341 -440 810
1477 810 -804 -219 713 -304 642 291 201 1267 6 70 996 -409 -120 377 -782 -457 -287 -620 -303
1496 -303 -725 -337 501 -1138 362 1401 -687 688 1410 -311 660 1139 -396 123 493 -347 328 -204
1514 -204 -372 -359 -1121 -227 -35 -1138 204 325 -531 485 303 177 1074 263 714 603 -347 824 437
1533 437 -1282 604 -128 -1618 198 -160 -1318 -169 -220 -825 123 23 164 213 -5 1170 -29 140
$$ packed form
1408a162J001Q59j623J101O57r64O87J69rj52o63J232j219j261K679j259j565
1425a492K407j064j656K496p66j234J611m03J33L20j96N90k14n74J425r42q00
1442c59J621j369m52P68r30P20k59q09J086n32n47J733q90j238K900j047j158
1459g62K304j143n65J153n65k11k97K00K07j273M73Q79j721P15J152j887R01J250
1477H10j614N85R32j017R46l51r0J066j261O4R26j405K89M97j159L25J70l33L17
1496c03m22L88Q38j639J500J039k088J375P22j721R71M79j535N19L70q40O75n32
1514b04j68J3p62Q94J92j103J342J21q56J016j82j26Q97q11M51j11r50J171l87
1533D37j719J886p32j490J816l58j158J149n1o05R48j00J41M9k18J175j199J69
$$ plain form
1551 140 1305 -312 41 1306 -691 -226 704 -776 -574 318 -1136 -262 111 -948 112 -127 -195 575
1569 575 343 255 580 357 617 332 -101 1002 -298 -630 762 -911 -834 861 -972 -1110 831 -915
1587 -915 -667 517 34 -32 230 521 808 144 788 938 -436 499 954 -933 10 309 -1256 -198 -146
1606 -146 -954 -43 -557 -321 395 -782 177 995 -394 723 1176 -335 652 966 -180 437 178 -329
1624 -329 -31 -623 -164 -295 -1251 76 -394 -1102 457 19 -355 740 -41 248 1103 50 150 842 -385
1643 -385 570 587 -680 -64 -65 -809 -140 -445 -777 -390 -652 224 -194 -603 703 159 -384 1460 684 -520
1663 -520 1250 761 -626 713 199 -540 -8 -72 -298 -522 -596 -171 -896 -551 685 -540 -332 1038 60
1682 60 213 971 -3 576 636 -438 565 -249 -385 490 -707 -618 249 -756 -878 23 -739 -120 136 80
$$ packed form
1551A40J165j617L53J265j997M65R30j480K02Q92j454Q74L73j059J060k39o8P70
1569E75k32q8L25k23K60k85m33J103j300l32J392j673P7J695j833j38J941j746
1587i15K48J184m83o6K62K91K87o64O44J50j374R35M55j887R43K99j565J058N2
1606a46q08R11n14K36P16j177R59Q18j389J117M53j511R87L14j146O17k59n07
1624c29K98n92M59j31r56J327m70p08J559m38l74J095p81K89Q55j053J00O92j227
1643c85R55J7j267O16jp44O69l05l32L87k62Q76m18m09J306n44n43J844p76j204
1663e20J770m89j387J339n14p39N32o4k26k24p4M25p25L45J236j225K08J370r78
1682F0J53P58r74N79O0j074J003q14j36Q75j197Q9Q67j005j22R01p62O19K56n6
$$ plain form
1702 80 603 -124 369 815 -56 537 1003 -339 480 830 -681 -103 37 -997 -15 -414 -846 139 -668
1721 -668 -392 597 -685 -75 892 127 353 496 -41 621 312 238 727 -442 186 295 -1259 -96 216
1740 216 -1417 39 276 -1155 41 346 -120 514 398 185 752 70 620 627 -98 584 123 -581 457
1759 457 -136 -909 146 -449 -589 50 -579 76 177 -630 742 326 -188 984 647 -212 900 116 -25
1778 -25 342 73 86 -324 -708 -110 -567 -828 472 -568 -742 605 -204 -228 932 -52 457 850 -26 452
1798 452 582 -168 335 -162 -248 262 -337 -573 -200 -791 -235 -141 -758 368 -255 -282 1032 -7 113 1242
1818 1242 -391 -43 1144 -108 -24 669 -259 -151 97 -283 -227 -460 -252 -59 -787 73 156 -841 422
1837 422 483 -468 669 462 -231 649 37 -29 627 -375 24 301 -962 -89 -10 -703 -322 -125 -636 -178
$$ packed form
1702H0N23p27M93M46q71N93M66j342Q19L50j511N78J40j034R82l99m32R85q07
1721f68K76R89j282O10R67p65K26J43n37O62l09p4M89j169O28J09j554J163L12
1740B16j633J456K37j431J196L05m66O34j16k13N67o82N50Pp25O82m61p04J038
1759D57n93p73J055n95j40O39o29O55J01q07J372m16n14J172l37q59J112p84j41
1778b5L67k69J3m10l84N98m57k61J300j040j74J347q09k4J160r84N09L93q76M78
1798D52J30p50N03m97q6N10n99k36L73n91N56R4o17J126o23k7J314j039J20J129
1818A242j633L48J187j252Q4O93r28J08K48l80N6k33K08J93p28Q60Q3r97J263
1837D22O1r51J137k07o93Q80o12o6O56j002L99K77j263Q73P9o93L81J97n11M58
$$ plain form
1857 -178 124 -105 445 -91 551 686 365 522 463 -303 858 288 -637 304 -416 -788 173 -813 -572 294
1877 294 -436 42 200 -253 582 529 -12 631 402 28 676 57 438 211 -655 319 -199 -879 284 -496
1897 -496 -1123 467 -336 -743 327 104 -176 574 49 78 288 111 690 50 -64 611 -589 -321 508
1916 508 -802 -427 -98 -809 -249 -70 -614 418 27 -569 926 103 -5 854 98 251 751 -78 59
1935 59 423 -156 246 -610 -321 47 -881 -323 85 -958 40 490 -858 475 541 -447 378 362 -3 816
1955 816 2 132 403 -340 -30 297 -392 -293 -70 -456 47 -354 -344 404 -345 67 597 -34 518 715 -375
1976 -375 727 831 -406 651 75 -554 -3 -200 -341 -202 -633 -209 -371 -537 305 229 -446 540 289
1995 289 -229 880 23 149 540 -176 214 340 -325 -30 129 -855 40 -327 -677 -1 -300 -121 187 -190
$$ packed form
1857a78L02k29N50n36O42J35l21J57n9p66J161n70r25R41p20l72R61r86K41Q66
1877B94p30M78J58m53Q35n3n41O43k29l74O48o19L81k27q66R74n18o80J163p80
1897d96o27J590q03m07J070k23k80P50n25K9K10j77N79o40j14O75j200K68Q29
1916E08j310L75L29p11N60J79n44J032l91n96J495q23j08Q59p56J53N00q29J37
1935E9L64n79M02q56K89L68r28N58M08j043R98M50j348J333O6r88Q25j6l65Q19
1955H16q14J30K71p43L10L27o89R9K23l86N03m01J0P48p49M12N30o31N52J97j090
1976c75J102J04j237J057n76o29N51j97j41J39m31M24j62j66Q42p6o75R86k51
1995B89n18J109q57J26L91p16L90J26o65K95J59r84Q95l67l50O76k99J79L08l77
$$ plain form
2015 -190 57 288 162 643 142 -146 798 -130 -236 605 -339 -229 123 -803 -379 -16 -712 -200 222 -607
2035 -607 51 -34 -10 627 95 319 622 62 259 478 -98 222 268 -289 177 -546 -331 188 -534 -511 274
2056 274 -716 -81 489 -498 252 202 -302 476 343 183 154 -95 578 213 -483 97 -177 -805 12 -155 -949
2077 -949 139 -263 -509 172 -355 -182 874 -401 347 725 -16 391 390 -397 219 -99 -350 -87 -467 67
2097 67 -110 -536 -21 173 -584 517 238 -600 731 214 -61 736 547 231 416 -72 295 376 -403 103
2117 103 -424 -637 170 -320 -648 419 -465 -300 235 -283 218 450 -409 945 193 -353 854 220 -231
2136 -231 688 -464 -159 470 -615 -151 -273 -727 -77 -2 -441 161 -244 -63 572 -183 527 465 -128 332
2156 332 390 -219 283 -154 -469 473 -360 -703 425 -660 -523 120 -298 -96 241 34 174 -214 223 616
$$ packed form
2015a90K47K31j26M81n01k88R44r28j06Q41r44J10L52r26M24L63o96N12M22q29
2035f07O58q5K4O37n32K24L03n60J97K19n76L20M6n57M66p23K15N19p22K3P85
2056B74r90O35N70r87P50n0n04P78j33j60k9k49O73l65o96N80k74o28Q17j67p94
2077i49J088m02k46O81n27J73J056j275P48L78p41M07jp87O16l18k51K63l80N34
2097F7j77m26N15J94p57J101k79q38J331n17k75P97j89l16J85m88L67Q1p79N06
2117A03n27k13Q07m90l28J067q84J65N35n18N01K32q59J354p52n46J207o34m51
2136b31R19j152L05O29j085M64j22m54O50P5m39O02m05J81O35p55P10o2n93M60
2156C32N8o09N02m37l15R42q33l43J128j085J37O43m18K02L37k07J40l88M37L93
$$ plain form
2176 616 14 269 575 -208 322 512 -525 61 258 -673 -265 -64 -627 -158 -189 -300 296 61 124 92 -181
2197 -181 733 173 117 828 -92 -308 428 -305 -341 203 -452 -340 391 -589 -24 35 -538 127 -124 -297 497
2218 497 235 122 781 -222 415 373 -449 406 68 -491 321 -436 -742 72 -332 -508 222 -532 13 338
2238 338 -193 635 445 -144 788 197 -374 846 192 -413 137 -64 -413 -310 -439 -92 -355 -496 228 -359
2258 -359 -132 573 -535 -98 530 -213 244 883 -332 270 514 -221 324 94 -297 -46 -376 -225 -1
2277 -1 -549 133 -61 -307 199 -35 -377 566 -27 -13 795 70 129 598 -133 2 325 -315 -66 211 -294
2298 -294 -232 -435 -270 -2 -445 38 296 -419 271 402 -428 651 433 -319 315 85 -203 75 -204 121
2318 121 -43 -589 -336 -115 -684 -27 -193 -488 240 -211 -246 471 -5 209 537 -232 377 136 -246 590
$$ packed form
2176F16o02K55L06p83N30J90j037N86J97r31M08K01n63M69l1j11N96k35O3l2k73
2197a81R14n60n6P11r20k16P36p33l6N44o55J12P31r80N65N9n73O65k51j73P94
2218D97k62j13O59j003O37m2q22Q55l38n59Q12p57l06Q14m04j76P30p54N45L25
2238C38n31Q28j90n89R32n91n71J220o54o05N50k01l49J03j29L47k63j41P24n87
2258c59K27P05j108M37O28p43M57O39j215O02K44p35N45k30l91K51l30J51K24
2277an48O82j94k46N06k34l42R43n93J4Q08p25N9M69p31J35L23o40K49K77n05
2298b94O2k03J65K68m43M83K58p15O90J31q30J079k18p52O34k30k88K78k79L25
2318A21j64n46K53K21n69O57j66k95P28m51l5P17m76K14L28p69O09k41l82Q36
$$ plain form
2338 590 116 -481 386 -209 -573 53 -429 -277 20 -402 166 281 -422 405 235 -41 505 131 118 483
2358 483 17 -64 93 -213 86 -143 -573 9 -197 -561 400 -63 -319 394 -196 -522 427 4 367 412 43
2379 43 322 94 -8 147 -220 40 141 -775 -83 80 -836 5 338 -660 152 114 -315 309 19 402 379
2400 379 -69 218 295 51 -84 24 -242 192 -261 -371 194 -413 -398 173 -647 -14 99 -316 405 517 -64
2421 -64 358 516 159 327 1 -33 121 -181 -167 -325 -533 -276 -120 -256 116 -259 -302 -46 -47 -21 344 12
2443 12 479 430 -285 301 22 -274 364 -367 -513 119 -373 -425 197 -252 -237 46 -410 109 3 -68 695 226
2465 226 109 508 44 11 530 -128 143 381 -364 -205 -72 -627 102 -166 -425 121 -315 -172 164 -91
2485 -91 155 389 -98 399 187 23 456 -61 -199 714 -219 -429 253 -351 -467 198 -539 72 222 -149
$$ packed form
2338E90m74n97Q67n95l64O26m82J52K97m22N68J15p03Q27j70k76N46l74j3L65
2358D83m66q1J57l06K99k29m30N82k06l64R61m63k56P13n90l26R49m23L63M5l69
2379D3K79k28j02J55l67K60J01r16O92J63r16Q41L33r98Q12l8m29O24k90L83k3
2400C79m48K87P7k44j35J08k66M34m53j10N65o07J5N71q20O33J13m15P21J12n81
2421f4M22J58l57J68l26l4J54l02J4j58k08K57J56j36L72l75m3K56jK6L65l32
2443A2M67m9p15N86k79k96O38p31j46O32m92n2O22m49J5K83m56N19j06p1P63m69
2465B26j17L99m64l3N19o58K71K38p45J59J33n55P29k68k59N46m36J43L36k55
2485i1K46K34m87M97k12j64M33n17j38R13r33k10O82o04j16O65p37O11J50l71
$$ plain form
2505 -149 259 -156 67 152 97 322 346 -354 280 232 -236 113 -44 -387 -94 -87 -560 218 -540 -255 154 -276
2527 -276 -136 226 -165 133 352 -7 105 371 -161 104 48 -216 127 -224 219 -86 -641 130 -294 -422
2547 -422 33 -206 -248 386 31 -97 482 23 107 310 -129 326 167 102 242 -306 -187 159 -445 -80 109
2568 109 -514 63 -91 -254 68 -103 75 488 -142 302 434 273 229 218 -83 58 199 -385 9 -186 -300
2589 -300 29 5 -170 307 -284 -174 100 -199 171 188 255 345 233 -283 443 29 -160 185 -387 -338 297 -359
2611 -359 -295 -92 -659 -150 -56 -155 26 -275 438 228 -135 429 449 -199 447 97 -136 381 17 -422 30
2632 30 -240 -426 14 -263 -168 -63 -213 -36 151 128 326 102 -52 266 105 13 235 -239 324 101 -443
2653 -443 -113 126 -547 -115 -148 -438 -80 -175 -143 171 -103 42 292 58 418 327 -118 525 328 -315 423
$$ packed form
2505a49M08m15K23Q5n5K25K4p00O34m8m68L49j57l43K93Pm73P78p58K85M09m30
2527b76J40L62l91K98K19l59J12K66n32K65n6k64L43l51M43l05n55P71m24j28
2547d22M55k39m2O34l55j28N79m59Q4K03m39M55j59o5J40n48J19L46o04L65J89
2568A09o23N77j54j63L22j71J78M13o30M44J32j61m4j1l01J41J41n84L94j95j14
2589c00L29k4j75M77n91J10K74k99L70J7O7R0j12n16P26m14j89L45n72M9O35o56
2611c59O4K03n67N09R4r9J81l01P13k10l63N64K0o48O46l50k33N17l64m39M52
2632C0k70j86M40k77R5J05j50J77J87k3J98k24j54L18j61r2K22m74N63k23n44
2653d43L30K39o73M32l3k90L58r5L2L14k74J45K50k34L60r1m45O43j97o43P38
$$ plain form
2674 423 -118 -592 76 -200 -439 127 -333 -220 -195 -120 195 -137 322 48 154 -221 183 41 360 20 -107
2695 -107 203 238 -604 -196 -329 -205 1 -384 -258 36 -320 -151 244 -16 205 76 -191 348 182 -3
2715 -3 312 8 -76 232 -421 -78 -204 -256 -111 -206 -432 -136 -152 -152 416 -170 228 569 -27 166 298 -72 444
2738 444 545 -160 -37 -193 -256 -32 -47 -40 -78 -260 -2 -146 -224 174 -34 105 322 61 -44 580 -83 271
2760 271 -141 -190 238 133 -366 -180 -92 -111 -82 -353 -298 182 -96 -60 -69 -355 445 516 95 355 351 -115 332 142
2784 142 -229 121 -53 -342 -159 -248 -33 -40 -132 46 -31 -378 142 257 -104 368 28 298 687 149 149 88 15
2807 15 221 124 -67 -21 -127 -113 5 -522 -6 81 -85 175 401 29 155 203 -223 199 -20 80 112 -116
2829 -116 112 16 -240 -5 -78 -422 281 -116 -393 124 -275 -466 468 -10 -238 293 32 348 486 158 60
$$ packed form
2674D23n41m74O68k76k39N66m60J13K5P5L15l32M59k74J06l75M04j42L19l40j27
2695a07L10L5q42M08j33J24K06l85J26K94l56J69L95k60K21j29k67N39j66j85
2715cL15l04q4L08o53L43j26n2J45r5k26K96j6%N68n86L98L41n96J93J32l70N16
2738D44J01p05J23j56o3K24j5Pl8j82K58j44p8L98k08J39K17k61j05O24o63L54
2760B71m12m9M28j05m99J86Q8j9K9k71N5M80k78L6rk86Q00P1m21K60mm66M47j90
2784A42l71L50j74k89J83q9K15pr2J78p7l47N20J15l61M72l40K70L89n38%o1p3
2807A5K06r7j91M6j06J4J18n27N16Q7j66K60K26l72J26M8m26M22k19J00L2k28
2829a16K28r6k56K35p3l44P03l97k77N17l99j91R34m78k28N31k61L16J38l28r8
$$ plain form
2850 60 163 -65 23 -114 180 234 -496 -165 308 -536 -120 28 -581 -79 213 -280 350 155 -120 395 -41
2871 -41 153 -1 -112 383 0 -382 -126 -255 -325 9 -218 -73 30 -358 22 190 75 171 107 -133 187
2892 187 102 136 187 -160 61 191 -358 -208 313 -173 -140 -22 -407 -330 -4 12 139 44 234 225 -47 123 550
2915 550 -74 245 128 -222 74 24 -460 264 -144 -563 249 -25 -387 114 -251 104 -8 48 75 -123 10
2936 10 251 225 176 74 -216 260 90 -241 -224 68 -335 -83 79 -440 -248 -368 -50 47 -148 57 59 -119
2958 -119 84 13 -80 26 0 -197 319 -77 -120 212 -292 -196 -103 -129 -301 -280 -9 229 250 212 372 349 151 178
2982 178 84 -9 205 -84 56 209 -216 -301 -253 -242 91 -148 -180 286 0 -141 -20 -162 289 214 91 418
3004 418 65 -234 285 145 -32 140 -303 -221 222 -253 -8 9 2 7 -183 -103 1 -9 177 529 -1 188 219
$$ packed form
2850F0J03k28Q8j37K94N4p30L31M73q44M16J48o09N02K92m93O30j95k75N15m36
2871d1J94j54j11M95l83l82K56j29p0L34k27J45J03l88L80J68j15R6o4k40L20
2892A87q5L4N1l47K21J30n49J50N21m86L3J18l85P7L26J6J27r5J90rk72J70M27
2915E50o24L19j17l50K96n0m84P24m08m19Q12k74l62N01l65L55j12N6K7j98J33
2936A0K41k6m9j02k90M76j70l31J7K92m03K52J62n19J92j20L18R7j95K05Kj78
2958a19K03p1r3J06k6j97N16l96m3L32n04R6R3k6j72K1K71K38K1l8J60k3j98K7
2982A78r4r3K14k89J40J53m25q5M8J1L33k39l2M66k86j41J21j42M51p5j23L27
3004D18l53k99N19j40j77J72m43Q2M43m75K45J7pNj90Q0J04j0J86L52n30J89L1
$$ plain form
3027 219 -196 174 151 -72 -38 -135 -321 -78 -184 -170 64 -453 -157 232 -116 409 51 15 203 56 -242 268
3049 268 -157 -254 359 -256 -87 -157 -353 -65 -1 -182 -236 -127 -487 7 -24 -103 218 -85 62 168 -80 500
3071 500 116 -292 72 -42 -279 -2 33 11 130 -198 -85 -175 -149 46 3 58 91 4 -219 81 116 241 353
3094 353 -37 340 -12 -150 -86 35 -388 -212 -63 -281 13 -166 135 45 -103 107 -90 -105 53 232 14
3115 14 277 324 102 374 -20 -101 -37 18 31 91 -285 -134 -80 -177 264 24 -16 180 -53 150 313 9 332
3138 332 222 -46 255 -24 -275 319 4 -236 64 -355 -204 34 -148 1 77 -159 216 -71 277 537
3158 537 -23 1 403 6 15 192 -22 255 -82 -264 -180 -128 -347 151 -248 82 210 -240 75 467 26 275
3180 275 377 -207 215 54 281 -83 135 -274 169 -246 -369 160 -395 201 -27 -403 -23 -222 -216 93 -119
$$ packed form
3027B19m15L70k3k23L4r7j86K43j06J4K34n17K96L89l48N25l58l6J88j47k98N10
3049B68m25r7O13o15J69p0j96K88O4j81n4J09l60M94l1p9L21l03J47J06k48N80
3071E00l84m08L64j14k37K77L5k2J19l28J13r0K6J95m3N5L3q7k23L00L5J25J12
3094C53l90L77l52j38O4J21m23J76J49k18K94j79L01r0j48K10j97j5J58J79k18
3115A4K63M7k22K72l94q1O4N5J3O0l76J51N4r7M41k40m0J96k33K03J63l04L23
3138C32j10k68L01k79k51N94l15k40L00m19J51K38j82J49P6k36L75k87L48K60
3158E37n60K4M02l97RJ77k14K77l37j82Q4N2k19M98l99L30J28m50L15L92m41K49
3180B75J02n84M22j61K27l64K18m09M43m15j23N29n55N96k28l76L80j99OL09k12
$$ plain form
3201 -119 38 524 -92 213 129 -129 239 258 -57 154 4 -138 47 -342 -278 -36 -370 43 190 -177 342
3222 342 87 -248 206 142 -245 323 -49 30 309 -54 172 173 -358 -92 -140 2 85 -468 -315 211 -246 -31
3244 -31 232 -152 138 210 -126 241 59 98 79 -34 11 -124 -333 -67 233 -466 -12 163 -392 -9 238 -277
3266 -277 294 1 103 271 -21 -66 272 289 -30 163 -121 185 -96 -8 24 -179 -224 -160 -156 -7 171 -313 138
3289 138 134 9 152 191 -132 239 62 97 41 83 203 -269 -43 10 -118 -380 125 -170 -19 -146 5 -137
3311 -137 233 100 -3 462 14 -52 225 61 114 -29 -34 -126 -260 93 53 -158 -24 3 -128 39 229 -104
3333 -104 159 244 227 159 227 93 -4 160 16 122 -89 -160 49 114 73 -160 -285 90 -343 -209 46 -73 -185
3356 -185 -5 -106 31 362 -88 -22 185 -2 -37 -16 -17 81 59 -160 103 -116 -105 30 -260 -40 137 -98 31
$$ packed form
3201a19J57M86o16L05q4k58L68J9l15K11j50j42J85l89O4K42l34M13J47l67N19
3222C42k55l35M54o4l87N68l72P9K79l63K26Jn31K66m8J42Q3n53J53N26m57K15
3244c1K63l84K90P2l36L67j82L9j9j13M5j35k09K66L00o99M54J75n55L83K47n15
3266b77N71k93J02J68k92m5L38J7l19J93k84L06k81Q8L2k03m5O4MJ49J78m84M51
3289A38mj25J43L9l23L71j77L5n6M2J20m72K26N3j28k62N05k95J51j27J51j42
3311a37L70j33j03M65m48o6K77j64N3j43nr2j34L53m0k11J34K7j31J67J90l33
3333a04K63Q5j7o8O8j34r7J64j44J06k11p1K09O5m1k33j25L75m33J34K55j19j12
3356a85J80j01J37L31m50O6K07j87l5K1jR8k2k19K63k19J1J35k90K20J77k35J29
$$ plain form
3379 31 21 -130 104 76 251 237 -186 201 139 -266 111 -59 -246 -110 -112 -386 65 -6 -131 -282 -116 109 4
3402 4 108 256 55 99 430 -116 2 172 14 -75 176 -247 -48 192 -332 5 -76 41 83 146 -27 194
3424 194 -36 181 409 -66 98 -92 -10 332 -111 -117 169 -93 -168 103 -181 154 -69 56 81 49 -31 125
3446 125 99 -84 262 -45 188 288 -107 254 197 5 246 116 -63 -157 -301 -357 123 119 -12 -12 -165 -147 121
3469 121 261 368 39 -104 433 269 -79 154 -165 -145 47 -15 -45 -6 -226 -66 -89 -192 36 -40 -124 126
3491 126 -215 32 237 -25 180 160 43 94 157 -239 177 -11 -304 -85 -35 116 167 -314 62 246 -150 151
3513 151 -26 -158 203 6 -190 335 -120 67 372 -109 -40 -146 -158 57 -174 -387 -245 -56 14 -95 -30
3534 -30 254 119 53 248 268 10 -34 -57 97 -146 -65 222 98 -107 -6 -134 -375 -112 -53 -177 361 -2
$$ packed form
3379C1j0j51K34k8J75j4m23L87o2m05L77j70j87J36kk74M51p1j25j51J66K25j05
3402DJ04J48k01M4L31n46J18J70j58q9K51m23J99K40n24L37q1J17M2O3j73K21
3424A94k30K17K28m75J64j90Q2L42m43oK86k62p5K71k84L35k23J25K5l2q0J56
3446A25k6j83L46l07K33J00l95L61n7j92K41j30j79r4j44n6M80mj31%j53J8K68
3469A21J40J07l29j43N37j64l48K33l19K0J92o2l0L9k20J60k3j03K28p6q4K50
3491A26l41K47K05k62K05k0j17N1O3l96M16j88k93K19N0J51N1m81L76J84l96L01
3513A51j77j32L61j97j96N25m55J87L05m81O9j06j2K15k31k13J42J89P0j09O5
3534c0K84j35o6J95K0k58m4k3J54k43Q1K87j24k05J01j28k41K63N9j24N38l63
$$ plain form
3556 -2 -429 254 213 -143 317 12 -2 181 39 97 -54 -242 -96 -213 -243 -93 -5 54 97 -107 -163 123 147 141
3580 141 56 155 260 -55 54 163 161 -105 66 -127 83 48 -400 -96 42 -224 101 -129 -293 239 398 -93
3602 -93 95 -102 20 417 130 257 -46 -91 141 -120 -203 86 -208 -297 2 -124 -307 63 -247 -22 56 -131
3624 -131 248 -85 -6 209 -163 142 163 -28 -86 280 109 -16 73 -298 -59 -275 -49 56 -27 -288 262 -354
3646 -354 173 33 -44 38 215 66 380 -26 -227 -13 -252 -143 124 -51 -112 237 -79 -209 78 -236 278
3667 278 -61 -128 176 77 92 -3 -37 143 368 -94 361 10 -205 -170 -271 -151 26 -95 -72 153 -65 -43 -94
3690 -94 8 198 204 -238 74 -98 -36 139 -73 -4 228 -19 51 -155 -286 -17 159 -82 126 -75 -29 98
3712 98 -264 -25 58 -48 -102 112 -21 195 224 117 -57 -55 -403 30 -91 -173 158 -140 -173 -27 -70 -40 54 -77
$$ packed form
3556bm27O83m1l56M60l05j4J83j42N8j51j88J46j17l0J50Q8N9M3k04n6K86K4o
3580A41q5R9J05l15J09J09kk66J71j93K10l5m48L04J38k66L25k30j64N32J59m91
3602i3J88j97J22L97k87J27l03m5K32k61q3K89k94q9K99j26j83L70l10K25P8j87
3624a31L79l33P9K15l72L05K1j91n8L66j71j25Q9l71K39k16K26J05q3k61N50o16
3646c54N27j40p7Q2J77j49L14m06k01K14k39J09K67j75o1L49l16j30K87l14N14
3667B78l39o7L04r9J5r5l4J80K25m62M55l51k15L5j01J20J77j21K3K25k18K2n1
3690i4J02J90Om42L12j72O2J75k12O9K32k47P0k06j31K69J76k41K08k01M6J27
3712I8l62K39Q3j06n4K14j33K16K9j07j74Kl48M33j21q2L31k98l3J46m3L0R4j31
$$ plain form
3736 -77 348 223 -208 180 27 -35 102 260 48 110 -51 -23 127 -49 46 -204 -49 52 71 -168 429 -107
3758 -107 109 83 -100 128 218 151 160 -110 -27 128 -94 -145 -141 -290 -229 -78 -250 -90 26 -261 152 30 -176
3781 -176 77 250 176 259 33 292 -88 -151 76 -190 -89 105 -99 -121 337 -267 -167 198 56 -93 35
3802 35 -197 120 26 -68 -116 38 -22 -235 -209 62 34 -126 -103 -310 -276 181 -85 -109 118 113 -192 -83 -56 95
3826 95 228 -120 290 -215 -55 74 204 -133 21 -132 -184 278 65 -147 64 -89 -151 138 -259 187 -115
3847 -115 -161 -75 210 146 22 -140 16 211 -277 152 131 -181 53 129 -151 17 37 -260 -114 -73 -17 -39 -44 53
3871 53 31 11 -113 -248 247 126 120 -81 54 -120 2 -131 -245 -71 -13 -226 42 119 -54 90 284 115
3893 115 -142 -84 -155 147 -192 -89 28 -74 44 -87 -51 107 -160 58 50 44 50 11 -150 -64 -58 -17 374 7 89
$$ packed form
3736g7M25j25m31L88j53o2J37J58k12O2j61K8J50j76R5k50J55J01J9k39N97n36
3758a07K16k6j83K28R0o7Rk70Q3J55k22n1Mj49O1J51j72J60J16k87M13j22k06
3781a76K53J73p4Q3k26K59l80o3K27k66J01J94k04k2M58o04J00L65j42j49J28
3802C5k32L17r4r4m8J54o0k13K6K71k8j60K3k07L4M57k66k4K27nl05J09K7J51
3826I5J33l48M10n05J60J29J30l37J54j53n2M62k13k12K11j53o2K89l97M46l02
3847a15m6Q6K85o4j24j62J56J95m88M29k1l12K34P6k80J68K0k97J46M1N6k2nR7
3871E3k2k0j24j35M95j21ok01J35j74J22j33j14J74N8k13K68P7j73J44J94j69
3893A15k57N8p1L02l39J03J17j02J18j31L6J58k67K18qoOl9j61Q6OM1L91l67Q2
$$ plain form
3918 89 143 -30 63 306 -277 -223 220 76 -69 134 -148 -22 -115 -216 76 -125 99 -7 -202 -217 129 216
3940 216 233 255 -26 84 103 -177 94 78 9 -17 -53 24 120 -384 34 -185 -44 290 -81 -275 172 -154 127
3963 127 217 -171 126 -45 -47 -102 -123 -146 95 155 -74 159 -433 19 64 -147 -135 54 -15 70 -162 37 124 -68
3987 -68 -25 286 -89 43 -40 -53 -102 22 -334 -293 3 -208 -63 -135 -76 19 30 146 125 145 148 238 169 197 232 25
4013 25 -7 -24 -168 162 -181 -157 118 -530 -12 -85 48 160 -34 -153 179 13 -129 284 -178 103 18 113
4035 113 -77 138 -189 -43 35 -213 -32 -10 -129 -31 40 -12 71 -197 69 85 -73 16 106 463 62 -210 59
4058 59 130 -309 209 98 -158 -30 -111 98 -49 107 -188 15 -122 98 246 74 -29 80 -105 211 -4
4079 -4 66 -4 -72 33 20 -102 -61 174 -63 -208 -12 -235 78 47 -151 130 -92 -104 -2 253 -318 -189 -172
$$ packed form
3918H9N4j73R3K43n83N4M43j44j45K03k82J26r3j01K92k01K24j06j95j5L46Q7
3940B16J7K2k81J10J9k80K71j6o9k6l6P7R6n04M18k19J41L34l71j94M47l26K81
3963A27R0l88K97j71kn5k1k3K41O0k29K33n92M52M5k11J2J89o9Q5k32J99Q7j92
3987f8M3L11l75J32q3j3m9J24l56M1K96k11J45p2N9R5J1J16k1K0LR0o9K8L5k07
4013B5l2j7j44L30l43K4K75o48N18p3J33J12j94j19L32j66j42M13m62K81q5R5
4035A13j90K15l27J46P8k48J81K2j19R8P1n2Q3k68K66J6j58Q9R0L57m01k72K69
4058E9P1m39N18j11k56J28q1K09j47J56k95K03j37K20J48j72j03J09j85L16k15
4079dP0p0o8J05j3j22M1K35k37j45J96k23L13l1j98K81k22j2J02K55n71J29J7
$$ plain form
4102 -172 -15 167 -149 -33 -153 -138 108 -115 -123 -189 -18 -69 196 -90 -64 192 -310 52 96 160 108 -140 -98
4125 -98 -54 -255 12 151 -128 -218 -89 -121 -118 -76 -150 -16 218 0 263 -92 118 169 134 -92 337 -165 204
4148 204 183 -317 74 9 -358 112 -288 -115 128 -141 -146 -126 -118 -63 112 -14 78 259 -20 -10 -15 -99 241 -94
4172 -94 -237 117 -201 -199 -169 -45 14 -131 155 342 258 -278 216 -18 159 -46 -175 104 -44 -84 233 -167
4194 -167 -78 -2 -240 65 -32 -129 -182 82 -21 25 222 168 125 -137 115 189 -28 2 128 4 25 147 -221 -87
4218 -87 -125 -92 38 -274 -50 272 -185 -160 198 -65 -73 142 -27 190 201 -23 -97 195 -225 -102 -38 -55 141
4241 141 7 -211 155 -49 162 -28 54 42 186 80 -53 -143 -31 223 -140 -208 87 -131 -119 62 31 86
4263 86 -132 -173 -346 -261 9 -157 -246 188 133 34 109 -2 14 184 -257 -93 126 -77 -26 -47 -343 -133 -97 -38
$$ packed form
4102a72J57J82l16J16j20J5K46k23qo6J71n1K65k86K6K56n02L62M4O4n2k48M2
4125i8M4k01K67J39k79r0J29l2LM2p4J34K34k18K63l55K10N1l5k26M29n02L69
4148B04k1n00L91o5l67M70m00J73K43k69nK0QN5J75j26R2J81k79J0nq4L40l35
4172i4j43L54l18KL0J24N9j45K86J87q4n36M94k34J77k05j29K79j48m0L17m00
4194a67Q9P6k38L05r7r7n3K64j03M6J97n4m3k62K52P4k17L0J26j24K1J22l68J34
4218h7l8L3J30l12K24L22m57K5L58k63qK15j69K17J1k24p4K92m20J23O4j7J96
4241A41j34k18L66k04K11j90Q2j2J44j06j33r0J12K54l63o8K95k18J2J81l1N5
4263H6k18m1j73Q5K70j66q9M34n5r9P5j11J6J70m41J64K19k03N1k1k96K10L6N9
$$ plain form
4287 -38 -31 37 -136 162 114 89 107 108 -57 115 65 47 38 -13 44 -122 -198 -145 -225 -202 -98 -234 -80 68 -225 -87
4313 -87 231 -152 20 -31 -130 234 -142 -34 189 142 52 -88 -197 72 20 -211 240 157 -307 -252 -107 56 216
4336 216 -49 95 93 108 -49 -150 -182 180 170 69 55 -172 -130 -178 97 -230 -55 -245 -64 -64 -292 106 29 -165
4360 -165 -30 108 15 283 -150 229 137 192 -40 173 19 112 -9 -215 150 -147 182 -99 -198 24 109 -166
4382 -166 -88 42 48 39 12 34 352 -209 -31 108 157 24 71 -155 184 9 -130 -122 -43 -89 82 -352 104 52 18
4407 18 -127 110 -8 70 84 -4 216 -50 -248 114 66 49 130 -229 -19 -59 140 60 13 -119 112 79 113 154
4431 154 230 -214 306 -413 -32 41 -103 -33 88 10 151 54 -138 -60 -63 39 -12 -2 -78 -5 -15 127 322 -77
4455 -77 123 149 -137 422 -218 80 49 -5 -112 -38 -180 -198 59 -296 -17 -11 114 164 101 -54 46 -26 23 62
$$ packed form
4287c8PO8j73K98m8k5J8Jj65J72n0j8rn1N7j66p6N3q0K3J04j36J54J48k93J38
4313h7L18l83J72n1r9L64l76J08K23m7r0j40j09K69n2k31M51q3m64N5J45J63J60
4336B16k65J44kJ5j57j01l2L62j0j01j4k27M2m8K75l27J75j90J81%k28L98p7j94
4360a65J35J38r3K68m33L79r2N5k32K13j54R3j21k06L65k97L29k81r9K22Q5k75
4382a66P8J30Ork7K2L18n61J78J39M9j33M7k26L39j75j39QP9m6J71m34M56n2l4
4407A8j45K37j18P8J4q8K20k66j98L62m8j7Q1l59K10m0J99q0m7j32K31l3L4M1
4431A54P6m44N20p19L81P3j44P0J21p8J41r7j92P8lJ02n1J0p6P3j0J42J95l99
4455g7K00K6k86N59o40K98l1n4j07P4j42j8K57l55K79OJ25N0o3j55J00p2M9L9
$$ plain form
4479 62 -93 -167 123 16 -170 57 29 -18 -366 -8 56 -87 -89 -68 -27 -102 34 -6 160 166 -55 62 -120 75
4503 75 -135 152 47 -115 135 25 -35 -192 -88 281 -193 -160 152 -35 135 -50 166 182 -8 -219 299
4524 299 50 -134 96 46 144 116 -101 101 27 -85 -153 212 -74 -97 -166 125 95 -182 196 129 158 63 -311 115
4548 115 71 -253 -145 -14 -150 283 -142 -273 67 -124 78 242 -115 -78 425 -63 -106 -52 -37 239 -184 -103
4570 -103 39 62 -52 74 -115 122 -41 83 -179 -10 -168 79 72 -4 159 -42 34 27 -100 77 50 77 6
4593 6 149 190 -86 -67 -95 96 -235 25 130 -312 -165 63 -33 -96 222 -271 317 157 60 -51 -183 -1 194
4616 194 -103 79 120 -198 4 102 -51 139 99 -130 -23 139 -188 -46 -78 46 244 -109 215 -22 -68 12
4638 12 25 30 158 1 180 -110 -172 -135 68 -119 89 111 -81 109 38 114 -75 87 105 -60 -205 -4 -33 150
$$ packed form
4479F2j55p4K90j07j86K27k8m7l48L58O4j43kK1M1p5J36m0J66Ok21J17j82J95
4503G5k10K87j05j62K50j10o0j57J04L69m74L3L12j87J70j85K16J6j90k11N18
4524B99k49j84K30n0R8k8k17K02p4j12o8L65k86k3o9K91l0k77L78o7K9r5l74M26
4548A15m4l24J08J31j36M33m25j31L40j91K02J64l57L7N03m88m3N4J5K76m23Q1
4570a03J42K3j14J26j89K37j63J24k62J69j58K47pp6J63k01P6pj27J77k7K7p1
4593FJ43M1k76J9k8J91l31K60J05m42J47K28r6o3L18m93N88j60r7j11j32J82J95
4616A94k97J82M1l18K02R8j53J90m0k29J07J62l27J42l2J24J98l53L24k37m6Q0
4638A2J3NJ28j57J79k90o2L7K03j87K08K2j92J90p1P6j89J62J8j65j45K01k9J83
$$ plain form
4662 150 2 77 -51 -54 191 -124 97 17 46 -156 -114 135 153 58 13 36 6 84 -79 -33 -156 87 -61 181
4686 181 220 93 -36 -247 6 -306 105 92 -87 3 -1 -122 -2 -110 6 147 -37 -90 51 219 56 -234
4708 -234 -287 73 44 -255 151 189 54 153 286 125 151 -149 -68 10 74 97 142 291 4 153 168 -153 58 -317
4732 -317 99 -140 -222 229 83 -197 176 86 81 200 -106 145 33 -12 60 -133 -147 19 163 1 -79 -87 87
4755 87 -13 -246 36 166 101 26 88 -27 -37 150 74 67 130 49 179 -61 -57 156 -4 -85 -113 -200 76 -117 -54
4780 -54 217 -159 5 -185 178 76 334 38 -93 127 -21 61 127 -95 73 86 103 -211 -174 52 165 61
4802 61 96 -6 -54 402 36 -333 -111 90 118 91 -304 0 -24 -65 161 -133 155 99 -239 -422 -13 -222 -164
4825 -164 92 -181 -82 43 26 120 18 100 -72 73 124 171 16 -219 39 -252 42 19 -206 -38 116 -84
$$ packed form
4662A50j48P5j28lK45l15K21q0K9k02M2K49J8r5m5K3l0P8j63M6j23K43j48K42
4686A81L9j27j29k11K53l12M11j3j79R0mj21J20j08J16J41j84n3J41J68j63k90
4708b34n3L60k9k99M06L8j35R9J33j61K6l00Q1P8O4K3M5J49k87J49J5l21K11l75
4732c17M16k39q2M51j46k80L73r0nJ19l06K51j12m5P2j93j4J66J44j62q0qJ74
4755H7j00k33K82J30o5p5O2j15j0J87p6pO3q1J30k40MK13j60q1k8q7K76j93O3
4780e4K71l76J64j90L63j02K58k96j31K20j48Q2O6k22J68J3J7l14L7K26J13j04
4802F1L5j02m8M56l66l69K22K01K8k7l95L04k4m1K26k94K88n6l38j83M09k09N8
4825a64K56k73R9J25j7R4j02Q2j72J45N1M7j55k35K58k91K94k3k25J68J54k00
$$ plain form
4847 -84 2 -362 -320 -70 33 79 -22 126 351 20 -33 111 -121 -247 238 -156 -142 14 -7 -90 155 214 71
4870 71 -20 60 -350 68 140 246 27 -106 80 114 -51 181 138 -153 236 -20 11 -12 -120 134 -39 33 -116
4893 -116 38 341 1 162 -51 98 245 10 282 -117 425 -212 56 31 -8 -22 -99 39 188 44 -232
4914 -232 14 -11 118 32 -211 294 185 75 65 93 97 -23 -69 23 356 -78 -87 -61 -339 91 -23 149 -31 -108
4938 -108 -48 -91 383 -85 108 -229 -326 90 -85 73 174 -72 112 -111 -75 69 3 -49 -37 -89 -308 -39 -179
4961 -179 71 77 30 -23 273 141 20 45 -83 72 252 68 74 -330 -12 -68 -185 152 5 110 -12 153 157
4984 157 66 -44 -9 -48 156 -76 48 38 14 233 -118 -30 234 -200 92 148 -66 -9 145 62 -72 -64 46 -239
5008 -239 -78 62 138 -17 164 138 142 66 150 223 8 169 42 -27 -240 -29 194 -257 -105 -53 -63 -83 108 1
$$ packed form
4847h4Q6l64M2K50J03M6j01J48K25l31n3J44k32j26M85l94J4J56k1q3K45N9j43
4870G1r1Q0m10M18P2J06k19j33J86L4j65K32m3k91L89k56L1k3j08K54j73P2j49
4893a16J54L03l40J61k13J49J47k35K72l99N42o37K68k5l9j4p7J38J49j44k76
4914b32K46k5J29q6k43N05j09j10j0K8Mj20m6R2L33m34rK6k78M30j14J72j80p7
4938a08O0m3M74m68J93l37r7M16j75J58J01k46J84k23L6J44o6n2J2n2k19K69j40
4961a79K50Om7n3K96j32j21K5j28J55J80j84Om04L18n6j17L37j47J05j22J65M
4984A57r1j10L5l9K04k32J24j0k4K19l51Q8K64m34K92N6k14N7J54q3j34QJ10k85
5008b39J61J40P6j55J81k6Mp6Q4P3k15J61j27o9k13K11K23m51J52N2j0k0J91j07
$$ plain form
5032 1 44 -126 149 -66 -209 -17 37 9 77 13 -133 132 -197 -155 98 -292 42 -158 112 132 47 187 52
5055 52 89 -61 202 110 105 169 117 -144 119 0 150 126 78 -156 -181 -75 -205 -22 146 189 -114 -271 158 -126
5079 -126 249 145 106 65 159 12 -60 -233 -101 112 -87 -112 -9 60 249 116 -137 -55 141 -66 -208 156
5101 156 -16 204 12 -161 92 -67 -26 -4 -203 15 -162 -43 190 -138 166 32 50 -228 74 76 195 37
5123 37 -44 265 -62 142 -33 -101 -191 -136 -117 340 -183 -65 8 49 -12 183 16 46 -9 97 -72 -49 5 -41 106
5148 106 -73 15 84 -87 173 5 -190 122 -219 112 34 -131 184 6 101 425 -22 100 108 -89 57 135
5170 135 -388 96 62 59 -35 -21 -252 -1 40 -27 194 163 -39 193 25 72 131 -176 -65 35 333 -71 140
5193 140 -187 167 -110 -168 -12 -188 4 -66 -6 -182 11 -13 35 144 -175 -136 31 -30 -202 -245 154 163 157 1
$$ packed form
5032AM3j70K75k15j43J92N4k8O8o4j46K65l29M2K53l90L34k00K70K0q5J40j35
5055E2L7j50K63r2nO4n2k61K63j19J50k4m8k34k5J06j30J83J68M3l03j57M29k84
5079a26L75j04l9m1R4j47p2j73J32K13j99k5J03O9J89j33k53Q2J96k07j42L64
5101A56j72K20j92j73K53j59M1K2j99K18j77J19K33l28L04j34J8k78L02KJ19j58
5123C7q1L09l27K04j75o8r0N5J9M57n23J18P3M1o1J95j67L0n5J06j69K3N4m6J47
5148A06j79Q8O9j71K60j68j95L12l41L31p8j65L15j78R5L24m47J22Qj97J46P8
5170A35n23M84l4lr4J4k31K51M1o7K21l1k02K32j68M7N9l07J11J00K98m04K11
5193A40l27L54k77n8J56j76J92p0O0j76J93k4M8J09l19L9J67o1j72m3L99Roj56
$$ plain form
5217 1 407 37 263 -130 39 81 -143 -243 -179 5 -154 198 66 -205 161 51 -161 4 -10 -113 -167 -12
5239 -12 235 -24 115 83 -202 -54 -13 -78 45 -92 -155 164 -221 -41 220 -26 173 126 216 -4 -14 95 -129
5262 -129 157 -239 68 -184 27 -80 73 94 -60 -250 3 -43 -12 229 66 104 326 -157 103 247 23
5283 23 29 -292 -4 -109 256 -44 -34 14 15 -367 100 -86 -53 139 110 -75 127 7 103 -49 164 -59 162
5306 162 115 -110 -83 -67 1 -26 135 -17 -65 -117 -66 153 233 64 -229 -150 90 98 90 64 -378 -81 89 224 118
5331 118 143 29 -260 179 -57 11 42 77 -85 -251 1 11 103 396 115 29 -107 104 116 97 139 -111 124
5354 124 114 -93 113 -71 207 1 152 12 23 48 34 119 34 121 248 -167 342 97 53 99 97 -136 98 40
5378 40 -318 -167 43 -142 -68 -47 -22 123 49 52 -43 -107 105 -298 140 89 -15 -278 17 44 -127 -1 13 -110
$$ packed form
5217AM06l70K26l93J69M2k24j00O4J84j59L52j32k71L66j10k12J65j4j03n4J55
5239a2K47k59J39l2k85J48M1o5J23j37o3L19l85J80K61k46J99m7R0k20j0J09k24
5262a29K86l96L07k52K11j07J53K1j54j90K53m6L1K41j63L8K22m83K60J44k24
5283B3Ol21K88j05L65l00J0M8Jl82M67j86L3J92k9j85K02j20R6j52K13k23K21
5306A62m7k25K7J6O8k7J61j52m8n2N1K19Q0j69k93P9K40Qqk6m42K97J70J35j06
5331A18K5j14k89M39k36O8L1L5j62j66K52J0R2K93k81q6j36K11J2j9M2k50K35
5354A24j0k07K06j84K78k06J51j40J1K5j4Q5q5Q7J27m15N09k45m4M6kk33K34n8
5378D0l58J51K10j85P4K1K5J45p4Lr5o4K12m03M38n1j04k63K95K7j71J26J4j23
$$ plain form
5402 -110 -68 -342 209 181 20 105 -277 -167 112 -344 -142 130 145 378 -69 288 -69 15 7 242 -17 -64 -19
5425 -19 158 -131 134 -2 -30 -96 72 95 170 -75 -112 -211 7 15 -239 -29 -70 -99 79 169 -71 -12 -404 -60
5449 -60 238 -117 -41 139 -186 -93 286 -97 51 -118 -63 207 145 -41 311 -71 4 83 -349 103 -122 -144 -16
5472 -16 -58 -77 -68 -79 127 73 74 -93 108 -197 167 -93 -195 -73 -54 15 183 -40 -89 107 -11 46 -42 53 203
5497 203 -190 -91 338 112 55 83 -105 50 54 46 146 -147 29 219 -156 177 210 144 52 8 -15 8 -66 -209 31
5522 31 2 24 129 -16 111 80 150 18 0 53 -27 103 14 -89 122 -20 -70 -12 -228 -70 -33 -162 -7 27
5546 27 16 74 33 250 45 -101 97 105 203 -44 -186 -90 -173 90 -209 67 -132 35 105 -107 -19 25 215 106
5570 106 -57 273 316 6 -22 31 112 263 146 -111 -168 -164 -74 117 50 -198 -208 -9 76 87 130 162 206 55 21
$$ packed form
5402a10M2k74N51k8j61Q5l82J10K79m56K02K72J5K33m47L57l57Q4qK35k59m7M5
5425a9J77k89K65j36k8o6J68K3P5k45l7r9K18Qk54K10m1k9J78R0k40N9l92L44
5449f0K98l55P6J80l25R3L79l83J48j69N5K70o2j86L52l82P5P9m32M52k25k2J28
5472a6m2j9Rj1K06n4Jj67K01l05L64k60j02J22J9O9J68k23m9J96j18N7q8R5J50
5497B03l93R9M29k26n7K8j88J55MqJ00k93J76J90l75L33L3o6r2m4k3K3p4j43K40
5522C1k9K2J05j45J27l1P0j32j8N3q0J30q9j03K11j42n0N8k16J58L7j29J55L4
5546B7j1N8m1K17k05j46J98QR8k47j42R6q3K63k99K76j99J67P0k12Q8M4J90j09
5570A06j63L30M3l10k8N3Q1J51j17k57n7MR0J91o7k48j0J99Q5J1M3L2M4j51l4
$$ plain form
5595 21 41 -55 313 -25 -157 -327 37 -116 110 -33 -157 183 -31 -105 -253 175 66 75 -314 86 47 -32 125
5618 125 79 222 -10 150 -176 35 -89 273 133 19 136 -128 139 102 -45 -172 -8 275 28 -23 -128
5639 -128 118 -131 -155 203 40 20 -5 -234 -36 -107 -117 -241 -114 -18 89 -142 32 73 9 -44 52 -140 36
5662 36 -31 -266 63 120 142 178 15 -82 190 -4 -43 -96 -91 -16 104 -180 395 -95 211 133 53 126 108 -158 -108
5687 -108 287 55 -177 99 -153 33 -124 -179 122 92 327 59 239 136 106 -105 119 240 -5 121 62
5708 62 -79 357 -207 -3 66 -200 -58 86 39 -50 -71 -225 -1 153 104 -82 -7 -15 -145 5 178 -36 -151
5731 -151 29 -204 -216 -125 227 -218 145 -311 -64 291 -211 -110 -156 10 -172 268 15 43 38 143 208 60
5753 60 -126 211 -37 11 -26 -110 305 -40 -5 128 4 -81 173 -130 -7 -47 93 141 -31 342 78 -77 137
$$ packed form
5595B1K0r6L68l38j32j70L64j53K26j43j24L40k14p4j48M28j09Rl89M00l9p9J57
5618A25m6J43k32J60l26K11j24L62j40j14J17k64K67l7j47j27J64K83k47n1j05
5639a28K46k49k4L58j63k0k5k29J98p1j0j24J27R6J07k31J74M1o4n3R6j92J76
5662C6o7k35L29N7K2L6j63r7K72j94l9n3NP5J20k84N75m90L06p8q0P3j8k66N0
5687a08L95k32k32K76k52J86j57n5L01l0K35k68J80j03l0k11K24J21k45J26n9
5708F2j41M36n64K04O9k66J42J44m7q9k1j54K24J54m9j86P5qj30J50J73k14j15
5731a51J80k33j2R1L52m45L63m56K47L55n02J01m6J66j82M40k53K8nJ05O5j48
5753F0j86L37k48M8l7q4M15l45L5J33j24q5K54l03J23m0J40M8j72L73k64j55K14
$$ plain form
5776 137 -70 -107 169 -21 -5 -79 -287 271 164 -183 -92 -9 -1 244 36 -33 -163 31 -15 31 171 126 17 39
5800 39 -139 -113 -81 -110 41 24 80 130 131 46 -69 -10 80 50 124 -162 -152 91 -26 71 -150 -28 47 -47 97 -22
5826 -22 7 239 195 -85 -13 -99 275 -99 118 80 0 15 -128 217 77 -109 -45 -109 239 68 219 -131 -261
5849 -261 52 14 29 50 -61 9 -355 90 245 127 30 342 57 163 470 67 -49 188 -149 169 -54 23
5871 23 79 -70 158 -105 161 -16 212 -220 148 -250 -80 112 206 -83 116 -38 -223 55 -50 89 140
5892 140 -3 37 -138 -60 -84 -224 -34 -86 -257 129 45 -48 -218 61 -37 137 7 -67 -42 98 86 -57 34 -66
5916 -66 -34 188 191 77 -206 139 320 -285 2 42 25 166 34 27 83 151 188 34 -181 37 -16 -32 273 -230
5940 -230 4 35 -147 -27 0 34 142 36 -103 6 -24 -143 -36 13 -54 112 213 134 68 -204 127 -84 -229
$$ packed form
5776A37k07l7K76j90J6p4k08N58j07l47R1Q3QK45k08o9j30J94m6M6J40m5j09K2
5800C9j78K6L2k9J51j7N6N0Jq5j15N9R0l0P4k86J0K43j17R7k21J22P5r4J44j19
5826b2K9K32m4k80P2q6L74l74K17l8q0J5j43L45j40j86O4o4L48j71J51l50j30
5849b61L13l8J5K1j11P0l64M45J55j18r7L12k85J06L07m03j16K37l37L18k23P7
5871B3N6j49K28k63K66j77K28m32L68l98J70J92R4k89J99j54j85K78j05J39N1
5892A40j43M0j75P8k4j40J90n2j71L86q4r3j70K79r8J74j30p4K5J40j2j43R1j00
5916f6L2K22Lj14k83L45J81o05K87M0j7J41j32pN6O8L7j54k15K18n3j6L05n03
5940b30K34L1j82J20K7L4J08j06j39J09l0j19J07M9o7J66J01p9o6k72L31k11j45
$$ plain form
5963 -229 -56 145 21 -171 93 10 356 41 -174 -112 -80 47 290 -89 207 -60 286 -7 -269 85 -14
5984 -14 -163 -139 -138 62 -235 107 -64 218 152 -113 -33 -42 259 91 23 -146 169 -84 -61 89 152 -146 141 3
6008 3 -132 -18 -203 91 94 -182 -78 -56 -148 -86 -43 -128 -19 -85 -9 124 19 -190 -66 -300 220 91 152 10
6032 10 10 170 -17 248 -112 -73 -64 377 128 -28 234 69 -250 218 -204 -254 97 -187 34 231 -297 258
6054 258 -122 -35 429 -83 -53 85 -90 53 185 -123 -40 15 220 -117 167 -224 154 -54 43 -83 -163 -93
6076 -93 84 9 247 171 -211 14 117 44 -37 80 253 182 -34 254 200 -344 90 111 -62 121 -246 -200 121
6099 121 -35 -29 20 36 -128 -188 32 281 96 -25 132 -16 4 43 148 -6 -10 -53 29 -16 26 121 -166 -101 32
6124 32 -34 -206 197 19 -103 326 -32 78 208 171 -92 143 -22 -110 42 77 -158 -41 -10 -9 -140 -142 -68 -21
$$ packed form
5963b29J73K01j24j92K64q3L46l15k15O2L2J27K43l79K96k67L46k93k62L54r9
5984a4j49K4JK00k97L42j71K82o6k65Q0rL01j68o8j69L15k53K3J50O3k98K87j38
6008Cj35J14j85K94Lk76J04K2r2O2M3q5J09o6P6J33j05k09J24k34N20j29O1j42
6032A0%J60j87K65l60L9RM41k49j56K62j65l19M68m22n0L51k84K21J97n28N55
6054B58l80Q7M64n12L0J38j75J43J32l08Q3N5K05l37K84l91L78k08R7j26q0P0
6076i3J77p5K38p6l82K25J03p3q1J17J73p1k16K88n4n44M34K1j73J83l67M6L21
6099A21j56OM9J6j64o0K20K49j85j21J57j48K0L9J05j54mm3Q2m5M2R5k87O5J33
6124C2o6j72M03j78j22M29l58J10J30l7k63K35j65q8J52L5k35J17L1Jj31kP4M7
$$ plain form
6148 -21 161 34 36 52 148 -52 45 -31 91 88 -68 185 219 -77 -175 -156 14 54 -110 13 117 -232 75 146 98
6173 98 82 16 66 118 -28 -360 46 148 -271 -47 67 -88 121 -56 -77 -116 -139 204 115 -82 157 69 26 9
6197 9 -214 99 160 32 -149 92 -248 161 8 125 64 -51 -21 -34 92 -248 -60 176 70 -76 -118 121
6219 121 -298 114 165 -109 -35 -97 -10 -21 -45 -336 -244 -4 -53 131 -328 -94 8 296 257 35 -116 95 241
6242 241 -202 -24 22 -199 180 -209 90 40 -178 -63 169 -21 -1 -116 -106 139 107 -6 -111 45 -89 -5
6264 -5 -28 -37 209 187 -162 -57 85 116 -156 -179 134 22 34 -50 23 15 -177 105 -112 -4 -103 70 -128 -50 4
6289 4 -231 38 -103 -72 -23 152 102 14 29 -174 -176 119 -146 134 -92 -189 233 -106 -142 246 22 121 61 14 -41
6314 -41 -4 -139 -102 -17 -176 -8 -121 36 134 -115 -106 -9 -132 58 -191 249 233 238 23 34 -55 -35 179 -79 76
$$ packed form
6148b1J82j27KJ6R6k00R7p6J22lj56K53L4k96r8J9J70M0j64J23J04l49L07P1m8
6173I8j6o6N0N2j46l32M06J02m19K24J14j55K09j77k1l9k3L43q9j97K39q8m3j7
6197Ik23L13O1j28j81K41l40M09j53J17o1j15L0j3J26l40J88K36j06j46m2K39
6219A21m19M12N1k74P4o2Q7j1k4k91R2K40m9J84m59K34J02K88l9k22j51K11J46
6242B41m43J78M6k21L79l89K99n0k18J15K32j90K0j15J0K45l2j13j05J56j34Q4
6264ek3rK46k2l49J05J42L1k72k3L13j12J2q4P3qj92K82k17J08r9J73j98P8N4
6289Dk35K69j41L1M9J75n0q8J5k03kK95k65K80k26r7M22l39l6L88k24R9o0m7n5
6314d1L7j35L7Q5j59J68j13J57R8k49RR7j23J90k49M40j6Nk15J1q9K0K14k58J55
$$ plain form
6339 76 32 -232 31 -329 -155 213 80 -24 72 -197 98 65 -175 17 -66 39 -261 -52 127 40 -38 -90 127
6362 127 -130 -48 165 125 -126 28 -98 -82 -31 -135 -90 -23 -106 -42 -57 -111 -91 202 -70 97 -90 192 243 10
6386 10 41 -86 -182 -264 93 -62 -116 84 -97 182 187 107 -84 -281 290 105 135 93 -157 47 141 -70 -96 4
6410 4 -94 -12 -32 -81 234 -54 26 266 122 281 94 -85 -95 118 34 -8 77 -8 285 19 217 71 128 -248
6434 -248 328 -96 -82 0 60 402 27 48 -9 -41 44 -176 -114 -92 -88 4 -1 167 -62 81 -86 201 158 -161 93
6459 93 187 40 -215 -157 -42 -48 187 -56 -25 50 33 187 -153 -17 313 -69 -145 -236 73 -167 -14 -156 -115 -55
6483 -55 128 9 -168 271 64 -81 -59 16 -2 96 -134 176 -50 143 0 257 -135 74 -124 -124 -33 -161 173
6506 173 92 67 -25 -59 -81 -127 -87 187 -151 -44 77 -156 221 -178 94 -7 -56 104 -64 -109 -137 32 -97
$$ packed form
6339G6m4k64K63l60J74L68j33j04R6k69K95l3k40J92q3J05l00K09J79q7p8n2K17
6362A27k57Q2K13m0k51J54j26J6N1j04M5O7q3O4j5n4K0K93k72J67j87K82N1k33
6386A0L1j27r6q2L57j55n4K00j81K79Nq0j91j97N71j85L0m2k50K04R4k11k6J00
6410Dr8Q2k0m9L15k88Q0K40j44J59j87j79j0K13q4m2Q5q5K93k66J98j46N7l76
6434b48N76m24J4Q2O0L42l75K1n7l2Q5k20O2K2MR2nJ68k29J43j67K87m3l19K54
6459I3R4j47k55N8J15oK35k43L1P5j7J54l40J36L30l82p6r1L09k40J53j42M1O0
6483e5J83j19j77M39k07j45K2P5j8R8k30L10k26J93j43K57l92K09j98%R1j28L34
6506A73q1k5r2l4k2m6M0K74l38J07J21k33L77l99K72j01m9J60j68m5k8J69j29
$$ plain form
6529 -97 69 -87 237 73 -186 -17 -127 10 242 58 -202 -356 132 -147 -168 -57 157 116 33 -53 -88 -267
6551 -267 31 -252 132 6 -152 100 261 -89 -17 370 -238 176 146 -71 -112 -172 -131 356 -406 14 -108 69
6573 69 -94 347 -110 -39 95 269 -15 -19 159 -235 17 -132 126 -170 142 37 34 83 -178 -122 -58 116 114 146
6597 146 -94 3 48 -44 83 -6 -17 -38 -138 96 5 25 -203 -224 -62 -177 99 -85 -174 179 -318 328 192
6620 192 -102 118 7 270 106 -74 -103 89 79 -100 -121 53 -111 -152 -229 6 -41 -316 -259 -37 -64 234 -78
6643 -78 273 132 -146 30 -16 -254 260 -113 213 4 -35 -17 -59 100 -56 104 -77 -127 142 174 14 -47 22
6666 22 261 -74 126 52 30 -370 -205 113 162 -100 27 150 24 124 -169 -271 -275 -66 13 17 77 -140 94
6689 94 20 29 127 -134 103 43 -78 -63 -31 -268 151 -152 -157 89 -27 31 -7 -21 150 117 -57 151 -59 -5 172
$$ packed form
6529i7J66j56L24j64k59J69j10J37K32j84k60j54M88k79k1J11K14m1q3q6l5j79
6551b67K98k83L84j26j58K52J61l50P2L87o08M14l0k17m1o0M1M87p62M20j22J77
6573F9j63M41m57P1J34J74k84mJ78l94K52j49K58k96L12j05lM9k61N6O4J74kL2
6597A46k40R7M5r2J27q9j1k1j00K34r1K0k28k1J62j15K76j84q9L53m97O46j36
6620A92k94K20j11K63j64j80k9J92j0j79k1J74j64m1p7K35m7k75N7K22k7K98l12
6643g8L51j41k78J76m6k38N14l73L26k09l9J8m2J59j56J60j81n0K69L2j60o1O9
6666B2K39l35K00p4k2m00J65L18M9k62J27J23j26J00k93j02mK09P9MO0k17K34
6689I4p4RR8k61K37o0j21J5L2k37M19l03nK46j16N8l8j4J71l3j74K08k10N4J77
$$ plain form
6714 172 -73 -92 227 61 56 -55 -103 -151 -24 -12 24 -30 235 -28 -4 183 169 -144 -129 396 9 125 190 -216
6738 -216 -73 -42 -171 106 -239 47 143 -57 16 60 18 105 -163 60 -171 -100 -96 168 -33 -19 166 58 50 117
6762 117 268 69 -151 -358 -39 -79 -123 118 134 16 37 -215 137 133 -48 56 47 29 -55 -69 33 20 -137 -128 -7
6787 -7 151 -174 -139 -26 173 -170 -43 96 204 -68 -95 67 -202 107 -71 -39 81 -55 15 29 114 79 -38
6810 -38 146 -75 -47 89 37 -248 14 -67 -77 157 -22 167 -47 -22 -14 56 -158 75 -29 -86 251 179 -59 192
6834 192 87 -168 25 -123 -273 225 52 26 -117 166 -104 65 196 -162 -12 152 -107 91 -83 -105 -123
6855 -123 57 235 -129 -119 -108 -70 -63 -121 -95 -6 103 69 46 -64 -141 -99 -110 82 4 -113 90 -272 -353 152 166
6880 166 -65 -447 -321 241 24 -27 -17 -23 81 -94 4 60 74 -326 -216 178 -23 83 56 -104 15 254 133
$$ packed form
6714A72k45j9L19j66nj11m8m8J27J2L6n4K65k63K4J87j4l13J5N25l87J16O5m06
6738b16J43L1j29K77l45K86R6k00P3M4m2Q7k68K23k31P1MK64k01J4J85j08qO7
6762A17J51j99k20k07L19m0m4K41J6j18K1k52L52mj81J04rj8q4j4J02j3j57RJ21
6787gJ58l25L5J13J99l43J27J39J08k72k7J62k69L09j78L2J20j36P0J4Q5l5j17
6810c8J84k21K8J36n2k85K62q1j0K34j79J89k14K5QP0k14K33j04n7L37p2k38K51
6834A92j05k55J93j48j50M98j73k6j43K83k70J69J31l58J50J64k59J98j74k2j8
6855a23J80J78l64J0J1L8Pn8K6Q9J09l4k3j10p7M2j1J92p8j17K03l62q1N05J4
6880A66k31l82J26N62k17n1J0oJ04j75R8N6J4m00J10L94k01J06k7j60J19K39j21
$$ plain form
6903 133 -99 127 -35 291 129 -19 -94 -55 -83 138 -6 -41 -105 -335 -199 78 90 24 53 16 -35 -83 -59 62
6927 62 -254 80 -33 -201 139 109 113 154 -76 60 -138 150 13 -220 -77 -110 107 33 35 -5 -80 -21 40 -69
6951 -69 0 -11 -8 233 163 70 51 -222 254 127 185 116 62 -7 -47 -11 173 2 113 33 -11 -8 -132 -77 -129 -70 -74 -21
6979 -21 122 172 84 -8 -142 19 119 -132 -143 161 -219 251 13 61 85 138 -203 -58 -78 205 0 -124 -95
7002 -95 -15 -20 55 73 47 46 -56 -141 86 88 -37 292 -160 33 26 -41 15 182 -19 204 -170 19 -63 -329 9 -113
7028 -113 -26 32 -56 -163 204 62 -292 213 222 54 43 -131 -167 106 -94 -1 72 -204 9 147 -64 13 -103
7051 -103 -86 -196 194 161 -108 124 123 -81 -115 59 89 22 -106 -127 -209 -19 105 108 206 -302 -88 40 -172 212
7075 212 -41 -153 -72 -10 73 108 175 24 21 -194 109 59 -79 63 -71 -197 153 -17 109 -55 138 87 113
$$ packed form
6903A33k32K26j62L26j62j48p5L9k8K21j44l5o4k30J36K77J2o6K9l7n1m8K4J21
6927F2l16L34j13j68L40l0MM1k30J36j98K88j37k33J43l3K17p4Km0p5N9O1j09
6951f9O9j1LK41p0r3j9k73M76j27N8o9n4o9m0L6J84j71J11q0m4Lj24N5n2N9mN3
6979b1J43N0q8r2j34J61J00k51j1L04l80M70k38M8K4N3l41J45k0K83k05j24K9
7002i5Q0nP5J8k6jj02q5K27Kj25L29m52J93po7N6J67k01K23l74J89q2k66L38j22
7028a13Q7N8q8j07L67j42l54N05Rj68j1j74l6K73k00R3P3k76K13J38k11P7j16
7051a03J7j10L90l3k69K32jk04l4J74L0o7j28k1q2J90J24LR8n08K14J28k12L84
7075B12k53j12Q1O2Q3L5O7j51lk15L03n0j38J42j34j26L50j70J26j64J93n1K6
$$ plain form
7098 113 -75 118 -122 -45 -14 52 -152 21 144 -82 62 70 -70 54 -58 146 144 23 175 -174 -162 -87 -95 44
7122 44 127 -180 -28 199 194 130 -25 105 8 166 26 -8 -112 -44 165 -37 -96 -80 143 154 -18 123 -91 -6
7146 -6 -67 189 18 32 164 -295 -50 178 -74 208 141 -6 -75 -108 -140 -116 -11 -37 25 -19 157 152 -82 -260 -22
7171 -22 -188 -295 -36 -288 180 129 -19 249 -121 58 349 -31 239 267 104 354 114 65 110 169 -183 -51
7193 -51 -13 13 46 -18 -113 126 -64 -18 -30 -104 50 136 -8 122 -149 -144 -135 111 14 107 291 -94 -209 -169 -53 -22
7219 -22 77 -15 -227 117 101 -96 141 73 75 -170 12 71 218 -23 -194 -106 12 -23 89 88 -108 -59 -25 44 -54
7244 -54 -3 257 44 22 92 -157 -220 45 413 86 -81 41 -105 -184 -2 -67 26 -110 49 -98 -87 4 40 -3
7268 -3 76 -5 -81 151 -127 -295 -24 -81 -28 6 -396 51 132 150 -150 -15 -149 -131 337 194 -87 230 -125 151
$$ packed form
7098A13j88J93k40P7L1O6k04J73J23k26J44Qj40J24j12K04kj21J52l49J2P5qJ39
7122D4Q3l07J52K27no4j55J30r7J58j40l4j04O8K09k02n9J6K23J1j72J41k14Q5
7146fo1K56j71J4J32m59K45K28k52K82o7j47o9l3l2K4J05k6O2m4J76nk34j78K38
7171b2j66j07K59k52M68n1j48K68l70J79K91l80K70K8j63K50k40m9M5N9l52J32
7193e1L8K6L3o4r5K39j90M6j2p4J54Q6j44J30k71NRK46r7R3J84l85j15M0J16L1
7219b2R9r2k12L44j6j97K37o8Kk45J82N9J47k41j71Q8J18l5J12jj96M9L4O9r8
7244e4N1K60k13k2P0k49o3K65L68l27j67J22j46p9J82o5R3j36J59j47J1R1L6m3
7268cP9q1p6K32k78j68K71n7N3L4m02M47Q1J8l00J35j34J8M68j43k81L17l55K76
$$ plain form
7292 151 153 156 -122 -90 -64 60 254 100 -73 -74 93 -153 -111 -55 -22 -34 27 94 -155 41 176 105 -88 134 62
7317 62 44 157 43 235 -109 -295 49 38 -99 121 147 -6 97 236 157 -110 -196 48 -160 19 -309 58
7339 58 -109 -80 12 -50 157 -154 78 -57 -15 231 -14 -160 197 -84 -213 135 -137 -288 76 78 -36 51 -102
7362 -102 -69 215 -144 56 191 -130 89 -47 -104 79 136 20 350 -130 -209 -84 -23 71 8 -52 235 -74 29
7385 29 -261 263 -399 -62 -183 -148 -49 -133 31 -176 216 -90 -18 -179 158 -190 90 205 75 -36 61 -105
7407 -105 -64 143 -116 165 225 -70 85 -120 -109 67 40 195 -176 -160 60 -61 -127 -356 -10 -19 -23 -58 58 38
7431 38 78 14 261 35 -172 -97 -227 -168 -132 -8 42 65 36 21 87 204 62 -11 -18 -191 -47 199 3 9 28 -54
7457 -54 55 -26 14 -110 -93 -204 226 30 7 147 66 225 48 93 -158 34 157 -97 -108 -103 -42 198 -18 110
$$ packed form
7292A51KLk78L2K6J24J94j54j73jJ67k46M2N6L3j2O1O7k49J96J35p1j93K22p2
7317F2j8J13j14J92l44j86L44j1j37K20K6j53J03J39p9k67q6K44k08J79l28L67
7339E8j67K9R2o2K07l11K32j35M2K46k45j46L57k81j29L48k72j51L64Kj14Q7j53
7362a02L3K84l59K00J35l21K19j36n7J83N7j16L30m80p9J25O1R4o3o0K87l09J03
7385B9k90N24o62L37j21L5R9q4J64k07L92l06P2j61L37l48K80J15j30j11R7j66
7407a05M1K07k59K81O0k95J55k05J1J76k7J55l71J6K20j21o6k29L46rml5J16k0
7431C8M0o4K47k26k07P5j30N9L6J24N0K3k9j5O6J17j42p3pj73J44K46j96OJ9q2
7457e4J09q1M0j24J7j11M30j96k3J40q1J59j77M5k51J92J23k54j1NO1K40k16J28
$$ plain form
7481 110 -67 -249 -58 -80 171 180 -24 71 -270 99 11 -223 100 14 -137 -39 138 51 123 -108 257 177 165 -80
7505 -80 -60 114 -202 33 -61 -9 92 77 -79 45 52 128 337 11 -123 -177 -106 17 -50 -67 162 -321 -9 21
7529 21 30 163 13 -299 187 31 -36 54 45 35 223 -1 -90 48 -43 237 -73 14 -12 113 101 139 2 -7 55 93
7555 93 -121 240 124 213 48 -45 79 204 -41 106 -185 -136 112 73 225 394 -15 61 156 -153 -6 61 -217
7578 -217 81 5 36 71 -211 174 404 -108 65 177 69 101 42 -163 17 -283 32 -153 77 -16 73 1 193
7601 193 -33 19 -187 50 -23 9 43 56 -107 -145 29 230 67 -47 -233 -161 51 -304 -102 147 -114 150
7623 150 38 -102 -76 -72 -163 110 139 -35 357 -19 354 -71 -178 -215 -119 -183 51 112 -73 -223 -140 126 -51
7646 -51 -212 29 -256 49 3 52 32 -32 118 -172 158 -7 -54 5 -10 86 -201 -196 -95 230 -56 -62 95 79 182
$$ packed form
7481A10j77j82J91k2K51Rk04R5l41L69q8k34L23q6j51R8J77q7P2k31L65q0j2k45
7505h0K0J74l16K35r4N2J01j5j56J24PP6K09l26j34n4P1J23o7j7K29m83L12L0
7529B1RJ33j50l12M86j56o7R0rj0J88k24q9J38r1K80l10Q7k6J25j2L8j37rO2L8
7555I3k14L61j16Q9j65r3J24J25k45J47k91M9K48l9J52J69m09P6R5l09J47O7k78
7578b17K98p6L1L5k82L85K30n12J73J12j08L2n9k05J80l00L15j85K30r3Q9p2J92
7601A93k26N2k06K37p3L2L4J3j63l8J74K01j63j14j86P2K12l55K02K49k61K64
7623A50j12j40K6Mr1K73K9j74L92l76L73m25j07l7R6o4K34O1j85j50Q3K66j77
7646e1j61K41k85L05m6M9k0o4J50k90L30j65m7N9j5R6k87NJ01L25k86oJ57j6J03
$$ plain form
7671 182 -101 -44 -44 21 53 80 -96 206 -15 -246 -174 -112 -104 -80 -31 -2 71 -315 -56 99 -98 34 170 -183 -103
7696 -103 97 -109 17 -35 -83 -68 -65 -174 248 -23 -67 76 180 41 67 32 61 -53 -136 92 0 4 -32 -176 100
7721 100 -100 -111 93 130 8 -9 -16 -64 117 -6 59 239 -99 103 -9 137 118 8 -109 86 -48 -96 -73
7744 -73 15 -87 105 -155 44 183 150 -15 206 -54 -129 194 -169 73 190 -2 7 -73 33 -140 -78 78 -29
7767 -29 29 12 -94 -121 8 -83 -23 -160 49 -87 -82 10 -45 50 -77 26 -352 -57 -10 100 186 96 109 -174 181
7792 181 -138 -4 -17 18 -38 10 40 208 121 -79 11 189 155 49 31 194 123 -147 -132 -58 30 123 -76 62 68
7817 68 -180 83 -132 -348 -18 -79 212 26 -44 9 35 57 306 37 8 -6 -46 126 33 174 168 -108 -251 -142
7841 -142 116 -21 -177 19 -85 94 -182 -201 -163 72 0 31 -45 -131 104 117 99 -227 -183 -5 31 -55 28 -157
$$ packed form
7671A82k83N7%O5L2K7j76L02k21k31P2O2QK4M9K9P3l86K59J55j97J32J36l53Q0
7696a03K00k06J26n2m8J5Lj09M22k71m4J43J04j39K6l5K9j14q3K28r2Ml6j44K76
7721A00k00j1K04L7j22j7pm8J81j23O5J80l38K02j12J46j9j10j17J95j34m8K3
7744g3Q8j02J92k60J99J39l3j65K21k60p5L23l63K42J17j92Rq0J06j73O2J56j07
7767b9N8j7j06k7J29r1O0j37K09j36NR2n5R5j27J03l78K95M7J10Q6r0J3k83L55
7792A81l19J34j3L5n6M8L0J68q7k00R0J78l4j06j8J63p1k70J5P4Q8R3j99J38O
7817F8k48K63k15k16L30o1K91j86p0N3K6K2K49k69k9j4m0J72r3J41ok76j43J09
7841a42K58j37j56J96j04J79k76j9L8K35p2L1p6q6K35J3j8l26M4J78L6q6Q3j85
$$ plain form
7865 -157 -174 145 70 10 140 136 -54 -176 -110 129 351 -7 -8 199 -95 -1 -42 119 84 133 -55 -23 150 16
7889 16 -127 -153 53 183 -82 126 133 -31 99 -65 -59 79 101 -31 -96 -135 118 -49 -6 -82 4 -39 55 43 -372
7914 -372 -70 -5 -12 77 56 26 77 -99 -6 91 -24 206 -172 93 78 -3 -147 -10 -303 5 58 65 -37 114 -99
7939 -99 115 41 -10 213 -85 22 143 -10 259 157 0 -61 35 -375 66 -1 218 -28 4 -104 21 96 280
7962 280 -111 62 165 -203 126 73 -114 23 -51 -139 41 -91 -133 153 -13 24 18 -150 78 158 -37 115 -33
7985 -33 53 142 129 31 182 10 62 66 29 13 45 299 17 107 -197 17 -49 -81 -160 -71 -131 -48 -116 57 -54 -138 -138
8012 -138 -57 -139 -48 -265 87 148 215 -43 61 53 153 86 25 -55 15 -166 177 -195 -52 34 139 105 112 25 -275
8037 -275 136 -130 125 -129 167 10 -432 -122 -179 -34 129 75 179 -150 61 183 -66 52 6 259 24
$$ packed form
7865a57j7L19p5o0J30mj90j22O6K39K22l58jK07k94R4m1J61l5M9j88L2J73j34
7889A6j43k6K06J30k65K08Pj64J30j64OJ38K2j32o5l9K53j67M3p6Q6m3R4j2m15
7914c72L02O5pQ9k1l0N1j76R3R7j15K30l78K65j5q1j44J37k93L08N3Pj02J51k13
7939i9K14p4n1K23k98J07J21j53K69j02j57o1R6m10M41o7K19k46L2j08J25P5J84
7962B80l91J73J03l68L29n3j87J37p4q8J80j32m2K86j66L7oj68K28Q0j95J52j48
7985c3Q6Q9j3r8J51j72N2Ml7j6L2K54k82R0l04K14o6l2p9Q9o0Q3o8J73j11q4%
8012a38Q1q2R1k17L52O1O7k58J04qJ00o7o1q0P0j81L43l72J43Q6J05l4Pq7l00
8037b75M11k66K55k54K96j57m42L10n7J45J63n4J04l29K11J22k49J18m6K53k35
$$ plain form
8058 24 -200 274 -70 88 -7 33 135 -32 108 259 47 -381 -272 19 -159 -79 -97 -318 150 127 48 69 -215
8081 -215 138 222 68 151 -94 34 -151 15 55 -138 -107 -33 -186 -164 -281 65 27 -20 -178 66 188 -73 14
8104 14 186 237 -197 70 129 -50 -123 -101 285 -30 87 135 43 68 -110 237 -19 15 92 -111 -2 32 128 196
8128 196 -53 -267 -187 31 -38 -195 -122 0 8 -139 59 64 17 133 -91 64 17 -22 132 -102 -179 21 261 -39
8152 -39 70 -252 -160 -71 62 -86 -122 -159 -5 -95 51 -23 -48 166 -25 -75 104 139 -268 -60 108 -121 155
8175 155 141 -131 -58 -328 -166 74 142 -91 -137 119 100 -11 30 -125 -39 65
$$ packed form
8058B4k24M74l44J58r5M0J02j67J40J51k12m28J09K91j78Q0j8k21M68k3p9K1k84
8081b15L53Q4j54Q3k45J28j85J66M0j93L1P4j53K2j17L46l8m7j58K44J22k61Q7
8104A4J72N1m34K67N9j79p3K2L86l15J17M8r2K5j78L47k56L4P7k03J09L4R6O8
8128A96k49k14Q0K18o9j57P3J22Qj47J98Nm7J16k24J55m7l9J54k34p7K00K40l00
8152c9J09l22R2Q9J33j48l6l7J54r0J46p4k5K14j91n0J79L5m07K08J68k29K76
8175A55j4k72P3k70J62K40O8k33m6K56j9j11M1j55Q6J04
8191F5
$$ Imaginary data points
##PAGE= N=2
##DATA TABLE= (X++(I..I)), XYDATA
$$ plain form
0 0 0 0 0 0 0 0 0 0 0 0 0 0 8 -8 8 -8 8 -16 16 -22 24 -32 32 -40 48 -56 64 -74 88 -99 112 -128 148 -168
34 -168 189 -213 239 -268 300 -333 372 -415 459 -509 561 -621 686 -756 833 -919 1012 -1115
52 -1115 1229 -1355 1498 -1657 1839 -2047 2288 -2573 2911 -3330 3849 -4527 5440 -6756 8811
67 8811 -12500 21142 -87642 30365 146447 -119425 -58739 105503 5862 -76490 50195
78 50195 30145 -52142 9196 46751 -38613 -9428 47635 -12376 -27377 35530 1505 -25597
90 -25597 6590 -1514 -12894 6177 -9690 -9990 12463 4760 -7562 2194 7145 1923 -6538 1385
104 1385 8361 1654 -2111 -303 8775 13423 -13753 -13852 18264 -1112 -24257 2782 4619 -11625
118 -11625 3224 6983 -6957 -1973 10745 3540 -10653 4605 13659 -11533 -137 22500 -10425
$$ packed form
0@%%%%%%%%%%%%Qj6J6j6J6k4L2l8M6n6O4p2Q8j04J20j38J62j87K11k40K76l16
34a68L57m02M52n07N68o33P05p87Q74r68J070j182J307j442J589j752J931k127
52a115K344k584K853l155L496l886M335m861N484o241P179q376R967j2196J5567
67H811k1311L3642j08784J18007J16082k65872O0686J64242r9641q2352J26685
78E0195k0050q2287O1338L7555q5364K9185N7063o0011j5001O2907l4025k7102
90b5597L2187q104j1380J9071j5867l00K2453p703j2322R756M951n222q461P923
104A385O976o707l765J808R078M648k7176r9L2116j9376k3145K7039J837j6244
118a1625J4849L759j3940M984J2718p205j4193J5258R054k5192J1396K2637l2925
$$ plain form
131 -10425 -12113 22418 -3159 -19700 10995 -82 -19975 7703 9175 -21206 -1258 26167
143 26167 -11986 -20925 30631 7765 -35818 18024 28379 -30552 -807 30323 -17299 -9202
155 -9202 23504 -11359 -18713 17020 2329 -23391 3422 14485 -14267 -5680 16222 -5151 -6790
168 -6790 13480 -3258 -3275 13425 -6532 -3899 16593 -5772 -9512 12615 -2805 -10612 5909
181 5909 -1505 -9542 3341 2478 -8657 657 9003 -6697 -4393 14682 -1333 -10149 14337 3537
195 3537 -11813 10505 4483 -12079 6320 5053 -12177 -858 5887 -5585 -7110 2405 2931 -6613
209 -6613 -1178 7776 -3787 -2535 10524 51 -4247 7361 3535 -2806 595 2256 -116 -4226
223 -4226 576 2460 -9185 -1893 7105 -9252 -5212 9247 -4296 -5103 8053 860 -2790 4813
$$ packed form
131a0425j688L4531k5577j6541L0695j1077j9893K7678J472l0381J9948K7425
143B6167l8153q939N1556k2866m3583N3842J0355n8931K9745L1130m7622Q097
155i202L2706l4863p354L5733j4691k5720K6813J1063k8752Q587K1902k1373j639
168f790K0270j6738j7J6700j9957K633K0492k2365l740K2127j5420p807J6521
181E909p414q037J2883q63j1135R314Q346j5700K304J9075j6015q816K4486j0800
195C537j5350K2318o022j6562J8399j267j7230J1319O745j1472j525R515N26r544
209f613N435Q954j1563J252J3059j0473m298J1608l826o341L401J661k372m110
223d226M802J884j1645P292Q998j6357M040J4459j3543q07J3156p193l650P603
$$ plain form
237 4813 3153 176 1337 3186 844 -2638 2445 1192 -5145 -652 -400 -3736 283 -3928 -2864
252 -2864 3638 -5648 -663 9459 -6376 -3674 13406 -1169 -6077 9211 2236 -5472 5157 3943
266 3943 -7677 -1774 7777 -4985 -10076 6410 308 -12013 5256 4372 -10175 3512 6734 -5777
280 -5777 3246 5350 -2880 3571 3710 -1141 1779 856 -1105 -126 -811 -1450 -2755 -2155 -991 -2760 587
297 587 -1109 -5076 5219 3634 -6551 4278 5336 -4574 5369 4429 -6443 4136 6154 -5603
311 -5603 -1107 3633 -2590 -4536 -279 944 -4456 -3070 2952 -1962 -1419 3886 -2041 125 6344
326 6344 -946 -926 3919 401 2117 205 -2713 3887 -540 -6307 3378 -278 -7319 1185 1146 -4572
342 -4572 -126 2218 -1487 -1374 4030 2361 -3951 3305 6685 -5086 303 7340 -5110 -1561 6487
$$ packed form
237D813j660k977J161J849k342l482N083j253o337M493K52l336M019m211J064
252b864O502r286M985J0122j5835K702J7080j4575m908J5288o975p708J0629j214
266C943j1620N903R551j2762n091J6486o102j2321J7269q84j4547J3687L222j2511
280e777R023K104q230O451J39m851K920r23j961R79o85o39j305O00J164j769L347
297E87j696l967J0295j585j0185J0829J058r910R943r40j0872J0579K018j1757
311e603M496M740o223j946M257J223n400J386O022m914N43N305n927K166O219
326F344p290K0M845l518J716j912k918O600m427n767R685l656p041Q504l9n718
342d572M446K344l705J13N404j669o312P256L380j1771N389P037j2450L549Q048
$$ plain form
357 6487 -4774 -4004 3407 -3310 -3218 808 -892 -1061 -1256 1194 2533 -1738 614 4249 -30 -13 2040
374 2040 1720 1083 -2202 1448 3091 -5725 -1327 3858 -5791 -2845 2785 -4293 -919 3682 -3055 -417
390 -417 3446 120 724 1477 1759 1937 -253 1438 1542 -1772 283 -275 -2092 -816 -1840 -1456 -685
407 -685 -3922 1505 1593 -6041 3265 5623 -6132 2693 7647 -5272 768 8087 -3675 -2681 6612
422 6612 -984 -6697 3016 3145 -8666 -2044 7436 -7198 -6124 9605 -3409 -7290 9582 782
436 782 -6788 7968 3049 -5012 4616 3980 -3497 446 3388 -1994 -3203 1828 -742 -5277 947
451 947 589 -5506 1440 1706 -4781 2811 2325 -3254 4184 2750 -2920 4090 2588 -2952 2028 2352
467 2352 -2621 -1408 1011 -1107 -4352 -98 1991 -5648 -1630 5224 -4191 -2940 7002 -650 -3076
$$ packed form
357F487j1261P70P411o717R2M026j700j69j95K450J339m271K352L635m279J7K053
374B040l20o37l285L650J643q816M398N185r649K946N630p078L374M601o737K638
390d17L863l326O04P53K82J78k190J691J04l314K055n58j817J276j024L84P71
407f85l237N427Q8p634R306K358j1755Q825M954j2919O040P319j1762R94R293
422F612p596n713R713J29j1811O622R480j4634J074J5729j3014l881J6872q800
436G82p570J4756m919q061R628o36p477L943K942n382j209N031k570m535O224
451I47l58o095O946K66o487P592m86n579P438j434n670P010j502n540M980L24
467B352m973J213K419k118l245M254K089p639M018O854r415J251R942p652k426
$$ plain form
482 -3076 5154 2607 -2221 1855 4331 -757 -3753 4081 2085 -8363 1313 5148 -9010 -1684 6913
497 6913 -6832 -4207 8067 -2165 -5736 5922 3581 -5286 1647 7410 -3176 -2791 8122 -1538
511 -1538 -6654 6941 -435 -8605 5200 346 -8940 3379 2004 -7077 1786 3527 -3741 594
525 594 4622 -742 -849 4440 543 -2874 5112 1337 -6146 3854 3209 -8369 1703 3781 -9027
540 -9027 1120 5041 -8233 -663 6864 -4450 -2675 6773 577 -4337 4469 5010 -5191 575
554 575 7696 -4572 -4253 7021 -3145 -7046 5343 -412 -6680 2196 1675 -3857 44 2244 54
569 54 -1306 2233 3376 -2085 1056 4790 -2171 -767 4056 -2141 -2070 1871 -1707 -2237 -639 -1228 -758
586 -758 -1767 -323 583 -1681 1194 2291 -1338 1922 1931 -816 3339 581 -2038 3466 -448 -3601
$$ packed form
482c076Q230k547m828M076K476n088k996P834j996j0448R676L835j4158P326Q597
497F913j3745K625J2274j0232l571J1658k341q867O933N763j0586L85J0913r660
511a538n116J3595p376q170J3805m854r286J2319j375r081Q863J741p268M335
525E94M028n364j07N289l897l417P986l775p483J0000o45j1578J0072K078j2808
540i027J0147L921j3274P570P527j1314J775R448o196m914Q806N41j0201N766
554E75P121j2268L19J1274j0166l901J2389n755o268Q876n21n532L901K200k190
569E4j360L539J143n461L141L734o961J404M823o197P1L941l578n30J598n89M70
586g58j009J444R06k264K875J097l629L260Rk747M155k758k619N504l914l153
$$ plain form
602 -3601 3248 -1029 -5264 1741 734 -4785 -794 2066 -2100 -2561 4257 1587 -4711 4568 5429 -5427
618 -5427 2681 6628 -6001 485 6864 -5413 -2878 5655 -3512 -4768 3146 -518 -5158 969 2853
633 2853 -3922 -1353 5648 -1812 -1952 6569 -303 -3216 5944 299 -3361 3809 -7 -2535 2115
648 2115 -1294 -2428 1039 -2085 -2414 698 -570 -1997 421 2356 -943 -990 4495 138 -2378 5583
664 5583 989 -4752 4499 2354 -5601 1994 2403 -5103 -525 1524 -2966 -2234 1289 330 -2631 757
680 757 3483 -2126 -83 5440 -1527 -1421 5251 -55 -2775 3263 743 -2746 12 829 -1522 -3251
696 -3251 402 686 -4262 529 3124 -3702 500 4679 -2254 -326 4286 -731 -530 2716 -213 -769
712 -769 967 204 -1527 -876 787 -2451 -2419 1887 -2039 -2862 3195 -1315 -2149 4713 -418 -2073 5742
$$ packed form
602c601O849m277m235P005j007n519L991K860m166m61O818k670o298R279Q61j0856
618e427Q108L947j2629O486O379j2277K535Q533r167j256P914l664m640O127J884
633B853o775K569P001p460j40Q521o872k913R160n645l660P170l816k528M650
648B115l409j134L467l124l29L112j268j427K418J935l299m7N485m357k516P961
664E583m594n741R251k145p955P595M09p506M578K049m490P32L523r59k961L388
680G57K726n609K043N523o967J06O672n306k720O038k520l489K758Q17k351j729
696c251L653K84m948M791K595o826M202M179o933J928M612n017K01L246k929n56
712g69J736p63j731O51J663l238L2M306l926q23O057m510q34O862n131j655P815
$$ plain form
729 5742 -33 -2610 4495 478 -3378 2186 1598 -3365 -772 2805 -3089 -4293 3834 -568 -6697
744 -6697 4164 2611 -6728 3520 5469 -5393 1614 5991 -3225 -577 4780 -1139 -2402 2550
758 2550 972 -3686 -762 2403 -3369 -2613 2981 -2492 -2923 3435 -998 -1663 3373 193 -121 2768
774 2768 -91 785 1508 -517 698 22 -1038 78 -888 -1050 -763 -2300 -270 -487 -1989 1417 31
791 31 -1990 2533 1476 -960 2007 1464 -23 1128 654 571 -782 -986 1845 -1769 -2687 2218 -2063
808 -2063 -3976 2707 -556 -3883 2019 1656 -2123 1041 2728 208 -376 2513 1808 -2616 1991 2684
824 2684 -4181 -6 3118 -4466 -1143 2818 -3915 -1973 2499 -1911 -1382 1702 274 -194 1023 1926
840 1926 293 140 2652 445 -992 2407 -718 -1785 1806 -1286 -2201 1294 -2136 -1674 1318 -2083
$$ packed form
729E742n775k577P105m017l856N564n88m963K593L577n894j204Q127m402o129
744f697J0861j553r339J0248J949j0862P007M377r216K648N357n919j263M952
758B550j578m658K924L165n772P56N594n473m31O358m433o65N036l180l14K889
774B768k859Q76P23k025J215o76j060J116r66j62K87j537K030k17j502L406j386
791C1k021M523j057k436K967n43j487J151m74q3j353k04K831l614r18M905m281
808b063j913O683l263l327N902l63l779L164J687k520n84K889p05m424M607O93
824B684o865M175L124p584L323L961o733J942M472m410N29L084j428m68J217R03
840A926j633j53K512k207j437L399l125j067L591l092r15L495l430M62K992l401
$$ plain form
856 -2083 -893 2113 -1271 436 2356 -99 608 1502 986 537 216 1460 -134 -1661 1474 -651
872 -651 -3237 1462 -585 -3137 964 -103 -2095 1092 223 -450 1177 205 1424 1408 -589 1745 1437
889 1437 -1132 1083 775 -1618 -124 -1 -868 -1583 -1067 659 -1739 -1684 2500 -1015 -2085 3641 330
906 330 -1601 3730 974 -1791 2198 1139 -896 157 251 -353 -1289 -442 273 -2255 -755 931 -2447
923 -2447 -364 1805 -1125 469 1885 38 1529 604 157 1963 -461 -664 2102 -1074 -1750 1397
939 1397 -1441 -1468 289 -1430 -991 -890 60 531 -974 1121 1783 -1196 1014 2840 -875 722 1788
956 1788 -917 634 328 -733 472 -1412 -909 714 -2464 -1208 1202 -2270 -1086 2082 -286 -63
972 -63 1622 1053 372 537 1974 255 -1512 2133 253 -3002 2136 737 -4529 1135 1097 -4099 -62
$$ packed form
856b083J190L006l384J707J920k455P07Q94n16m49l21J244j594j527L135k125
872f51k586M699k047k552M101j067j992L187q69o73J627r72J219j6j997K334l08
889A437k569K215l08k393J494J23q67p15N16J726k398N5M184l515j070N726l311
906C30j931N331k756k765L989j059k035J053R4o04r36Q47P15k528J500J686l378
923b447K083K169k930J594J416j847J491r25m47J806k424k03K766l176o76L147
939A397k838k7J757j719M39J01R50M71j505K095O62k979K210J826l715J597J066
956A788k705J551l06j061J205j884N03J623l178J256K410l472J184L168k368K23
972f3J685n69o81J65J437j719j767L645j880l255N138j399n266N664l8n196M037
$$ plain form
989 -62 1267 -1833 -40 1329 330 310 1044 1359 52 306 2008 -408 -510 1675 -795 -985 752 -1829
1007 -1829 -457 232 -2662 -6 665 -2592 602 1474 -1077 1109 1790 -178 973 1437 883 -297
1023 -297 409 1638 -1197 -958 2104 -1658 -2456 2076 -1818 -2320 1729 -780 -1931 1402 794 -314
1039 -314 363 1295 1534 -197 618 2040 -989 -320 1930 -1669 -832 1364 -1547 -1538 167 -921 -776 -939
1057 -939 181 956 -1282 659 1672 -1124 1481 2059 -1094 1190 1667 -1217 768 560 -1404 391
1073 391 -682 -1531 120 -1100 -954 38 -658 238 -17 279 1460 -473 1062 2023 -1294 1476 2251
1090 2251 -2599 535 2454 -2790 -924 2080 -2415 -2146 1283 -689 -1807 445 806 -1324 -574 2843
1106 2843 -833 -1374 3982 373 -2295 3634 844 -2738 2236 522 -2591 646 103 -2093 -711
$$ packed form
989f2J329l100J793J369r99k0P34L15j307K54J702k416j02K185k470j90J737k581
1007a829J372O89k894K656O71l257L194Q72k551K186O81j968J151M64n54j180
1023b97P06J229k835K39L062l762p98M532l894n02M049k509j151L333o08j108
1039c14O77R32K39j731Q15J422l029O69K250l599Q37K196k911RJ705j088J45j63
1057i39J120P75k238J941J013k796K605N78l153K284M77k884J985k08j964J795
1073C91j073q49J651j220J46R92o96Q96k55K96J181j933J535R61l317K770P75
1090B251m850L134J919n244J866L004m495K69L429j972j118K252L61k130P50L417
1106B843l676n41N356l609k668N929k790l582M974j714l113L237n43k196J382
$$ plain form
1121 -711 96 -961 -1471 396 890 -1120 378 2279 -961 668 1979 -675 677 1687 -1356 383
1137 383 829 -1427 -39 102 -1413 25 -536 -1129 -549 -806 516 -262 -612 1982 338 -436 2195
1154 2195 371 -733 2516 12 -1148 1486 -37 -1291 -402 -336 -478 -1828 -15 748 -2172 -149
1170 -149 2268 -1911 87 3416 -1203 -705 3086 -160 -1049 2096 632 -1443 -115 1231 -1231 -2034
1186 -2034 1255 -667 -2965 1281 229 -2948 1868 1177 -2419 1665 1544 -1451 1305 1357 -662 595
1202 595 744 -343 -436 34 161 -1322 -283 471 -2207 -313 1053 -2105 430 1763 -1932 619 2534
1219 2534 -1278 820 2655 -814 -77 1505 -399 -943 -125 641 -1319 -1574 1184 -930 -2207 1399
1235 1399 -521 -2252 1657 540 -1579 1670 1094 -322 849 918 584 -62 -12 1165 -1070 -1238 1381
$$ packed form
1121g11Q07j057n10J867M94k010J498J901l240J629J311k654J352J010l043J739
1137C83M46k256J388J41j515J438n61n93N80k57J322p78l50K594j644p74K631
1154B195j824j104L249k504j160K634j523j254Q89O6j42j350J813P63k920K023
1170a49K417m179J998L329m619M98L791l246q89L145j464k075J328J346k462q03
1186b034L289j922k298M246j052l177M816o91l596M084j21k995K756N2k019J257
1202E95J49j087r3M70J27j483J039P54k678J894J366l158K535J333l695K551J915
1219B534l812K098J835l469P37J582j904n44Q18P66j960k55K758k114j277L606
1235A399j920j731L909j117k119L249n76j416J171O9l34o46N0J177k235j68K619
$$ plain form
1252 1381 -1349 -1696 897 -1184 -1304 828 -474 -569 805 132 571 385 712 1382 -409 562 1449 -853
1270 -853 366 876 -1420 188 186 -2023 10 -297 -1532 472 -252 -1028 617 503 -180 542 734 907
1288 907 269 548 1086 -394 201 1283 -1740 -258 1754 -2233 -970 1571 -1780 -1215 1127 -812
1304 -812 -863 820 560 -40 154 1133 462 -700 1585 642 -1464 981 207 -1743 526 -210 -1859 215
1322 215 -594 -1133 730 -616 -250 431 -377 908 1019 -440 906 651 23 805 -199 -41 134 -959
1340 -959 -6 -376 -1635 397 -549 -1762 766 45 -1027 1211 -72 22 1272 352 137 857 20 1058
1358 1058 248 -490 867 -138 -1086 172 -405 -838 -99 -890 -240 -142 -942 703 111 -440 1341 -28
1376 -28 -347 1958 -170 -315 1638 -94 -373 542 -258 -702 -487 -488 -184 -1071 -105 571 -1386 60 1159
$$ packed form
1252A381k730l47K593k081j20K132j302r5J374o73M39j86L27O70j791R71Q87k302
1270h53J219N10k296J608kk209K033l07j235K004p24p76J645j14o83P22J92J73
1288I07o38K79N38j480N95J082l023J482K012l987J263K541l351N65K342j939
1304h12n1J683k60o00J94R79o71j162K285r43k106K445p74j950K269p36j649K074
1322B15q09n39J863j346L66O81q08J285J11j459J346k55o28P82j004J58J75j093
1340i59R53l70j259K032r46j213K528p21j072K238j283R4J250r20k15P20q37J038
1358A058q10p38J357j005r48J258n77m33P39p91O50R8q00J645n92n51J781j369
1376b8l19K305k128j45J953j732k79R15q00m44K15jL04q87R66O76j957J446J099
$$ plain form
1395 1159 -882 374 1416 -99 772 576 -240 1053 89 -487 619 -658 -613 681 -1188 -746 156
1412 156 -1034 -666 31 -384 137 -127 646 656 -490 1216 1293 -791 990 1170 -1314 289 628 -1721
1430 -1721 -71 58 -1159 -128 -593 -334 -183 -631 626 372 -615 941 752 -301 1225 463 531 939
1448 939 -236 309 415 -1263 301 -140 -2096 113 -151 -1713 112 244 -901 445 843 -22 328
1465 328 497 694 -22 151 1397 -242 -543 1140 -754 -1020 694 -1166 -800 152 -872 -324 7 -715
1483 -715 509 124 -434 1173 273 -122 1099 250 282 741 108 326 -478 -361 474 -1056 -770 799 -1316
1502 -1316 -760 969 -645 -415 1359 -229 430 929 30 816 677 105 646 -307 -70 462 -1069 -254
1520 -254 357 -1072 -585 -26 -789 -27 -202 -271 495 -424 418 1231 -282 527 1477 -636 472 1068 -892
$$ packed form
1395A159k041J256J042j515Q71j96q16J293r64n76J106j277M5J294j869M42R02
1412A56j190L68O97m15N21k64P73J0j146J706P7k084J781J80k484J603L39k349
1430a721J650J29j217J031m65K59J51m48J257k54r87J556j89j053J526p62O8M08
1448I39j175N45J06j678J564m41j956K209k64j562J825J32j145J346L98q65L50
1465C28J69J97p16J73J246j639l01J683j894k66J714j860L66R52j024N48L31p22
1483g15J224l85n58J607r00l95J221q49L2M59o33K18q04J17Q35j530K86J569k115
1502a316N56J729j614K30J774j588O59M99q99P86j39n72N41r53K37N32j531Q15
1520b54O11j429M87N59p63P62j75o9P66r19Q42Q13j513Q09R50k113J108N96j960
$$ plain form
1539 -892 137 355 -983 -241 -310 -616 -262 -658 181 -327 -974 786 -29 -447 1590 141 -258 1427
1557 1427 485 -208 891 -250 -139 621 -831 -347 257 -1005 -370 -122 -793 64 -302 134 101 -127 1210
1576 1210 730 -128 1344 465 -882 1313 210 -1034 877 -186 -1230 48 -249 -979 -158 -367 -371
1593 -371 -415 -284 737 -488 -94 1194 -190 163 1402 -96 52 742 -469 -165 -52 -497 -53 -912
1611 -912 -776 625 -1086 -648 620 -716 -346 645 -230 131 919 388 703 513 371 650 -531 125
1629 125 448 -725 -206 204 -1105 98 -60 -1105 298 -104 -476 994 -357 50 1281 219 360
1646 360 1017 -79 127 475 -215 44 -212 -79 -205 -1020 107 -204 -1642 567 509 -1395 406 805
1664 805 -787 622 827 -213 577 616 452 17 -406 390 -365 -616 461 -585 -1082 221 -560 -961
$$ packed form
1539h92J029K18j338P42o9l06L54l96Q39n08o47J760q15m18K037j449l99J685
1557A427r42o93J099j141J11P60j452M84O04j262O35K48o71Q57l66M36l3k28J337
1576A210m80q58J472q79j347K195j103j244J911j063j044J278k97p30Q21k09m
1593c71m4J31J021j225L94J288j384L53J239j498J48O90j211L04J13m45M44q59
1611i12J36J401j711M38J268j336L70R91q75L61P88n31L15j90j42K79j181O56
1629A25L23j173N19M10j309J203j58j045J403m02l72J470j351M07J231j062J41
1646C60O57j096K06L48o90K59k56J33j26q15J127l11j438K209n8j904J801L99
1664H05j592J409K05j040P90L9j64m35m23P96p55k51J077j046m97J303p81m01
$$ plain form
1682 -961 323 -239 -169 610 -70 329 865 -114 882 440 -342 750 180 -427 344 -224 -517 -184 -492 -378
1702 -378 -237 -709 99 -325 -397 632 -302 24 1218 97 284 825 -58 334 364 -799 163 32 -687
1721 -687 424 -551 -955 166 -799 -769 -99 -457 200 113 245 961 -63 133 908 -254 48 1046 -567
1740 -567 -133 907 -1055 -692 228 -832 -529 -104 -620 -177 -333 -58 366 -242 771 698 89 751 710
1759 710 -296 715 391 -519 311 -537 -177 255 -896 -177 -16 -1095 -130 352 -444 344 592 -613
1777 -613 597 421 174 618 -43 635 251 -306 574 -467 -1003 280 -519 -952 284 -651 -917 433
1795 433 -439 -251 505 -124 741 672 -295 723 647 -16 681 69 -135 -38 -715 -131 -223 -830 -112 -325 -700
1816 -700 621 -307 -655 627 -20 -213 1152 63 -182 445 112 237 160 -290 274 -641 -474 116 -1004
$$ packed form
1682i61J284n62P0P79o80L99N36r79R96m42p82J092n70o07P71n68k93L33l08J14
1702c78J41m72Q08m24p2J029r34L26J194j121J87N41q83L92L0j163R62j31p19
1721f87J111r75m04J121r65L0O70l58O57q7J32P16j024J96P75j162L02R98j613
1740e67M34J040j962L63R20j060L03M25n16M43j56K75M24o08J013p3o09O62m1
1759G10j006J011l24r10Q30q48L60M32j151P19J61j079R65M82p96P88K48j205
1777f13J210j76k47M44o61O78l84n57Q80j041n36J283p99m33J236r35k66J350
1795D33q72J88P56o29Q65o9r67J018p6o63O97o12k04R7o77N84r2o07P18k13l75
1816g00J321r28l48J282o47j93J365j089k45O27l33J25p7m50N64r15J67N90j120
$$ plain form
1835 -1004 -398 321 -919 -259 471 -458 81 384 -213 510 370 254 854 -47 245 691 -424 17 77
1854 77 -715 -360 -178 -499 -219 -537 -232 128 -585 70 514 -355 594 714 -363 748 919 -332 552
1873 552 264 -438 442 -269 -687 16 -519 -391 143 -990 -158 -48 -132 389 124 326 853 -213 624 820
1893 820 -204 661 358 -725 385 228 -892 -65 -31 -958 -249 -377 -325 -163 -99 206 -3 -200 1138
1912 1138 183 -103 1028 230 -265 741 -26 -139 76 -670 172 -253 -874 178 -264 -925 472 65
1930 65 -517 393 153 -76 603 119 372 498 -61 761 -19 -116 650 -584 -475 333 -1110 -472 400 -672
1950 -672 -77 86 -505 545 228 -15 577 576 475 711 311 66 347 -464 -121 182 -620 92 -483 -615
1970 -615 121 -743 -729 708 -494 -208 880 -354 170 843 -169 225 683 129 237 160 -14 101 -563
$$ packed form
1835a004O06P19j240O60P30r29N39L03n97P23j40j16O00r01K92M46j115M41O0
1854G7p92L55J82l21K80l18L05L60p13O55M44q69R49J20j077J111J71j251Q84
1873E52k88p02Q80p11m18P03n35J28N34j133Q32J10q4N21k65K02N27j066Q37J96
1893H20j024Q65l03j083J110j57j120Q27L4r27P09j28N2J62O4L05k09j97J338
1912A138r55k86J131p98m95J006p67j13K15p46Q42m25o21J052m42o61J397m07
1930F5n82R10k40k29O79m84K53J26n59Q22p80r7P66j234J09Q08j443O38Q72j072
1950f72N95J63n91J050l17k43N92jj01K36m00k45K81q11L43L03q02P12n75j32
1970f15P36q64J4J437j202K86J088j234N24O73j012L94M58n54J08p7j74J15o64
$$ plain form
1989 -563 -124 -155 -782 -5 60 -740 314 -51 -569 605 62 59 1002 127 271 936 -176 43 386 -512
2009 -512 -99 60 -633 -222 -218 -338 15 -410 -225 51 -487 639 458 -281 831 450 -41 833 -280 6
2029 6 593 -278 -165 54 -342 -211 -366 -510 86 -413 -587 296 -51 -284 289 -252 383 775 -36 604 348
2050 348 -418 490 37 -549 470 -489 -537 587 -818 -563 334 -556 -309 204 -135 45 83 110 342 -48
2070 -48 260 781 -294 194 380 -450 246 380 -1064 150 -330 -703 354 -308 -334 433 -117 -2 509
2089 509 111 336 603 -163 87 54 187 355 -385 74 296 -800 -1 131 -1132 -38 7 -886 -24 448
2109 448 -405 147 229 236 626 223 585 372 -217 728 91 -200 42 -8 -718 276 -711 -241 184 -770 -59
2130 -59 31 -422 618 370 -222 854 228 -84 653 -103 22 284 -104 -198 43 -701 -29 -37 -767 -1 -375
$$ packed form
1989e63M39l1o27P77O5q00J054l65n18J174n43lR43q75J44O65j112K19L43q98
2009e12M13J59o93M11Mj20L53m25J85K76n38J126j81p39J112l81m91Q74j113K86
2029FN87q71J13K19l96J31j55j44N96m99j74Q83l47k33N73n41O35L92q11O40k56
2050C48p66R08m53n86J019r59m8J124j405K55Q97q90K47N13l39J80L8K7K32l90
2070d8L08N21j075M88J86q30O96J34j444J214m80l73J057o62k6P67n50J15N11
2089E09l98K25K67p66K50l3J33J68p40M59K22j096P99J32j263J094M5q93Q62M72
2109D48q53N52Q2PL90m03L62k13n89R45o37k91K42n0p10R94r87M70M25r54P11
2130e9R0m53J040k48n92J076o26l12P37p56J25K62l88r4K41p44O72qp30P66l74
$$ plain form
2151 -375 -171 156 -502 -104 497 -111 342 442 -41 647 258 -114 753 -147 -606 107 -102 -680 -71 -492
2171 -492 -352 -301 -445 95 -291 11 551 117 80 908 -59 121 1135 -317 -2 487 -228 -92 66 -346
2191 -346 -6 -470 -335 -12 -376 -55 106 -311 317 351 -202 659 188 -156 518 205 -106 583 0 -487
2211 -487 214 -301 -402 -120 -764 -73 -141 -123 373 -247 -54 432 -222 355 464 -70 286 584 -295 20 119
2232 119 -343 258 -335 -453 -49 -425 -48 67 -603 99 -64 -565 326 169 -77 671 382 -77 218 303
2252 303 -91 177 -196 181 -47 -335 257 -329 -289 62 -609 -525 530 -94 24 706 -143 299 587 160
2272 160 337 268 222 257 -94 -293 186 -500 -79 -48 -844 126 -111 -513 317 2 -527 631 151 60 770
2293 770 -14 39 569 111 22 229 -10 -22 -137 -233 -108 -445 -265 176 -819 -46 339 -445 209 578 -72
$$ packed form
2151c75K04L27o58L98O01o08M53J00m83O88l89l72Q67r00m59P13k09n78O09m21
2171d92J40N1j44N40l86L02N40m34l7Q28r67J80J014j452L15M89p15J36J58m12
2191c46L40m64J35L23l64L21J61m17O28L4n53Q61m71l44O74l13l11O89n83m87
2211d87P01n15j01K82o44O91o8J8M96o20J93M86o54N77J09n34L56K98q79L15R9
2232A19m62O01n93j18M04l76L77J15o70P02j63n01Q91j57k46P48k89m59K95Q5
2252C03l94K68l73L77k28k88N92n86M0L51o71Q4J055o24J18O82q49M42K88m27
2272A60J77o9m6L5l51j99M79o86M21L1p96R70k37m02Q30l15n29J158m80r1P10
2293G70p84N3N30m58q9K07k39j2j15r6J25l37J80M41r95P73L85p84O54L69o50
$$ plain form
2314 -72 435 298 22 416 5 18 282 -114 26 42 -668 -100 -151 -384 100 212 -507 -9 -136 99 147 -348
2336 -348 312 369 -95 602 213 -206 409 10 -136 369 -381 -565 -60 -393 -358 149 -567 -94 331 -118 361
2357 361 244 205 587 261 317 565 -280 179 363 -520 -9 -33 -686 178 -433 -920 89 -138 -363 271 -192
2378 -192 68 315 197 466 145 325 684 59 -33 571 -549 -54 374 -556 -432 288 -361 -121 39 -273
2398 -273 -183 138 -149 316 330 87 490 10 109 28 62 420 14 -399 378 -324 -329 -8 -362 -205 217 -165
2420 -165 -124 332 -345 67 354 176 297 11 119 556 -51 146 610 -404 -31 141 -388 -48 -78 -612
2440 -612 -156 -444 -254 -6 -186 137 321 -144 292 410 -214 342 339 -239 51 139 -620 154 -592 -258 -165
2461 -165 -601 -59 -56 -401 252 -29 -148 677 53 181 588 121 48 609 -76 133 60 -221 13 -13 -579 3
$$ packed form
2314g2N07j37k76L94m11J3K64l96J40J6p10N68n1k33M84J12p19M98j27K35M8m95
2336c48O60N7m64O97l89m19O15l99j46N05p50j84N05l33L5N07p16M73M25m49M79
2357C61j17l9L82l26N6K48q45M59J84q83N11k4o53Q64o11m87J009k27k25O34m63
2378a92K60K47j18K69l21J80L59o25r2O04j120M95M28r30J24P20o49K40J60l12
2398b73R0L21k87M65J4k43M03m80R9q1L4L58m06m13P77p02nL21l54J57M22l82
2420a65M1M56o77M12K87j78J21k86J08M37o07J97M64j014L73J72n29L40l0n34
2440f12M56k88J90K48j80L23J84m65M36J18o24N56ln78K90Q8p59P74p46L34R3
2461a65m36N42Ll45O53k81j19Q25o24J28M07m67p3N61o85K09p3k81K34k6n66N82
$$ plain form
2483 3 -186 -407 -53 -426 100 124 -5 574 111 -64 442 -7 -66 540 224 -139 516 -336 -220 -55 -364
2504 -364 -220 -177 -495 110 -374 -356 388 -259 -56 303 67 378 437 86 675 391 -76 166 -36 -590 100
2525 100 -130 -383 128 -360 -321 -112 -488 -59 236 -81 246 342 -185 94 -3 209 392 -438 365 87 -381
2546 -381 111 -317 -499 206 -120 -458 8 -154 -402 483 -245 78 332 -303 191 482 -78 501 201 -143
2566 -143 394 -137 -73 -39 -454 -353 -41 -607 82 215 -337 220 -66 -399 400 -3 -86 225 143 233 309 -161
2588 -161 179 63 -335 312 -294 -477 -16 -363 -483 75 -128 -149 342 -229 434 -277 -200 474 112 11 439
2609 439 108 -97 417 28 -263 166 -190 -126 -191 -328 16 -444 -227 188 -272 -67 402 12 473 492 -78
2630 -78 482 368 -209 170 -221 -296 219 -334 -100 126 -385 -260 -224 -30 36 -147 -119 267 141 -180 539 16
$$ packed form
2483Cj89k21L54l73N26K4j29N79m63j75N06m49n9O06l16l63O55q52J16J65l09
2504c64J44M3l18O05m84J8P44o47K03L59k36L11N9l51N89k84m67K42k02n54O90
2525A00k30k53N11m88L9K09l76M29K95l17L27R6n27K79r7K12J83q30Q03k78m68
2546c81M92m28j82P05l26l38M66j62k48Q85p28L23K54o35M94K91n60N79l00l44
2566a43N37n31O4L4m15J01L12n66O89J33n52N57k86l33P99m03q3L11q2R0P6m70
2588a61L40j16l98O47o06j83M61l47j20N58k03k1M91n71O63p11P7O74l62j01M28
2609D39l31k05N14l89k91M29l56O4o5j37L44m60K17M15m60K05M69l90M61J9n70
2630g8N60j14n77L79l91p5N15n53K34K26n11J25L6J94O6j83K8L86j26l21P19n23
$$ plain form
2652 16 -18 531 -93 163 320 -304 -114 -16 -192 -71 -171 -327 -60 -158 148 126 -257 398 276 -218 439 319
2674 319 -67 253 -32 -144 443 -37 171 21 -177 85 -99 -290 -50 -279 -162 278 102 98 418 233 244
2695 244 350 76 153 337 -63 233 -193 -197 -75 -357 -504 -217 -370 -176 48 -379 164 231 -284 440 260
2716 260 -184 243 273 -17 317 35 121 59 -136 154 -256 -363 62 -131 -153 279 -253 -219 532 -28 130 435
2738 435 -131 93 364 229 70 300 279 289 -372 -29 65 -428 -94 -181 -288 25 11 -316 128 14 -404 316
2760 316 315 28 295 88 -34 467 -45 -36 -75 -251 -138 46 2 -77 -368 -197 284 -316 -246 357 215 253 243
2783 243 159 250 62 -216 93 -17 -64 223 -251 -56 -104 -506 81 2 -405 138 -93 -312 52 175 -145 227
2805 227 159 367 101 15 146 244 147 -16 -251 -266 284 -582 -651 73 -259 -113 -17 -343 -150 118 207 137 152
$$ packed form
2652A6l4N49o24K56J57o24J90R8j76J21j00j56K67r8L06k2l83O55j22m94O57j20
2674C19l86L20k85j12N87m80K08j50j98K62j84j91K40k29J17M40j76mL20j85J1
2695B44J06k74P7J84m00K96m26mJ22k82j47K87j53J94K24m27N43O7n15P24j80
2716B60m44M27L0k90L34k82Q6o2j95K90m10j07M25j93k2M32n32L4P51n60J58L05
2738D35n66K24K71j35j59K30k1J0o61L43R4m93L34q7j07L13j4l27M44j14m18P20
2760C16jk87K67k07j22N01n12Rl9j76J13J84m4p9k91J71M81o00P0O03j42L8j0
2783B43q4R1j88k78L09j10m7K87m74J95m8m02N87p9m07N43k31k19L64J23l20L72
2805B27o8K08k66q6J31R8r7j63k35j5N50q66o9P24l32J46R6l26J93K68Q9p0J5
$$ plain form
2828 152 162 160 36 45 122 -228 186 -3 -355 225 -173 -525 274 22 -682 199 -141 -41 70 58 6 63 210
2851 210 342 207 -20 199 81 -21 208 -252 -210 386 -129 -180 -80 -374 -115 16 -189 -68 185 81 293
2872 293 83 223 452 -14 316 223 -150 336 -46 -433 78 -45 -538 125 -301 -168 -139 -73 -45 85 -204
2893 -204 126 288 -75 703 47 6 465 -99 -377 349 -202 -6 113 104 -6 -304 -117 0 -185 -215 64
2914 64 66 170 377 163 236 341 -169 380 234 -71 73 107 -143 53 167 -285 76 -374 -147 -216 -168 -14
2936 -14 90 -79 410 -76 -46 447 25 -64 259 -113 54 -30 -489 -49 -104 -428 181 -332 -228 169 -47 -32
2958 -32 393 -290 218 307 -64 223 160 -66 254 96 -162 256 -339 -230 -28 54 -240 -155 -247 -42 19 -55 408
2981 408 -83 -15 285 110 -251 383 -105 177 176 -57 278 377 -394 18 -349 -65 85 -303 50 75 -394 177
$$ packed form
2828A52J0kj24RP7l50M14j89l52N80l98l52P99k52p04Q81l40J00J11j2n2N7J47
2851B10J32j35k27K19j18j02K29m60M2N96n15n1J00k94K59J31k05J21K53j04K12
2872B93k10J40K29m66L30r3l73M86l82l87N11j23m93O63m26J33K9O6K8J30k89
2893b04L30J62l63P78o56m1M59n64k78P26n51J96J19rj10k98J87J17j85l0K79
2914F4KJ04K07k14P3J05n10N49j46l05J44L4k50J96J14m52L61m50K27o9M8J54
2936a4J04j69M89m86L0M93m22q9L23l72J67q4m59M40n5l24O09n13J04L97k16J5
2958c2M25o83N08Q9l71K87o3k26L20j58k58M18n95J09K02Q2k94Q5r2K05O1p4M63
2981D08m91O8L00j75l61O34m88K82jk33L35R9p71M12l67K84J50l88L53K5m69N71
$$ plain form
3003 177 204 54 394 235 -95 418 184 267 139 -61 333 -81 -299 -43 -65 -389 -79 -133 -92 19 -182 -272
3025 -272 294 -164 214 312 -29 -18 232 182 -135 77 -189 167 24 -288 45 -423 -7 -99 -330 -21 -50 -285
3047 -285 52 298 -257 471 182 -104 189 -40 -6 104 -51 74 129 -252 66 -111 -351 127 -156 -53 269
3068 269 -102 196 211 -245 290 445 -59 -7 123 -104 379 -147 15 143 -86 -26 230 -384 0 -22 -357
3089 -357 295 96 80 235 127 193 126 162 152 136 107 204 9 -40 69 -11 -229 -312 -334 -401 164 -534 -124 344
3113 344 -30 -25 124 -23 140 186 -8 339 17 38 364 -58 149 380 -322 116 -254 -225 -26 -2 -512 28
3135 28 3 -1 356 -60 302 255 34 266 278 -98 228 -97 -131 163 -3 -62 -149 -106 -10 -97 -148 -48 -17 -445 151
3160 151 37 -184 459 40 76 218 22 214 267 -149 70 55 -78 -22 -187 -431 45 -27 -64 314 -119 8
$$ packed form
3003A77K7j50L40j59l30N13k34Q3j28k00L94m14k18K56k2l24L10n4M1J11k01r0
3025b72N66m58L78R8l41J1K50n0l17K12k66L56j43l12L33m68M16r2k31L09k9k35
3047b85L37K46n55P28k89k86K93k29L4J10j55J25N5l81L18j77k40M78k83J03L22
3068B69l71K98J5m56N35J55n04N2J30k27M83n26J62J28k29O0K56o14L84k2l35
3089c57O52j99j6J55j08O6o7L6j0j6k9R7j95m9J09q0k18q3k2o7N65o98M10M68
3113C44l74NJ49j47J63M6j94L47l22K1L26m22K07K31p02M38l70K9J99K4n10N40
3135B8k5mL57m16L62m7k21K32J2l76L26l25l4K94j66n9q7M3R6q7n1J00L1m28N96
3160A51j14k21O43m19L6J42j96J92N3m16K19j5j33N6j65k44M76p2l7L78m33J27
$$ plain form
3182 8 12 9 109 34 203 223 124 246 240 -77 -147 72 -183 65 -343 -424 -237 -136 -423 143 -262 -169 219 -193 87
3207 87 206 134 124 346 -48 104 169 -390 6 -186 -43 237 -22 53 206 -178 30 -12 -471 199 83 42
3229 42 98 310 -83 205 99 173 112 -79 68 194 -366 28 39 -297 199 -323 12 314 -254 -221 82 54
3251 54 -109 173 10 356 144 -169 179 -59 -174 151 -136 -368 96 -234 -354 -131 -410 -105 9 -52 76
3272 76 49 29 181 -97 116 -31 163 132 16 -47 414 24 -456 329 48 -345 -111 -201 -302 31 -77 51
3294 51 -30 71 52 93 266 365 29 252 195 -177 18 -154 -318 77 -44 -104 54 -124 -226 -78 99 -127
$$ packed form
3182HMlJ00p5J69K0r9J22ol17p0K19k55K48m08q1J87J01k87N66m05R3L88m12K80
3207H7J19p2j0K22l94J52O5n59L96j92J43K80k59P5J53l84K08m2m59O70j16m1
3229D2N6K12l93K88j06P4o1j91J47J26n60L94J1l36M96n22L35L02n68L3L03k8
3251E4j63K82j63L46k12l13L48k38j15L25k87k32M64l30j20K23k79L05J14o1J28
3272G6k7k0J52k78K13j47J94l1j16o3M61l90m80P85k81l93K34r0j01L33j08J28
3294E1q1J01j9M1J73R9l36K23n7l72J95j72j64L95j21o0J58j78j02J48J77k26
$$ [...]
8191a42
##END NTUPLES=NMR FID
##END=
